##TITLE=1H_2PEPA0207
 D2O, 8 sc, 
 5.07.2021
##JCAMPDX= 6.0         $$ Bruker NMR JCAMP-DX V2.0
##DATA TYPE= NMR FID
##DATA CLASS= NTUPLES
##ORIGIN= UXNMR, Bruker Analytische Messtechnik GmbH
##OWNER= root
$$ XWIN-NMR		Version 3.5
$$ Mon Jul  5 09:56:28 2021 Russian Standard Time (UT+4h)  she@DPX200
##.OBSERVE FREQUENCY= 200.131506
##.OBSERVE NUCLEUS= ^1H
##.DELAY= (6, 6)
##.ACQUISITION MODE= SIMULTANEOUS
##.ACQUISITION SCHEME= undefined
##.AVERAGES= 8
##.DIGITISER RES= 18
##SPECTROMETER/DATA SYSTEM= spect
##.PULSE SEQUENCE= zg30
##.SOLVENT NAME= CDCl3
##.SHIFT REFERENCE= (INTERNAL, CDCl3, 0, 15.7039)
##AUDIT TRAIL= $$ (NUMBER, WHEN, WHO, WHERE, WHAT)
$$ ##TITLE= Audit trail, XWIN-NMR		Version 3.5
$$ ##JCAMPDX= 5.01
$$ ##ORIGIN= Bruker BioSpin GmbH
$$ ##OWNER= she
$$ F:/spectra/data/she/nmr/H-F/1/audita.txt
$$ ##AUDIT TRAIL=  $$ (NUMBER, WHEN, WHO, WHERE, WHAT)
(   1,<2021-07-05 09:55:17.65 +0400>,<she>,<DPX200>,
      <created by zg, POWCHK disabled, PULCHK disabled
       configuration hash MD5:
       00 E9 B6 7A A2 85 ED C7 34 08 36 98 17 FE 4E 26
       data hash MD5: 16K
       FB 56 3D F6 B4 B6 BE B9 1E F4 A9 B8 A6 40 DE 6A>)
$$ ##END=
$$ 
$$ hash MD5
$$ 3C C5 59 6F E4 FC F7 02 7C 6A BB 47 A9 E1 70 44
##$RELAX= 
##$RELAX= 
##$RELAX= 
##$RELAX= 
##$RELAX= 
##$RELAX= 
$$ Bruker specific parameters
$$ --------------------------
##$DU= <F:/spectra>
##$EXPNO= 1
##$NAME= <H-F>
##$PROCNO= 1
##$TYPE= <nmr>
##$USER= <she>
##$AMP= (0..31)
100 100 100 100 100 100 100 100 100 100 100 100 100 100 100 100 100 100 
100 100 100 100 100 100 100 100 100 100 100 100 100 100 
##$AQSEQ= 0
##$AQ_mod= 1
##$AUNM= <au_zg>
##$AUTOPOS= <>
##$BF1= 200.13
##$BF2= 200.13
##$BF3= 200.13
##$BF4= 200.13
##$BF5= 200.13
##$BF6= 200.13
##$BF7= 200.13
##$BF8= 200.13
##$BYTORDA= 1
##$CFDGTYP= 0
##$CFRGTYP= 5
##$CHEMSTR= <none>
##$CNST= (0..31)
1 1 145 1 1 1 1 1 1 1 1 1 1 1 1 1 1 1 1 1 1 1 1 1 1 1 1 1 1 1 1 1 
##$CPDPRG= <>
##$CPDPRG1= <>
##$CPDPRG2= <>
##$CPDPRG3= <>
##$CPDPRG4= <mlev>
##$CPDPRG5= <mlev>
##$CPDPRG6= <mlev>
##$CPDPRG7= <mlev>
##$CPDPRG8= <mlev>
##$CPDPRGB= <>
##$CPDPRGT= <>
##$D= (0..31)
0 1.2 0 0 0 0 0 0 0 0.06 0 0.03 0 0 0 0 0.0002 0 0 0 0 0 0 0 0 0 0 0 0 
0 0 0 
##$DATE= 1625464517
##$DBL= (0..7)
120 120 120 120 120 120 120 120 
##$DBP= (0..7)
150 150 150 150 150 150 150 150 
##$DBP07= 0
##$DBPNAM0= <>
##$DBPNAM1= <>
##$DBPNAM2= <>
##$DBPNAM3= <>
##$DBPNAM4= <>
##$DBPNAM5= <>
##$DBPNAM6= <>
##$DBPNAM7= <>
##$DBPOAL= (0..7)
0.5 0.5 0.5 0.5 0.5 0.5 0.5 0.5 
##$DBPOFFS= (0..7)
0 0 0 0 0 0 0 0 
##$DE= 6
##$DECBNUC= <off>
##$DECIM= 32
##$DECNUC= <off>
##$DECSTAT= 4
##$DIGMOD= 1
##$DIGTYP= 9
##$DL= (0..7)
0 120 120 120 120 120 120 120 
##$DP= (0..7)
150 150 150 150 150 150 150 150 
##$DP07= 0
##$DPNAME0= <>
##$DPNAME1= <>
##$DPNAME2= <>
##$DPNAME3= <>
##$DPNAME4= <>
##$DPNAME5= <>
##$DPNAME6= <>
##$DPNAME7= <>
##$DPOAL= (0..7)
0.5 0.5 0.5 0.5 0.5 0.5 0.5 0.5 
##$DPOFFS= (0..7)
0 0 0 0 0 0 0 0 
##$DQDMODE= 0
##$DR= 18
##$DS= 0
##$DSLIST= <SSSSSSSSSSSSSSS>
$$ [...]
##$SUBNAM2= <"">
##$SUBNAM3= <"">
##$SUBNAM4= <"">
##$SUBNAM5= <"">
##$SUBNAM6= <"">
##$SUBNAM7= <"">
##$SUBNAM8= <"">
##$SUBNAM9= <"">
##$SW= 20.0188882624521
##$SWIBOX= (0..15)
0 0 2 0 0 0 0 0 0 0 0 0 0 0 0 0 
##$SW_h= 4006.41025641026
##$TD= 16384
##$TD0= 1
##$TE= 0
##$TE2= 300
##$TE3= 300
##$TEG= 300
##$TL= (0..7)
0 120 120 120 120 120 120 120 
##$TP= (0..7)
150 150 150 150 150 150 150 150 
##$TP07= 0
##$TPNAME0= <>
##$TPNAME1= <>
##$TPNAME2= <>
##$TPNAME3= <>
##$TPNAME4= <>
##$TPNAME5= <>
##$TPNAME6= <>
##$TPNAME7= <>
##$TPOAL= (0..7)
0.5 0.5 0.5 0.5 0.5 0.5 0.5 0.5 
##$TPOFFS= (0..7)
0 0 0 0 0 0 0 0 
##$TUNHIN= 0
##$TUNHOUT= 0
##$TUNXOUT= 0
##$USERA1= <user>
##$USERA2= <user>
##$USERA3= <user>
##$USERA4= <user>
##$USERA5= <user>
##$V9= 5
##$VALIST= <valist>
##$VCLIST= <CCCCCCCCCCCCCCC>
##$VD= 0
##$VDLIST= <DDDDDDDDDDDDDDD>
##$VPLIST= <PPPPPPPPPPPPPPP>
##$VTLIST= <TTTTTTTTTTTTTTT>
##$WBST= 1024
##$WBSW= 4
##$XGAIN= (0..3)
0 0 0 0 
##$XL= 0
##$YL= 0
##$YMAX_a= 400621
##$YMIN_a= -365534
##$ZGOPTNS= <>
##$ZL1= 120
##$ZL2= 120
##$ZL3= 120
##$ZL4= 120
##$ABSF1= 10
##$ABSF2= 0
##$ABSG= 5
##$ABSL= 3
##$ALPHA= 0
##$AQORDER= 0
##$ASSFAC= 0
##$ASSFACI= 0
##$ASSFACX= 0
##$ASSWID= 0
##$AUNMP= <proc_1d>
##$AZFE= 0.1
##$AZFW= 0.1
##$BCFW= 1
##$BC_mod= 2
##$BYTORDP= 1
##$COROFFS= 0
##$CY= 11.3945322036743
##$DATMOD= 1
##$DC= 2
##$DFILT= <>
##$DTYPP= 0
##$F1P= 15.9154993809931
##$F2P= -4.1035820241983
##$FCOR= 0.5
##$FTSIZE= 0
##$FT_mod= 4
##$GAMMA= 1
##$GB= 0.15
##$INTBC= 1
##$INTSCL= 1
##$ISEN= 128
##$LB= 0.24
##$LEV0= 0
##$LPBIN= 0
##$MAXI= 10000
##$MC2= 0
##$MEAN= 0
##$ME_mod= 0
##$MI= 1.114404
##$NCOEF= 0
##$NC_proc= 0
##$NLEV= 6
##$NOISF1= 3.799351
##$NOISF2= 2.8
##$NSP= 1
##$NTH_PI= 0
##$NZP= 0
##$OFFSET= 15.70392
##$PC= 1
##$PHC0= -12069.7
##$PHC1= 2.00099
##$PH_mod= 1
##$PKNL= yes
##$PPARMOD= 0
##$PSCAL= 0
##$PSIGN= 0
##$REVERSE= no
##$SF= 200.130013532006
##$SI= 16384
##$SIGF1= 3
##$SIGF2= 2
##$SINO= 400
##$SIOLD= 16384
##$SREGLST= <1H.CDCl3>
##$SSB= 0
##$STSI= 0
##$STSR= 0
##$SW_p= 3612.71676300578
##$SYMM= 0
##$S_DEV= 0
##$TDeff= 0
##$TDoff= 0
##$TI= <>
##$TILT= no
##$TM1= 0
##$TM2= 0
##$TOPLEV= 0
##$USERP1= <user>
##$USERP2= <user>
##$USERP3= <user>
##$USERP4= <user>
##$USERP5= <user>
##$WDW= 1
##$XDIM= 8192
##$YMAX_p= 0
##$YMIN_p= 0
$$ End of Bruker specific parameters
$$ ---------------------------------
##NTUPLES= NMR FID
##VAR_NAME=  TIME,          FID/REAL,        FID/IMAG
##SYMBOL=    X,             R,               I
##VAR_TYPE=  INDEPENDENT,   DEPENDENT,       DEPENDENT
##VAR_FORM=  AFFN,          ASDF,            ASDF
##VAR_DIM=   8192,          8192,            8192
##UNITS=     SECONDS,       ARBITRARY UNITS, ARBITRARY UNITS
##FACTOR=    0.0002496,     1,               1
##FIRST=     0,             0,               0
##LAST=      2.0444736,     0,               0
##MIN=       0,             -365534,         0
##MAX=       2.0444736,     400621,          0
$$ Real data points
##PAGE= N=1
##DATA TABLE= (X++(R..R)), XYDATA
0 0 0 0 0 0 0 0 0 0 0 -8 8 -8 8 -8 16 -16 24 -28 32 -40 48 -56 72 -81 96 -112 131 -152 176 -200 228 -262
32 -262 297 -334 380 -425 479 -536 599 -669 744 -827 917 -1018 1123 -1244 1372 -1509 1665
49 1665 -1833 2019 -2225 2453 -2707 2991 -3311 3677 -4095 4580 -5156 5844 -6687 7753 -9141
64 -9141 11035 -13791 18183 -26306 46398 -204110 -201466 212685 218905 312040 111895 -260777
76 -260777 -345803 -153226 32038 291776 303755 64670 -142470 -279565 -281830 25705 269816
87 269816 273234 159454 -99888 -348925 -251486 3022 196041 312062 206026 -116964 -315423
98 -315423 -255499 -36676 193578 295099 195159 -59991 -287403 -266154 -54232 156337 272977
109 272977 202680 -30920 -218138 -264569 -137229 133869 282877 194739 27433 -179834
119 -179834 -306152 -148011 113433 244679 247203 54337 -216744 -260805 -133476 31568
129 31568 245000 272126 29930 -163012 -219791 -191402 18241 235327 222123 85282 -89856
140 -89856 -253966 -206851 14585 178339 230891 141979 -86098 -243514 -203457 -37137 167066
151 167066 256659 129881 -72726 -199757 -214760 -70586 155192 238904 132887 -30429
161 -30429 -174330 -222326 -90733 118240 218443 166953 7760 -173593 -224364 -99396 81055
172 81055 205073 193445 23972 -161161 -209991 -120783 51499 200411 190746 41410 -121219
183 -121219 -208955 -147926 38540 181738 183111 72848 -94575 -206199 -155015 9470 155541
194 155541 193687 95001 -76275 -191371 -166369 -21078 139867 198453 111031 -57227 -179844
205 -179844 -170168 -41648 118603 193384 121193 -32376 -157312 -178398 -64653 101478 178370
216 178370 133164 4206 -146907 -188514 -74726 75218 166636 155194 18478 -135840 -175777
227 -175777 -98501 48660 171470 154518 28591 -101830 -176649 -122113 41239 153651 148893
238 148893 60734 -84683 -178507 -122394 14769 130166 164292 75524 -72743 -159964 -137410
249 -137410 -14100 127237 163389 82473 -44648 -152346 -151878 -24898 110459 155982 100960
260 100960 -27527 -143231 -150390 -46400 89614 157639 109467 -10870 -123603 -155604 -67210
271 -67210 75048 150680 118600 10167 -111734 -156328 -81108 53706 145145 128527 22771
282 22771 -94951 -150846 -98707 35587 138161 130665 39911 -76647 -149623 -109296 18179
293 18179 124549 137363 55862 -64923 -140625 -116133 -4488 113481 141560 65656 -47036
304 -47036 -129308 -126859 -22999 101185 140361 79442 -30297 -122991 -130816 -38102 84306 139869
316 139869 91366 -17726 -111248 -130378 -55068 67268 137032 100965 -1463 -98838 -132033
327 -132033 -69509 50374 130957 110556 13493 -88529 -130250 -80562 32425 123024 117380
338 117380 27259 -75186 -125820 -91159 14749 113431 122618 42009 -61446 -121633 -99731
349 -99731 -1760 102063 125884 55294 -48732 -116212 -105195 -16773 88611 126333 67794
360 67794 -35149 -108935 -108697 -31572 73984 125405 79838 -20605 -100871 -112310 -45081 60178
372 60178 121949 89358 -6526 -92418 -113722 -55948 45531 115512 97002 8080 -81710 -113251
384 -113251 -66698 30828 108389 103701 22780 -71027 -112813 -75476 17238 99855 107989 34984
396 34984 -59896 -109066 -83107 2904 90305 109546 46969 -46006 -105092 -90592 -9579 79828
408 79828 110272 59305 -34225 -100254 -94045 -22267 67782 109919 68101 -21603 -91540 -98565
420 -98565 -35209 56866 105791 76314 -5895 -84853 -102871 -44156 45193 100738 84411 5786
432 5786 -76411 -101679 -54647 32271 96533 88101 16897 -63213 -100356 -66194 19547 90288
444 90288 92102 29028 -52434 -98381 -74397 6769 83539 95618 39082 -42554 -95212 -79304
456 -79304 -3693 72865 95776 50511 -32562 -90749 -81393 -16531 61508 97240 57761 -21652
468 -21652 -81074 -87600 -29745 55811 94037 62477 -5807 -74699 -93698 -37095 44907 89951
480 89951 73371 2072 -71270 -88974 -46684 29983 91490 78155 5039 -59011 -84147 -57696
492 -57696 20040 84645 78220 20218 -47626 -87012 -62813 9254 72843 85440 35068 -43630
504 -43630 -86652 -66509 -2322 67898 89702 39504 -36005 -79897 -71486 -12171 62343 87199
516 87199 43454 -23931 -71439 -75287 -23229 51807 84542 52772 -11445 -67036 -78217 -32179
528 -32179 38801 83427 66389 -3752 -67511 -76646 -37973 26912 83389 72434 -418 -59914
540 -59914 -73644 -46319 20737 77873 68244 12561 -45662 -77843 -52089 14676 64621 72023
552 72023 30281 -42054 -78332 -53333 -1212 58203 84287 33432 -39926 -68766 -60852 -13326
564 -13326 60422 81816 33437 -25405 -66101 -66965 -12565 48843 70893 48704 -13362 -68354
576 -68354 -63599 -19947 30952 73756 60786 -8965 -61895 -65808 -33450 28228 75826 59392
588 59392 -249 -53408 -70750 -37652 25380 67498 59617 10966 -46182 -69845 -41458 14704
600 14704 58924 64293 22542 -39909 -69538 -46219 3314 53092 71665 29789 -36710 -66051
612 -66051 -51524 -5591 53184 70953 29985 -24752 -61979 -59061 -6254 46970 59970 40585
624 40585 -10800 -63721 -58302 -11912 30227 62740 53448 -9412 -57310 -57308 -28444 27012 70114
637 70114 50019 -3075 -46789 -65531 -32882 29518 59518 49333 10847 -45054 -65178 -29793
649 -29793 15703 49561 58581 17296 -39590 -57836 -39971 1830 51687 61893 21368 -28960
661 -28960 -59022 -50447 295 50686 59225 27793 -22912 -60377 -49868 -2227 41601 57010
673 57010 33877 -17377 -54557 -48571 -11959 31668 57393 40021 -9381 -48061 -52154 -22826
685 -22826 26431 59296 44376 -2237 -44218 -57123 -27954 24962 56303 45430 4725 -41693
697 -41693 -57242 -27144 17734 47966 49633 11395 -37679 -51518 -31687 4434 45955 54346
709 54346 15122 -28529 -49380 -42321 92 46001 51800 22820 -20486 -54253 -43874 -252
721 -252 36606 52218 31726 -20539 -51346 -39603 -10099 29532 55513 31913 -14412 -41598
733 -41598 -44967 -18237 27698 50574 35733 -1715 -41570 -49975 -18991 20679 47128 43698 1959
746 1959 -40864 -47073 -23655 13931 46775 44157 6189 -33243 -47195 -28792 9691 42062 45209
759 45209 13784 -28766 -47011 -31702 3240 38210 46822 18842 -22523 -46208 -36210 -323
771 -323 33933 45565 26127 -17293 -47212 -36622 -4452 27736 46657 29549 -13620 -41705
783 -41705 -39008 -11888 25914 44853 30384 -4049 -38288 -44504 -14040 22084 40607 36141 1463
796 1463 -37985 -42575 -17451 14313 40740 38908 3910 -31506 -42240 -24343 11488 38724 37913
809 37913 11363 -26268 -45103 -26207 8263 33181 39688 17331 -22758 -43303 -29456 2112
821 2112 31486 40458 19826 -16473 -41323 -34217 -1553 29234 38925 23452 -10974 -39074 -35791
834 -35791 -6797 24515 39438 26946 -6397 -35594 -37898 -11886 21445 38433 29405 -1161
846 -1161 -33103 -38981 -14975 16676 36072 32203 3702 -29397 -39360 -19769 12680 35236 33189
859 33189 7942 -24532 -39817 -23659 9494 32727 33581 12493 -20110 -38780 -26845 3895
871 3895 30107 35658 15722 -16525 -36705 -29715 -931 28028 36028 18431 -12116 -34678 -31549
884 -31549 -4854 24000 35441 22648 -7563 -33190 -33067 -8880 20292 35201 25421 -3666 -30423
897 -30423 -34062 -12806 16914 34014 27144 784 -26760 -34989 -16754 13158 32677 29172 4866
910 4866 -23880 -34878 -19795 8835 30905 30947 8218 -20466 -33830 -22810 4547 28697 32062
923 32062 12177 -16810 -33452 -25012 1036 25573 32478 16016 -13166 -32249 -26837 -2904 22529
936 22529 32402 18979 -8818 -30471 -29114 -6331 19797 31619 21653 -4712 -28513 -30246 -9800
949 -9800 16373 30911 23857 -953 -25468 -31070 -13514 13281 29547 25523 3274 -22990 -31773
962 -31773 -15898 9660 27439 27531 6906 -20184 -31232 -18837 5873 26024 28107 10169 -16134
975 -16134 -31187 -21769 3441 23723 27827 13761 -12514 -30518 -23480 20 21077 28201 16284
988 16284 -8981 -28581 -25639 -3755 19042 28030 18372 -5233 -26620 -27304 -7023 16622 27601
1001 27601 20112 -1805 -24059 -28459 -10088 14150 26334 21566 2020 -21805 -28820 -12619 10587
1014 10587 25180 23571 4514 -18861 -28169 -16636 7477 25310 23607 6962 -14575 -28764
1026 -28764 -19585 5962 23003 23499 10731 -12238 -28087 -20306 1738 20390 25287 12557 -9606
1039 -9606 -25310 -22877 -2579 19524 25488 14109 -5752 -23873 -25081 -5149 17501 25084 16122
1052 16122 -3052 -22155 -25636 -7867 14880 24313 17728 -3 -20044 -25613 -10505 10871 23743
1065 23743 20273 1914 -17404 -24568 -15024 7698 24679 20576 4241 -13639 -26051 -17739 7066
1078 7066 22334 20874 8221 -12973 -25774 -16624 2680 19083 23375 9212 -11057 -21428 -19307
1091 -19307 -2640 18858 23533 10898 -6055 -21229 -22853 -4107 17094 23298 14427 -4440 -21804
1104 -21804 -22373 -5734 14131 23377 15686 -3201 -19331 -21429 -8343 10597 22416 17220 -461
1117 -461 -16160 -21230 -12682 7627 22540 18175 3015 -13232 -23740 -15152 7114 20591 19638
1130 19638 6840 -13966 -23921 -13687 3438 18374 22104 6635 -12530 -19470 -16140 -959 18281
1143 18281 20652 7932 -6262 -19376 -19794 -1829 15367 19927 13402 -4434 -21097 -19576 -4270
1156 -4270 12676 22107 14626 -4560 -18713 -19384 -6872 11544 21127 14277 -1630 -15642 -19688
1169 -19688 -9395 8836 19676 15603 2160 -13196 -21224 -11950 7044 18434 17399 5455 -13257
1182 -13257 -21707 -12082 4041 17303 19627 5402 -11845 -18523 -14683 862 18052 18295 6032
1195 6032 -6631 -18517 -17669 512 15224 17091 10840 -4923 -19623 -16800 -2480 12002 19775
1208 19775 12233 -5157 -16622 -17372 -6260 11958 19733 11493 -1871 -14313 -19090 -7417 10069
1221 10069 17698 13391 1259 -13418 -19068 -9486 7110 17517 15379 2692 -12241 -18677 -11337
1234 -11337 4714 17360 16414 3419 -10404 -17304 -13123 2266 16665 16193 4995 -7172 -16787
1247 -16787 -14991 468 14462 16449 8525 -5714 -17243 -15182 -2024 12256 18367 9964 -5755
1260 -5755 -15313 -15310 -4999 11543 18379 9573 -3150 -13019 -16537 -6738 9756 16849 11540 -143
1274 -143 -12559 -16739 -8005 6523 16535 14247 969 -11911 -15956 -10136 4066 16988 15180
1287 15180 1670 -10094 -15682 -11694 2970 15744 14828 3999 -8086 -15747 -12119 988 13092
1300 13092 15699 6724 -7032 -14901 -12818 -2191 11841 17163 7981 -5532 -13966 -14219 -3853 11042
1314 11042 16728 9261 -3711 -13588 -14333 -4937 8642 16143 10993 -2115 -12511 -14199 -6710 6506
1328 6506 15558 12346 10 -11342 -14647 -8131 4558 14815 13683 1766 -10313 -14717 -9573
1341 -9573 2972 14379 13972 3352 -8637 -14784 -10548 1758 12518 14365 5624 -7442 -14367
1354 -14367 -10916 -725 10951 15286 6898 -5938 -13201 -12374 -2572 10401 14914 8168 -3670 -13166
1368 -13166 -13209 -3293 8482 14419 10130 -2387 -12551 -12970 -5124 6652 14589 10774 -867 -10815
1382 -10815 -13665 -6875 5663 13608 11507 1439 -9905 -13982 -7796 3716 12850 12739 2698 -8720
1396 -8720 -13407 -9203 1903 12300 12985 4084 -7020 -13314 -10204 577 10931 13265 5831 -5769
1410 -5769 -12804 -10829 -1449 9793 13675 6899 -4170 -11992 -11842 -2874 8691 13428 8227 -2518
1424 -2518 -11378 -12045 -4222 6891 13384 9423 -1350 -10262 -12128 -5974 5406 13125 10096 271
1438 271 -9146 -12510 -7068 4033 12163 11167 1833 -8335 -12222 -7896 2122 11482 11934 2986 -7037
1453 -7037 -11794 -9037 561 10613 12285 4516 -5761 -11593 -9660 -798 9322 12601 5847 -4685
1467 -4685 -11016 -10004 -2374 7923 12723 7129 -3343 -10380 -10489 -3723 6632 12547 8281 -2015
1481 -2015 -9769 -10812 -4825 5168 12045 9345 -554 -8987 -10838 -5796 3635 11381 10235 972 -8133
1496 -8133 -10920 -6728 2268 10579 10875 2371 -7253 -10816 -7383 970 9552 11243 3822 -6076 -10730
1511 -10730 -8079 -351 8466 11529 5221 -4964 -10562 -8601 -1307 7406 11369 6423 -3654 -10069
1525 -10069 -9053 -2509 6104 11145 7537 -2214 -9614 -9664 -3466 5066 10677 8495 -681 -8994 -9956
1540 -9956 -4256 3748 10127 9263 558 -8221 -9976 -5281 2603 9582 9646 1897 -7001 -10210 -6211 1695
1556 1695 8596 9867 3466 -5994 -10328 -6864 592 7643 10313 4754 -5020 -10032 -7549 -599 6985
1571 6985 10275 5461 -3556 -9492 -8327 -1607 6274 9811 6352 -2059 -9041 -8912 -2399 5167 9436
1586 9436 7439 -791 -8480 -9140 -3649 3894 9437 8100 190 -7586 -9355 -4750 3298 9111 8096
1601 8096 1259 -6422 -9554 -5392 2405 8068 8490 2844 -5524 -9544 -6100 994 7297 9114 3795
1616 3795 -4727 -9110 -6895 -296 7003 9295 4322 -3403 -8580 -7769 -1057 6458 8840 5265 -2098
1631 -2098 -8300 -8162 -1737 5044 8587 6530 -1219 -7992 -8009 -3011 3704 8948 7132 -558 -6939 -8279
1647 -8279 -4326 3361 8649 7103 870 -6008 -8761 -4671 2504 7361 7679 2422 -5541 -8641 -5128
1662 -5128 876 6772 8689 2992 -4814 -8080 -6148 -248 6735 8664 3533 -3506 -7868 -6859 -540
1677 -540 5910 7926 4755 -2238 -7904 -6863 -1339 4304 7908 6079 -1498 -7450 -6983 -2749 3363
1692 3363 8330 6570 -735 -6602 -7661 -3677 3400 7867 6386 546 -5980 -8085 -3633 2582 6548
1707 6548 6886 1960 -5386 -7650 -4210 910 5944 7825 2760 -4512 -7445 -5505 -110 6182 7868
1722 7868 3367 -3365 -7764 -6292 61 5599 7076 4236 -2466 -7764 -5990 -448 4030 6807 5258
1737 5258 -1621 -6817 -6145 -2103 3249 7309 5663 -450 -5961 -7301 -3102 3449 6955 5797 787
1752 787 -5882 -7777 -3018 2937 6091 6240 1532 -5363 -7168 -3459 1511 5596 6542 2129 -3988 -6781
1768 -6781 -4866 574 5555 6508 3107 -2743 -7243 -5826 381 5187 6398 3907 -2233 -7332 -5762
1783 -5762 -138 4310 6398 4382 -1704 -6287 -5789 -1516 3697 6514 4563 -490 -5417 -6615 -2467
1798 -2467 3489 6082 4949 720 -5207 -7082 -2746 2738 5719 5497 1162 -4777 -6667 -3393 1788
1813 1788 5657 5709 1608 -3720 -6442 -4402 1044 5451 5665 2336 -2778 -6395 -5023 459 4910 5690
1829 5690 3119 -2128 -6359 -5212 -256 4211 5936 3667 -1686 -5700 -5383 -1320 3762 6017 3913
1844 3913 -836 -5024 -5859 -2051 3376 5714 4292 151 -4841 -6127 -2372 2517 5444 4887 553
1859 553 -4414 -5763 -3047 1723 5362 5034 1155 -3554 -5823 -3828 1181 4952 5186 1972 -3019 -5813
1875 -5813 -4171 530 4551 5442 2528 -2423 -5565 -4490 -147 4059 5349 3030 -1712 -5318 -4793
1890 -4793 -877 3490 5333 3503 -1068 -4790 -5071 -1548 3079 5242 3831 -131 -4495 -5489 -2032
1905 -2032 2522 4971 4360 459 -4181 -5328 -2517 1844 4812 4512 907 -3474 -5337 -3144 1379
1920 1379 4466 4494 1694 -2804 -5398 -3536 727 4002 4782 2260 -2290 -5125 -3975 81 3842 4774
1936 4774 2600 -1642 -4960 -4422 -387 3492 4600 3049 -944 -4659 -4693 -1010 2913 4595 3356 -340
1952 -340 -4138 -4818 -1636 2538 4525 3592 272 -3713 -5039 -2179 2021 4444 3865 747 -3200 -4939
1968 -4939 -2696 1574 4253 3984 1239 -2609 -4877 -3180 1002 3930 4085 1709 -2099 -4712 -3637
1983 -3637 353 3696 4105 2058 -1614 -4392 -3979 -244 3473 4195 2391 -1014 -4052 -4243 -804 3051
1999 3051 4179 2696 -447 -3752 -4401 -1412 2568 4214 2983 -15 -3328 -4372 -1992 2086 4190
2014 4190 3174 448 -2851 -4429 -2470 1583 3935 3449 877 -2437 -4284 -2840 992 3839 3667
2029 3667 1099 -2045 -4102 -3307 383 3639 3764 1547 -1596 -3902 -3485 -217 3202 3858 1928 -1242
2045 -1242 -3676 -3616 -714 2863 4027 2262 -778 -3355 -3706 -1211 2440 3940 2580 -360 -3099 -3735
2061 -3735 -1617 2003 3912 2857 8 -2765 -3811 -2021 1455 3708 3108 485 -2439 -3823 -2393
2076 -2393 988 3534 3367 846 -2127 -3634 -2660 426 3342 3437 1218 -1723 -3613 -2947 2 2941
2092 2941 3571 1687 -1309 -3421 -3139 -451 2603 3643 1974 -917 -3116 -3296 -922 2318 3601 2217
2108 2217 -502 -3007 -3398 -1252 1862 3500 2556 -113 -2709 -3410 -1718 1491 3372 2751 295 -2273
2124 -2273 -3426 -2078 998 3175 3003 650 -2000 -3452 -2384 610 3053 3039 1050 -1582 -3399 -2598
2140 -2598 266 2770 3173 1384 -1341 -3141 -2695 -257 2469 3252 1610 -883 -2840 -3048 -721 2270
2156 2270 3237 1964 -441 -2769 -3217 -1032 1849 3160 2310 -191 -2488 -3143 -1452 1481 3159 2317
2172 2317 75 -2067 -3089 -1829 1043 3030 2535 595 -1805 -3036 -2198 604 2893 2734 858 -1540
2188 -1540 -3107 -2449 289 2696 2927 1122 -1424 -2820 -2478 -259 2421 3078 1250 -978 -2496 -2755
2204 -2755 -636 2215 2931 1563 -444 -2457 -2828 -946 1713 2957 2077 -368 -2435 -2699 -1377 1378
2220 1378 3133 2116 -224 -1898 -2621 -1670 1140 2891 2235 287 -1712 -2738 -1880 570 2683 2543
2236 2543 616 -1555 -2687 -2002 263 2555 2792 848 -1361 -2560 -2191 -235 2266 2868 1079 -1149
2252 -1149 -2250 -2322 -547 2034 2739 1433 -709 -2322 -2431 -713 1533 2736 1879 -519 -2261 -2295 -1089
2269 -1089 1182 2883 1916 -348 -1902 -2363 -1420 982 2628 2056 181 -1698 -2473 -1582 625 2354
2285 2354 2391 529 -1676 -2487 -1642 277 2265 2541 669 -1527 -2259 -1762 -26 2054 2513 936 -1045
2302 -1045 -2061 -1984 -352 1740 2413 1314 -645 -2255 -2126 -528 1425 2464 1716 -620 -2264 -2095
2318 -2095 -819 1236 2561 1746 -357 -1879 -2175 -1049 1032 2336 1757 103 -1616 -2211 -1234 618
2334 618 2107 2103 520 -1536 -2246 -1475 311 1988 2298 664 -1372 -2194 -1670 27 1969 2286 787
2351 787 -1067 -2113 -1831 -31 1688 2133 1110 -630 -1971 -1847 -429 1280 2253 1422 -440 -1924
2367 -1924 -1997 -752 1156 2397 1634 -373 -1738 -2054 -1000 1042 2215 1617 -96 -1551 -2092 -1105 696
2384 696 1933 1825 251 -1374 -1932 -1274 315 1839 2012 498 -1203 -1904 -1503 54 1780 2082 745
2401 745 -1015 -1893 -1624 -154 1618 2050 912 -745 -1827 -1620 -326 1274 2035 1251 -541 -1662 -1661
2418 -1661 -659 1107 2161 1362 -380 -1586 -1723 -779 902 2068 1539 -99 -1491 -1862 -955 653
2434 653 1875 1679 128 -1428 -1728 -1063 317 1704 1802 353 -1200 -1697 -1211 69 1557 1926 625
2451 625 -977 -1698 -1373 -120 1350 1904 856 -863 -1734 -1457 -297 1198 1887 1132 -656 -1701 -1444
2468 -1444 -491 934 1898 1281 -350 -1541 -1533 -667 789 1800 1378 -151 -1419 -1582 -724 549 1601
2485 1601 1574 82 -1332 -1656 -827 349 1539 1619 410 -1146 -1605 -1082 178 1361 1683 628 -989
2502 -989 -1684 -1173 11 1198 1682 809 -751 -1574 -1207 -145 1052 1695 999 -523 -1599 -1374 -317
2519 -317 862 1573 1165 -230 -1437 -1388 -466 721 1540 1332 -76 -1259 -1462 -625 592 1471 1332 137
2537 137 -1256 -1507 -744 421 1361 1402 349 -1034 -1555 -890 272 1274 1508 533 -816 -1527 -1090 94
2555 94 1092 1437 778 -667 -1418 -1111 -98 983 1511 934 -493 -1436 -1245 -237 902 1470 981 -233
2573 -233 -1339 -1308 -452 722 1463 1135 -42 -1226 -1340 -641 553 1342 1199 96 -1011 -1386 -733 385
2591 385 1223 1278 287 -951 -1425 -855 222 1100 1350 532 -826 -1338 -973 47 1042 1385 584 -582 -1260
2610 -1260 -1029 -142 968 1363 762 -426 -1336 -1194 -262 756 1378 964 -344 -1206 -1177 -410 642 1309
2628 1309 1057 -136 -1143 -1246 -490 492 1266 1141 122 -1029 -1242 -691 384 1170 1248 238 -870 -1269
2646 -1269 -735 230 1051 1294 464 -776 -1248 -826 23 982 1305 580 -617 -1286 -960 -84 834 1308 754
2665 754 -435 -1267 -1067 -169 711 1310 912 -250 -1188 -1116 -318 597 1214 983 -63 -1095 -1183 -426 492
2684 492 1136 1078 142 -988 -1189 -491 337 1049 1121 299 -890 -1236 -682 210 958 1174 513 -695 -1262 -801
2704 -801 126 873 1151 565 -490 -1269 -933 -25 784 1140 758 -366 -1184 -969 -103 633 1119 894 -174
2723 -174 -1120 -1099 -270 585 1083 894 44 -993 -1115 -401 563 1026 955 158 -815 -1154 -473 394 904 969 354
2744 354 -779 -1213 -618 222 873 995 417 -619 -1191 -801 105 890 1059 532 -401 -1150 -890 69 786
2763 786 997 654 -290 -1140 -936 -94 628 1000 762 -130 -981 -989 -318 546 1034 787 -28 -840 -1142 -456 622
2784 622 950 805 80 -862 -1136 -470 372 866 856 209 -647 -1057 -613 141 894 964 382 -464 -995 -727 63
2805 63 816 950 480 -387 -1062 -904 14 811 982 536 -342 -1047 -844 -99 636 947 627 -232 -872 -918 -329
2826 -329 506 942 654 15 -730 -961 -401 458 921 718 120 -716 -1050 -423 383 866 806 250 -660 -1036
2846 -1036 -522 222 898 898 250 -512 -921 -707 29 817 887 453 -318 -987 -859 81 682 850 598 -291 -945
2867 -945 -813 -64 501 920 613 -218 -829 -838 -283 496 921 651 15 -703 -953 -329 446 788 712 86 -692
2888 -692 -932 -374 350 778 705 220 -592 -931 -480 204 762 802 298 -466 -903 -637 106 690 760 392 -255
2909 -255 -883 -740 105 609 766 495 -287 -850 -718 -81 529 747 529 -132 -732 -788 -245 479 767 500
2929 500 33 -661 -868 -333 423 718 643 123 -570 -888 -389 346 719 697 187 -522 -850 -440 245 702 653
2950 653 206 -347 -819 -611 115 636 642 283 -253 -844 -722 27 555 637 388 -177 -803 -728 -120 492 775
2971 775 489 -172 -646 -740 -221 502 763 454 28 -528 -768 -307 390 677 539 85 -471 -777 -405 282
2991 282 671 663 152 -435 -746 -530 147 705 614 182 -349 -753 -586 99 653 582 305 -249 -715 -559 -46
3012 -46 604 677 313 -178 -660 -623 -195 475 704 419 -130 -535 -725 -269 413 658 452 -20 -475 -716 -346
3033 -346 311 680 521 98 -476 -746 -431 253 625 586 93 -429 -621 -463 142 625 620 206 -263 -649 -564
3054 -564 65 555 602 256 -296 -680 -517 -16 478 657 295 -154 -623 -564 -110 445 706 439 -76 -563 -622
3075 -622 -198 416 666 417 8 -500 -625 -273 295 563 495 73 -445 -699 -311 265 593 502 130 -379 -665
3096 -665 -385 116 600 531 235 -332 -623 -462 67 465 532 258 -254 -604 -494 -18 491 550 246 -140 -573
3117 -573 -558 -130 381 608 321 -101 -502 -587 -152 405 592 427 -55 -411 -609 -258 341 578 411 96 -349
3138 -349 -620 -334 242 597 465 64 -350 -579 -346 152 547 529 177 -337 -555 -453 62 509 587 129 -257
3159 -257 -484 -474 -14 550 503 177 -182 -495 -519 -119 449 563 266 -77 -463 -540 -192 345 565 316 -36
3180 -36 -381 -526 -317 267 558 436 82 -391 -500 -300 164 509 404 20 -324 -470 -425 133 546 478 133
3201 133 -252 -489 -409 4 487 486 127 -190 -457 -470 -102 425 524 193 -171 -450 -446 -90 337 541 241 -142
3223 -142 -399 -462 -212 266 567 340 -38 -346 -395 -246 268 492 330 24 -298 -437 -265 114 518 480 41
3244 41 -296 -523 -349 90 465 439 56 -270 -492 -387 47 437 519 167 -236 -412 -377 -50 325 543 180
3265 180 -168 -436 -356 -117 237 539 252 -159 -377 -360 -198 227 482 336 -97 -372 -379 -184 273 506 393
3286 393 38 -341 -445 -296 150 445 421 72 -280 -462 -247 73 386 436 95 -269 -415 -305 -35 382 461
3307 461 123 -197 -380 -314 -87 337 394 258 -114 -327 -354 -59 272 421 292 -111 -359 -317 -148 173 386
3328 386 309 -90 -310 -386 -214 149 398 354 21 -285 -371 -232 107 402 332 6 -283 -388 -290 46 363 387
3350 387 46 -188 -344 -306 -72 338 361 63 -196 -290 -321 -57 357 347 167 -72 -278 -286 -39 231 427 248
3372 248 -105 -312 -361 -116 161 353 261 -102 -271 -293 -180 143 331 336 -29 -248 -318 -216 82 386 381 77 -201
3395 -201 -369 -231 -3 350 408 47 -201 -357 -301 -14 279 352 82 -101 -270 -311 -34 290 348 154 -136 -321
3417 -321 -251 -75 163 340 278 -108 -305 -268 -123 170 355 228 -25 -269 -328 -230 88 367 323 16 -230 -309
3439 -309 -165 96 312 300 70 -262 -360 -232 -73 337 432 150 -211 -253 -264 -73 275 354 125 -70 -305 -283
3461 -283 12 269 378 230 -69 -260 -260 -147 139 378 239 -103 -303 -252 -141 89 354 250 -45 -206 -282
3482 -282 -177 105 346 349 66 -263 -382 -193 60 278 376 118 -234 -281 -212 -52 232 350 120 -184 -299 -254
3504 -254 -42 284 390 192 -126 -275 -285 -52 213 274 247 -14 -279 -235 -88 157 285 248 -57 -199 -304 -134
3526 -134 103 282 252 -33 -218 -319 -189 74 270 287 61 -235 -300 -170 19 257 308 130 -182 -275 -169 -17
3548 -17 226 306 105 -112 -247 -245 -43 207 329 122 -154 -242 -256 -52 184 292 204 -69 -309 -243 -115 122 295
3571 295 265 0 -247 -295 -191 86 288 274 -29 -217 -283 -133 63 268 297 106 -198 -283 -174 -2 269 290
3593 290 87 -123 -232 -195 -21 236 311 146 -100 -287 -247 -63 172 325 144 -70 -288 -202 -72 187 267 223
3615 223 -55 -280 -240 -120 144 253 233 -41 -274 -289 -157 102 335 271 -9 -225 -259 -173 30 204 299 57
3637 57 -181 -284 -152 56 254 301 164 -146 -228 -172 -6 156 271 211 -147 -237 -187 6 147 292 121 -144
3659 -144 -334 -215 -43 154 259 244 -13 -298 -255 -122 92 288 246 -24 -236 -283 -92 79 221 266 28 -244
3681 -244 -254 -159 27 221 321 60 -244 -330 -152 26 254 301 88 -175 -168 -190 -12 178 279 141 -101 -261
3703 -261 -220 -18 169 268 230 -139 -271 -272 -50 197 303 178 -57 -312 -240 -90 112 236 239 -15 -249 -185 -127
3726 -127 91 280 236 3 -222 -278 -104 61 205 286 79 -177 -234 -210 30 213 230 152 -173 -297 -238 12 200
3749 200 255 152 -150 -322 -272 -11 198 297 160 -121 -314 -269 -40 127 262 213 -45 -286 -287 -93 145 267
3771 267 194 16 -258 -228 -84 82 229 238 62 -204 -228 -155 73 282 267 45 -194 -273 -189 34 232 215 165 -144
3795 -144 -298 -145 -4 196 302 186 -133 -275 -247 -63 172 264 188 -106 -283 -270 -71 103 231 219 -40 -248
3817 -248 -259 -80 111 271 198 -23 -256 -253 -35 70 280 274 79 -217 -242 -118 43 263 236 102 -193 -218 -163
3840 -163 61 218 306 100 -198 -301 -172 1 173 313 166 -210 -301 -181 -12 219 294 123 -85 -258 -258 9
3862 9 135 227 161 -42 -263 -231 -96 150 269 235 40 -254 -250 -100 75 254 269 95 -192 -324 -192 107 267
3885 267 311 148 -200 -366 -159 68 249 266 205 -158 -340 -168 33 219 277 182 -114 -336 -234 -44 165 269
3907 269 143 -72 -247 -286 -50 209 219 195 27 -267 -345 -36 167 220 222 -6 -234 -290 -133 144 250 257 -32
3930 -32 -200 -311 -188 173 297 240 85 -194 -353 -92 118 175 249 97 -201 -336 -224 57 229 300 164 -61
3952 -61 -295 -204 -29 218 319 107 -77 -295 -337 -77 231 295 226 -56 -334 -372 -82 191 248 231 10 -239 -286
3975 -286 -150 148 355 229 9 -171 -327 -128 80 321 264 25 -172 -382 -210 127 252 258 69 -156 -310
3996 -310 -155 52 236 275 92 -152 -279 -238 -47 242 238 87 -66 -271 -295 -29 226 265 206 -27 -280 -301 -68
4019 -68 164 261 226 -29 -254 -334 -157 145 275 240 10 -235 -302 -104 154 277 219 -13 -174 -329 -193 171
4041 171 201 231 142 -216 -324 -227 48 288 315 98 -177 -284 -246 2 281 285 170 -64 -335 -269 -5 267 299
4064 299 173 -71 -348 -267 -84 174 279 187 -22 -231 -301 -148 184 308 270 -28 -252 -306 -196 209 296 251
4086 251 57 -282 -369 -148 137 284 242 22 -251 -283 -254 85 221 278 96 -139 -325 -253 5 287 312 151
4108 151 -84 -341 -295 -3 277 296 175 -84 -270 -297 -17 226 324 216 -34 -261 -313 -145 229 309 199 58
4130 58 -220 -395 -94 213 345 283 0 -188 -363 -140 116 282 227 39 -217 -327 -190 88 273 266 40 -140
4152 -140 -307 -295 68 296 260 104 -151 -344 -256 7 228 284 145 -107 -287 -339 -68 239 330 120 -48 -229
4174 -229 -291 -98 209 302 156 -58 -192 -309 -172 156 355 189 -20 -227 -351 -180 127 268 243 61 -130
4195 -130 -388 -238 51 334 285 -8 -171 -314 -270 49 359 330 108 -94 -288 -259 13 246 319 131 -135 -298
4217 -298 -267 8 255 336 145 -89 -236 -290 -130 176 322 204 -56 -188 -331 -110 178 304 222 -24 -162
4238 -162 -355 -194 156 295 241 29 -262 -340 -177 89 343 278 41 -177 -270 -243 55 233 348 72 -188 -267
4260 -267 -188 27 257 335 128 -81 -275 -347 1 261 291 147 -30 -272 -240 -98 190 327 225 -23 -285 -299
4282 -299 -101 208 348 256 -24 -188 -265 -151 150 361 236 9 -225 -315 -201 103 264 306 25 -194 -341
4303 -341 -255 18 308 330 103 -160 -306 -261 50 286 300 164 -155 -302 -295 -2 296 296 131 -41 -256 -274 -69
4326 -69 185 368 189 -58 -251 -311 -148 177 342 215 -36 -215 -277 -163 153 342 282 -12 -224 -297 -162 141
4348 141 307 277 -15 -194 -333 -228 59 334 310 44 -139 -270 -263 4 242 327 36 -114 -271 -204 -39 235
4370 235 354 143 -90 -287 -304 -73 235 389 207 -87 -207 -235 -121 162 342 182 -114 -236 -261 -184 160
4391 160 419 242 -6 -222 -269 -170 131 320 312 -12 -203 -266 -229 37 304 253 10 -246 -231 -249 9 348 369
4414 369 130 -217 -265 -276 -10 263 319 131 -176 -310 -204 -43 226 375 193 -109 -334 -263 -132 166 360
4435 360 191 -56 -226 -273 -149 148 299 245 -52 -258 -338 -125 130 285 340 -2 -216 -270 -189 48 370 281
4457 281 60 -241 -316 -220 59 267 287 83 -120 -322 -222 46 322 345 66 -199 -359 -211 -4 175 357
4478 357 184 -166 -246 -251 -102 199 373 189 -67 -312 -237 -68 158 275 234 15 -262 -267 -97 122 386 287 25
4501 25 -265 -305 -137 76 321 274 -48 -250 -243 -156 82 332 259 68 -161 -302 -166 70 262 336 70 -164 -292
4524 -292 -219 -34 262 343 150 -146 -290 -250 -74 218 351 127 -71 -283 -313 -31 166 366 262 -36 -297
4545 -297 -277 -79 114 300 322 -13 -219 -330 -158 127 353 283 30 -244 -355 -165 97 290 309 32 -232
4566 -232 -367 -186 66 298 284 97 -237 -327 -158 -6 278 330 123 -159 -272 -233 -12 226 350 163 -63
4587 -63 -284 -276 25 177 346 255 -80 -321 -224 -56 151 320 241 -74 -313 -270 -118 98 349 305 4 -281 -248
4610 -248 -87 83 263 274 79 -250 -342 -138 70 254 234 74 -211 -286 -199 77 262 333 95 -215 -339 -206
4632 -206 17 186 289 177 -136 -325 -190 -37 247 297 194 -128 -327 -274 -80 164 417 262 -94 -370 -256
4653 -256 -56 148 303 214 -1 -284 -299 -38 126 239 280 3 -269 -296 -89 85 263 269 104 -255 -306 -123
4675 -123 88 234 259 139 -209 -316 -154 23 226 328 115 -157 -290 -225 20 187 324 220 -120 -286 -230
4696 -230 -36 202 301 229 -71 -317 -289 -100 94 291 222 -31 -289 -310 -77 143 263 233 26 -263 -289 -125
4718 -125 136 279 292 51 -237 -347 -142 88 301 289 119 -159 -304 -243 64 216 238 114 -165 -292 -180
4739 -180 8 233 271 144 -138 -334 -241 0 174 268 91 -102 -287 -243 -36 160 271 171 -33 -307 -272 -69
4761 -69 205 270 231 5 -280 -251 -72 127 312 235 3 -194 -341 -105 94 238 275 35 -189 -272 -137 98
4783 98 301 296 69 -146 -316 -164 55 235 268 62 -155 -325 -250 8 277 262 202 -107 -347 -300 37 119 314
4806 314 148 -77 -292 -270 -48 201 258 203 -72 -341 -311 -48 192 287 261 76 -277 -285 -42 178 234 206 30
4829 30 -235 -310 -137 120 181 277 70 -140 -361 -151 79 265 265 81 -194 -290 -212 76 231 217 140 -77 -288
4852 -288 -283 12 188 253 175 -133 -310 -296 -56 244 244 204 18 -308 -235 -10 167 267 228 -1 -241 -296 -116 161
4876 161 256 197 30 -262 -305 -120 131 214 141 87 -237 -266 -154 196 285 212 15 -162 -339 -221 115 240 233 99
4900 99 -145 -317 -260 47 269 267 125 -109 -273 -246 -12 196 265 205 -8 -284 -313 -67 172 252 160 21 -241
4923 -241 -288 -66 145 246 152 -32 -223 -313 -153 129 249 169 56 -192 -298 -177 138 216 240 15 -137 -319
4945 -319 -188 89 304 203 64 -132 -293 -156 91 234 246 45 -92 -244 -242 19 287 306 53 -29 -280 -309
4967 -309 27 242 257 137 -117 -223 -311 -21 200 256 213 -16 -289 -252 -90 156 286 201 -6 -258 -331 -138
4989 -138 102 303 187 11 -185 -303 -191 90 272 216 78 -201 -309 -205 89 280 258 56 -187 -293 -223
5010 -223 52 261 206 73 -102 -292 -297 18 254 235 116 -103 -271 -287 -23 235 278 100 -29 -272 -259 -57
5032 -57 163 256 113 -84 -239 -223 -71 136 255 132 24 -161 -335 -114 101 270 203 10 -169 -269 -92
5053 -92 160 246 230 65 -165 -299 -209 50 282 253 90 -120 -316 -233 2 200 198 61 -97 -237 -215 20 190
5076 190 213 131 -93 -253 -226 -47 159 249 161 -72 -184 -293 -114 186 262 131 -56 -187 -261 -119 169 297
5098 297 149 -5 -198 -280 -177 110 278 245 28 -147 -255 -128 105 237 202 21 -117 -252 -215 51 285
5119 285 247 47 -156 -300 -225 -59 232 244 46 -102 -226 -189 -32 213 272 78 -142 -199 -270 -77 189 307
5141 307 143 -47 -189 -207 -95 183 287 121 -96 -246 -238 -145 181 320 199 -72 -186 -178 -111 74 242 224 8
5164 8 -152 -197 -191 39 281 242 -5 -200 -195 -213 6 221 233 28 -153 -293 -164 -21 197 215 153 -120 -204 -178 -44
5189 -44 213 295 144 -85 -208 -201 -75 107 260 148 -38 -250 -214 -72 158 252 207 -36 -235 -224 -105 93 298
5212 298 219 -24 -176 -227 -143 79 291 237 21 -134 -204 -144 17 225 212 48 -160 -180 -173 47 252 276 142 -139
5236 -139 -273 -173 -25 204 253 115 -71 -141 -176 -59 179 266 135 -84 -195 -213 1 146 273 172 -63 -187
5258 -187 -213 -55 137 265 236 -3 -183 -187 -121 82 317 242 -32 -146 -282 -196 51 272 234 30 -172 -229 -182
5281 -182 33 233 294 25 -173 -193 -182 -45 250 312 64 -102 -194 -168 14 217 266 117 -96 -228 -184 -70 73
5304 73 267 96 -97 -248 -236 -62 125 271 143 -115 -176 -223 -101 77 263 190 -67 -175 -241 -177 62 222
5326 222 256 0 -200 -195 -115 -6 219 207 94 -203 -241 -154 11 180 279 111 -157 -274 -116 -17 207 302 121
5349 121 -194 -241 -147 -42 150 274 172 -28 -187 -171 -37 92 249 200 -72 -236 -200 -126 92 249 219 -55
5371 -55 -207 -207 -71 67 170 242 25 -237 -203 -59 64 235 272 49 -207 -197 -153 79 234 297 38 -171 -234
5394 -234 -98 10 148 229 153 -105 -262 -126 -2 154 192 151 -136 -266 -199 -15 92 287 138 -72 -240 -168
5416 -168 -84 141 272 193 -33 -219 -160 -55 155 214 198 36 -244 -247 -60 131 229 213 17 -185 -228 -107 51
5439 51 220 154 21 -183 -255 -74 52 182 247 71 -100 -242 -123 17 179 261 104 -177 -188 -175 -25 129
5461 129 282 116 -75 -223 -145 -10 146 228 132 -65 -256 -152 -32 108 228 221 -38 -195 -182 -105 105 162 231
5484 231 -5 -213 -186 -140 106 190 229 2 -173 -251 -115 38 193 223 53 -125 -259 -115 11 175 192 78
5506 78 -154 -221 -133 54 194 150 108 -138 -222 -135 -36 126 192 122 -74 -242 -164 -86 131 235 159 -53 -217 -235 -60
5531 -60 90 235 209 -28 -230 -203 -69 90 225 257 -28 -205 -267 -132 47 189 188 32 -215 -274 -103 73 156
5554 156 279 57 -152 -221 -148 57 146 213 100 -183 -211 -180 72 159 182 127 -65 -242 -166 -17 118 209 166 -72
5578 -72 -268 -167 21 134 175 189 -31 -236 -242 -3 180 205 236 4 -199 -247 -47 123 159 189 32 -168 -212 -80
5602 -80 97 202 191 61 -87 -277 -136 84 210 232 94 -157 -262 -155 38 173 240 104 -114 -253 -139
5623 -139 75 170 133 133 -71 -216 -239 4 218 161 98 -5 -238 -272 -50 113 180 126 -29 -201 -256 -91 75 229
5647 229 151 20 -184 -212 -114 137 179 115 69 -135 -239 -157 102 163 144 66 -117 -298 -79 101 171 255 61 -90
5671 -90 -252 -144 76 206 178 57 -88 -236 -211 26 175 177 66 -27 -228 -228 3 103 182 189 -47 -208 -189 -89
5695 -89 95 214 144 -27 -195 -169 -83 142 180 92 3 -140 -171 -82 119 201 151 97 -104 -199 -93 38 193 142 80
5720 80 -140 -194 -136 47 224 147 30 -68 -240 -165 0 215 197 136 -90 -174 -230 -1 193 240 130 -53 -220 -182
5744 -182 -21 128 139 170 1 -181 -158 -86 145 199 130 -14 -123 -245 -100 113 179 158 -18 -141 -251 -40 50
5767 50 181 175 14 -175 -216 -129 120 201 177 -5 -95 -189 -174 51 209 229 78 -97 -265 -187 -8 161 164 40 -76
5792 -76 -223 -185 -10 152 200 75 -87 -166 -210 -46 143 300 120 9 -111 -248 -38 96 197 195 -16 -147
5814 -147 -249 -92 92 201 127 44 -129 -279 -116 94 201 107 39 -167 -278 -157 52 181 133 48 -56 -241
5836 -241 -171 83 197 214 74 -70 -205 -197 15 211 174 70 -64 -194 -239 -7 211 226 86 -44 -222 -251 -63
5859 -63 161 164 131 -38 -95 -211 -86 87 248 138 -46 -145 -209 -184 68 189 158 20 -134 -177 -229 93 227 114
5883 114 -9 -125 -169 -257 38 243 262 83 -95 -196 -130 42 179 228 52 -114 -173 -233 -55 239 200 41 -9
5906 -9 -166 -166 -38 165 203 83 -53 -201 -162 -110 160 241 135 -3 -179 -196 -123 93 188 122 -23 -120 -130 -97 53
5931 53 207 167 34 -174 -261 -170 62 148 209 -11 -137 -158 -119 8 207 224 64 -34 -172 -179 23 190 152 40
5955 40 -71 -197 -157 -68 129 220 64 -64 -147 -115 -51 164 210 101 -57 -177 -155 -87 179 199 124 -3 -217 -220 -89
5980 -89 75 186 115 -32 -154 -247 -157 68 232 185 -2 -133 -192 -132 28 218 176 40 -119 -161 -215 19 171
6003 171 177 81 -100 -227 -160 0 163 191 102 -82 -137 -171 -3 139 250 56 -51 -147 -186 -73 81 210 142 -70
6027 -70 -147 -249 -57 177 259 122 -23 -150 -132 -136 52 181 168 22 -127 -144 -164 41 254 205 -7 -147 -202 -137
6051 -137 1 177 163 78 -114 -198 -157 1 158 235 63 -81 -174 -111 -51 133 228 77 -75 -127 -147 -64 119 252
6075 252 78 -86 -119 -235 -52 149 238 166 -48 -170 -139 -142 126 222 128 -58 -129 -188 -152 1 218 190 -16 -135
6099 -135 -218 -158 49 166 148 -16 -173 -149 -159 -50 211 186 21 -146 -166 -92 -31 173 262 91 -103 -196 -209 -45
6123 -45 150 279 73 -99 -232 -161 -57 119 217 113 -36 -177 -136 -73 41 211 131 -43 -112 -193 -84 45 221
6146 221 193 -21 -144 -210 -68 1 240 136 22 -189 -192 -74 56 193 191 65 -99 -172 -102 -55 171 224 93 -129
6170 -129 -153 -144 -12 184 183 81 -104 -178 -187 -61 103 218 128 -42 -162 -156 -56 136 214 158 -62 -156 -169 -37 46
6195 46 185 151 -29 -149 -137 -60 13 223 157 -90 -137 -180 -104 22 174 147 7 -110 -170 -117 -9 201 168 3
6219 3 -63 -202 -108 30 178 235 112 -114 -187 -152 -30 113 264 76 -49 -140 -135 -20 177 234 92 -54 -266 -127
6243 -127 -29 84 202 200 -16 -181 -193 -20 47 221 108 -55 -123 -155 -36 26 190 133 22 -103 -198 -48 73
6266 73 183 210 77 -125 -197 -72 -21 143 211 88 -117 -172 -117 -26 96 165 105 -111 -255 -180 -44 97 165 151
6290 151 -78 -195 -132 -15 42 189 140 -64 -208 -185 -41 47 237 191 -70 -173 -188 -72 86 223 183 -24 -197
6313 -197 -131 -93 105 96 202 48 -173 -154 -133 12 146 193 85 -145 -209 -129 23 110 153 104 -139 -206 -153 34 118
6338 118 197 98 -77 -149 -209 -18 69 158 211 -67 -121 -243 -2 97 194 152 -7 -221 -199 -139 83 181 168 -14 -153
6363 -153 -209 -89 99 124 166 65 -141 -192 -47 139 136 187 63 -118 -169 -55 68 144 227 57 -86 -240 -102
6386 -102 93 172 204 115 -88 -196 -193 18 126 152 122 -80 -211 -97 -42 118 159 138 -32 -180 -242 -18 115 133
6410 133 152 13 -186 -153 -32 98 164 135 22 -156 -186 -109 40 191 202 45 -154 -149 -114 54 151 206 72 -147
6434 -147 -179 -92 22 138 174 68 -90 -214 -148 10 109 173 134 -89 -200 -178 -39 115 123 114 -115 -139 -193 20 85
6459 85 141 88 -15 -154 -198 -33 71 172 159 49 -168 -202 -68 76 130 135 39 -115 -226 -59 84 113 138 65
6483 65 -74 -175 -133 53 125 123 103 -51 -223 -140 28 121 176 80 -84 -239 -88 -60 124 199 78 -35 -197 -138
6507 -138 -76 115 108 97 17 -193 -167 -39 93 156 76 9 -114 -191 -88 108 138 150 43 -150 -199 -113 47 124 147
6532 147 81 -67 -226 -92 84 150 146 42 -111 -200 -138 2 109 116 96 -17 -205 -112 70 116 147 139 -8 -231 -203
6557 -203 -1 132 149 121 -25 -142 -178 -60 75 174 59 -11 -194 -178 -66 107 192 125 -1 -119 -160 -119 121
6580 121 101 84 44 -97 -179 -118 33 125 142 52 -84 -194 -86 51 161 168 113 -39 -200 -152 32 164 176 121 -73
6605 -73 -157 -201 3 167 166 121 -79 -192 -201 -59 76 171 70 -4 -199 -235 -81 97 146 93 17 -120 -174 -68 52
6630 52 150 111 19 -141 -162 -62 44 143 89 57 -83 -165 -96 61 161 114 80 -72 -178 -102 36 146 132 59 -87
6655 -87 -145 -155 2 196 141 65 -78 -194 -187 -53 85 177 72 -4 -122 -190 -57 128 219 102 11 -173 -164 -143 87
6680 87 157 137 -3 -81 -185 -87 116 125 88 62 -42 -133 -73 25 165 146 75 -85 -199 -86 60 170 142 39 -89
6705 -89 -162 -141 -47 148 189 12 -77 -153 -173 -23 158 136 66 -47 -150 -226 -54 147 154 95 -39 -137 -169 -59 89
6730 89 157 97 -3 -78 -224 -87 42 146 117 -58 -107 -146 -171 69 121 140 26 -97 -188 -133 1 175 207 32
6754 32 -85 -169 -153 32 164 143 28 -97 -158 -216 -59 131 135 49 -68 -218 -160 -13 146 137 112 -95 -208 -167 -79
6779 -79 70 159 139 -22 -120 -191 -70 153 182 88 26 -86 -236 -160 117 165 197 49 -112 -182 -140 42 211 179 -3
6804 -3 -54 -156 -147 14 156 101 51 -1 -183 -127 -14 119 144 41 -44 -138 -166 -36 150 131 32 -57 -147 -145 -14 118
6830 118 209 88 12 -102 -119 -75 99 159 75 24 -125 -162 -63 64 134 112 41 -122 -164 -129 19 142 119 12 -88
6855 -88 -117 -136 22 167 176 43 -54 -146 -162 -53 130 177 66 -52 -169 -179 -36 119 160 80 -79 -129 -137 -49 101
6880 101 189 53 -25 -76 -114 -128 96 156 52 -11 -112 -136 -95 105 143 106 -25 -69 -168 -86 -14 162 125 -7 -128
6905 -128 -112 -79 41 215 88 14 -58 -137 -138 -32 132 173 36 -91 -125 -91 19 76 161 99 -64 -112 -135 -43 164
6930 164 175 55 -69 -102 -91 -104 40 176 118 -51 -130 -186 -14 87 182 117 12 -42 -119 -78 15 224 103 -14
6954 -14 -144 -91 -95 58 207 162 -5 -89 -118 -124 -61 100 114 47 -95 -121 -92 -42 137 212 27 -150 -134 -143 -87 84 165
6981 165 86 -116 -140 -127 -24 77 173 92 -91 -129 -109 -62 73 140 82 -53 -120 -142 -39 37 180 77 -22 -56 -145
7006 -145 -125 9 137 170 32 -131 -120 -121 2 110 161 26 -71 -181 -102 -78 108 151 18 -42 -166 -149 -77 82
7030 82 155 81 -73 -104 -139 -15 87 150 87 -34 -108 -79 -39 54 122 149 -54 -152 -108 -130 47 202 106 -67 -116 -109 -116
7057 -116 -4 102 77 11 -55 -70 -70 12 157 150 10 -110 -64 -116 5 125 124 76 -71 -236 -89 -3 80 169 104 -104
7083 -104 -133 -112 -54 31 120 72 -62 -108 -132 -34 18 182 84 -63 -151 -125 -13 28 156 102 5 -106 -107 -79 18 159 130
7110 130 11 -107 -159 -116 44 142 118 -2 -95 -171 -91 22 132 165 36 -79 -118 -113 -59 110 169 51 -66 -120 -171
7135 -171 -8 71 169 80 -96 -119 -105 -60 40 189 73 -22 -118 -129 -62 6 184 71 -20 -120 -141 -31 9 99 114
7160 114 -29 -134 -145 -68 -18 158 143 11 -135 -198 -82 5 98 156 36 -80 -118 -93 -11 66 128 73 -93 -160 -65
7185 -65 -75 92 120 102 -48 -116 -105 -7 46 97 110 -43 -171 -103 -86 51 140 105 29 -188 -139 -62 113 161 137 -21
7211 -21 -160 -127 -51 -13 50 194 9 -153 -117 -43 5 77 122 30 -119 -207 -50 -36 64 237 12 -93 -128 -54 0
7236 0 18 148 82 -94 -110 -128 10 86 114 87 -16 -151 -147 -14 50 161 117 -47 -50 -124 -72 7 142 141 21 -83 -121
7263 -121 -20 98 123 150 20 -87 -124 -84 36 54 99 7 -118 -197 -71 -10 67 129 72 -98 -148 -83 16 58 174
7288 174 83 -49 -174 -66 10 135 75 107 18 -153 -119 -5 127 127 95 -40 -120 -129 -19 129 121 149 11 -170 -171 -9
7314 -9 93 116 90 78 -94 -161 -39 10 74 101 83 -90 -143 -83 34 81 146 27 -65 -124 -111 30 38 91 81 -44 -127
7341 -127 -95 44 79 67 57 -18 -190 -79 5 71 140 104 -92 -117 -157 -35 62 156 48 -30 -138 -159 -26 85 83 39
7367 39 44 -87 -74 -115 52 97 129 43 -113 -201 -27 64 99 102 -15 -92 -114 -85 59 88 107 70 -34 -162 -137 0 77
7394 77 92 43 -87 -156 -102 10 42 95 105 -41 -91 -133 10 42 92 89 -17 -88 -187 -62 55 98 112 -5 -126 -161
7420 -161 11 72 83 167 19 -100 -139 -73 -11 63 125 20 -78 -127 -124 33 119 116 86 -45 -159 -80 22 48 93 89 -27
7447 -27 -147 -91 -6 36 167 73 50 -98 -87 -30 18 132 41 27 -107 -141 6 61 70 84 -10 -111 -107 -83 61 92 61
7474 61 43 -80 -99 -80 61 179 153 73 -43 -103 -78 79 94 87 52 -70 -114 -86 49 77 104 57 -63 -124 -86 39
7500 39 52 89 107 -53 -143 -108 8 88 73 43 -46 -135 -157 -95 48 108 84 40 -96 -128 -46 46 89 69 34 -73 -154 -52
7528 -52 12 126 91 44 -40 -125 -88 38 145 84 74 -72 -139 -114 103 47 112 65 -29 -136 -147 44 103 136 109 -50
7554 -50 -118 -149 -9 96 56 24 -9 -91 -94 -50 49 46 35 -17 -93 -143 -46 23 108 53 37 -44 -156 -19 45 100 89 4 -75
7583 -75 -72 -103 39 43 44 33 -78 -138 -15 17 45 115 31 -16 -88 -80 -23 121 51 0 -14 -148 -122 -63 56 95 39 -30 -72
7612 -72 -91 -8 95 139 97 15 -92 -98 -108 65 152 49 -3 -55 -160 -100 33 125 55 15 -36 -104 -95 50 115 91 -2 -70
7640 -70 -45 -122 -1 66 115 12 -30 -138 -77 0 110 94 93 6 -106 -122 -15 101 97 97 -33 -113 -88 -64 116 60 42
7667 42 3 -124 -85 -46 44 118 43 15 -80 -176 21 42 69 16 24 -24 -84 -66 56 160 88 -12 -68 -116 -106 12 115
7694 115 128 12 -48 -120 -56 57 82 68 95 -50 -114 -70 2 37 61 19 -45 -102 -157 -2 87 51 32 -42 -32 -151 -40
7721 -40 58 134 64 20 -79 -190 -92 55 100 57 35 -73 -102 -101 67 121 99 51 -16 -125 -91 56 82 140 23 -53 -65
7748 -65 -113 -7 68 85 43 -109 -57 -41 3 90 89 -2 -16 -94 -124 -65 100 92 -29 -28 -80 -150 -63 101 118 12 -7 -57 -60
7777 -60 -67 43 71 29 21 -77 -64 -89 24 135 61 -31 -77 -85 -59 39 133 85 20 -4 -21 -80 -23 70 64 83 -79 -88 -37 -74 78
7808 78 68 -8 -95 -67 -89 -32 80 169 45 -2 -79 -97 -55 67 92 99 18 -61 -123 -28 57 73 34 1 -47 -96 -74 35 117
7837 117 78 15 -53 -84 -110 44 169 50 -23 13 -85 -99 -21 120 70 -37 -65 -60 -119 -23 120 79 43 -85 -56 -59 -46
7864 -46 81 94 5 22 -96 -113 7 92 120 64 -3 -50 -70 -75 84 139 20 -9 -58 -109 -85 73 176 70 -9 -40 -101
7891 -101 -69 59 98 118 -24 -56 -104 -40 31 79 144 -17 -90 -101 -72 -8 60 132 31 -46 -19 -67 -41 79 101 12 -68
7918 -68 -89 -45 -19 92 156 -16 -53 -98 -69 -15 74 106 71 -35 -51 -54 -91 55 103 53 -14 -69 -111 -78 -55 60 126 40
7946 40 -112 -39 -43 4 73 109 -11 -65 -84 -73 -4 53 123 -32 -21 -146 -99 -1 63 90 37 -63 -91 -130 9 67 77 60
7974 60 -33 -66 -26 -26 40 96 30 -62 -115 -81 -141 -64 120 77 -34 -85 -121 -62 23 90 44 -60 -42 -116 -74 -8 39 58 26
8003 26 -85 -32 -57 -57 98 99 21 -123 -113 -103 18 97 49 104 -45 -88 -104 -20 60 92 51 2 -55 -79 -41 15 139 53
8031 53 24 -68 -75 -45 42 80 -3 -92 -78 -62 -14 116 88 32 -80 -50 -55 -49 49 37 124 0 -56 -36 -32 21 86 74 34 -68
8061 -68 -80 -38 4 77 111 -12 -87 -111 -45 -39 107 70 14 -87 -92 -29 -28 43 70 54 -20 -133 -99 -24 -28 72 73 0 -69 -117
8091 -117 -45 -33 85 64 -22 -82 -25 -31 -21 89 114 -2 -41 -97 -65 59 67 55 37 -73 -81 -50 -48 33 86 4 -73 -80 -58 -39
8121 -39 71 115 35 -78 -61 -91 3 18 10 73 -75 -4 -89 46 40 90 54 -7 -157 -94 -29 -12 87 58 -16 -99 -58 -21 71
8150 71 37 36 58 -54 -114 -36 10 74 130 52 -64 -69 -63 -71 73 73 -24 -25 -105 -52 -21 41 101 16 -4 -78 -65 -8 19 82 54 -22
8182 -22 -84 -35 -35 -9 76 29 -70 -32 -22
8191b2
$$ Imaginary data points
##PAGE= N=2
##DATA TABLE= (X++(I..I)), XYDATA
0 0 0 0 0 0 0 0 0 0 0 0 0 0 0 0 0 0 0 8 -7 8 -8 8 -8 11 -12 16 -16 19 -24 25 -29 35 -36 43 -48 52 -60 66 -71
39 -71 81 -87 100 -110 119 -132 146 -159 178 -195 213 -238 259 -287 318 -352 393 -441 495 -563 643
60 643 -746 879 -1057 1305 -1676 2269 -3346 5685 -12792 77078 400621 265040 85863 -85196
74 -85196 -365534 -290600 62203 239387 295190 177100 -143948 -293425 -228449 -85884 200368
85 200368 352264 163822 -71793 -246389 -324552 -95734 220910 293156 204274 209 -276742
96 -276742 -328431 -93120 172884 293951 219912 -1708 -230461 -308181 -135179 143982 273794
107 273794 216928 31669 -198879 -276134 -151802 55417 256352 270638 44142 -166268
117 -166268 -247529 -212006 23703 267582 254151 87588 -123064 -295993 -205552 47915 192802
128 192802 246618 150592 -134455 -277299 -169615 -20324 158624 274398 132781 -93819
138 -93819 -205825 -221023 -72733 171703 249040 143755 -25124 -207364 -247192 -75527 132184
149 132184 239148 189115 -21481 -210358 -216846 -93658 86477 237553 198533 -8850 -172957
160 -172957 -204602 -124475 57368 219221 199711 33586 -137051 -221454 -149805 47015 197402
171 197402 198312 72157 -117204 -228041 -152670 24232 170071 208471 90509 -101747 -202646
182 -202646 -163046 -16523 159353 212711 96314 -69492 -182059 -180752 -38312 138407 201087
193 201087 120952 -39154 -175781 -185571 -58346 109944 198190 142044 -18296 -164726 -188666
204 -188666 -74301 89111 187173 152555 3012 -145817 -181672 -94866 60165 180662 158640
215 158640 21995 -114331 -181830 -123219 45538 169677 158062 52078 -96982 -187918 -125853
226 -125853 23285 145215 174596 69383 -91341 -167384 -133519 -11986 139729 177886 72528
237 72528 -60008 -153260 -154019 -24090 123709 164272 98207 -35749 -153913 -152483 -41773
248 -41773 94391 170619 115501 -27660 -135680 -152952 -68211 81991 168285 118554 -4772
259 -4772 -120082 -158850 -78842 62322 154494 132782 14236 -109636 -152224 -93245 37188
270 37188 148248 141236 29899 -91184 -150539 -107397 20500 135004 146204 49891 -78683
281 -78683 -146152 -112900 -1373 120136 152317 63023 -62673 -136003 -123207 -19828 108072
292 108072 150425 78315 -43341 -131875 -128071 -32582 88420 147796 95010 -29282 -122773
303 -122773 -127919 -50907 69785 146416 105763 -12392 -110876 -132561 -64614 55633 138359
314 138359 114925 5995 -101621 -132686 -73296 37357 127773 123628 22893 -88941 -130794
325 -130794 -85234 20080 118110 128921 39685 -74899 -129773 -94060 5864 105752 131065
336 131065 55377 -60661 -125232 -100489 -9828 91938 131764 69683 -44944 -119451 -107459
347 -107459 -24606 78497 130057 82121 -29151 -112809 -112373 -36836 65225 125335 92150 -12488
359 -12488 -103802 -115553 -48283 51046 118730 101046 4267 -93684 -117892 -60321 36765 112084
371 112084 107363 19047 -82175 -118262 -70608 23860 103636 110591 33416 -68662 -115961 -79562
383 -79562 9880 94071 113162 47037 -54761 -113114 -88627 -2974 84695 113421 58491 -41391
395 -41391 -108515 -94175 -15479 73015 112407 68834 -27547 -100619 -99073 -29123 62209 110456
407 110456 77404 -13015 -93182 -103806 -39384 50691 105130 85386 371 -84753 -103958 -50446
419 -50446 36769 100907 91341 12828 -72154 -104640 -62869 26271 95805 94095 25718 -61299
431 -61299 -104317 -69924 13912 86747 97987 36514 -51302 -98557 -76407 -1593 77806 101121
443 101121 47336 -39119 -94228 -83003 -13747 68356 101877 57763 -28131 -89641 -87457 -23841
455 -23841 59201 98574 64667 -14244 -83131 -91781 -32079 48051 92905 73607 -2181 -76816
467 -76816 -90636 -42932 33708 92527 80048 5179 -64825 -89751 -56440 24700 89172 82274
479 82274 18892 -56737 -93766 -59308 16108 77359 88776 31250 -54411 -89183 -59456 1326
491 1326 68374 91442 37835 -40750 -82128 -70314 -9454 62905 87923 49123 -24598 -83312
503 -83312 -78882 -15244 54789 87205 59009 -17938 -80614 -78026 -23581 44412 86526 63885
515 63885 -11048 -71413 -75913 -33719 32281 82232 69276 1353 -61798 -78629 -43654 23387
527 23387 76313 74183 17219 -55561 -86153 -48297 18863 68240 77965 28419 -52663 -85022
539 -85022 -49191 8506 62089 80024 30766 -41360 -74164 -59296 -4064 60061 75972 37263
551 37263 -22784 -73716 -70215 -8035 50511 72966 53988 -16132 -78783 -67044 -14704 37293
563 37293 78393 60157 -16215 -68244 -65709 -27568 35053 75229 54431 -103 -54609 -75544
575 -75544 -33410 30778 62888 60912 17639 -52990 -78427 -37886 18153 61894 70109 19587
587 19587 -48113 -72840 -46383 9991 62257 68016 22620 -36284 -68753 -52732 2773 54839
599 54839 65687 32098 -24106 -67222 -59474 -4865 47480 65182 43343 -15537 -68980 -62103
611 -62103 -10580 39499 68017 49020 -14496 -61430 -60046 -22439 35592 68608 44074 -4051
623 -4051 -46771 -67035 -30775 32526 58391 49224 13665 -46767 -70779 -31757 18557 55399
635 55399 63147 14593 -46499 -62862 -40640 9131 60839 59919 13770 -31814 -61291 -48972 8792
648 8792 52157 52912 27651 -21706 -63066 -48873 -990 39471 59841 38150 -19667 -58539 -52279
661 -52279 -13679 38539 64940 38174 -14257 -53150 -56993 -17561 36880 59407 39070 -4900
673 -4900 -48205 -57193 -20894 27276 52816 45194 4978 -43054 -57155 -28230 16633 51431 52657
686 52657 11327 -39426 -57411 -35517 10726 52825 54253 13620 -33072 -56277 -40137 8677
698 8677 48321 49424 20659 -23844 -56117 -41266 3039 37002 50813 31606 -19781 -53274
710 -53274 -42426 -8866 32593 56896 33294 -14671 -46781 -49785 -15182 34490 52424 34240
722 34240 -3533 -46547 -53321 -13456 26482 45789 42110 1253 -44484 -47924 -20635 15568 47562
735 47562 44263 5077 -33836 -50060 -31189 14334 45846 43159 14434 -29269 -54001 -32119
747 -32119 10324 39954 45984 19066 -26121 -49667 -35020 2428 37229 46278 22750 -18367
759 -18367 -47551 -39525 -2480 32739 45754 27962 -12855 -44571 -42033 -9353 29592 45852
771 45852 29767 -5614 -40563 -46878 -13143 27051 42439 33296 632 -38704 -45811 -17005 18931
784 18931 42421 36997 2817 -31903 -44343 -25956 15229 43049 36027 8888 -25762 -47385
796 -47385 -28482 12475 37058 38286 15529 -23999 -45208 -30019 4266 34930 41259 17083
808 17083 -17982 -41468 -36114 -317 34051 39283 20665 -10922 -40356 -38748 -4768 28947 40084
821 40084 25086 -7980 -37022 -39297 -11497 25229 41166 26703 -3783 -32645 -40238 -15998
833 -15998 20458 39210 30359 1468 -29897 -40377 -20269 15036 38324 32901 5218 -25901
845 -25901 -40299 -24400 11200 36045 33610 10019 -21348 -39744 -27559 5985 33496 35955
857 35955 13535 -17870 -37500 -30603 490 31507 36717 16102 -13327 -35119 -32935 -4252 27342
870 27342 36999 20809 -9415 -33913 -33863 -8528 22958 37349 24205 -6044 -31302 -34524 -12651
883 -12651 19127 36063 26367 -980 -27979 -35995 -16533 15494 34608 28787 3314 -25251 -36083
896 -36083 -19695 11179 32931 30537 6794 -21622 -34976 -23113 6429 31037 32167 10489
908 10489 -18141 -34440 -25610 2555 28282 32999 14298 -14715 -33347 -27289 -1629 24858 33482
921 33482 17826 -10644 -31618 -29556 -5457 22213 32896 20437 -6362 -29610 -31170 -8976
933 -8976 18814 32176 23047 -2426 -26799 -31919 -13153 15361 31715 24825 1180 -23658 -32383
946 -32383 -16429 11844 30143 26614 4882 -20752 -31937 -19422 7656 28693 28144 8010 -17159
959 -17159 -31333 -22563 4308 26688 28336 11551 -13509 -30800 -24591 650 23861 29337 14526
972 14526 -10527 -28711 -26575 -3698 22044 29626 16112 -6659 -26343 -28374 -7163 19321 29043
985 29043 18666 -3257 -24350 -28819 -10627 15719 28997 20965 -429 -21758 -28982 -14050 12346
998 12346 28222 22746 2416 -19282 -28654 -16927 8843 27290 23933 5027 -16122 -28135 -19638
1011 -19638 5718 25254 24834 8681 -13581 -27618 -20918 1443 22760 27101 10771 -11880 -25087
1024 -25087 -22953 -3035 21897 27511 11997 -7983 -23638 -24926 -5084 18892 26390 15554 -5061
1037 -5061 -22849 -24461 -8390 14579 27315 18338 -3277 -20511 -24737 -12074 12043 27221 19851
1050 19851 -515 -18530 -25018 -14254 9125 25847 21144 2198 -15998 -24729 -16308 6100 23419
1063 23419 22307 6287 -14218 -24709 -17149 1840 20829 25381 8647 -13006 -22576 -19603 -2265
1076 -2265 21080 25697 9352 -9019 -22187 -21879 -2340 18159 23199 13565 -6276 -22371 -20197
1089 -20197 -5346 12530 24584 16854 -4884 -19404 -21083 -10417 11275 25451 17741 -1431
1101 -1431 -18094 -23456 -11389 10240 23439 18993 1205 -17116 -22832 -11994 6990 20841 19999
1114 19999 4371 -14655 -21893 -13696 2561 18817 22555 6933 -12561 -20747 -17228 -919 19702
1127 19702 22993 8295 -8963 -21763 -19731 -55 17508 20953 12103 -7439 -22259 -17296 -2508
1140 -2508 12267 22268 13992 -6251 -17639 -18069 -8387 11499 22570 14201 -1279 -16082 -22207
1153 -22207 -9558 10695 20830 17114 1150 -17174 -21555 -9765 7591 20007 18192 1992
1165 1992 -14512 -19682 -11850 4196 18403 18870 4645 -11381 -19028 -14984 1028 18107 19674
1178 19674 6884 -8520 -19867 -17366 614 16476 19070 10120 -7624 -20286 -15734 -1747 12649
1191 12649 20935 11407 -7359 -16441 -16145 -6822 12192 21084 11102 -2816 -14623 -19592 -7507 10891
1205 10891 18550 14533 221 -16155 -18744 -7965 6769 18875 16689 -15 -13880 -17052 -11019
1218 -11019 4577 18629 16327 2404 -10783 -17683 -12941 2759 16793 17438 5600 -9651 -18015
1231 -18015 -13813 669 15109 18456 7567 -8717 -17494 -13587 -1545 12704 19036 9107 -7224
1244 -7224 -15383 -14348 -4760 11186 18881 10503 -3689 -14498 -16762 -5938 9884 17656 13125 -1414
1258 -1414 -15448 -16506 -6329 6831 17350 14947 -947 -13784 -15160 -8691 4404 16893 15148
1271 15148 1451 -10908 -15887 -10773 3107 15062 15817 4995 -9927 -16997 -11133 1306 13057
1284 13057 17230 7055 -9463 -16386 -11580 -851 12213 17531 7692 -7304 -15009 -13019 -2444
1297 -2444 10886 16217 9480 -4011 -14719 -14174 -3736 8395 15941 12239 -2394 -14456 -14388 -5674
1311 -5674 6764 16278 13093 -929 -13004 -14951 -7050 5688 14978 13509 1470 -11546 -15306
1324 -15306 -8017 3890 13562 14290 3729 -9893 -15323 -9715 2094 12632 14788 5814 -8295
1337 -8295 -15506 -10784 498 11591 15416 7116 -6931 -14641 -11893 -1262 10741 15010 8104 -4434
1351 -4434 -14024 -13018 -2330 8921 14280 10234 -2672 -13593 -13158 -4237 7026 14687 11203 -1353
1365 -1353 -11966 -13906 -6269 6381 14081 11480 1019 -10845 -14648 -6990 4766 12857 12741 2639
1379 2639 -9812 -14020 -8422 2569 12490 13267 3817 -7870 -13907 -9996 1371 11456 13355 5783
1393 5783 -6454 -13909 -10486 -317 9957 13917 7103 -5177 -13018 -11405 -2096 9063 13660 8214
1407 8214 -3211 -12324 -12146 -3331 7403 13377 9701 -1813 -11512 -12356 -4995 5987 13335 10487
1421 10487 -248 -10295 -12807 -6195 4740 12371 11339 1676 -9421 -12858 -7075 2799 11463 12268
1435 12268 3008 -8199 -12569 -8395 1427 10786 12361 4574 -6604 -12651 -9210 249 9402 12545
1449 12545 6267 -5419 -12238 -9737 -1331 8114 12723 7381 -3864 -11557 -10612 -2538 7070 12269
1463 12269 8540 -2154 -11040 -11085 -3539 5763 11770 9655 -457 -10188 -11445 -4760 4443 11171 10439
1478 10439 1060 -9220 -11740 -5879 3353 10462 10804 2572 -7971 -11828 -6882 2086 9527 11039
1492 11039 4163 -6627 -11854 -7871 842 8690 11246 5428 -5271 -11615 -8643 -216 7793 11064
1506 11064 6494 -3652 -11103 -9496 -1406 6824 10903 7546 -2120 -10456 -10262 -2529 5997 10516 8159
1521 8159 -653 -9554 -10671 -3692 4914 9977 8813 747 -8480 -11010 -5013 3839 9618 9166 2092
1536 2092 -7366 -11278 -6142 2899 9058 9409 3357 -6148 -11227 -6967 1718 8278 9745 4393 -5006
1551 -5006 -10675 -7893 403 7765 9780 5215 -3452 -10144 -8879 -775 7033 9609 6230 -2029 -9764
1566 -9764 -9435 -1792 6014 9567 7064 -1054 -8857 -9631 -3255 5005 9584 7460 -41 -7674 -9870
1581 -9870 -4500 4155 9144 7749 1413 -6662 -10228 -5377 3069 8534 8494 2575 -6043 -10095 -6174
1596 -6174 1729 8234 9028 3147 -5055 -9429 -6984 583 7717 8786 4016 -3525 -9074 -7961 -462
1611 -462 6764 8801 5269 -2359 -8931 -8370 -1457 5784 9084 6149 -1724 -8270 -8469 -2748 4847 9175
1627 9175 6503 -778 -7148 -8797 -3970 4224 8579 6740 905 -6342 -9313 -4455 3166 7713 7752
1642 7752 2094 -6086 -9151 -5103 1641 7556 8322 2476 -4992 -8461 -6243 761 7293 7897 3396
1657 3396 -3247 -8506 -7027 135 6136 7813 4946 -2440 -8640 -7265 -935 5137 8387 5718 -2046
1672 -2046 -7788 -7488 -2242 4688 8275 5606 -825 -6700 -8074 -2992 4208 7337 6040 931 -6091
1687 -6091 -8640 -3715 2956 6884 7092 1982 -5826 -8445 -4643 1851 7179 7463 1911 -4770 -7985
1702 -7985 -5535 1343 6860 6799 2886 -3079 -7899 -6213 650 5595 6687 4388 -2166 -7812 -6605
1717 -6605 -751 4821 7625 5102 -1843 -7249 -7159 -1938 4954 7719 4674 -915 -6224 -7649 -2394
1732 -2394 4533 6677 4893 673 -5522 -7698 -3002 2968 6273 6092 1488 -5023 -7440 -4402 1823
1747 1823 6944 6573 1624 -4078 -7471 -5474 1675 6806 6043 2249 -3040 -7394 -5542 1083 5567
1762 5567 6002 3261 -2391 -6795 -5830 -626 4817 6818 3947 -1666 -6098 -6626 -1913 4756 7084 4064
1778 4064 -885 -5663 -7117 -2263 4473 6560 4462 19 -5292 -6878 -2705 3083 6192 5264 483
1793 483 -4626 -6401 -3862 1912 6443 5646 1062 -3666 -6506 -4849 1439 6222 5684 1888 -3083 -6663
1809 -6663 -4978 835 5403 5944 2585 -2638 -6146 -5132 -367 4776 6291 3057 -2012 -5527 -5715
1824 -5715 -1408 4445 6371 3541 -1208 -5188 -6009 -1882 3834 6073 4133 -471 -4963 -6009 -2365
1839 -2365 2843 5871 4801 64 -4469 -5801 -3231 1984 5968 5032 690 -3662 -5929 -3994 1575
1854 1575 5611 5145 1571 -3250 -6021 -4110 778 4875 5486 2210 -2788 -5551 -4466 -217 4553
1869 4553 5588 2657 -1956 -5217 -5081 -818 4073 5622 3225 -1322 -5072 -5251 -1436 3519 5622
1884 5622 3682 -668 -4609 -5388 -2016 2847 5340 4077 -15 -4160 -5328 -2616 2091 5216 4509
1899 4509 565 -3600 -5404 -3389 1569 5057 4614 1244 -3000 -5519 -3755 1040 4670 4774 1788
1914 1788 -2565 -5199 -4086 176 4280 4967 2102 -1869 -4777 -4535 -504 3908 4943 2668 -1217
1929 -1217 -4607 -4802 -1106 3466 5022 3158 -825 -4190 -4829 -1794 2859 5052 3339 -261 -3643
1944 -3643 -4883 -2333 2368 4831 3704 297 -3276 -4828 -2875 1584 4686 4058 795 -2837 -4735
1959 -4735 -3377 966 4484 4310 1250 -2440 -4578 -3674 359 4161 4454 1631 -1932 -4341 -3906 -342
1975 -342 3750 4623 2063 -1503 -4030 -4095 -944 3268 4669 2609 -1049 -3713 -4159 -1543 2714 4706
1991 4706 2958 -612 -3459 -4212 -2057 2120 4562 3321 -144 -3123 -4124 -2396 1541 4402 3643
2006 3643 339 -2862 -4148 -2740 839 4141 3987 830 -2563 -4000 -3105 295 3794 4114 1297 -2129
2022 -2129 -3876 -3281 -194 3338 4259 1788 -1712 -3756 -3407 -711 2868 4326 2193 -1284 -3444 -3558
2038 -3558 -1165 2439 4243 2659 -747 -3355 -3681 -1530 1958 4117 3093 -350 -3130 -3675 -1931
2053 -1931 1422 3983 3311 188 -2812 -3670 -2289 973 3677 3492 612 -2542 -3673 -2497 519 3411
2069 3411 3690 1083 -2107 -3633 -2765 78 3054 3783 1618 -1713 -3499 -2897 -351 2659 3906 1966
2085 1966 -1361 -3317 -3086 -840 2386 3764 2249 -821 -3236 -3356 -1104 1890 3633 2597 -393
2100 -393 -2997 -3317 -1555 1471 3599 2835 -5 -2608 -3382 -1928 1145 3368 3054 438 -2326 -3389
2116 -3389 -2189 688 3133 3201 908 -1950 -3318 -2494 239 2857 3356 1266 -1584 -3222 -2662 -239
2132 -239 2580 3471 1615 -1315 -3058 -2926 -600 2363 3410 1906 -793 -2994 -2985 -894 1888 3285
2148 3285 2270 -505 -2695 -2953 -1420 1404 3364 2529 -157 -2390 -3083 -1724 1169 3186 2756 362
2164 362 -2179 -3115 -1920 743 2895 2980 579 -2023 -2931 -2076 201 2715 3075 1004 -1598 -2844 -2375
2181 -2375 -237 2459 3179 1399 -1312 -2830 -2548 -499 2171 3218 1630 -1022 -2781 -2608 -695 1743
2197 1743 3107 2050 -723 -2585 -2495 -1154 1163 3159 2356 -341 -2244 -2705 -1575 1028 2934 2452
2213 2452 249 -2199 -2904 -1496 755 2618 2815 504 -2164 -2671 -1651 255 2463 2901 747 -1655
2229 -1655 -2587 -1998 -98 2188 2854 1310 -1272 -2705 -2176 -284 1864 2889 1659 -1009 -2688 -2257
2245 -2257 -508 1568 2814 1932 -766 -2546 -2255 -889 1202 2784 2148 -410 -2135 -2485 -1201 1099
2261 1099 2597 2241 176 -2124 -2730 -1158 797 2268 2505 493 -1981 -2511 -1349 347 2130 2553
2277 2553 719 -1621 -2414 -1752 84 2019 2533 1145 -1173 -2660 -2014 -32 1776 2480 1434 -1035
2293 -1035 -2550 -1939 -244 1445 2453 1621 -691 -2354 -2073 -634 1158 2406 1786 -273 -2021 -2315
2309 -2315 -956 1062 2332 1978 181 -1941 -2519 -1090 899 2174 2200 328 -1970 -2327 -1156 540
2325 540 2031 2180 446 -1414 -2221 -1595 243 1870 2108 913 -975 -2299 -1782 44 1651 2227 1242
2342 1242 -867 -2343 -1888 -226 1491 2343 1386 -775 -2171 -1849 -467 1265 2234 1439 -409 -1815
2358 -1815 -2026 -766 1125 2079 1676 76 -1788 -2200 -900 783 1973 1974 263 -1724 -2164 -1147 483
2375 483 1997 2031 420 -1446 -1992 -1366 325 1796 1974 716 -1115 -2089 -1484 79 1541 1991 1076
2392 1076 -897 -2042 -1545 -236 1363 2116 1327 -686 -1994 -1730 -382 1162 2098 1395 -414 -1870
2408 -1870 -1810 -565 981 1910 1513 -61 -1689 -1924 -700 744 1780 1706 215 -1559 -1910 -937 442
2425 442 1711 1847 441 -1354 -1987 -1200 316 1582 1785 694 -1083 -1962 -1244 192 1371 1868 881
2442 881 -869 -1956 -1350 -49 1199 1743 1120 -572 -1905 -1522 -211 1102 1786 1277 -320 -1769 -1697
2459 -1697 -434 1009 1681 1417 -47 -1596 -1754 -574 817 1550 1492 190 -1476 -1862 -814 579 1582
2476 1582 1570 376 -1243 -1910 -1112 422 1419 1536 659 -1003 -1856 -1165 290 1279 1600 834 -679 -1802
2494 -1802 -1337 9 1182 1634 992 -510 -1734 -1463 -112 1114 1541 1133 -238 -1608 -1573 -308 900
2511 900 1560 1192 -100 -1445 -1635 -563 808 1476 1178 108 -1280 -1665 -823 587 1379 1379 324 -1073
2529 -1073 -1702 -969 461 1287 1426 466 -874 -1659 -1128 218 1187 1363 609 -661 -1539 -1265 18 1174
2547 1174 1427 784 -444 -1458 -1321 -163 984 1419 916 -242 -1429 -1358 -352 919 1322 1086 -147
2564 -147 -1264 -1432 -580 731 1362 1142 106 -1098 -1545 -708 555 1316 1182 216 -996 -1497 -891 413
2582 413 1182 1256 439 -826 -1453 -978 212 1172 1320 545 -576 -1397 -1120 41 1093 1317 696 -436
2600 -436 -1342 -1132 -124 903 1327 818 -273 -1252 -1225 -283 784 1351 913 -145 -1148 -1321 -447 639
2618 639 1288 1067 77 -1102 -1358 -630 573 1178 1120 231 -957 -1439 -747 330 1109 1146 414 -713 -1379
2637 -1379 -887 264 1069 1235 515 -593 -1311 -1078 103 922 1208 687 -432 -1294 -1172 -124 877 1159
2655 1159 793 -239 -1206 -1140 -278 799 1227 906 -24 -1130 -1290 -425 655 1155 961 95 -950 -1313
2673 -1313 -605 554 1079 998 279 -817 -1311 -692 362 1094 974 325 -708 -1275 -820 217 1033 1059 484
2692 484 -474 -1226 -999 139 994 1053 624 -344 -1227 -1054 -68 876 1132 685 -181 -1103 -1094 -293 791 1089
2712 1089 720 -100 -973 -1222 -461 663 1069 792 86 -832 -1271 -568 501 1045 901 149 -733 -1216 -673
2731 -673 358 1092 1015 258 -561 -1119 -844 174 1063 978 359 -405 -1155 -960 13 914 1043 556 -321 -1083
2751 -1083 -1015 -100 801 1123 565 -211 -1006 -1001 -318 753 1043 602 -107 -846 -1094 -421 620 1004 732 34
2771 34 -773 -1120 -493 400 990 853 154 -687 -1103 -672 299 1023 909 198 -531 -999 -807 209 1015 915
2791 915 343 -366 -1053 -809 40 799 1009 521 -296 -957 -893 -151 669 1024 577 -309 -815 -975 -332 643
2811 643 994 611 -125 -819 -1029 -429 591 904 672 -4 -791 -962 -417 392 881 877 139 -633 -903 -616
2831 -616 166 954 835 202 -520 -940 -716 165 862 851 284 -437 -1004 -758 66 752 905 456 -353 -883
2851 -883 -726 -149 657 957 553 -288 -802 -922 -314 584 915 526 -97 -746 -999 -329 498 865 681 -39
2871 -39 -730 -912 -418 422 824 712 90 -594 -877 -513 225 823 756 137 -459 -920 -683 170 839 726 324
2892 324 -367 -910 -724 42 701 760 423 -308 -872 -775 -134 691 877 436 -244 -712 -818 -310 566 830 465
2913 465 -88 -655 -848 -340 514 770 541 43 -634 -807 -408 356 818 685 26 -542 -800 -575 181 876
2933 876 705 151 -399 -807 -644 101 787 722 205 -415 -773 -656 -12 609 752 294 -280 -731 -678 -188 582
2954 582 865 437 -133 -619 -777 -275 467 847 417 -76 -577 -824 -339 411 787 591 -96 -489 -684 -389
2974 -389 300 771 635 33 -464 -664 -526 173 725 663 82 -401 -655 -559 97 698 705 138 -372 -711 -589
2995 -589 -43 547 713 333 -307 -636 -649 -160 469 781 386 -215 -616 -623 -281 373 802 530 -97 -586 -661
3016 -661 -337 308 716 624 -6 -543 -648 -358 199 726 585 79 -500 -653 -460 108 627 613 91 -460 -649
3037 -649 -466 22 583 666 189 -311 -632 -556 -77 532 681 276 -345 -631 -623 -130 459 705 334 -184 -596
3058 -596 -597 -179 368 670 408 -118 -520 -606 -296 295 690 512 11 -462 -563 -338 196 639 532 84 -432
3079 -432 -591 -412 143 609 560 137 -380 -609 -445 -43 550 589 166 -324 -614 -534 -61 497 639 254 -217
3100 -217 -491 -558 -138 438 658 357 -151 -540 -582 -218 381 666 416 -122 -487 -572 -184 316 619 458 -62
3121 -62 -428 -528 -282 230 664 487 36 -445 -532 -306 169 550 519 95 -418 -540 -399 50 539 583 101
3142 101 -300 -520 -472 -27 539 630 216 -264 -505 -474 -122 459 609 275 -215 -447 -447 -180 318 620 409 -182
3164 -182 -469 -395 -252 246 586 409 -33 -411 -434 -268 188 517 451 21 -389 -505 -319 65 529 492 78
3185 78 -348 -502 -404 -10 451 554 169 -338 -454 -391 -103 342 591 159 -267 -471 -440 -90 345 579 322
3206 322 -222 -464 -417 -82 292 597 371 -158 -400 -355 -266 236 552 410 -29 -420 -431 -205 96 438 497 40
3228 40 -422 -468 -261 123 420 468 44 -370 -461 -335 60 398 489 184 -326 -502 -326 -57 311 493 254 -284
3250 -284 -482 -340 -75 274 518 313 -137 -456 -364 -137 246 465 341 -119 -413 -402 -130 178 453 408 -24
3271 -24 -325 -421 -176 114 444 414 67 -360 -481 -231 84 437 410 59 -276 -435 -293 8 363 447 129 -255
3293 -255 -425 -308 -6 360 455 212 -214 -428 -296 -42 296 449 306 -152 -397 -334 -80 207 439 321 -19
3314 -19 -339 -382 -118 181 411 319 -24 -332 -417 -201 153 387 365 110 -353 -406 -177 92 372 439 67 -311
3336 -311 -389 -232 32 347 374 156 -230 -342 -299 -9 316 411 256 -213 -391 -295 -68 226 413 263 -96 -341
3358 -341 -274 -152 184 443 185 -82 -289 -367 -174 174 372 360 48 -323 -393 -151 80 324 352 9 -308 -374
3380 -374 -205 26 301 296 152 -259 -337 -239 24 255 378 165 -198 -377 -279 -9 239 381 256 -94 -340 -179
3402 -179 -57 204 386 300 -129 -338 -282 -103 253 337 288 -57 -292 -331 -129 93 323 302 59 -284 -359 -137
3424 -137 33 265 358 121 -266 -361 -161 39 250 408 143 -179 -346 -186 -3 280 320 145 -138 -378 -278
3445 -278 16 179 304 221 -145 -309 -214 -21 155 322 285 -75 -320 -303 -103 138 314 319 -17 -294 -384 -125
3467 -125 168 264 275 28 -342 -336 -116 134 247 326 109 -265 -351 -156 23 338 300 109 -167 -283 -215 -14 264
3490 264 290 203 -159 -407 -244 -24 188 319 249 -102 -340 -322 -69 114 357 237 -36 -260 -328 -146 174 281
3512 281 200 59 -236 -336 -145 148 252 275 113 -271 -343 -158 55 282 289 71 -197 -288 -212 71 274 312 170
3535 170 -210 -272 -205 24 254 332 127 -159 -336 -191 -34 169 278 215 -45 -324 -237 -20 144 357 219 24
3557 24 -322 -355 -100 138 250 213 9 -218 -358 -143 133 277 265 29 -241 -319 -151 50 181 223 111 -206
3579 -206 -312 -221 6 252 297 98 -113 -318 -206 1 232 238 151 -103 -316 -243 -74 210 282 197 -10 -329 -285
3602 -285 -31 96 231 183 -84 -304 -261 -158 143 253 207 73 -279 -335 -115 62 242 298 53 -188 -305 -152
3624 -152 108 282 282 119 -160 -259 -219 43 228 250 156 -129 -242 -191 -7 184 248 178 -90 -324 -226 -61 158
3647 158 257 234 -51 -243 -245 -101 154 280 233 22 -260 -309 -137 129 248 241 45 -182 -297 -132 156 225 256
3670 256 73 -214 -336 -134 101 168 266 131 -106 -398 -163 62 217 242 103 -128 -295 -267 25 237 324 179
3692 179 -35 -336 -273 -33 224 179 117 40 -320 -302 -93 198 252 240 70 -266 -274 -60 132 250 192 38 -261
3715 -261 -304 -119 113 237 250 72 -209 -252 -132 98 261 252 78 -167 -297 -186 47 318 286 171 -159 -231
3737 -231 -200 -18 211 268 116 -93 -309 -271 -34 166 230 165 -29 -250 -368 -102 144 334 208 -42 -211 -300
3759 -300 -150 113 304 244 -11 -195 -291 -164 97 235 215 41 -190 -307 -172 69 247 264 137 -118 -318
3780 -318 -236 52 245 260 115 -75 -323 -208 20 235 256 165 -40 -290 -310 -36 214 257 158 -44 -238 -290 -77
3803 -77 117 274 173 7 -249 -316 -88 150 259 235 23 -164 -298 -169 138 261 167 71 -158 -315 -130 70
3825 70 253 273 68 -146 -255 -215 48 258 214 158 -41 -320 -263 -36 253 242 194 -56 -225 -299 -89 188 191 194
3849 194 -33 -280 -251 -45 156 272 181 -19 -221 -224 -167 180 259 227 37 -145 -322 -129 224 254 215 99 -100
3872 -100 -323 -158 133 296 251 137 -119 -299 -190 85 280 226 129 -125 -248 -272 34 252 258 125 -33 -299
3894 -299 -296 -10 229 248 178 7 -241 -294 -171 198 244 239 -10 -237 -274 -93 177 339 278 30 -204 -330 -137
3917 -137 207 291 222 110 -142 -298 -197 92 292 218 101 -147 -259 -261 81 267 311 38 -140 -259 -290 -55
3939 -55 325 224 69 -56 -284 -264 -86 256 262 195 -75 -259 -303 -142 121 304 154 -41 -264 -214 -139 135 328
3962 328 183 9 -170 -375 -202 185 314 221 49 -175 -334 -150 104 321 303 50 -230 -284 -188 -22 274
3983 274 330 51 -109 -278 -248 -29 326 292 133 -98 -305 -351 57 231 285 110 -97 -288 -280 -87 145 346
4005 346 163 -67 -203 -238 -89 203 295 202 -28 -175 -296 -134 163 275 233 59 -259 -295 -222 125 313 258
4027 258 -19 -209 -301 -225 58 294 291 50 -140 -306 -296 -65 263 306 83 -101 -330 -268 -12 272 357 154 -109
4050 -109 -311 -282 -105 199 364 175 -50 -250 -317 -89 175 300 151 -21 -163 -322 -142 176 288 216 -18
4071 -18 -243 -326 -216 144 330 294 32 -200 -313 -250 41 258 287 44 -120 -294 -261 29 374 296 76 -82
4093 -82 -356 -271 -50 241 348 87 -83 -260 -311 -58 226 385 218 -71 -224 -327 -130 210 350 195 -45
4114 -45 -228 -314 -162 159 279 231 -84 -190 -305 -187 93 331 282 9 -226 -323 -269 67 347 252 -6 -174
4136 -174 -314 -258 15 299 354 51 -179 -304 -229 -3 229 375 133 -118 -254 -249 -32 293 287 156 -55 -214
4158 -214 -263 -109 215 409 268 -98 -245 -283 -169 149 293 242 15 -268 -288 -170 60 349 275 -42 -246 -258
4180 -258 -166 74 314 254 13 -205 -249 -238 30 288 375 130 -146 -236 -224 -31 228 326 120 -182 -255 -199 -81
4203 -81 229 415 161 -120 -279 -254 -40 234 310 185 -105 -329 -257 -143 156 330 242 -74 -237 -289 -147 63
4225 63 270 251 -35 -254 -323 -171 90 305 381 38 -210 -254 -173 94 225 367 52 -194 -315 -164 -22 244
4247 244 322 106 -196 -304 -206 -46 193 342 153 -145 -272 -284 -125 186 319 198 -127 -307 -355 -90 134
4268 134 372 273 -43 -284 -302 -100 118 326 289 -20 -231 -290 -175 92 347 306 51 -218 -298 -111 13 328
4290 328 298 61 -151 -287 -240 72 253 361 163 -165 -336 -263 -3 258 367 146 -143 -326 -281 -41 194
4311 194 369 110 -110 -336 -291 -67 114 309 217 -92 -231 -278 -123 116 321 279 -61 -277 -258 -175 96 288
4333 288 296 58 -282 -258 -140 66 283 306 32 -222 -271 -239 40 232 372 165 -222 -270 -243 -7 201 386 167
4356 167 -184 -329 -225 -40 191 312 143 -132 -364 -252 -100 173 341 214 -5 -287 -270 -116 142 315
4376 315 273 15 -312 -294 -106 55 340 279 34 -274 -269 -136 68 277 318 68 -181 -335 -192 81 288 303
4398 303 131 -244 -291 -205 31 254 316 179 -184 -346 -184 -38 217 333 126 -129 -278 -248 -32 154 312
4419 312 243 -44 -315 -253 -71 116 255 277 -3 -291 -302 -87 142 318 299 26 -298 -285 -84 145 309 291
4441 291 28 -261 -342 -177 90 283 302 44 -178 -337 -153 97 259 311 155 -155 -375 -263 -39 183 313
4462 313 152 -71 -339 -235 -6 200 333 204 -101 -300 -252 -51 201 288 250 -28 -327 -307 -36 116 263
4483 263 287 -41 -270 -282 -149 180 365 228 0 -216 -338 -151 124 283 259 61 -202 -323 -178 72 272
4504 272 243 126 -197 -342 -168 32 231 299 146 -109 -304 -255 38 240 328 154 -94 -322 -240 -42 266 296
4526 296 234 -47 -249 -225 -119 140 341 271 -67 -339 -349 -85 114 293 218 3 -268 -400 -125 137 241 275
4548 275 73 -250 -327 -182 94 245 273 105 -282 -336 -181 75 275 317 139 -208 -348 -219 29 206 271 148
4570 148 -141 -313 -254 -1 187 271 210 -80 -319 -341 -42 159 302 244 -8 -302 -309 -85 177 337 193 4
4592 4 -242 -310 -110 150 295 250 29 -368 -363 -128 73 263 222 119 -172 -335 -139 96 264 277 142 -182 -355
4615 -355 -200 48 236 282 113 -92 -338 -259 95 192 255 214 -86 -311 -260 39 218 314 217 -102 -326 -301 -24
4638 -24 159 260 188 -42 -301 -359 -101 182 261 202 15 -312 -387 -137 96 316 269 -6 -272 -324 -194 56 272
4661 272 239 45 -105 -377 -189 50 235 289 79 -92 -351 -230 38 260 320 183 -103 -304 -317 68 223
4682 223 343 111 -119 -255 -316 -77 141 270 141 -67 -317 -386 -140 190 250 176 28 -261 -333 -141 178 293
4704 293 240 74 -257 -348 -119 129 251 213 70 -159 -304 -237 118 255 223 126 -121 -266 -246 149 289 295 162
4727 162 -76 -282 -246 37 209 262 169 -96 -285 -285 -67 239 228 176 -38 -287 -331 -30 194 278 133 -54 -243
4750 -243 -325 -99 220 355 234 37 -231 -306 -101 156 310 207 18 -243 -335 -215 141 277 244 89 -137
4771 -137 -262 -214 90 315 237 69 -92 -241 -210 -2 233 243 54 -120 -269 -290 -1 220 276 153 -64 -270
4793 -270 -315 -3 234 278 221 -19 -300 -265 -99 252 358 205 26 -172 -293 -111 171 283 283 36 -216 -288
4815 -288 -176 129 353 199 9 -174 -310 -215 121 284 231 21 -166 -338 -253 28 302 234 114 -127 -325
4836 -325 -236 11 265 238 56 -102 -285 -353 19 234 291 153 -69 -255 -277 -90 214 317 100 -73 -232 -278
4858 -278 -86 153 336 190 -1 -203 -339 -126 158 370 175 -14 -161 -259 -190 158 325 215 55 -198 -300
4879 -300 -220 23 265 223 34 -179 -268 -198 7 273 233 79 -154 -243 -237 -41 273 306 125 -104 -279 -194 -32
4902 -32 215 250 135 -58 -222 -280 -66 206 370 187 -71 -201 -256 -105 166 336 172 -36 -234 -269 -141 103
4924 103 305 256 -21 -157 -308 -191 74 295 246 56 -184 -271 -190 37 295 310 113 -173 -236 -248 -34 316
4946 316 288 137 -90 -239 -222 3 199 308 113 -93 -274 -272 -52 202 343 179 -84 -249 -295 -65 178 298
4968 298 181 -122 -254 -319 -98 144 278 204 -36 -188 -249 -89 97 319 277 7 -137 -313 -191 65 291
4989 291 288 68 -179 -254 -199 10 281 297 18 -123 -233 -193 -19 250 263 96 -134 -276 -234 -33 185 296 153
5012 153 -107 -218 -186 -84 133 275 136 -64 -226 -216 -107 201 320 193 -21 -224 -266 -77 112 372 265
5033 265 2 -191 -252 -108 103 320 243 34 -142 -245 -184 43 300 260 90 -144 -184 -116 30 283 292 73 -196
5056 -196 -232 -185 -50 209 326 161 -161 -233 -248 -75 166 260 150 -92 -217 -212 -58 160 251 187 -48 -181 -201
5079 -201 -135 120 324 234 -84 -202 -200 -108 103 342 277 -21 -179 -182 -147 31 328 247 37 -184 -260 -203 16 219
5103 219 287 62 -175 -275 -219 4 207 281 102 -203 -254 -181 -67 163 304 124 -99 -236 -216 -42 176 323
5125 323 156 -90 -245 -198 -67 147 319 206 -12 -228 -244 -102 64 251 232 -17 -254 -221 -77 144 238 292
5147 292 59 -220 -204 -117 41 268 295 74 -176 -300 -152 -39 191 314 58 -205 -302 -91 -7 189 262 169
5169 169 -139 -252 -185 -12 142 315 129 -137 -244 -175 -3 117 302 230 -39 -180 -229 -80 135 252 226 -48
5191 -48 -249 -227 -87 85 246 253 14 -237 -251 -140 90 219 224 24 -255 -247 -151 -12 197 251 38 -212 -288 -147
5215 -147 76 159 239 71 -172 -270 -140 1 199 269 145 -118 -256 -143 15 172 245 167 -114 -286 -239 -36
5237 -36 122 206 186 -10 -189 -227 -55 132 270 224 -23 -214 -249 -52 80 226 211 46 -225 -199 -130 49 251
5260 251 181 25 -194 -244 -167 59 185 225 110 -159 -280 -114 26 160 288 127 -142 -241 -215 -18 212 262
5282 262 105 -128 -266 -191 -54 128 205 213 -75 -253 -195 3 45 237 219 -1 -263 -198 -72 88 223 192 23
5305 23 -233 -192 -95 114 201 190 81 -222 -238 -108 37 162 208 62 -211 -238 -98 97 244 315 99 -143 -215
5328 -215 -81 39 139 234 109 -123 -264 -200 41 110 246 177 -78 -206 -226 -41 138 231 138 -84 -179 -276 -23
5351 -23 177 246 121 -25 -180 -319 -89 142 202 215 21 -240 -258 -83 168 219 208 105 -134 -193 -102 118 178
5374 178 197 101 -194 -273 -134 70 195 216 75 -74 -295 -210 90 141 163 98 -101 -214 -225 -8 161 235 137 -80
5398 -80 -248 -206 18 156 173 110 -13 -230 -298 -59 126 204 197 12 -251 -230 -18 127 176 219 36 -183 -225 -85
5422 -85 155 217 173 68 -155 -297 -116 73 153 149 75 -155 -283 -174 83 183 210 100 -99 -305 -201 19 190
5445 190 196 112 -115 -195 -223 -35 189 221 148 -53 -267 -196 18 159 264 131 -23 -208 -282 -49 137 222 173 27
5469 27 -199 -211 -82 128 220 106 44 -170 -244 -129 119 198 172 8 -116 -262 -164 81 181 166 29 -141 -277
5492 -277 -98 32 151 175 134 -107 -226 -204 62 241 107 113 -32 -206 -195 50 148 258 167 -77 -255 -228 33
5515 33 138 196 157 -64 -230 -243 -61 71 201 168 31 -132 -272 -52 119 213 171 58 -98 -251 -196 35 186
5538 186 172 83 -138 -247 -167 59 145 200 76 -136 -218 -167 76 213 161 106 -35 -275 -191 12 194 212 107 9
5562 9 -218 -197 -86 152 189 102 3 -145 -269 -47 144 231 197 23 -124 -259 -94 121 196 133 5 -146 -261
5585 -261 -160 159 183 143 10 -127 -222 -140 33 253 212 45 -87 -237 -228 25 261 206 59 -92 -152 -230 87
5608 87 169 182 28 -89 -212 -200 -17 177 238 89 -56 -215 -181 -73 219 271 98 -23 -204 -274 -64 130 229
5631 229 71 -51 -159 -275 -104 115 182 123 -9 -168 -251 -124 105 239 129 11 -203 -215 -188 44 227 177
5653 177 48 -98 -210 -194 -4 226 203 35 -70 -231 -220 26 233 222 31 -45 -230 -162 -7 196 248 44
5675 44 -85 -191 -154 -61 133 227 92 -13 -192 -249 -97 167 261 135 -61 -128 -175 -97 69 205 138 8 -141
5698 -141 -237 -183 64 262 204 22 -181 -192 -192 57 191 196 65 -120 -232 -192 46 194 183 60 -108 -235 -170 -11
5722 -11 149 205 59 -110 -182 -225 -75 111 174 99 -23 -164 -213 -55 179 234 114 4 -185 -151 -79 121 240
5745 240 181 -102 -161 -164 -164 58 261 203 -1 -85 -197 -160 87 207 126 42 -58 -232 -182 26 228 171 41 -100
5769 -100 -215 -138 19 172 201 65 -146 -217 -154 -52 124 243 79 -84 -196 -172 -53 137 204 111 -78 -184
5791 -184 -213 -118 168 235 118 13 -140 -192 -140 95 237 170 -2 -144 -135 -174 68 243 153 -27 -160 -236 -198 13
5815 13 245 189 18 -122 -232 -181 -51 136 247 56 -86 -227 -155 -76 201 206 37 -96 -155 -180 -13 162 203
5838 203 138 -117 -209 -144 -77 140 280 190 14 -161 -152 -102 78 227 134 -74 -160 -208 -150 59 193 200 -11 -178 -228
5863 -228 -146 73 257 227 -74 -144 -224 -165 -49 156 202 51 -154 -206 -137 -44 218 245 105 -85 -206 -164 -28 211
5887 211 244 163 -104 -221 -147 -45 139 210 132 -112 -168 -167 -78 95 203 118 -99 -174 -79 -31 90 202 178 -5 -208
5912 -208 -196 -55 62 195 215 -27 -169 -223 -106 61 168 209 61 -106 -166 -128 -2 158 191 49 -202 -163 -105
5935 -105 54 192 220 54 -124 -206 -124 -4 126 244 121 -107 -205 -88 -39 157 170 101 -39 -253 -181 -102 116
5958 116 201 127 -78 -183 -160 -76 102 179 81 -14 -159 -187 -70 10 171 215 3 -178 -194 -67 69 180 262 45
5982 45 -117 -175 -110 10 157 233 92 -88 -166 -118 45 158 191 93 -103 -153 -134 -51 190 255 105 -70 -184 -145
6006 -145 -101 134 166 135 -16 -181 -154 -72 115 204 106 -13 -180 -154 -90 97 177 263 21 -166 -206 -42 98 154
6030 154 263 -25 -203 -170 -75 44 121 223 27 -169 -190 -119 24 103 228 101 -127 -244 -120 43 106 222
6052 222 82 -68 -205 -140 44 132 230 144 -74 -233 -111 0 91 208 160 -16 -216 -174 -90 85 238 260 -13
6075 -13 -167 -192 -96 83 215 199 3 -145 -171 -67 19 169 185 62 -132 -189 -75 44 120 198 13 -190 -225 -111
6099 -111 40 155 158 133 -97 -186 -122 -21 115 121 153 -64 -183 -135 37 122 183 193 -44 -206 -191 -29 104 184 191
6124 191 -27 -189 -146 -19 126 141 237 35 -182 -154 -30 59 199 161 28 -191 -197 -61 58 188 186 78 -191
6147 -191 -228 -94 73 146 132 101 -141 -238 -114 22 146 145 115 -98 -219 -155 6 103 224 96 -54 -193 -177 -16
6171 -16 99 183 173 -4 -183 -160 -28 142 215 123 -28 -180 -218 -64 -8 138 128 -20 -164 -253 -69 52 133 188
6195 188 41 -135 -197 -123 78 187 158 86 -135 -233 -58 75 167 201 95 -155 -220 -151 7 147 185 132 -59 -223
6219 -223 -128 39 196 170 166 -38 -199 -204 -13 44 194 174 -38 -214 -163 -39 111 208 189 41 -187 -158 -98 113
6243 113 156 126 43 -172 -225 -55 54 119 177 48 -164 -238 -70 43 133 205 49 -77 -193 -156 33 176 218 128
6267 128 -80 -218 -98 38 134 184 138 -42 -186 -200 23 150 217 109 22 -155 -165 -33 107 158 142 -41 -211
6290 -211 -218 -75 136 115 156 16 -165 -203 -74 76 171 126 56 -191 -213 -116 12 204 204 79 -148 -190 -118 18 164
6315 164 129 111 -26 -210 -150 19 126 175 87 -64 -219 -142 37 133 195 62 -6 -172 -218 -52 161 250 100 33
6339 33 -139 -223 -38 152 134 144 -25 -226 -208 -110 101 208 152 82 -156 -266 -71 69 260 150 50 -86 -200
6362 -200 -125 44 197 161 97 -91 -231 -137 71 135 106 86 -75 -131 -176 40 232 133 53 -64 -189 -136 -50 173
6386 173 149 39 -49 -176 -188 -96 156 155 68 9 -124 -167 -95 104 228 135 -8 -164 -177 -67 125 235 190 40
6410 40 -84 -179 -109 85 169 158 8 -92 -200 -121 120 145 148 57 -134 -221 -186 5 125 152 35 -33 -210 -196 -1
6435 -1 156 179 122 -76 -87 -193 -40 135 150 77 -15 -210 -190 -71 117 203 168 19 -114 -169 -47 88 188 90
6459 90 11 -66 -208 -122 72 180 100 57 -118 -167 -66 36 190 120 15 -67 -155 -136 -26 155 136 49 -35 -199 -193
6484 -193 4 184 180 106 -13 -122 -207 -35 141 153 67 15 -135 -146 -81 84 194 159 -12 -152 -171 -163 122 240
6508 240 138 -13 -96 -204 -131 91 163 114 51 -116 -223 -106 51 193 134 62 -97 -158 -138 9 131 176 52
6531 52 -112 -182 -202 -20 167 175 62 -44 -128 -221 -14 207 185 137 -18 -129 -154 -42 148 199 78 -23 -126 -196
6555 -196 -45 131 226 58 -24 -168 -208 -111 47 175 114 19 -89 -178 -89 62 168 121 31 -142 -217 -104 30 177
6579 177 121 5 -83 -167 -183 -13 121 164 50 -109 -161 -145 62 114 232 8 19 -118 -111 -32 165 208 135 -22 -125
6604 -125 -112 -83 76 170 63 -24 -105 -178 -122 115 229 112 -26 -122 -136 -87 7 213 115 4 -43 -133 -113 6 159
6629 159 150 62 -102 -120 -130 49 153 115 56 -66 -159 -229 10 168 158 99 -91 -188 -163 -36 96 216 90 -35
6653 -35 -151 -152 -41 129 163 72 -15 -152 -151 -92 71 206 164 23 -147 -137 -113 45 206 120 -24 -72 -185 -97 21
6678 21 189 211 11 -78 -120 -108 13 212 190 64 -123 -136 -120 -80 194 184 59 -98 -113 -158 -56 209 216 101 -20
6703 -20 -113 -179 -59 80 147 86 -77 -170 -165 -76 20 177 133 -13 -70 -145 -104 9 167 104 20 -112 -181 -98 33 219
6729 219 175 2 -128 -141 -115 36 203 169 33 -83 -108 -106 1 172 148 19 -56 -104 -155 -26 169 161 111 -54 -136
6754 -136 -86 -85 90 215 107 -22 -151 -125 -101 69 216 108 -64 -193 -104 -67 54 165 157 -22 -156 -115 -77 54
6778 54 155 146 23 -122 -121 -107 51 187 180 16 -37 -108 -129 26 111 241 57 -39 -127 -154 -5 122 196 131 -97 -157
6804 -157 -73 1 105 146 77 -75 -84 -122 -27 100 166 98 -91 -129 -99 -99 24 188 126 -3 -137 -136 -77 86 159 166 59
6831 59 -152 -93 -19 55 227 178 21 -99 -126 -48 24 154 103 29 -81 -185 -107 -5 92 156 68 -165 -140 -120 -52 83
6857 83 188 103 -137 -152 -106 -4 134 192 128 -17 -95 -164 -87 96 156 121 13 -126 -144 -49 55 149 164 15 -100
6882 -100 -151 -13 40 172 162 -71 -157 -135 -49 -10 173 132 53 -31 -172 -13 -24 87 184 60 -132 -128 -100 -19 86
6907 86 206 82 -77 -156 -77 -3 126 147 98 -57 -126 -98 -28 124 114 119 -22 -128 -76 -8 67 182 187 11 -121 -125
6933 -125 5 8 164 152 28 -93 -186 -80 36 94 192 76 -72 -106 -83 4 100 218 19 -124 -93 -82 -23 98
6957 98 162 88 -82 -150 -147 -31 90 159 168 -86 -143 -56 -12 115 130 171 -23 -126 -147 4 63 152 161 -83 -117 -143 -31
6984 -31 14 59 92 19 -128 -140 -92 88 156 130 16 -103 -128 -45 7 114 115 -1 -34 -192 -35 -37 95 160 48 -73
7010 -73 -172 -101 -23 110 198 47 -69 -121 -89 0 73 171 119 -44 -133 -80 -22 57 186 71 -23 -169 -107 -39 21 140
7036 140 123 -3 -102 -176 -46 15 69 90 29 -139 -125 -29 33 70 128 56 -64 -167 -58 73 84 174 101 -27 -164
7061 -164 -82 -36 121 137 83 -41 -107 -69 -7 90 182 86 -24 -142 -97 -17 34 106 62 -39 -116 -80 -46 82 146 106 4
7088 4 -149 -200 -16 24 98 128 31 -133 -163 -88 53 143 151 53 -76 -137 -55 43 82 144 36 -83 -166 -83 13 113 169
7115 169 63 -59 -152 -94 3 91 95 102 -5 -128 -114 40 59 118 95 -84 -174 -114 -28 21 85 104 2 -125 -182 -24
7141 -24 20 60 120 -11 -140 -110 -19 88 125 125 61 -7 -194 -94 33 97 131 62 -96 -131 -87 111 155 129 135 -38 -150
7168 -150 -172 41 125 137 89 -41 -140 -100 -78 110 141 119 -1 -135 -96 -28 20 68 88 3 -131 -147 -108 77 111 105 5
7195 5 -103 -142 -2 57 125 137 36 -99 -137 -59 67 54 112 77 -70 -189 -42 -32 131 115 116 -63 -150 -92 24 103
7221 103 78 41 -96 -204 -116 6 98 128 19 -14 -185 -139 12 57 125 115 10 -146 -134 -33 114 134 115 28 -142
7246 -142 -139 -37 55 161 146 -12 -35 -98 -61 92 111 104 75 -86 -184 -75 14 85 114 55 -44 -133 -67 68 105 90 44
7273 44 4 -157 -96 -10 132 62 65 -16 -140 -120 -100 68 106 112 -16 -128 -147 -14 104 79 100 -2 -73 -135 -29 96
7299 96 110 78 8 -138 -112 -79 73 109 108 85 -60 -195 -103 88 167 116 94 -46 -129 -114 -20 117 90 14 -46 -129 -90
7326 -90 49 91 128 104 -2 -145 -109 -1 75 62 71 -36 -125 -148 -83 125 132 92 37 -35 -106 -39 105 134 50 55 -131 -125
7354 -125 -64 44 125 36 20 -46 -95 -123 25 169 90 84 -64 -131 -95 76 132 62 54 12 -112 -110 -16 122 105 -19 -59
7381 -59 -120 -121 47 100 81 80 -41 -115 -158 -30 156 60 15 36 -109 -181 -21 88 131 106 20 -123 -139 -31 62 114 21
7408 21 20 -95 -100 -52 48 135 92 46 -39 -91 -76 40 93 37 -7 -37 -125 -123 50 112 67 36 -44 -83 -80 -18 110 113 74 -94
7438 -94 -85 -109 -85 78 114 43 -22 -98 -187 -12 41 124 66 -57 -90 -107 -65 117 157 103 -6 -79 -129 -74 33 114 63 23
7466 23 -77 -137 -66 -8 116 55 -7 -88 -101 -88 -4 102 70 18 -25 -120 -134 -1 133 110 115 -76 -72 -88 -28 96 141 37
7494 37 -20 -107 -147 -34 74 178 85 -5 -57 -172 -14 81 65 81 -27 -104 -145 -63 50 89 50 -42 -45 -113 -96 59 130
7521 130 109 38 8 -40 -118 44 55 38 23 -28 -92 -28 61 151 109 53 7 -84 -93 20 110 138 34 -75 -78 -112 -59 87
7549 87 115 40 6 -69 -114 -73 43 62 23 49 -102 -94 -64 23 133 126 -50 -59 -118 -86 -14 125 59 7 -47 -63 -34 31 89
7578 89 127 -3 -77 -110 -43 7 141 128 68 -10 -78 -130 -19 115 155 10 -12 -101 -148 -46 110 109 -12 -46 -113 -93 -52
7605 -52 73 111 11 -28 -110 -105 -15 -6 82 84 -3 -65 -115 -45 5 64 86 -2 -64 -101 -92 41 131 110 77 -94 -47 -107 -41 104
7635 104 112 84 -36 -72 -135 -31 119 141 -19 -16 -99 -97 -52 52 110 39 -13 -61 -128 -55 14 110 127 -52 -78 -100 -50 23
7663 23 140 57 -3 -113 -96 -113 79 124 98 27 -61 -64 -83 51 71 122 30 -72 -102 -114 -39 113 64 -26 -33 -93 -37 -1
7691 -1 98 99 34 -20 -106 -120 -83 5 122 49 -30 -115 -83 -42 89 106 52 -65 -52 -113 -105 64 127 74 -47 -74 -62 -46 25
7720 25 120 108 13 -68 -68 -35 49 130 146 71 -62 -122 -66 19 71 146 62 -97 -90 -77 -14 33 121 35 -48 -63 -114 -16 54 104
7750 104 15 -45 -91 -79 -52 106 119 26 -40 -122 -42 3 22 135 111 -54 -75 -48 -40 -3 102 113 -48 -78 -57 -40 23 91
7778 91 126 55 -41 -64 -23 7 38 114 -6 -126 -80 -65 -9 28 68 43 -56 -54 -53 19 73 108 42 -41 -123 -49 -17 8 111 138
7808 138 -69 -84 -27 -93 29 84 150 -57 -78 -59 -31 -7 80 69 -26 -35 -20 -29 31 130 82 33 -124 -135 -60 29 96 65 60
7837 60 -67 -74 -64 -39 47 60 72 -56 -55 -21 -45 90 58 9 -92 -69 -23 27 64 97 120 -2 -125 -81 57 29 112 106
7865 106 -2 -105 -95 -25 -10 91 96 21 -124 -103 3 52 123 95 5 -132 -85 -13 29 91 71 35 -79 -104 -62 -18 62
7892 62 127 14 -93 -77 -6 35 80 119 49 -50 -80 -67 11 66 104 96 -50 -75 -83 -9 -7 82 111 -32 -101 -30 -38 38 83 65
7922 65 61 -137 -99 -61 81 128 82 -46 -68 -126 -94 2 63 90 0 -99 -91 -73 60 75 147 37 -46 -71 -63 -65 93 82 37
7951 37 -64 -112 -28 36 2 112 82 -4 -93 -50 38 68 88 37 -4 -59 -61 -67 3 84 84 -39 -91 -47 -15 -20 49 99 10 -106
7981 -106 -55 -14 6 58 79 9 -70 -103 -4 38 100 70 71 -57 -126 -1 -18 81 139 135 -23 -139 -100 33 -7 95 98 -29
8009 -29 -59 -47 7 26 96 44 -19 -117 -120 -24 12 96 76 -25 -93 -86 -9 -10 17 56 -13 -104 -129 -33 1 114 120 56 -85 -148 -23
8040 -23 -17 96 104 -16 -93 -11 -35 49 34 70 91 -16 -89 -30 -9 56 106 76 -32 -115 -52 1 66 48 91 -17 -118 -77
8068 -77 49 42 65 20 1 -122 -91 -56 17 74 61 49 -99 -59 -71 46 87 76 32 -77 -107 -33 27 6 88 84 -81 -114
8096 -114 9 21 103 39 70 -10 -50 -21 -33 87 68 99 -97 -44 -19 31 97 101 48 -48 -79 -93 -28 11 10 65 11 -132 -130
8125 -130 18 81 68 34 -13 -73 -142 27 -10 49 90 35 -91 -76 -9 14 35 101 49 -64 -89 -93 29 27 104 74 -42 -44
8153 -44 3 40 78 75 168 -36 -114 -137 15 72 63 60 -51 -97 -58 -4 72 66 42 -79 -86 -150 -24 28 91 56 39 -95 -101 -32
8183 -32 50 94 122 0 -75 -129 -30 46
8191D6
##END NTUPLES=NMR FID
##END=
