##TITLE=1H_2PEDM2907
 CDCl3, 8 sc, 
 29.7.2019
##JCAMPDX= 6.0         $$ Bruker NMR JCAMP-DX V2.0
##DATA TYPE= NMR FID
##DATA CLASS= NTUPLES
##ORIGIN= UXNMR, Bruker Analytische Messtechnik GmbH
##OWNER= root
$$ XWIN-NMR		Version 3.5
$$ Mon Jul 29 15:51:09 2019 Russian Standard Time (UT+4h)  she@DPX200
##.OBSERVE FREQUENCY= 200.13155
##.OBSERVE NUCLEUS= ^1H
##.DELAY= (6, 6)
##.ACQUISITION MODE= SIMULTANEOUS
##.ACQUISITION SCHEME= undefined
##.AVERAGES= 8
##.DIGITISER RES= 18
##SPECTROMETER/DATA SYSTEM= spect
##.PULSE SEQUENCE= zg30
##.SOLVENT NAME= CDCl3
##.SHIFT REFERENCE= (INTERNAL, CDCl3, 0, 15.7039)
##AUDIT TRAIL= $$ (NUMBER, WHEN, WHO, WHERE, WHAT)
$$ ##TITLE= Audit trail, XWIN-NMR		Version 3.5
$$ ##JCAMPDX= 5.01
$$ ##ORIGIN= Bruker BioSpin GmbH
$$ ##OWNER= she
$$ F:/spectra/data/she/nmr/H-F/1/audita.txt
$$ ##AUDIT TRAIL=  $$ (NUMBER, WHEN, WHO, WHERE, WHAT)
(   1,<2019-07-29 15:50:10.65 +0400>,<she>,<DPX200>,
      <created by zg, POWCHK disabled, PULCHK disabled
       configuration hash MD5:
       00 E9 B6 7A A2 85 ED C7 34 08 36 98 17 FE 4E 26
       data hash MD5: 16K
       3F C5 9C EB 0B 0B 88 A7 C3 7E E3 F0 C6 CA 38 30>)
$$ ##END=
$$ 
$$ hash MD5
$$ A4 31 D3 91 E7 8E 92 EA 84 54 C9 BD 69 FC 81 9E
##$RELAX= 
##$RELAX= 
##$RELAX= 
##$RELAX= 
##$RELAX= 
##$RELAX= 
$$ Bruker specific parameters
$$ --------------------------
##$DU= <F:/spectra>
##$EXPNO= 1
##$NAME= <H-F>
##$PROCNO= 1
##$TYPE= <nmr>
##$USER= <she>
##$AMP= (0..31)
100 100 100 100 100 100 100 100 100 100 100 100 100 100 100 100 100 100 
100 100 100 100 100 100 100 100 100 100 100 100 100 100 
##$AQSEQ= 0
##$AQ_mod= 1
##$AUNM= <au_zg>
##$AUTOPOS= <>
##$BF1= 200.13
##$BF2= 200.13
##$BF3= 200.13
##$BF4= 200.13
##$BF5= 200.13
##$BF6= 200.13
##$BF7= 200.13
##$BF8= 200.13
##$BYTORDA= 1
##$CFDGTYP= 0
##$CFRGTYP= 5
##$CHEMSTR= <none>
##$CNST= (0..31)
1 1 145 1 1 1 1 1 1 1 1 1 1 1 1 1 1 1 1 1 1 1 1 1 1 1 1 1 1 1 1 1 
##$CPDPRG= <>
##$CPDPRG1= <>
##$CPDPRG2= <>
##$CPDPRG3= <>
##$CPDPRG4= <mlev>
##$CPDPRG5= <mlev>
##$CPDPRG6= <mlev>
##$CPDPRG7= <mlev>
##$CPDPRG8= <mlev>
##$CPDPRGB= <>
##$CPDPRGT= <>
##$D= (0..31)
0 1.2 0 0 0 0 0 0 0 0 0 0.03 0 0 0 0 0 0 0 0 0 0 0 0 0 0 0 0 0 0 0 0 
##$DATE= 1564401009
##$DBL= (0..7)
120 120 120 120 120 120 120 120 
##$DBP= (0..7)
150 150 150 150 150 150 150 150 
##$DBP07= 0
##$DBPNAM0= <>
##$DBPNAM1= <>
##$DBPNAM2= <>
##$DBPNAM3= <>
##$DBPNAM4= <>
##$DBPNAM5= <>
##$DBPNAM6= <>
##$DBPNAM7= <>
##$DBPOAL= (0..7)
0.5 0.5 0.5 0.5 0.5 0.5 0.5 0.5 
##$DBPOFFS= (0..7)
0 0 0 0 0 0 0 0 
##$DE= 6
##$DECBNUC= <off>
##$DECIM= 24
##$DECNUC= <off>
##$DECSTAT= 4
##$DIGMOD= 1
##$DIGTYP= 9
##$DL= (0..7)
0 120 120 120 120 120 120 120 
##$DP= (0..7)
150 150 150 150 150 150 150 150 
##$DP07= 0
##$DPNAME0= <>
##$DPNAME1= <>
##$DPNAME2= <>
##$DPNAME3= <>
##$DPNAME4= <>
##$DPNAME5= <>
##$DPNAME6= <>
##$DPNAME7= <>
##$DPOAL= (0..7)
0.5 0.5 0.5 0.5 0.5 0.5 0.5 0.5 
##$DPOFFS= (0..7)
0 0 0 0 0 0 0 0 
##$DQDMODE= 0
##$DR= 18
##$DS= 0
##$DSLIST= <SSSSSSSSSSSSSSS>
##$DSPFIRM= 0
$$ [...]
##$SUBNAM2= <"">
##$SUBNAM3= <"">
##$SUBNAM4= <"">
##$SUBNAM5= <"">
##$SUBNAM6= <"">
##$SUBNAM7= <"">
##$SUBNAM8= <"">
##$SUBNAM9= <"">
##$SW= 24.9336996594482
##$SWIBOX= (0..15)
0 0 2 0 0 0 0 0 0 0 0 0 0 0 0 0 
##$SW_h= 4990.01996007984
##$TD= 16384
##$TD0= 1
##$TE= 0
##$TE2= 300
##$TE3= 300
##$TEG= 300
##$TL= (0..7)
0 120 120 120 120 120 120 120 
##$TP= (0..7)
150 150 150 150 150 150 150 150 
##$TP07= 0
##$TPNAME0= <>
##$TPNAME1= <>
##$TPNAME2= <>
##$TPNAME3= <>
##$TPNAME4= <>
##$TPNAME5= <>
##$TPNAME6= <>
##$TPNAME7= <>
##$TPOAL= (0..7)
0.5 0.5 0.5 0.5 0.5 0.5 0.5 0.5 
##$TPOFFS= (0..7)
0 0 0 0 0 0 0 0 
##$TUNHIN= 0
##$TUNHOUT= 0
##$TUNXOUT= 0
##$USERA1= <user>
##$USERA2= <user>
##$USERA3= <user>
##$USERA4= <user>
##$USERA5= <user>
##$V9= 5
##$VALIST= <valist>
##$VCLIST= <CCCCCCCCCCCCCCC>
##$VD= 0
##$VDLIST= <DDDDDDDDDDDDDDD>
##$VPLIST= <PPPPPPPPPPPPPPP>
##$VTLIST= <TTTTTTTTTTTTTTT>
##$WBST= 1024
##$WBSW= 4
##$XGAIN= (0..3)
0 0 0 0 
##$XL= 0
##$YL= 0
##$YMAX_a= 593021
##$YMIN_a= -380554
##$ZGOPTNS= <>
##$ZL1= 120
##$ZL2= 120
##$ZL3= 120
##$ZL4= 120
##$ABSF1= 10
##$ABSF2= 0
##$ABSG= 5
##$ABSL= 3
##$ALPHA= 0
##$AQORDER= 0
##$ASSFAC= 0
##$ASSFACI= 0
##$ASSFACX= 0
##$ASSWID= 0
##$AUNMP= <proc_1d>
##$AZFE= 0.1
##$AZFW= 0.1
##$BCFW= 1
##$BC_mod= 2
##$BYTORDP= 1
##$COROFFS= 0
##$CY= 11.3945322036743
##$DATMOD= 1
##$DC= 2
##$DFILT= <>
##$DTYPP= 0
##$F1P= 20.1537800932815
##$F2P= 0.134698688090026
##$FCOR= 0.5
##$FTSIZE= 0
##$FT_mod= 4
##$GAMMA= 1
##$GB= 0.15
##$INTBC= 1
##$INTSCL= 1
##$ISEN= 128
##$LB= 0.24
##$LEV0= 0
##$LPBIN= 0
##$MAXI= 10000
##$MC2= 0
##$MEAN= 0
##$ME_mod= 0
##$MI= 1.114404
##$NCOEF= 0
##$NC_proc= 0
##$NLEV= 6
##$NOISF1= 3.799351
##$NOISF2= 2.8
##$NSP= 1
##$NTH_PI= 0
##$NZP= 0
##$OFFSET= 15.70392
##$PC= 1
##$PHC0= -9375.12
##$PHC1= 10.00097
##$PH_mod= 1
##$PKNL= yes
##$PPARMOD= 0
##$PSCAL= 0
##$PSIGN= 0
##$REVERSE= no
##$SF= 200.130013532006
##$SI= 16384
##$SIGF1= 3
##$SIGF2= 2
##$SINO= 400
##$SIOLD= 16384
##$SREGLST= <1H.CDCl3>
##$SSB= 0
##$STSI= 0
##$STSR= 0
##$SW_p= 3612.71676300578
##$SYMM= 0
##$S_DEV= 0
##$TDeff= 0
##$TDoff= 0
##$TI= <>
##$TILT= no
##$TM1= 0
##$TM2= 0
##$TOPLEV= 0
##$USERP1= <user>
##$USERP2= <user>
##$USERP3= <user>
##$USERP4= <user>
##$USERP5= <user>
##$WDW= 1
##$XDIM= 8192
##$YMAX_p= 0
##$YMIN_p= 0
$$ End of Bruker specific parameters
$$ ---------------------------------
##NTUPLES= NMR FID
##VAR_NAME=  TIME,          FID/REAL,        FID/IMAG
##SYMBOL=    X,             R,               I
##VAR_TYPE=  INDEPENDENT,   DEPENDENT,       DEPENDENT
##VAR_FORM=  AFFN,          ASDF,            ASDF
##VAR_DIM=   8192,          8192,            8192
##UNITS=     SECONDS,       ARBITRARY UNITS, ARBITRARY UNITS
##FACTOR=    0.0002004,     1,               1
##FIRST=     0,             0,               0
##LAST=      1.6414764,     0,               0
##MIN=       0,             -380554,         0
##MAX=       1.6414764,     593021,          0
$$ Real data points
##PAGE= N=1
##DATA TABLE= (X++(R..R)), XYDATA
0@%%%Qj6J6j6K4l6M4n6P2r1J15j37J62k01K45k91L42l98M67n45O27p20Q27r45
27e03J077j222J383j564J760j974K208k467K752l064L405l778M192m647N144n694
43b992O304o982P741q594R559j0665J1943j3437J5216j7377K0064k3512K8123
56A5391l4648M4668o2151J01242l33984R2968O70615l55465k53002K05234j8156
67G2712m53266J81897N69721n8984n32487R817K57434q2374m2792L36468N31m66782
79b08105j27824L71261J16772j56295O2633R1745k48634j29899K84629J56933
89B13216k45939j18391J70839M1382j06287Q0198J05473j54204j64599J06411
99g1901J59321N490n3159o6279q7389M3896J72554L5336j37066p7616q571l1214
$$ plain form
0 0 0 0 0 8 -8 8 -8 16 -20 24 -32 40 -51 64 -73 89 -112 133 -158 184 -214 253 -292 335 -385 442 -503
27 -503 574 -648 735 -829 931 -1043 1165 -1302 1450 -1614 1791 -1987 2205 -2442 2702 -2992
43 -2992 3312 -3670 4071 -4523 5036 -5629 6314 -7123 8093 -9284 10780 -12732 15391
56 15391 -19257 25411 -36740 64502 -269482 -176514 494101 138636 -114366 90868 72712
67 72712 -380554 -198657 371064 312080 -220407 -210590 46844 -35530 -78322 258146 258677 -208105
79 -208105 -335929 35332 152104 -4191 58442 150187 -98447 -228346 56283 213216
89 213216 -32723 -151114 19725 61107 -45180 35018 140491 -13713 -178312 -71901
99 -71901 87420 92910 39751 -26528 -113917 -70021 102533 137869 803 -76813 -85384 -116598
111a16598R6056K26515k537k76516j28186J19912P0515L2896J48464l105l05596
122a38180j41171K67107K05954j03741p5203J2204j62659j11371K79441K73255
132C05636j80514k58419N5166N5391j04569J13692K70177j10246l56915J5906
142a94695K84996K3208j26362O1007J5328k07544l0036K74973R7626k06610q2057
153i0166J03182l2449p6408J42365J17480j78909j57962J44886J48981q2449p0625
164c2074N5643m0332j09385R0501J88846m3810j95014k3920J14476K3450k6988
175A393M9193R454j25945p3568J24037J45943k7578j20391n9193N6K4180Q1833
187B9414R3456l4408j48011o7759Q4678R4949J2296j4971k9646q4750n0964R7739
$$ plain form
111 -116598 -20542 205973 203436 -73080 -201266 -81354 -10839 22057 170521 167416 -138180
122 -138180 -279351 -12244 193710 89969 14766 26970 -135689 -247060 32381 305636
132 305636 125122 -133297 -78131 -22740 -127309 -13617 256560 146314 -210601 -194695
142 -194695 90301 113509 -12853 48154 63482 -144062 -174098 100875 198501 -8109 -90166
153 -90166 13016 -19433 -95841 46524 164004 -14905 -172867 -27981 121000 38551 -32074
164 -32074 23569 -16763 -126148 -35647 153199 109389 -85625 -109545 4931 28381 1393
175 1393 50586 60040 -65905 -139473 -15436 130507 102929 -17462 -76655 -76599 -52419 29414
187 29414 122870 88462 -59549 -127308 -42630 52319 64615 49644 19998 -64752 -115716 -17977
199a7977J36252j4612j19607n5031J5704J7808N3494Q1956k1365j28883m9601
210a01862Q6339O5757k0360j4343J945m8365l9557O1759Q1983k1988p7363k1452
222d7507K6890K0931J8446J5523k3661m6857l721M7093L3367k0144l9561j1099
234c0300J7768J6400J0662J3546r840m8819k5594N1812N8170j9906m8453m961
246a9515L238j2401L4690O0660k9842r1408n87P3967Q331l2855K8866J7378p5593
259c5071l9203Q6111N8677n9440l9280L5433j0185m4110M8757O9934n3931p8096
271f0404M2809N4604m5668k2193O5594M954q2424k621P8729l330o0581K1430M4049
284C4948m3946l5895N7337K9281n9757j6485N8078J382n6296J0246N0321j7298
$$ plain form
199 -17977 118275 103663 -15944 -70975 -55271 -37463 16031 97987 76622 -52261 -101862
210 -101862 -15523 50234 29874 15531 17476 -30889 -70446 -8687 73296 51308 -26055 -47507
222 -47507 -20617 314 18760 34283 10622 -36235 -39956 7137 40504 20360 -19201 -30300
234 -30300 -12532 3868 14530 28076 18236 -30583 -56177 -4365 53805 33899 -14554 -19515
246 -19515 -16277 -28678 6012 66672 36830 -54578 -55165 18802 27133 -5722 23144 40522 -35071
259 -35071 -74274 11837 70514 11074 -28206 7227 -2958 -47068 1689 71623 17692 -60404
271 -60404 -17595 37009 -8659 -30852 34742 39696 -42728 -45349 33380 30050 -30531 -9101 34948
284 34948 -8998 -44893 12444 41725 -18032 -34517 23561 24943 -31353 -21107 29214 11916
296A1916l7280K6214K2163l6839j1464M3970P103m0806j072L0165j0790k1404
308a8124K4088K0977k8122k2157J9206J4193n473N174J621k4761j0504K8909J8577
321B3604j7042j2147M003o694m720K2491J5393k1832k1958O128R614N516J6758
334A9114K278l4358k4015K6654L2847m299j5578o682j4058p442K9745L1879j7361
347A8724l8590p164J3961J1387K0985J7563k6871m8889k129M4126K8866n137j7508
360I324k5801k2294J8819N0001J5908l6308l5740m708J2545K5444L3431O00m8518
373g297m1584J5291M4840K4843n468k6809l5002q704L8163M3482m556m1539l0149
386c4489Q11K3677L5198J9862k4471n0260j9660L0940M3533J4769k1342l8888
$$ plain form
296 11916 -25364 850 23013 -13826 -25290 18680 25783 -15023 -16095 14070 3280 -18124
308 -18124 5964 26941 -1181 -23338 -4132 10061 4588 9762 11383 -13378 -23882 5027 23604
321 23604 6562 -5585 -1582 -8276 -12996 9495 24888 3056 -18902 -12774 -3160 2356 19114
334 19114 21392 -12966 -36981 -10327 22520 18221 2643 -4039 -18097 -25539 4206 36085 18724
347 18724 -19866 -27030 -13069 -1682 19303 36866 9995 -38894 -41023 3103 31969 26832 9324
360 9324 -16477 -38771 -19952 30049 45957 9649 -26091 -30799 -18254 7190 40621 41221 -7297
373 -7297 -48881 -33590 11250 36093 30625 3816 -31186 -39890 -1727 41755 37199 -4340 -34489
386 -34489 -33678 -10001 25197 45059 20588 -29672 -49332 -18392 25141 39910 18568 -20320
398b0320k4229J8541M8650K7239k5011m9741k5423J8848M4505L3689o517m4469
410d238m2125J771M4343M3013J439m0275m4639o783M0484N0618J0508m1612n3314
423d0810j4043L6373N1555K2008k5757n1002l0704J9794N1978L2639j8353m9603
435a5925l4144J2699M9849M2475q478n5319m7420P000N1149M5439K060m0751m9092
448d0458j2282L9141N2440J2206l8617n0171j6300L2205N4789K7654l0497o1898
460c1788l1793K8203N7772L3360j8283n1576l7400J2151M9652L9186q483m8069
472g068m3324L160M9897M9379Q71m7092n0137r782L9027N4555J7601l9296n4690
485c6899j2582L5888M4343J7258k2917n0585l3413K6272O3030L0305k8780m9932
$$ plain form
398 -20320 -44549 -26008 22642 49881 24870 -24871 -50294 -31446 13059 46748 40231 -4238
410 -4238 -46363 -44592 -249 42764 44203 3928 -40711 -47494 -7010 43608 54116 12504 -40810
423 -40810 -54853 -18480 33075 55083 29326 -21676 -52380 -32586 19392 52031 33678 -15925
435 -15925 -50069 -37370 12479 54954 46476 -8843 -56263 -49263 1886 47325 49385 8634 -40458
448 -40458 -52740 -13599 38841 51047 12430 -37741 -54041 -21836 32953 60607 30110 -31788
460 -31788 -63581 -35378 22394 55754 37471 -14105 -51505 -39354 10298 49484 41001 -7068
472 -7068 -50392 -47232 2665 52044 52915 5823 -44314 -54096 -15069 39486 57087 17791 -36899
485 -36899 -49481 -13593 30750 48008 25091 -25494 -58907 -32635 30395 60700 31920 -18012
497a8012l0224N414M3374N1056j34n9132m7814J5814M8824L0888p16l1121m9588
510d1371j8711M6526O2194O223m4972m2119j4082J7309M6902L8509k3003o4384
522c0979k5809L7510M6895J4773j5160l7381l9603L883N7075M7195j6018n2813
534a0432l2215N978L1984L9442J3692l6619n4062p992M7379M6336N91l4825l7749
547b8492j6967J9495M8974L2660k4785n6658k3532K7369L8211J7215n729k8969
559a208l8543k649M9827M3364j8583m7971j9433R381J8327L0066K0932k9242n3996
572c9728l099M7373K7252j2010j5132j6077k4843R096N6346K7192m7129n0188
584d0947P978K8810J4089J8582Q441m2444m9962K1987O3856J4802l2345k2014
$$ plain form
497 -18012 -48236 -42822 552 51608 51474 -7658 -55472 -39658 9166 40054 39338 8217 -41371
510 -41371 -60082 -13556 48638 54861 9889 -32230 -46312 -29003 17899 56408 33405 -30979
522 -30979 -56788 -19278 27617 42390 27230 -10151 -49754 -45871 11204 58399 42381 -10432
534 -10432 -42647 -36669 -4685 34757 48449 11830 -42232 -50224 -2845 43491 44082 9257 -28492
547 -28492 -45459 -25964 23010 55670 30885 -25773 -49305 -21936 16275 33490 27761 -1208
559 -1208 -39751 -42400 7427 50791 32208 -15763 -35196 -25815 -7488 22578 43510 14268 -39728
572 -39728 -42827 4546 31798 19788 4656 -11421 -36264 -27168 29178 56370 9241 -40947
584 -40947 -32969 -4159 9930 28512 36953 -5491 -55453 -33466 30390 45192 12847 -9167
596i167j2510j5416K2629N9523J2329o0433m6157J8046L2426J4416J5722L01m5185
609a3476m1034K8512N7197P557l1107j8045q039r711J8349M2797O000m4577l0868
622c6445J6911K5347N919K309k645k1839j7607J9522L1135k758k6791r933R507
635g368O942N537J0044l976k5581j2100K4327K8191o942k6365r209N942N570J2954
649G966J9119p921l9774j7507L1892L2860m738j5485o462j7805j5456K9218M6303
662D2210q842m9178j4141K0168N702N793K9549M9n4132k5787M3854L3209j9046
675I408q177J4923k4074l6590L2415N5370j9227m7995J1989K3384k5824o997M7546
688B6151P650n5978j0701M8846K383l9545J4612L6999k8124l5811L5256L0201
$$ plain form
596 -9167 -21677 -37093 -14464 45059 57388 -3045 -49202 -31156 1270 15686 31408 31709 -13476
609 -13476 -54510 -25998 31199 38756 7649 -10396 -18435 -28146 -9797 33000 39000 -5577 -36445
622 -36445 -19534 5813 11732 14041 11396 -10443 -28050 -8528 22607 19849 -6942 -16875 -7368
635 -7368 -426 5111 15155 11179 -14402 -26502 -2175 26016 19074 -7291 -16500 -10558 -4988 7966
649 7966 27085 19164 -20610 -38117 -6225 26635 21897 6412 -50 -17855 -33311 -4093 42210
662 42210 33368 -15810 -29951 -9783 -4081 1712 31261 31310 -22822 -48609 -4755 28454 9408
675 9408 1231 16154 -7920 -44510 -12095 43275 24048 -23947 -11958 11426 -14398 -21395 26151
688 26151 33801 -22177 -32878 15968 18351 -21194 -6582 30417 2293 -33518 1738 31939
700C1939m0258k1716M4485J3947m3794l308L8831j2282l7683K6918M2159l0455
712H783m1499K4149K6712k3127n679L4765l584m6523l473M0618Q692j9569K509
725B774N523k2813j0814K8287K2024j3009j7674l939k366L272J4268R729n485
738I777j1435j1614m022J5445J8460n894j4721K520j40j5144P013L1148j648l2955
752a3210K40K3369j3098j9124L0951K5244l7211k7642L3304J5184l4114L948M5203
765C3044j3444n3624J3465M6161j8248l0028L5397K1150n2781k2466N4826J9465
777C2917m5469j779M0109k0740m5477L1721M8869l0254l8081L0305J7788m0224
789b0315m135N0832J337m9573J561L7940j3343k8454K7017K6754l2319k3414K9262
$$ plain form
700 31939 -8319 -30035 14450 28397 -15397 -18705 20126 7844 -29839 -2921 39238 8783
712 8783 -32716 -8567 18145 -4982 -10661 24104 20520 -26003 -29476 11142 19834 265 2774
725 2774 8297 -14516 -25330 2957 24981 11972 -5702 -9641 -12007 -8735 5533 15262 9777
738 9777 -1658 -13272 -17294 -1849 16611 10717 -4004 -1484 -1624 -16768 -9755 21393 19745 -13210
752 -13210 -12970 10399 -2699 -21823 9128 34372 -2839 -30481 2823 18007 -16107 -12159 33044
765 33044 19600 -34024 -20559 25602 7354 -22674 12723 33873 -18908 -41374 13452 32917
777 32917 -12552 -14331 25778 5038 -40439 -8718 40151 9897 -28184 2121 19909 -20315
789 -20315 -24450 26382 27719 -21854 -20293 17647 4304 -24150 2867 29621 -2698 -26112 3150
802C150J2606k8155M72L1884o245l1609O287K2935j0353j2334K0131J0179k5270
815f322j3411J8430J0121q133L537Q215j3634j7584Q892J9744L440p457n559o782
829f503n527N798J4023P307o271j4908j0072O509J5409N935m400m846q047j0314
843a5907O041K1337N736j6912r431N657j173l047J4375J0942j7892j7498J2455
856e317J4347r257m520J3505j850k0164K689K2538k824k0342N586J8318q934j6070
870a2295J1479J2144j5875q307K1678R183k3788j1024J8945O882j3568M463J5904
883A5821j4017k4781J2832K8410n116j9227M741N125j7495j419L0574J0213k9572
896c911j5864J6570O077r215J1825J6150k0603k7610J4651K7055o032j2611R044
$$ plain form
802 3150 15756 -12399 -11927 19957 13712 -17897 -11610 11325 972 -11362 8769 18948 -6322
815 -6322 -19733 -1303 8818 685 4222 12437 -1197 -18781 -9889 9855 13295 5838 279 -6503
829 -6503 -12030 -6232 7791 15098 8827 -6081 -16153 -9644 5765 11700 7300 2454 -5593 -15907
843 -15907 -9866 11471 17207 295 -9136 -3479 -4652 -7699 6676 17618 -274 -17772 -5317
856 -5317 9030 -227 -4747 8758 6908 -13256 -10567 11971 9147 -11195 -5609 12709 3775 -12295
870 -12295 -816 11328 -4547 -12854 8824 18007 -5781 -16805 2140 9022 -4546 -83 15821
883 15821 1804 -22977 -10145 18265 13149 -6078 -1337 3788 -13707 -15126 15448 25661 -3911
896 -3911 -19775 -3205 2872 -6343 5482 21632 1029 -26581 -11930 15125 9093 -3518 5526
909E526j426k2665K737L1489M718k6240n863J4119m204q513J6815J2176k1211
922b542j5796J6779J2773j1545l213J0877n605j3927Q977J6040p867j3276O076
935b249P108o238m62Q458m100j1647M528J2264j619p197j76j226l707O106R678
950I521m055j0041j059K181J047O990O103r623j2466M255R638L49R19L967r121
965a395j3519P543J7433j376j0631J286K26r717L965J8906l58j9488k987J2043
979A931j382m497J1625M231j9187q344J8536Q856j2890j971R611p459j1525J3187
993G22J4966j3252j4353J0164Q280r571L13J2853n973j6870O053J6895m423j1281
1007e477N116L600r946P34J5428k79j6276j735J1106n07m402P355K452j3431n270
$$ plain form
909 5526 4100 -18565 -15828 15661 20379 -5861 -11724 2395 -1809 -10322 6493 18669 -2542
922 -2542 -18338 -1559 11214 -331 -3544 7333 1728 -12199 -3222 12818 4951 -8325 -2249
935 -2249 4859 -1379 -1841 6617 2517 -9130 -4602 7662 6043 -1154 -1330 -2556 -6263 -157 9521
950 9521 5466 -4575 -5634 -3453 -2406 4584 10687 1064 -11402 -7147 2491 2840 3759 7726 -1395
965 -1395 -14914 -7371 10062 8686 -1945 -659 -433 -10150 -6185 12721 12363 -7125 -10112 1931
979 1931 549 -3948 7677 11908 -7279 -15623 2913 11769 -1121 -3092 6519 -940 -12465 722
993 722 15688 2436 -11917 -1753 6527 -3044 -2731 10122 4149 -12721 -6668 10227 5804 -5477
1007 -5477 -361 3239 -6707 -5973 9455 9176 -7100 -8835 2271 1764 -2638 4717 7169 -6262 -11532
1022a1532J3039O935p492k638L042m867m050R534P983p976p921L185K612j809
1036a955M195N059o222q453L996O834j072j656J742k777n190L844P266k039n587
1051b015N10J475j821J990M727k798o637J279N715k79k233J530j220m817J886
1066b708O874L06o166j380K151p45P82N019k60p221k405N371K906j558M96J47
1082A609m966k120N913M954l125m265K30J73m62L553L247l321n006P21L161J234
1098A530L70O19k731l428J556M436Q39k345j552m36n43J501K769M0l102k060J153
1115a384J893J090K3j246j925m97J545K185k2j556j634j44J000J200Q37m60j836
1132i31j372J512K099j49j631l24L61q20P77K226m83k674n05K368P79j258K60
$$ plain form
1022 -11532 1507 8442 950 -1688 1354 -3513 -7563 1971 9954 1978 -5943 -2758 -146 -1955
1036 -1955 2240 7299 1077 -7376 -3380 3454 2382 726 2468 -309 -5499 -1655 5611 3572 -2015
1051 -2015 -1505 -30 -1851 139 4866 2068 -4569 -3290 2425 2146 -87 1443 223 -4594 -2708
1066 -2708 4166 4472 -1694 -3074 -923 -1668 -886 4133 3873 -3348 -5753 -382 2524 966 1462 1609
1082 1609 -3357 -5477 436 5390 2265 -2000 -1770 -1597 -2059 1494 4741 1420 -3586 -2865 296 1530
1098 1530 1900 2519 -212 -3640 -2084 2352 3191 846 -706 -1142 -1685 -184 2585 2625 -477 -2537 -1384
1115 -1384 509 1599 1622 376 -1549 -2046 -501 1684 1662 106 -1528 -1672 -672 528 1365 905 -931
1132 -931 -2303 -791 1308 1159 -472 -796 -435 -1255 -478 1748 1265 -1409 -1914 454 1233 -25 235
1149B35L86j832o02L130J433k940j425J784K21j202J903J647k828k902K463K657
1165B128j393q86J225j226k389J898L375j134k770L69Q83j289P49K889r74l505
1181b050O7K456q0o66J238l63k609J99K624L50j540M19k4j710O06K742m94k515
1199a350P81J471j822l87L010J49l741M00L216q56k604K177J992l443j339M159
1215A813N05m227M36M160j649l823K826L180l984k315M918J141n214k26N033j282
1231A292m488K865M062m235l718M849K890m981j348N321o69n494J443N654j850
1246A593m767K462L149l246k054L922J820l961j185L063L05k421O65K620j141
1261H24k084N28J423l59o87P40Q16r03j296n7J795O68j228m27R67p58j751J446
$$ plain form
1149 235 621 -1211 -1813 1317 2750 -190 -1615 169 390 -812 1091 2738 -90 -2992 -529 2128
1165 2128 735 -151 1074 -152 -2541 -643 2732 1598 -1172 -803 80 -1209 -460 2429 1455 -2050
1181 -2050 -1983 473 393 -273 965 602 -2007 -1808 816 1166 -374 45 21 -1689 -1083 1659 1165 -1350
1199 -1350 -569 902 -920 -1307 1703 1852 -1889 -1489 1727 871 -1733 444 2436 -1007 -2346 1813
1215 1813 2318 -1909 -1473 2687 1038 -2785 41 3221 -763 -3078 1840 2981 -2233 -2459 2574 1292
1231 1292 -3196 -331 3731 -504 -4222 627 3517 -1464 -2812 2509 1840 -3654 -2211 3443 1593
1246 1593 -3174 -712 2437 -809 -2863 1059 2879 -1082 -2267 796 1101 -1320 -655 1965 824
1261 824 -1260 -732 691 332 -355 385 1201 298 -998 -1055 740 1408 180 -247 720 -38 -1789 -343
1279c43K937j150l318R44K028j890p10L845P32n286j404N009N25l585J282L823
1295C439l799m895M477N422m006l790L835J359n207K16O649l20o610M28N078j625
1311F51l541L645L029m732k853M563K092m030o23L906m16l833R37L306j248k546
1327a693J592K384j827k049Q53J526l03l77P60N1j716j590J715L067j68k911o63
1344a349J037r80l35M033K068n415m120L853L476k785M10M240l111p580K631Q939
1360E012j167o376K010K933n937k045R279L540q903l521O369K97n461M039O937
1375G006n874q123N430O475n249k912O468O48q271J32Q704q43p435K247O109l734
1391G78n481M675L839m902k235N898J239o302j476M869R96k641J369J881l171
$$ plain form
1279 -343 2594 1444 -1874 -930 1098 -792 -1502 2343 3075 -2211 -3615 1394 1919 -1666 -384 3439
1295 3439 -360 -5255 -778 4644 638 -3152 683 2042 -3165 -2949 3700 3380 -3230 -2802 2276 651
1311 651 -2890 755 3784 -948 -3801 762 2854 -1176 -1799 2107 1691 -2142 -1205 2101 853 -1693
1327 -1693 -101 2283 456 -1593 -740 786 483 106 866 917 -799 -2389 -674 2393 2225 -686 -1349
1344 -1349 -312 -1292 -1627 2406 4474 -941 -5061 -1208 2268 -517 -107 4133 1022 -6558 -3927 5012
1360 5012 3845 -2531 -521 2412 -3525 -5570 3709 7249 -1654 -5175 1194 1491 -3970 69 7006
1375 7006 1132 -6991 -1561 4914 -335 -3247 3221 3869 -4402 -4270 4434 3591 -3844 -1597 4512 778
1391 778 -4703 -28 3811 -1091 -3326 2572 3811 -2491 -3967 902 1898 -743 626 2507 -664
1406f64l681K470M599M60k594j784q25k32J255L128J958k688m869q79M078K681
1422B413n82k06p6m348k857N548N966l338m934J646J270l927J420P653o46q912
1438c910q21O905j94m691L555M421o307m968O389M774n820k762N892L09o237J315
1454b150O126k704n741L952N241m724m332M578K473m888J95N965j269p165N59
1469c884O113K02l214J561J088m492j980N429L983l112l243o3J67m24K825L107
1485D063j539m728j620K572K956N69m84j142k414j707K121M488O10l702k489J329
1501a117P19l62K200K416l605m508K383M504j208k684K200N49m083m11N337R52
1517C282n197l45M093j015l605K495L328l645k628M272K265m886j546M588N44
$$ plain form
1406 -664 -4345 -1875 2724 3184 590 -1194 -2019 -2251 -996 2132 4090 1402 -3467 -4346 -268 2413
1422 2413 1831 1625 1549 -2799 -5656 -108 5858 2520 -2414 -768 502 -3425 -2005 5648 5002 -3910
1438 -3910 -4731 2174 1980 -2711 844 5265 -1042 -6010 379 5153 -667 -3429 2463 2772 -3465 -2150
1454 -2150 3976 1272 -4469 -517 4724 0 -4332 246 2719 -2169 -1974 3991 2722 -4443 -3884
1469 -3884 2229 2431 -783 778 1866 -2626 -4606 823 4806 1694 -1549 -1612 -1445 -1869 956 4063
1485 4063 2524 -2204 -3824 -1252 1704 2273 1789 647 -1767 -3474 -1353 3135 3745 43 -2446 -1117
1501 -1117 -398 -760 1440 3856 251 -4257 -1874 2630 1422 -1262 938 1487 -2596 -3007 2330 3282
1517 3282 -1915 -2260 1833 818 -2787 -292 3036 -609 -3237 1035 3300 -1586 -3132 1456 2000
1532B000m035J364M115l358m822L659N214k777l560K411J208m138J49O086O79
1547D195n761j875L441O57j230K209J733l906l624K567L780m94j114L47j510k421
1563c006J411M023M25k925j427N23J66L10J603J125k061k533N62K379O24j010
1579A89j75K53r81o26J310J594j038j831P76J414p31j182J094Q66j292n42J996
1596A094J62k516k94K658K66j854L56J223j758j614K711K308k145k336J389Q91
1612E41j608P09K790q98l658K3L049J72j525J053P00k656j396L176K057k275j411
1629a157J232o4j724J453K452j159k872Q47J810r28m94J432J87k085n09K321M80
1646A222j787J96J131o82j120J137J144j284r37J132P48j009m49R90j11p65K22
$$ plain form
1532 2000 -2035 -671 3444 86 -4736 -1077 4137 1360 -2200 211 1419 -2719 -2570 3516 4195
1547 4195 -1566 -3441 0 657 -573 1636 3369 -537 -4161 -1594 2186 1692 578 925 -585 -3006
1563 -3006 -1595 2428 2853 -72 -1499 -976 -810 -500 1103 2228 167 -2366 -1804 575 1199 189
1579 189 14 267 -714 -1340 -30 1564 526 -1305 -529 885 154 -1028 66 932 -360 -902 1094
1596 1094 1256 -1260 -1554 1104 1370 -484 -128 1095 -663 -2277 434 2742 597 -1739 -350 541
1612 541 -1067 -358 2432 1534 -2124 -2101 948 1120 -405 648 1348 -1308 -2704 472 2529 254 -1157
1629 -1157 75 11 -1713 -260 2192 1033 -1839 -992 818 -110 -604 828 1015 -1070 -1579 742 1222
1646 1222 -565 -369 762 80 -1040 97 1241 -43 -980 152 900 -109 -558 432 321 -444 -222
1663b22R63m48o94J79M60k34K0K61j95m25QN83l4j73j02k15p1L42K58j31k35j60
1685b65j65N9O15K86o77j57K26J5l74M51N54n08q33O25N55m67l75Q51j34q08J96
1706c30R58l27q94O17P61q94o59J095K87q56r0R98j43j189M02J048o21o68N98
1725I3O02j040l04J165K31j178j28Q61l08n48N49P51q57o17O22N50n30k10O70
1744C74l43p06M42Q56m66n76K90K79m36K25N99k92p54K4O44K15m26L05r5n42q8
1765d71Q86R4n62j12R0j25J52M49J90p09l46M10L47j1N8j28n46j53M66O16k76
1786C19m15j42j0M6M49J45m56l86NL95K03J59j29m06m91L74P32N7m51l65j30J14
1808c83L60O85j00q46m03K68N33M86J5o37o75P0N91O60Q2m42n68k39J23P23N37
$$ plain form
1663 -222 741 293 -401 -222 238 4 24 285 90 -335 -327 256 222 49 -53 -268 -339 3 261 130 -105 -265
1685 -265 -430 -371 244 530 -147 -304 -78 -63 -437 14 568 60 -773 -148 407 -60 -435 416 282 -526 -330
1706 -330 628 301 -593 24 785 -109 -768 327 614 -242 -332 666 523 -666 -264 784 163 -505 93
1725 93 695 -345 -649 516 747 -431 -559 302 -6 -554 -5 746 -111 -728 -106 444 -86 -296 374
1744 374 31 -675 -233 623 157 -419 -129 150 -286 -61 538 246 -508 -484 160 375 -51 254 159 -383 -471
1765 -471 415 509 -53 -165 -75 -200 -48 401 591 -118 -464 -54 293 282 340 212 -334 -487 -21 595 319
1786 319 -96 -238 -248 -202 247 392 -64 -450 -445 -50 153 312 183 -223 -714 -340 392 449 -2 -367 -497 -383
1808 -383 -23 662 562 -284 -687 -419 114 600 615 -22 -697 -627 -36 624 706 264 -304 -543 -420 303 840
1829H40l58q80k42L12M07M13J23o11p70K39P44L59k60m00l53J2K94O96J89r84
1849b30n91M03N15L20j4k30p21n63R65Q65q4p32l57r0j5Q57O66m04j129l85O99
1870b55N69K29J76o22r75j82J314Q25m88o97k90k87L38R12N69p71j033Q7O10L16
1890C45L17o4q33p01N84R11J35m81m68k31N6N66O68k65r63m43L95R54K97k62q19
1911c02n04N8P80O36K90o47j313j97J275Q23j57n97n62n65J07J451R55j001j404
1930h74P9M65L64O39O13j170j602N14J638L70o98j5n05r41N75J672J81j453r32
1949a080P48K57O3P98J89j547q39J154J345m07p14k4n76m61J000J391l14j587
1967f04o67P36P97K16R8p6j184o91J077J321J5j210n05L37n4M62Q87J13j502j022
$$ plain form
1829 840 482 -398 -640 -328 79 492 615 4 -766 -527 217 576 316 -84 -437 -425 -131 565 754 -230
1849 -230 -821 -418 97 417 403 173 -548 -1111 -146 719 635 -97 -454 -544 -559 298 964 560 -569 -954 -255
1870 -255 314 543 719 97 -878 -1060 254 1079 591 -106 -396 -683 -345 567 1136 365 -668 -581 29 345
1890 345 662 598 -235 -936 -352 559 694 213 -255 -486 -430 136 804 539 -424 -867 -472 482 779 517 -302
1911 -302 -806 -748 32 668 958 311 -1002 -1199 76 899 742 145 -417 -982 -875 576 1531 530 -874
1930 -874 -795 -330 34 673 1286 116 -1486 -972 666 1036 338 323 -182 -1123 -548 1124 1305 -148 -1080
1949 -1080 -332 -75 -12 786 975 -572 -1411 -257 1088 681 -33 -57 -633 -1094 -94 1297 983 -604
1967 -604 -1271 -535 262 478 576 500 -684 -1375 -298 1023 1038 -172 -677 -340 -394 68 955 1068 -434 -1456
1987a456J184J268l06o20N1l37q78P88J826m59k121J57J292k23m99J012J77k100
2005a244l68K315R55j854o52J174n10j050J653J646j946k261J390J885j110k04
2021a81J281q86k332P31L120q9k159j02O05r26O1K253N83k544j357J490R46j84
2039C10L56K17j277j343J081J730J16p28p19n36O0O47Q61J93q15r82l40J202J044
2058A077o52o61L27k37q20P99J559p30k053P22J738j061j178J655P39k319k61
2075a356K688J5k811J34K716p31k289J801J864k913j760L511J557l201q73K807
2091A159o18k795J901L504k342l436J843K382j877q28K885j19l956j2L889J67
2107A747k513O93J394k264j503K962K038k417j660J674J53j688J318K118j217
$$ plain form
1987 -1456 -272 996 690 70 121 -216 -1094 -306 1520 1061 -1060 -903 389 166 -333 679 856 -1244
2005 -1244 -1612 703 1658 -196 -848 326 -184 -1234 419 2065 119 -2142 -752 1133 23 -181
2021 -181 1100 214 -2118 -1387 1733 1644 -515 -617 -12 -938 -877 1376 1959 -585 -1942 -452 494 310
2039 310 666 883 -394 -1737 -656 1074 1190 462 -257 -793 -733 -86 775 968 153 -829 -1169 33 1077
2058 1077 425 -236 91 -146 -966 -167 1392 662 -1391 -669 1069 8 -1170 485 1224 -1095 -1356
2075 -1356 1332 1347 -1464 -1330 1386 655 -1634 167 2031 -882 -2642 869 2426 -775 -1648 1159
2091 1159 541 -2254 -353 3151 809 -2627 -784 1598 -279 -1107 1778 1659 -2297 -2309 1580 1747
2107 1747 -766 -73 1321 -943 -2446 516 2554 137 -1523 151 304 -1384 -66 2052 835
2122H35k279N08J361l86k67Q09O5j208l36P79L66J9J24n87j19K91k80k35R63M76
2142H99j108m18R72j26j287R66J714r91j934R05J445j528o17K647K01l170l56
2159a786K970j29k291J272K114k412k513K812K401k602j415K782r4l364Q06L873
2175B424r59l352J226K264k131j636K995J611l340j078K904O8k679R74K995j486
2191H00k803J277K098j621j076K506M82k594j064K424O35j364L11J063j058j824
2207a808J057J876j57j127j29J00n59J81J250Q42j180j454O7J108M57PQ9j46j274
2226h00p31J600J627j107j353O17L13j041K92K059l50k563N4K145r9j667Q67J358
2244A221j635j223K038J307k142j229K015Q47j890P1J756q16k111J286K612j200
$$ plain form
2122 835 -1444 -936 425 39 -228 581 646 -562 -898 -119 247 266 390 -197 -316 -25 -305 -540 423 899
2142 899 -209 -627 345 219 -1068 -102 1612 621 -1313 -408 1037 -491 -1108 1539 1740 -1430 -1786
2159 -1786 1184 1055 -1236 36 2150 -262 -2775 37 2438 -164 -1579 1203 1109 -2255 -1449 2424
2175 2424 1465 -1887 -661 1603 -528 -2164 831 2442 -898 -1976 928 996 -1683 -709 2286 800
2191 800 -2003 -726 1372 -249 -1325 1181 1663 -931 -1995 429 1064 -300 11 1074 16 -1808
2207 -1808 -751 1125 968 -159 -288 -188 -747 -566 684 1526 346 -1108 -1041 67 524 531 620 474 -800
2226 -800 -1531 69 1696 589 -764 -147 166 -875 -583 1476 1126 -1437 -1383 762 663 -1004 -137 1221
2244 1221 -414 -1637 401 1708 -434 -1663 352 1199 -691 -620 1136 320 -1791 -505 2107 907
2260I07k265Q00J127j243QK260J39l028r21K452J128j118p3O88j624j305J820
2277b48K603q61k393l05Q66k93O05J888k23k798j223J984J638k48n85j62j019
2294g74j117J583K316n68k303o08J182J88J83J174jk391j040K167J790j114j167
2311e00L40k65p88J383J872j002k664P3J883M43k14K64n08j991P8K509J260j650
2329E23j503M9J76M98J589N70j832k191N02K206Q62l66p30j227j045J005K334
2346A420Q97j765j994l19J120J454P68n09j487j760M86K340J586j094j728q73
2362a458J74R08J792P45j746k472K28K088J131k00m21j162j756O67K990J054k157
2379D05j869L54M80M40J848L99k465k284J567K395J12o80n55j158j150J762K786
$$ plain form
2260 907 -1358 -558 569 -674 -666 1594 1733 -1295 -2216 236 1364 246 173 861 -763 -2068 -248
2277 -248 2355 1494 -899 -1204 -338 -631 -26 1862 1639 -1159 -2382 -398 1240 992 407 245 -774
2294 -774 -1891 -308 2008 1440 -863 -1471 -289 -101 82 1256 1255 -1136 -2176 -9 1781 667 -500
2311 -500 -160 -425 -1213 170 2042 1040 -1624 -1551 332 775 561 825 317 -1674 -1596 913 2173 523
2329 523 -980 -931 -755 -257 1332 1902 70 -2121 -1619 587 1449 1083 353 -874 -1919 -914 1420
2346 1420 2317 552 -1442 -1761 -641 813 1581 1072 -415 -2175 -1689 651 2237 1143 -585 -1458
2362 -1458 -1284 -376 1416 2161 415 -2057 -1829 259 1390 1190 769 -393 -2149 -1482 1508 2562 405
2379 405 -1464 -1110 -630 -190 1658 2057 -408 -2692 -1125 1270 1382 702 147 -1011 -2161 -399 2387
2396B387l87k684r70N58O88J077J337q23k956o80K177J896k33q63j231j207M59
2413a455K344J640j595k111n10N18J364J625K1k108j962N80K051J339j12j272
2429C57j976n22J937K074j37j224j608q80R54K278J206j704j989n69Q41J414J431
2446A883j08k330j703Q71K077R31l50j091j786n79J990K366k92k150j182n4P13
2463g94J709J277j189k690n69J829J563K63l78j335j755N07K515J247j391j427
2479f18q35J63J085J875L66k276j757O37J607Q79K55o80j925q83J793J926J29
2496A741j493j208m06N24J658J130r49k065o78J030J450P53k29j597j579O90J564
2513C36J162l84j315j217j52J278J784Q5j590j342J8R03J287P96j028j609n63
$$ plain form
2396 2387 2000 -684 -1654 -1096 -408 669 2006 1183 -1773 -2453 -276 1620 1387 524 -707 -1914 -1455
2413 -1455 889 2529 934 -1177 -1687 -1169 195 1820 1841 -267 -2229 -1649 402 1741 1629 357
2429 357 -1619 -2141 -204 1870 1733 509 -1099 -1979 -1025 1253 2459 755 -1234 -1803 -962 452 1883
2446 1883 1775 -555 -2258 -1387 690 1621 1271 180 -1606 -2185 -195 2171 1879 -271 -1453 -1507 -794
2463 -794 915 2192 1003 -1687 -2256 -427 1136 1399 1021 -314 -2069 -1562 953 2200 809 -618
2479 -618 -1453 -1290 -205 1670 2036 -240 -1997 -1360 247 1126 1381 701 -1224 -2107 -314 1612 1741
2496 1741 248 -960 -1366 -842 816 1946 997 -1068 -1746 -716 734 1487 1258 -339 -1918 -1228 336
2513 336 1498 1114 -201 -1418 -1570 -292 1492 1577 -13 -1355 -1337 -434 853 1649 621 -988 -1551
2530a551J053J178O40l97j422j099N68J671P85n56j232p69J16J054J338j77j398
2547a98q38J09R92Q11M00r12j433l71J349J188j97n86p72o13M24J268P55p88j376
2566g88k11N75P60N41j56r60r16M36R86N81k73p54o11j55Q24Q74J71q73q44M7
2586g46O62O09J88l72p60l45L47P71M54k29j038k04M44M44K36K8l30p37rR73K44
2607F30m33k34Pj75j72P07M42p69p89O50O01m90j43P25m25r42L99J145k66r35
2627d67K09N77l73n25R37J56r17k12Q64K33o63j84O82l12o51O18N16m05n53M27
2647d3M79n85j51N80m3m89K5L89K1m59J18M44o1k55j45L30k06j39M67J65n32m29
2669e19L61M92n4k29R0j68l62j10R63L55p95q61M42M38P1M4L70m83j082J93J453
$$ plain form
2530 -1551 -498 680 1320 923 -499 -1598 -1030 641 1426 870 -362 -1131 -1015 39 1377 1200 -198
2547 -198 -1036 -927 65 876 1276 364 -1069 -1440 -91 1097 900 314 -458 -1071 -647 621 1376 588 -788
2566 -788 -999 -424 336 877 721 -239 -1155 -719 267 848 575 -179 -790 -945 -121 753 924 51 -793 -746
2586 -746 -84 525 713 341 -419 -764 -417 354 808 579 -459 -663 -219 225 461 489 159 -578 -587 386 630
2607 630 197 -37 -30 -205 -377 330 772 3 -786 -136 465 -25 -168 557 132 -810 -411 734 468 -467
2627 -467 -258 319 -54 -579 358 514 -403 -615 249 482 -181 -365 317 5 -646 -28 488 83 -470 -43
2647 -43 436 -149 -300 280 237 -252 -227 162 183 -276 -158 286 225 -30 -175 155 -51 -190 277 442 -90 -519
2669 -519 -158 334 280 51 141 -27 -389 -499 464 819 24 -837 -395 43 114 158 528 45 -1037 -844 609
2690F09L74r82k89J16n24L2J387L97j159j121O41Q98j72J12N21q29j400O37J816
2709A064R8j386r5L41n62J61J402L43j844r61J373J022p07j31N53q40j165J189
2727a45J647p21j718L2J152l26j4J091k57j963m62J812J334r76q35N2n01l22J686
2746E66J412j265k294R1J471M93K41L88r44k004J64K256J336j004j475k60j36
2763i64K83J575J231j473k183K2J525R63o0k30p31j616K58K166J246j336j607
2780i31j4M85K80R75O54j145j956J45K249P42j215n92l9n35oJ861R45j942j865
2799a904Q52J642J25j51K26j187j853J081K929L10k266j110M30Q2O73J768L97
2816B044k796k020J732K311R7n16k10j579j486J725L124j85k804r89Q50K59O53
$$ plain form
2690 609 983 1 -288 -172 -696 -664 723 1120 -39 -1160 -519 379 207 319 840 11 -1389 -752 1064
2709 1064 1162 -224 -319 22 -540 -379 1023 1366 -478 -1439 -66 956 249 118 671 -169 -1334 -145
2727 -145 1502 781 -937 -905 247 -79 -93 998 741 -1222 -1684 128 1462 486 -349 -297 -798 -1120 566
2746 566 1978 713 -1581 -1490 -19 474 715 1103 159 -1845 -1681 575 1911 907 -568 -828 -964
2763 -964 -681 894 2125 652 -1531 -1509 16 979 919 689 -42 -1658 -1400 766 2012 676 -931
2780 -931 -945 -460 -180 795 1449 304 -1652 -1507 742 1484 269 -323 -362 -897 -903 958 1903 -39 -1904
2799 -1904 -1052 590 715 564 790 -397 -2250 -1169 1760 2070 -196 -1306 -876 -794 -121 1647 2044
2816 2044 -752 -2772 -1040 1271 1368 852 642 -937 -2423 -698 2426 2241 -563 -1552 -702 -443 210
2833B10J645j38k939j343J977K145k84q79k97r49r85J602K421l78k651q19J139
2850e23O65M24N14j51k179q41J987J898q40j350k81K3k48J317J363q93k410j94
2868a719J832J077m12l71n20j317j9K246J532j425k278j02J194L86Q56P02j257
2885D05k404R3K661J223j091j003n54p95L27K350J331j814k601K42J502P27M65
2902A064M42j413k371L51K822J072j419j110j91l74K85J897R69j804k053N78J582
2919C27K97j39K86r24j406M15K131O73j719j045N99L52J36P25N01j583j375J209
2937e40J774k54r82k83l46k47P23J841j99k270q65J351P98Q7J67q3j504r98J560
2956b70K100n53j521n26rj1R00J388k77k142q44J370J021P1j18k72j177n21J302
$$ plain form
2833 210 1855 1717 -1222 -2565 -588 1557 1273 394 97 -852 -1837 -235 2186 1808 -843 -1662 -523
2850 -523 142 566 1080 929 -1250 -2091 -104 1794 954 -396 -677 -654 -902 415 1778 885 -1525 -1719
2868 -1719 113 1190 778 407 -113 -1430 -1449 797 2329 904 -1374 -1476 -282 104 960 1662 405
2885 405 -1999 -1906 755 1978 887 -116 -670 -1465 -1138 1212 2543 729 -1872 -1630 -128 599 1064
2902 1064 1506 93 -2278 -1927 895 1967 548 -562 -753 -1127 -842 1055 2024 220 -1833 -1255 327
2919 327 624 485 771 -153 -1559 -1144 987 1660 -59 -1104 -505 -153 -17 708 1209 -374 -1749 -540
2937 -540 1234 980 -2 -285 -631 -878 -155 1686 1487 -783 -1648 -297 501 588 755 672 -832 -1830 -270
2956 -270 1830 1277 -244 -770 -779 -790 110 1498 1221 -921 -1765 -395 626 697 579 307 -870 -1391 -89
2975h9J469m36j488k58L69J56N45R56l87j661m87J281R07l73m58k63l32j18R58
2994B91Q49o00j324o8R15K92n6J48k99r40j54J341O93p04q52N0K32m1O40P48q57
3015C04j555L91J391J76n43j75l4r25K57J343O36j370p42M90L32m8N46M17r28
3034c7r72M78J052K4n58J7k33m16L26J016or33l12M34J58p6M63O7p23l86N87M88
3056D58k79k41p2J7o2J86L79p1m79r6K02J35K23j16k42j57J24J95J62p9k89m23
3078e25L32M38k85pR9j19k23K01N06j49m91K1K39j31q8K58R1n03j97O11J78l89
3100a33M9M06l88l59M96L82m56l65M64K62n15m4N45j88m02K68M11m27l60M00K42
3121B88l88j14M92j25m26K10M06j93l72K58J7l14J01M48j36m06p4M37m4j29K59
$$ plain form
2975 -89 1380 944 -544 -802 -433 -277 268 1224 837 -824 -1311 -30 877 504 46 -217 -549 -667 291
2994 291 1140 540 -784 -852 63 355 299 447 148 -792 -946 395 1088 384 -468 -418 -186 -227 413 1161 304
3015 304 -1251 -860 531 707 164 -11 -45 -970 -713 630 1266 -104 -846 -356 -24 -72 474 891 -37
3034 -37 -1009 -531 521 545 -13 4 -229 -645 -319 697 691 -242 -554 -120 38 -38 425 492 -231 -617 -30 458
3056 458 179 -62 -134 -117 -179 7 386 315 -164 -260 -58 77 300 184 -58 -215 -91 104 266 187 -102 -525
3078 -525 -193 245 -40 -47 52 -67 -290 -89 417 268 -223 -202 37 -94 -182 76 167 -336 -533 78 256 -133
3100 -133 -84 322 -66 -425 71 453 -3 -368 96 358 -157 -201 344 156 -246 22 433 6 -354 46 288
3121 288 -100 -214 278 153 -273 -63 343 150 -222 36 53 -261 -160 288 152 -254 -328 109 65 -64 195
3142A95j33l62R8L65Q4l35q6J07j8l3M12n6l42j63K42J80r8L43j84n07mK85L82
3165C72j46j10j35m52K90M13K35k90l86N8lJ54L39M9o24j53L21K57OJ8j24l53
3187b64j51M18L27j81m50J00K3J39L10Q9l12n11J47L61K01j15R6l90l56J63P13
3208C57K07m95l94P9lK86N35j64n44k83K24L40M6J56l35l01k28M49N26p5k78l78
3230b73kJ81M12J99l26k80l29K13K21L64l8m35k22J86K00K45J3l36m81K03L49
3251F4M09k98k82k11n1M38K75J05m77l41P9K29L07K16l83m25j58K36N32J63k58
3272A69l53k93L62L69L16l60m43r5J93K80K71r3k90n08R1N45K76o0k77l34j30
3293c64K87M69K8m00k24k73K76M17J99j69m45j99R6L35M78l17m19k48J74L43J09
$$ plain form
3142 195 62 -300 -202 163 247 -88 -174 -67 -85 -118 294 238 -104 -267 -25 155 57 400 216 -291 -295 -10 372
3165 372 226 116 -19 -471 -181 232 467 177 -209 -151 -154 0 339 388 -236 -389 -68 189 195 213 89 -264
3187 -264 -415 3 330 149 -301 -201 -178 -39 271 360 48 -463 -316 45 246 131 227 -163 -519 -356 357
3208 357 564 69 -325 -246 -249 37 572 408 -136 -419 -195 145 191 347 12 -289 -517 -68 458 383 105 -273
3230 -273 -275 -94 318 517 191 -89 -418 -205 16 380 342 -93 -315 -129 71 316 329 -7 -488 -285 64
3251 64 473 175 -107 -318 -369 69 344 449 -28 -369 -290 -61 246 462 79 -346 -504 -268 264 427 169
3272 169 -184 -477 -115 254 570 210 -233 -328 -135 145 416 323 33 -475 -384 161 437 377 100 -234 -364
3293 -364 -77 392 420 20 -204 -477 -201 216 415 246 -199 -398 -302 33 511 194 -225 -473 -299 44 153
3314A53J36j89l70k79N27N13l18j68q8j13R5L15L04m59l57J28L24n5j18K84k37
3335B8l94K53N85l3n09k19K71J0k0J33L39n70l98M28L49j88M4J03n54j28M45M82
3357D57k48m09qJ26m9K36K31j70m34j45M32J02k8qp7k38o8K54L54r6l68j9p4K40
3381gJ79K2j37k39l9K11L15j06k97Q7R2k16J77K38n9l46k77M55K92l86j9J87j52
3404b5j81K78K16k85l40K55K18j93n9K96J5m81j07P06o1m56J53J66j52j80L10
3425I3J99l83l31M00K09j69k3K68k41k38R9L64n5k27JJ92j48j52K35K00k40l62
3447c09K22J64j2j32K12M9l21j42L25J91m91L5M15j2m90L00K04j18k51J21L15
3468B75l79l33N43K41m44n2L36R2p16J27P80j01p51J97M97l22m07N74M02o39l59
$$ plain form
3314 153 289 100 -270 -549 -22 491 173 5 -83 -196 -101 214 518 59 -298 -170 154 99 -19 265 28
3335 28 -366 -113 472 439 -70 -289 -18 -8 -28 105 444 -126 -524 -96 253 65 109 212 -342 -470 -25 457
3357 457 209 -200 -208 -82 -131 105 336 166 -268 -413 19 121 93 85 8 -230 -298 -44 310 214 -154 -173 -247 -7
3381 -7 172 194 57 -182 -221 -10 305 199 -98 -11 81 -135 42 280 221 -125 -402 53 345 -41 -60 127 -25
3404 -25 -206 72 288 3 -337 -82 136 -57 -116 180 195 -286 -393 313 252 -204 -51 115 -37 -217 93
3425 93 292 -91 -422 -22 187 18 -5 263 22 -216 -117 247 192 -35 -34 158 10 -142 93 293 53 -309
3447 -309 -87 77 65 -67 145 194 -127 -269 56 247 -244 -209 206 194 -296 4 208 90 -161 -40 275
3468 275 -104 -437 106 347 -97 -149 187 279 -437 -310 470 369 -382 -185 312 -10 -417 157 559 -80 -439
3489d39M54K12m67J30L88j75n75L53M54j33n14L34K78m20l03N32K05m43j27L96
3509A40m0k47O6L29o9l10J6K58j07l20M23J00j68l06J81J73k16OR6J45j79j82
3531b11J96K08j46q2J18j80j31J6M32K18m53l35L04J6j12J57M82m13m20Q5N81
3552C30j45l43L99o6m55j67P44O4n45pM58j41n91M24N05k86n69L49K81m67j38
3573c66O74J9o30q5O34j77m46J38O33k63o10N49J26l54k11N68J19m72k00M56K7
3594A29k79J01M21l49m10K65M79j53l73K23N7k82qL65J65l63k11J52P8j47J15
3615b5K91q5m48M0L66Oj65P8J59l43j45K10L30j31l57K69M3j70j64L68J24m35
3637a84j17L87Q9k99rM40j97l00J85J02K8k68J0M41l23j34K16Q4k83l5K67J05
$$ plain form
3489 -439 15 227 -240 -110 278 103 -472 -119 335 202 -312 22 300 -120 -423 109 314 -129 -256 140
3509 140 100 -147 -81 248 179 -131 -115 143 36 -284 139 239 71 -235 -54 119 -97 -91 5 150 -29 -211
3531 -211 -15 193 47 -35 83 -97 -228 -212 220 438 -15 -350 -46 -30 -142 15 497 84 -336 -251 330
3552 330 185 -158 241 175 -280 -447 297 361 -184 -191 267 126 -465 -41 464 178 -391 -42 239 -228 -366
3573 -366 308 327 -303 -388 246 69 -377 -239 394 131 -479 70 196 -158 -369 199 318 -154 -354 102 129
3594 129 -150 -49 372 23 -387 -122 357 204 -169 54 111 -171 -179 186 351 -12 -223 -71 7 -140 -25
3615 -25 266 181 -267 -227 139 145 -20 58 217 -126 -271 -61 269 138 -219 50 93 -77 -241 127 251 -184
3637 -184 -301 86 175 -124 -133 307 110 -190 -5 97 125 -143 -133 308 -15 -149 67 151 -132 -167 100 205
3659B05l27l0L06k3k35O2K61n1m58L77K05l19j02J28K30l17j84L72J56l66o3L13
3681A40n2l27K82J66j91k26J09K55j88o3J77R3m00o6L64J41k06j16K25j18j55
3702a56J16J69l2l84K49J98k13J09KJ89l34q7L49R0k86n4R8j49K2J61K83k29m20
3725c09J69J41l0r2L04j41k26j0K65P3j22n6j60J36qJ87L0k30j76J28J97n1j7
3748BK8j18m3M4K57l8j60k56J55J86J55m6p0j39j71J99K16J18l70j15L1P4J37
3771G6N3J48k96k55M7L80j7q8Pj17k86K33M19ml06j09o9J89N6J73m2k91k44P9
3795b64M54K2j38j7j67k18K73L22m4l62q6R3K6J08J89j51l47n8L38J71l0j28r5
3818a09j47J44J23K42j29l54k1K00%K39k1j87l16Q1L31J49j27j52j57k5J33K41
$$ plain form
3659 205 -122 -152 154 131 -104 -42 219 168 -290 87 292 -27 -129 -1 229 -88 -272 100 256 -110 -173 140
3681 140 88 -239 43 209 18 -208 -99 156 -32 -95 82 175 -225 -291 73 214 8 -108 117 -1 -156
3702 -156 -40 129 97 -287 -38 160 -53 56 58 247 -87 -174 175 265 -21 -75 23 -126 -104 57 340 111 -309
3725 -309 -140 1 -29 -121 183 42 -184 -194 71 144 22 -34 -194 -58 -66 121 151 -79 -255 -127 70 19 2
3748 2 30 -88 -131 -87 170 132 -28 -284 -129 57 212 166 96 -43 -214 -15 201 319 -51 -166 -135 -61 76
3771 76 129 277 -19 -274 -227 153 136 48 55 -62 -348 -115 304 300 -6 -115 -184 5 61 234 192 -99 -343 -264
3795 -264 190 212 74 57 -110 -328 -55 267 223 -139 -225 -132 -106 2 191 40 -307 -365 -27 144 114 -14 -109
3818 -109 -256 -112 11 253 124 -230 -251 -51 -51 188 167 -20 -336 -255 76 225 98 -54 -211 -236 -103 138
3840A38P2j39k51K3K31J44n6r3j99j77J95K67J38k07k52N2n5K11K17j21k47j13
3862b22j9K81K19j77j50j69n9L80P0J45k57l81L7J88K61P4j92k27l9J11K44J38
3884B56j53l50m6P0M26J70j44k02l95N2L97L11j41k61j99n3K07K73P9k02l75J03
3906a77K13J08K68l01k79n3J41L47M0j53k64j66jL35J68m3k46j40R5K46N3J5j99
3929Gk72Q3J12M00j24j04m25J42K54J71R9k60l35k7K64J72J21j27l30k02J34L55
3951A08K04j03l19j73k6L22K88q2j34k97n2K93J27Q9k34k28N5m8M05n4j37j62
3973a58p9J52J77P0J7k79j62J19K36J33j28r5k38M4J59J66J5j05k89K32J7K05
3995B09j33k1k27n3J97K37J6k56j76J32N5J93N2r6k53K4n2L08O0j17k12l7J04
$$ plain form
3840 138 210 71 -180 -157 74 218 162 69 -130 -307 -112 155 293 86 -166 -114 -169 42 259 138 -109 -222
3862 -222 -241 40 259 82 -68 -237 -296 84 154 299 42 -339 -302 -114 147 221 29 -198 -237 -126 118 256
3884 256 103 -247 -293 -223 203 373 229 27 -368 -316 81 392 251 -10 -209 -262 -55 218 297 95 -280 -177
3906 -177 36 144 412 111 -168 -221 -80 267 307 154 -110 -276 -277 58 226 183 -63 -203 -108 138 191 206 7
3929 7 -265 -182 -70 330 206 102 -323 -181 73 244 343 83 -252 -279 -15 157 278 151 -179 -381 -247 108
3951 108 312 209 -110 -283 -309 13 301 219 85 -212 -264 29 156 245 11 -217 -162 -210 195 141 4 -158
3973 -158 -237 -85 92 162 179 -100 -262 -143 93 226 98 3 -235 -191 -32 134 149 44 -245 -13 4 209
3995 209 76 55 -172 -225 -28 209 225 -31 -207 -75 -20 173 225 129 -124 -100 -152 156 216 99 -113 -150 -46
4018d6J67O3j8j94j66J10J28Q6j51J28j33j83J15K55q4j70j9o1pJ80J15j4j69
4041f8j41J60K5L9o9P7p3k13K61K59j00l38K22J7o7q7J59L6k88J09J52J21k52
4064e9R3P2j25j22J51K13j89k3l7o2M3k4J82j38j5j0J35j74J81p7M0l3k12K27
4088C7O4j31m8N9P2m2j30K04Nj41p6P0J17J07j85P8M1j83QJ21J67k93Q4K8n4j25
4114a46J82K53k42r4n7J39j65R0J80l1l79K6L13M3j18P6J02k48j66M16J42k34
4136H2k92J65J82j46J03K19k14l11M9L66N6l14J9Q4j07L4J95O7l58k19L16L04
4158B80m5k78J61k72m5R5L96j45k29j10J58O4Q5J02k6k69l68K70N39o8j94j70
4180f9R7k57J32M40J20n25l59K86K43p7MK27k85k51K21M17j45l57J68l5j25q7
$$ plain form
4018 -46 121 184 166 -28 -194 -84 44 130 -21 107 -26 -209 -94 161 77 -93 -112 -173 -180 0 115 101 -68
4041 -68 -209 -49 -24 15 -54 23 -50 -263 -2 257 157 -181 41 58 -9 -96 63 99 -189 -80 72 193 -59
4064 -59 34 106 -19 -141 10 223 34 11 -26 -88 -45 -69 113 -25 -40 -50 85 -89 92 15 55 22 -190 37
4088 37 101 -30 -78 -19 53 11 -119 85 90 -51 -127 -57 60 167 -18 60 101 -82 -74 47 214 -79 5 33 -21 -146
4114 -146 36 289 47 -47 -104 35 -130 -40 140 109 -270 -244 69 112 -6 70 172 -76 -242 174 316 82
4136 82 -210 -45 137 -9 94 313 99 -212 -163 203 259 -55 -36 48 -59 -25 170 237 -121 -340 -24 280
4158 280 235 -43 118 -154 -199 -104 292 147 -82 -192 -34 30 115 217 191 -78 -446 -176 363 295 101 -69
4180 -69 28 -229 -97 343 463 -62 -421 -135 108 31 35 262 -23 -274 -53 364 219 -138 30 -5 -130 -217
4202b17N19J42o63j44M11J75j75J8pk35k51O07L47m17l37L6R4j44L53L10j26o42
4224c46QO29j1j27k04Q7m15J07L69M12m49k89r5K99J54J34q7j85l15k7N34K29
4246D12k81k07j06l7R7L60L21m45m88k0M34K40j2k05j60k49J5N49K54k82m55M3
4268b22K41j30L01J12k65n48K51N08K17n11OR3k54J22M67P2o32k84L91K73Ol2
4290A82J50m43l38L22P27k82l42j74J64j54K31M39k2p09j15K74L42q3n2K4m52
4311c11j61N09L60rm65j46J10L8J85K43j81m98j16L91L26o3j73p6k10j31L49M25
4333C96j00m68j21K68J4K08Q6k34l17%L16L62k92k56lM1j01K91M61n18m16J54
4355b29M15K9r0k7j04l19PN54N5j47m11J21J50JJ78J23l91m02J89L96K59j54k13
$$ plain form
4202 -217 302 444 -219 -363 48 223 48 66 59 -176 -427 180 527 110 -227 -191 -97 -241 112 422 296 -346
4224 -346 -338 291 280 153 -51 36 -379 -272 97 509 60 -229 -324 -25 129 263 176 -9 -324 -351 183 412
4246 412 131 -76 -182 -219 -122 238 559 114 -374 -394 40 280 268 63 -97 -346 -331 218 472 190 -265 -222
4268 -222 19 -111 190 302 37 -511 -260 248 465 -46 -40 53 -201 -79 388 460 -172 -456 -65 208 214 182
4290 182 332 -111 -449 -127 600 318 -24 -198 -34 -188 43 482 460 -249 -364 -90 252 169 117 141 -311
4311 -311 -472 37 397 388 -77 -223 -113 -75 110 353 172 -326 -442 -51 275 212 39 -37 -247 -378 -29 396
4333 396 296 -172 -293 -25 -11 197 283 49 -268 -268 48 410 118 -138 -141 -100 -201 90 551 33 -383 -229
4355 -229 186 215 125 98 -6 -325 -318 236 291 144 -267 -146 4 5 183 306 -85 -487 -298 98 357 203 -10
4378a0j74j33J21L94P4k09l89J52O9K83j28K33k65m63J40M97O8j34m44J15J42
4399f1M2L20rl73l55J64N37J0j78l4o9l29K35M32j9l26j97J08N0R0J86nl85j05
4423b71L40J72j40j62L4j44m7J93L39k22k14j45K76Q2k53L92nn22P2J45K69j45
4445D4L0k1k02l9J98K09j88k27PK34lR0rr4k42R9K43q8j10J6nMN5J16J21k25j42
4472a29j0R5K23k2j18j65Rl1R2K87j95j26j4K47M6k15r4J25q2k4J93J6m9j78P6
4497d3J53j09L1J2P4l57J37K73j00j04K3M0j61l4K73K7k14L4J22q5j28J46Lj21
4521a08o4K28O4j52q7K81j90l9L8P4J22k70J8Q0N7j21R7j38O6p8J06O4o5j2m5
4546g4K8j76K65P1n4o6l8J20r6Q8j38NN6j20J78J9Jm2j01Q0r6K55k10J27r8M0
$$ plain form
4378 -10 -184 -317 -196 198 272 63 -326 -174 -105 178 50 283 18 -445 -305 192 260 126 -318 -203 -61
4399 -61 -19 301 292 -81 -436 -272 265 275 97 63 -6 -335 -100 332 313 -13 -210 -102 -52 38 224 219 -166 -271
4423 -271 69 241 101 -61 -27 -171 -218 -25 314 92 -122 -267 9 91 -162 230 225 -297 -225 -80 189 44
4445 44 74 53 -149 -188 10 219 31 -196 -189 45 42 132 123 29 -213 -114 129 41 -69 -53 -58 -54 1 117 238 13 -129
4472 -129 -139 -44 179 157 39 -126 -117 -148 -56 231 36 -90 -104 143 189 -26 -120 5 -77 -101 92 108 59 -119 -43
4497 -43 110 1 32 44 118 -239 -102 171 71 -33 -10 30 -131 -165 108 135 -79 -45 77 -8 -136 10 13 -108
4521 -108 -172 56 120 -32 -119 162 -28 -67 -29 45 167 -103 -85 -5 52 -69 28 -110 -44 -122 -16 48 -17 -29 -74
4546 -74 -46 -222 43 114 60 -6 -44 76 -20 68 -70 -65 -9 -129 49 68 69 27 -74 6 -90 165 -45 82 -16 24
4572B4l8M9m3q1OO6L0n8q2J78j43J28M7j05Q8j07%r6J06J02K9j90J13q8L2R0n6
4599Ap8J75n2n3J17j12pM1o3J36rr0j16J41k2LO7r7o7m6J40nmJ93k38J29r5J18
4627A07j0j48N7n7K2L6Q2j42O4j16Q5J41j46k1J6K0j9P3M4n3k18R8J65m5kP8j79
4654f8j50K30P7Oj46N6K1J7j04N4P0L0j32p8P4Q4Pm0op7K1J35j94J07J5K3l3m
4682eP1j30k3L6K5N7l0oK9n8Q9j40J89l7r3j49J42J55q6m1j6j6n2O6J51r1q0o2
4710a05J29L9lJ30j80j42J8J35N8k9Rl3o6L7l0J04q2p1On5J33L6k6j7oj79L51
4737A61j11p8j15J44m4O7m5J00j74j13K59n6n8l3J63j39J2J06nl6q9j0R0l8O2
4762B0P5k8p7j36J95Ll7K1L5m3p9M6J27j12k0l1K3l0n9P0N9j06K2O1K7Mn6J7l3
$$ plain form
4572 24 -14 35 -8 -89 -83 -17 13 -45 -127 51 -92 36 83 -22 66 -41 -41 -137 -31 71 100 -90 23 -65 -33 57 1
4599 1 -77 98 46 -7 110 -2 -9 32 -31 105 96 6 -110 31 9 12 79 -18 -85 -131 9 4 0 193 -45 84 -11 107
4627 107 97 -51 6 -51 -29 7 89 -53 11 -105 -20 121 -25 -46 -30 -10 -29 44 88 35 -183 -85 80 35 33 111 -68
4654 -68 -218 12 89 95 -51 5 26 43 -61 -7 63 93 -39 -117 -43 41 48 8 2 -75 -54 81 -113 -6 9 32 -1 -5
4682 -5 66 -64 -87 -51 -26 31 1 -5 24 -34 55 -85 104 67 -26 -175 -33 122 36 -5 -21 -37 -89 -23 128 37 -43 -105
4710 -105 24 63 60 190 10 -132 -114 21 79 50 59 26 -40 -3 -33 71 -11 -82 -76 -131 2 38 12 -5 -11 -190 161
4737 161 50 -28 -143 1 -43 24 -21 79 -95 -208 51 -5 -63 -96 67 -72 -60 46 41 5 -84 -94 -4 -42 20
4762 20 95 67 -10 -146 49 52 15 36 71 28 -51 -5 122 10 -10 -41 -18 -48 -107 -37 22 -84 -62 -1 26 30 -26 -9 -42
4791d2jo8J47N3r2o9K2P1P4j28J3k1j33J47K5Q4j65kJ58j39J29O9q2j06o2K06
4817H8n3K4Lm3j18M5J54K4k39l3J82O8o4k2j9l2q8J3J21K22k30mj2n7J62k1M3
4844A14j72j11L1K74p2j54J01n9j06J32J66j6k47K6Q1K8o1P0J21k16j43J95J33
4867A15N5k76J26J91k20o7J38k5o5l3L3K11k58j8J70r1q2J39M2m1k32Q3J69l0
4891C4j6M1J00j52k38L16L6p2J9n9K5k52J77J72l2j58k9J88q3kM1j62ok7K23%
4917H4r2q3O0L1o8J40J31k00k8q1J63L9j61J02J18k74R9L5J19j18k72K91L4k08
4941a39J95N5r5j91K23N4N9k79J09m6O8j17K09K5k22qJ27N7j18L3N9Jn8L7RR5
4967A42j85%J66k74L4J82J38k10r3K19j37%J0M8n9r9J16J78q7q0j54K46r0l4k3
$$ plain form
4791 -42 -43 -111 36 89 -3 -72 -50 21 95 -33 -20 -41 -174 -27 -2 82 -83 -85 73 -66 63 132 50 -56 -118 88
4817 88 35 59 62 19 -99 -54 100 124 -115 -148 34 102 38 16 -3 -35 -123 -110 11 233 3 -1 -13 -70 92 71 114
4844 114 -58 -169 -138 136 64 -90 11 -48 -154 -22 144 128 -119 -93 -12 16 -45 25 146 -70 -213 -18 115
4867 115 170 -106 20 211 -9 -76 62 37 -28 -61 -28 183 -75 -93 77 -14 -96 43 85 44 -188 -105 64 34
4891 34 18 59 159 7 -231 85 121 49 68 9 34 -218 -41 131 99 -59 -88 100 17 15 56 -106 -112 -139 84 84
4917 84 -8 -91 -31 0 -68 72 203 3 -25 -106 57 96 -65 37 155 -119 -20 15 134 16 -256 35 69 -139
4941 -139 56 111 16 -175 48 102 161 -118 -9 -55 13 -104 105 130 -92 -100 27 84 -34 -1 58 59 1 38 47 142
4967 142 -43 -43 123 -151 -117 65 203 -7 -100 119 -18 -18 -8 40 -19 -118 -2 176 89 9 -145 101 11 -23 -46
4992d6K58k61n5K13q3P0o2L4P1j95l7R4Q0p3MR0j22k1Q7K11k95o9J67n4qr9J27
5019B6L0o1q6K47k9k45m7J91j2j25Q6J45k50o5K04k1j3O7m6N0l7J7nN2j03j56
5045a86K75j23qJ82q4p6j11J65K0j42M6Q7j14O3K8L7O6j56j0L9J7r5K53j11o1
5070Ak07R5J78j0j39O4k0j52P5R6J27j53l2J12NR7k3m5j00j26Q8K97j24k27J49
5095B6j70J10J29J0qj58q9J32P6M3j18k0N5j35K23J06j30p6k03J94k0j2J37j37
5119c5Jk5J15L8n9j60P2l3l4J87P6j29r4P8p9R1K6K9l2j27NK25Q5k10O8l02J59
5146f4Q0J11N6p5k66k4K43%M5j04p4j5oK08R1j32j58P6m9N1J73q9j10q4J31N4
5172F9J00p0k86J51q0R3J18M7p8k17J12J59R4q0l9j47j31J65M6J70p1r7p7q5J92
$$ plain form
4992 -46 212 -49 -104 109 26 96 34 68 139 -56 -93 1 81 8 12 102 -20 -41 46 257 -38 -107 60 6 -2 -101 26
5019 26 56 -5 -91 156 127 -118 -165 26 14 -111 -25 120 -130 -195 9 -12 -25 42 -4 46 9 26 21 73 -30 -186
5045 -186 89 -34 -42 140 56 -20 -131 34 54 -88 -42 45 -69 -6 22 59 125 -31 -41 -2 15 -80 173 62 1
5070 1 -206 -111 67 57 -82 -18 -38 -190 -115 -19 108 -45 -77 35 40 137 114 69 -31 -157 -69 228 104 -123 26
5095 26 -144 -34 95 105 97 -61 -150 -18 58 101 -17 -37 18 -117 106 212 82 6 -197 -3 -23 -35 102 -35
5119 -35 -34 -59 56 94 35 -125 -53 -86 -120 67 143 14 -80 -2 -81 10 36 65 33 -94 -89 136 221 11 79 -223 -64
5146 -64 16 127 183 108 -158 -182 61 61 106 2 -72 -87 -93 115 206 74 -84 -8 -57 -6 167 78 -32 -116 15 69
5172 69 169 99 -187 -36 -116 -23 95 142 64 -153 -41 118 212 132 93 -54 -185 -20 26 196 125 28 -49 -134 58
5197E8M9p8n5j75Q0J71N1m6j60M1j13P4Q4J82j33j50J13k8M3J00J6j19r0L5P8
5222B8P0j10r9j9R6RK17j65o0j03Q7K8J32N2k32o2m0K12N2m6j78rj8R6K27O7j40
5249I2k37j9J31P6Q5R0j88p8l6N2K25j06j40n1j9R6J42j8p2j25N3P6N2Nj01j94
5275b09J65J61n0Q4k11L7J27j56J91mj30n2j22m2L77J0j58j02n2J17N4Lj6o1j01
5300a40J9Q7K12K4k19r1Q0l0Q3J25q1n0j20O7J03J53k35m9j63K05OJ01j4j40m6
5325a13O1n1J82M5j62l4qR9O3O6j51j02o3J14kJ79j42j35pJ40J06k5J0r2j56K42
5351F4O0K4n9n0k61Q4J59L4K0j42J01Jp2R9J9j55q7R4R6k9P6j53o4J1l7K18P7
5378A28j06j00l2R1m4J91m3j26j30J15P6M8N2n8j45J02J8N7o7n0%j96K89j80K16
$$ plain form
5197 58 107 29 -26 -201 -121 50 101 55 -105 -64 -177 -103 -19 163 30 -120 -7 -35 8 108 124 5 -85 -50 28
5222 28 98 -12 -111 -130 -34 -25 192 27 -33 -136 -49 -21 111 163 -69 -131 -171 41 93 47 -131 -140 -158 -62 165 232 92
5249 92 -145 -164 -33 43 128 218 30 -48 -84 -32 193 87 -53 -104 -123 -27 115 97 25 -100 -47 29 81 86 -15 -209
5275 -209 -44 117 67 151 -60 -23 104 -52 139 135 5 -47 -169 -211 166 176 18 -84 -136 -19 35 38 22 -39 -140
5300 -140 -121 -34 178 202 -17 -108 -28 -58 25 150 69 19 -101 -34 69 222 -13 -62 -225 -20 -14 87 73 -67 -113
5325 -113 -52 -103 79 124 -38 -72 -80 19 82 148 -3 -105 -168 -54 -56 123 -19 -154 -161 -21 85 60 70 -22 -178 64
5351 64 124 148 89 39 -222 -138 21 55 75 -67 34 35 -37 62 81 -74 -161 -67 29 0 76 -77 -141 -130 -167 51 128
5378 128 22 -78 -110 -19 -63 128 85 -41 -171 -56 20 68 120 62 -83 19 37 94 27 -23 -23 -219 70 -110 106
5403A06r9p9k7QJ65m7L3j57P0rP1M2q5r6M7j1J2J87n3rj44J15QO0j18L1q3m2Q
5432i6M6O7n4Q7j07JQ1M9o4K2l9M0j13O5j0L9r9J33j03M4R4r4k8P4J7n8J39k32
5460i9L0L6J5m0R3j78J78o4J36m9k62J94k7J5L1K4L6p3M5j70J86o9Q9l4l3jq4
5487g5J62j43l3J99q0P3j50K0kK3m9J21l7m6J18j09K0K1N4j88J46K9m7o6O1m1
5513a9j40K01P7n2j16J10m0OK8N6o1K0k8l0j3l4Q4PJ8j00n3J11p9p6J66j23oO7
5541a9P1J2j75N6L2N2J05j8r1j26N8L8N3P3o9L7j23r6J64P6q1l4N4j5K1K9p3m5
5569c4j17J30QK08r9j53l3M8M0K3q3J80j64j24J85L6k6p7R4j65O3J24J1o4r7k6
5595a12Q9J07r9J77j40j47M0N2J35n2l4k1o6OJ56m1p2r8P0R1Q5o7Q7k72O6R5k1
$$ plain form
5403 106 7 -72 -99 -91 74 27 60 -97 -27 -36 35 77 -8 -104 -57 -68 -56 131 78 69 -75 40 48 108 -10 21 -62 -104 -96
5432 -96 -50 17 -37 50 -57 -56 25 74 10 32 -7 33 -80 -15 -25 14 -85 48 -55 -11 83 -11 -39 35 52 -6 133 -99
5460 -99 -69 -33 -18 -58 35 -143 35 -29 107 58 -204 -10 -37 -22 9 33 69 -4 41 -129 57 -12 77 43 10 9 -75
5487 -75 87 -56 -89 110 30 103 -47 -27 -29 -6 -55 66 29 -17 101 -8 12 33 87 -101 45 74 27 -39 22 -19
5513 -19 -159 42 119 67 -49 61 21 27 55 111 50 70 42 12 -1 -35 49 56 74 -26 -79 32 -47 -123 43 -80 -86 -19
5541 -19 52 64 -111 -55 -23 29 134 116 25 -101 -43 -5 48 121 52 89 -34 -130 34 110 29 -5 49 34 55 84 11 -34
5569 -34 -151 -21 -13 195 96 -57 -90 -42 -2 21 -62 118 -46 -170 15 51 25 -52 42 -123 -60 64 75 11 -86 -112
5595 -112 -23 84 -15 162 22 -125 -85 -33 102 50 16 -5 -71 -65 91 50 -22 -120 -50 41 126 59 146 -126 -60 35 14
5622A4K1j0n4L4J6M0m1J30k17j0r4J92L4JJ7j50O0m3K09k5k59J12jK7O7N3j44
5649b1n6k0p0K72j3rr0j2l5K22j11M2m4r0l2R3jJ38j04j06j25J55J28K9j48l9
5675d7p3Q2Q5L2j6j52L4N7K6K5m9n3M7N5P7j7p8p6J21j33N7N3L0j58M9j70Q8J87
5703H3o2q5M1q8Q9J33j00k9L9j98R1O2J40p3j31P2q6R3Q7l6j20m0jJ81J9n5j7
5730Im6N9PJ71j23Jq9K3r7J92j16P1j27O8R0k00J78j5n4j31K35o7lj25Q5m3j12
5757a59J09L7R8j03m2Q5j09J1J01j44N4L9LQ7n8N2l8o2J01r2N0l1P7l2n2P0nj8
5785B9j06K7J27p4K38j31m6j25J9Q6k3Q2r1Nj55J37j8P6k01J63q7K2J09NJ3q7
5811fj0J01j48j0K95j73p5RJ3P6R1j97kj27K93j54R0k8m1N2m0m1J8O7q3J7L3l3
$$ plain form
5622 14 35 25 -29 5 21 61 20 150 -67 -77 -171 21 55 56 73 -77 -17 -60 149 124 -135 -23 -24 3 70 123 -21
5649 -21 -77 -97 -167 105 92 83 -7 -19 -54 168 57 99 55 -35 -67 26 25 163 59 -47 -172 -17 111 140 -8 -47
5675 -47 -120 -38 47 79 63 -89 -55 2 28 53 4 -49 -2 53 130 113 35 -41 80 -53 4 57 87 -71 -22 -192 -104 83
5703 83 21 -64 -23 -111 -22 111 11 -18 21 -177 -86 -24 116 43 -88 -16 -102 -9 78 42 -78 -118 -119 62 81 26 9
5730 9 -37 22 29 200 77 78 -11 12 -85 107 -9 62 -65 3 93 -107 71 56 2 -129 106 39 36 -89 -4 -47 -159
5757 -159 -50 -13 85 -18 -60 25 -84 -73 28 -116 -62 -23 -20 67 9 61 23 -39 62 -30 20 -11 66 34 -18 52 47 29
5785 29 -77 -50 77 3 241 110 64 -61 -42 44 21 103 12 17 -138 -1 -19 57 -144 19 -68 -46 63 68 81 -6
5811 -6 -16 85 -63 -73 222 49 -26 -17 -4 72 163 -34 -36 -163 130 -24 66 38 -3 49 9 -32 -14 53 -30 -13 20 -13
5839a3J05j69o4M8J9O5Q8j38J07k4n1J40m1%o9j7J2l0m6J87j27o9J6O6K0m2M2
5866A5j18J31n1Q1P0j41M6l8J9p0r9Q9Q9j27L7J26j4q4j02K05l8K4o6n6J93j01
5892B0J5j08N4PkQ3o2J3n2kkJ84r2m8N1j7mq7p6J58jo9K1O9n6P2j06M3%j16P3
5923c7j1J5M7O9r7J5n5j9J21L0o4o8J24p6O8m3N5j79K0J44p6o9N7N9Jp7N7j53
5951a42Q4J11M9mm4R4j87J2J46m9m9P9k7j37J02n0j21J26o1J51o4p6R1k6P7n5
5977C0k5L9M1p9j7m9L8L5o6N0O9j62J14j5j8Qn6Q9j7o4m5J99Mj11N8j02M9QO1
6006F6j1n5m8r2J98o0l4Q5j4q8J45p5K3kj40O0j5P9m7O1q9J2j3J02k9%P1j14P5
6035E1j36J4R0L4k5r3K1J76j03mM8j1j02Q6o0J7Jo2R2r0L2j8J28j64J9N4N3j6
$$ plain form
5839 -13 92 -77 -141 -93 -74 -9 79 -59 48 24 -27 113 72 72 3 -14 -2 -32 -78 109 -18 -87 -71 -5 15 -27 15
5866 15 -103 28 -23 58 128 -13 33 -5 14 -56 -155 -66 23 -104 -67 59 45 -39 -141 64 26 50 -16 -72 121 20
5892 20 35 -73 -19 -12 -14 69 7 20 -32 -34 -36 148 56 8 59 42 38 -49 -125 33 32 -37 -16 53 -3 69 -37 6 6 -110 -37
5923 -37 -48 -33 14 83 -14 1 -54 -73 48 78 14 -54 70 -6 62 19 74 -105 -85 59 -17 -86 -29 30 31 -46 11 -142
5951 -142 -58 53 102 98 54 148 -39 -27 119 70 21 100 73 -64 38 -12 -133 -7 -68 83 19 -57 34 8 85 30
5977 30 5 44 85 6 -11 -60 -22 13 -53 -3 66 -96 18 3 -15 -7 -63 26 9 -55 -100 99 103 -8 50 -52 -3 5 66
6006 66 55 0 -48 -140 58 -2 -36 49 35 -53 92 17 40 38 -102 -42 -57 22 -25 36 -53 -41 -54 48 19 19 90 -24 51
6035 51 -85 -71 19 53 28 -65 -44 132 29 25 73 62 -40 46 -14 3 4 -58 34 -56 -24 -42 86 -78 -59 -5 48 32
6063C2KPp6Q1k7P5q8Q4j03j7j7k5J55qM2l4l5k7l0O5m3j37J69j09Q2n9K10k94
6091a25R4M8j57J08P3j48J86n5m7J2n3O4rm8J01j4j10Q5K2j04J10LL5r9J40k00
6117h8J8R8N1l0r5Q7l1P2l0N6j57Q8l1L1K9j07n7K09k40K49r7J60j87l8l6K16
6143A40j75L5pp8M1M7l1K7l8L5j20L2K24k29J08o3J50j86J22j3J52j00j15NJ17
6168H0J7p7j23J05j20Q8J27j0j1j08K5R1p9n6L0K2L0J19r1j47J7L5R0N8j36p3
6194i7J52O9j55ko7K12l6j34K3J6R8o7J47j80o8J4J74M4j20j1J6P9j36j9J12O
6220G0m1j02j8N3J12o4N1j36o4Q9P7j27k0J11k4N3K5o2o9N4j00P7R0QJ33k00j
6247b5n2J01J7n9m4j2qJ53lk7q0L5Q5o7k0n6R4r5o8J21O0j68J41k4m8J61o5J1
$$ plain form
6063 32 34 41 -35 46 19 94 6 90 -13 -30 -47 -72 83 75 117 83 48 21 -9 56 13 -124 45 -64 18 -41 169 -125
6091 -125 -31 17 -140 -32 41 -107 79 24 -23 -11 -64 0 -9 -57 44 30 -80 5 27 -77 33 36 71 -28 112 -88
6117 -88 -70 28 79 49 -46 41 10 82 52 108 -49 39 8 39 68 -39 -96 113 -127 122 25 185 -2 -40 -76 140
6143 140 -35 0 -7 -85 -44 3 -28 -1 -39 -4 -124 -92 132 -97 11 -52 98 -88 34 21 173 73 -42 -37 80
6168 80 97 20 -103 2 -118 -30 97 87 76 -32 -7 84 5 -51 -21 1 31 150 59 -88 -71 -36 54 112 -24 -97
6194 -97 55 124 -31 -33 -100 112 76 -58 -35 -19 79 12 159 -21 -89 -75 99 143 23 12 28 107 -29 -48 64 70
6220 70 29 -73 -91 -38 74 10 61 -75 -139 -50 27 -100 -120 -9 -33 20 45 -17 -86 -32 -132 -55 35 43 176 -24 -25
6247 -25 -77 24 41 -18 -62 -74 -82 71 68 41 -39 -4 81 14 -6 -62 32 -63 -131 -10 50 -118 23 -1 -49 112 47 58
6275E8K2j61M0J22k0Rj21q9J24o2j2MJ35o2L8p7k3J46on4o6n5J38L3J3Lk0k8Q2
6304A11p7j06J02q8J6J9J8K9K5p9j14K01r7J84q3o4k7n5R1k6Q7n1J3o4L3J8r6
6331h0L7J39j40R4r4j1J38q8m0J71j41J4k9M9M5j17J44o5J7o0L3j1n0Rj6j19J06
6358f5M0O5m8j1Rn7j14K07o5J03n8p7J09oj23L6O2k1nr9J23o4J39j39J41p8Q%
6386A2P3j42LN4p9J34j32J38l2k2MJ26o7p1RK9l1j03R4K4Q5j93P4L3J2l3rr6J21
6415A5j8R2m0m2ML9j05Q3Q3k1K5k16l0J44J21n6O5j06p5L9N5K1J3j33m7J29k9
6442A0j4J61j6j93J20k8M3j33rLN8Jj00J12o5J13Mj49O4j71K69J4j13m8j8%M1
6469d4Q1j04oO3k2kL7P7qj08K5l9J87j53L4j30P9J25j01J6q7J51M1j48Q0R2j91
$$ plain form
6275 58 80 -81 -41 81 61 70 -51 -140 -16 -78 -90 -86 49 -13 25 -52 -75 71 65 11 -55 -110 28 61 74 77 57 29 111
6304 111 34 -72 30 -58 -42 -23 -5 24 49 -30 -144 57 -40 144 61 -3 -30 -85 6 -20 67 16 29 -35 -2 16 -80
6331 -80 -43 96 -44 50 -44 -55 83 -5 -45 126 -15 -1 -30 19 64 -53 91 26 43 -17 16 5 -45 -36 -52 -171 -65
6358 -65 -25 40 -8 -19 -10 -67 -181 26 -39 64 6 -71 38 32 -91 -55 7 -14 -19 -118 5 -59 80 -59 82 4 12 12
6386 12 85 -57 -54 0 -79 55 -77 61 29 7 11 137 70 -1 8 37 6 -97 -3 21 106 -87 -13 20 32 -1 -10 -106 15
6415 15 -3 89 49 7 11 50 -55 28 111 90 115 -101 -131 13 134 78 143 37 -38 1 56 77 90 -43 -90 39 10
6442 10 -4 157 141 -52 68 40 83 -50 -59 -56 2 3 -97 15 -50 63 67 -82 -18 -189 80 94 -19 -67 -85 -85 -44
6469 -44 37 -67 -73 -10 -32 -34 3 80 72 -36 -11 -50 137 -16 18 -112 -33 92 -9 7 -80 71 112 -36 44 136 -55
6496e5R7n5O9n5o4J03N2j38qP3r8R1l2o0n0K26q6k2n0O7J25j75J76p1k3p0L3l9
6524c9R5k03K64r8p1J13j18R9K5j21J48q3M1J06o5j85O4J1R4P3n0j47n2J70j12
6549d1NK8N3j27J9JJ60J01j24N6j83L0N1j9O7j09KL5q6J60q3j1Q9j18J19j06k
6576c3n6J25l8l1N3n7J14j24mL9J0jn2L5j39J13J1J08Pl5j73K23j92J50p3M7j5
6603A2Joo4Q2o5j3N4pJ54j18P6j44J76k01N4N1pj79P2J06r2J66j34K6j7j0Q4P4
6631A31m6m4j5L2p7j1J49m8l5p1K5M5j9j8m2O9K5j15N3%k7q8J54n6j7J15j66O1
6659c6l6K2R0N0K7j35R3n0l3N2L4l1j60J85j18J4oO6k5p5N3l3M3J1L1j23P1LJ87
6688A71k09P2J6j1O6j0r2K8j01P3r0R6o2k0NQP2n7J04q2kn8M7m6RK01k50O2K6
$$ plain form
6496 -55 42 -13 56 1 -63 40 92 -46 -54 19 -79 12 -20 -80 -130 96 10 -12 -62 5 130 -45 131 60 37 -33 0 -39
6524 -39 56 -147 117 19 -52 61 -57 42 67 -54 94 11 52 158 93 -92 -28 -17 77 150 100 -47 -99 71 -41
6549 -41 -36 -8 45 -82 -63 -62 98 199 75 131 -52 -22 29 10 77 -32 -30 5 -81 79 -4 -15 74 -44 75 -31 -33
6576 -33 -89 36 -2 -33 20 -37 77 -47 -51 -12 -2 -3 -55 -20 -159 -46 -35 73 80 45 -128 95 -97 53 -20 27 12
6603 12 13 7 -57 25 -40 -53 1 -6 148 30 106 -38 138 -63 -9 42 35 -144 -72 34 -58 108 -26 0 -17 -27 57 131
6631 131 85 41 26 58 -19 -30 119 71 36 -35 -10 35 16 -2 -44 25 50 -65 -12 -12 -39 -127 27 -29 -46 69 -97 -36
6659 -36 -72 -50 40 90 117 -18 75 25 -8 44 78 47 -113 72 -46 -32 -38 28 3 -72 -19 -52 -9 2 33 -90 -19 -16 171
6688 171 -38 34 50 39 105 95 3 31 -70 3 -87 9 -53 -73 -68 -60 12 -45 59 -23 -25 -83 -36 -82 -73 128 -122 -60 -34
6717c4pO1q6N7M9o9m7K70k50J19r3N7K8op7m9P5p6J9O9M4j0L0j1M1o3P1j10L5
6746C7k8m9Q6l0n7P8N3q5k8J45j35J8j0m7J59q6OR7q0p2K7Q1j68J28j54J5J04
6773Ej26J24N6K6l5j7j4J09p0L9j82R3j1K0l2k0o8Q4Q8q8Q8l8l3P1r7O8n2p4l
6802h9K7J06M2j18Q0j47K6J17Qo9N9J02j88k7N1r3O5Q6j90K35j79J02N0j2q0P9
6828D3l6o3pKQ8o1o3J36n5N5o1L4N5N0j83M9J60j32O4j42J46j4j2j3lK0k4L5k7
6857D1kj06j0J40j41J18j17j0P9J19j92K1Q1n5O3p4M5ol2J04n0m9J55k11J43K9
6883H3n6M9m1J57k08j9O2N9p3k8P4j23J37q0p0j1J30n2J58k05Q6n6Q8k00Q1J69
6909A11l4m7j08P7K1l2J5K4K9M4j03N6n5qK0J49k19N1L0l1O1n1O2q7mP7K3m7j83
$$ plain form
6717 -34 -41 20 -66 -9 40 -29 -76 194 -56 63 -30 27 55 49 -28 -77 -2 -78 -59 10 54 44 74 63 104 41 112 2 37
6746 37 9 -40 46 16 -41 37 90 5 -23 122 -13 5 -5 -52 107 21 27 124 44 -28 -1 80 -88 40 -114 -99 5
6773 5 -121 3 59 85 50 33 19 128 58 97 -85 8 -3 17 -15 -35 -103 -19 69 -19 69 31 -2 69 -28 40 -12 -86 -89
6802 -89 -62 44 86 -32 48 -99 -73 44 52 -17 42 144 -44 -71 -20 -113 -48 38 -152 83 -96 6 56 44 -36 43
6828 43 7 -56 -63 -61 27 -34 -97 39 -16 39 -22 12 67 117 -66 -17 143 11 75 -67 79 65 53 40 37 57 33 68 41
6857 41 39 -67 -77 63 -78 40 -77 -87 -8 111 -81 -60 21 -34 29 -45 0 -6 -38 66 16 -33 122 -89 54 83
6883 83 27 76 35 192 -16 -35 27 86 13 -15 59 -64 73 -7 -77 -88 42 -10 148 -57 29 -27 61 -139 -58 111
6909 111 77 30 -78 -1 20 -12 3 27 56 100 -3 53 -2 -10 10 159 -60 -9 21 -10 51 0 62 -25 -29 48 71 24 -159
6938a59J11O8n9Rp5N7Q5j26J12mO8l9r1m3O1l3l8J67J6k0j0lL6q4J9q5P2j07J32
6967C7Kp5P8L6j97M1J00Jn8J17j33J6Q0Rj71L5J41k9j2n7Jl6K8K6M0J8q2O0Q0
6996I6j96Q9j42J02Q4J8l0j0l4L8K0Q6r8K7j67O0J02n1O4n0m2Mo6K20j17Q4q2
7023Ij3Q7j97J26j21J27j10K15r1o9M5j7J34j32k7O1K1j62P6J02p9K1o9OK08r9
7049E2l2j3qK1M8K6p4J80j51j3j35R8L5k19J38NlM1m7J44M4j93K3P8l4NL2j58
7077a10R5R6j04N9n6l3N9J39k85J46m7N6P7j19Q7p4P1k7L4q0M8J0j29J19r2Q0
7103B0m7Q6JN2j08k0N4Pk0L2l6l8OO9j11J01p6m2K7J8k7N4K4j13L7L8J17n9K3
7132F9j18K9J0o5P6n3r9L15o1j56P0Rl0O6ql8K2p8Q4j8QO8K0M8k04J1nK6J27j32
$$ plain form
6938 -159 -48 20 -39 -30 -105 -48 37 -89 23 19 87 48 -43 -86 -25 -58 -96 71 87 67 57 54 90 6 25 -60 12 -95 37
6967 37 39 -36 42 78 -119 -78 22 23 -35 82 -51 -35 45 54 -117 -82 59 30 18 -39 -38 -74 -46 -20 20 38 -44 16 96
6996 96 -100 -11 -153 -51 33 51 21 11 -23 15 35 121 23 50 -117 -57 45 -6 58 8 -34 -30 -96 124 7 91 9
7023 9 -4 83 -114 12 -109 18 -92 123 32 -37 8 -9 125 -7 -34 27 48 -114 -38 64 -15 6 -63 -57 151 52
7049 52 20 7 -1 20 68 94 20 200 49 36 -99 -1 34 -185 -47 -42 -45 -4 -51 93 137 -56 -33 45 11 16 48 -110
7077 -110 -15 81 -23 36 -20 -53 6 145 -140 6 -41 15 92 -27 60 -14 57 30 64 -16 32 42 -87 32 -60 20
7103 20 -27 59 60 112 4 -16 38 45 25 57 21 -17 -11 58 -53 48 -28 -70 -43 -25 -52 2 26 -87 -50 -12 105 46 69
7132 69 -49 -20 -10 -75 1 -52 -151 164 103 -53 17 26 -4 62 54 16 38 -40 44 26 34 102 122 170 -34 -23 -28 -2 125 -7
7162gj10J36K6o7Q2ROp2l8k1M3j7j11M4J9K6l4J20R7r0np4R2m1n1P7j39R0o6R7
7192B1N9m1K1j3pj36J55N0j39l2O5Q3k8l0q5O9L2L6j16j22J13lJ54j40M6J08j71
7219e1l7J09j0K0M1k17J91j36P0n3J10Nk33K00N9l0mJ5q4P6n8J82k15rM6M0j9
7246HK7L7n7k1L9K5j2j73J24K6m8O3K5J7J0m7j27J42K6j44J12p9O9n4K7l6L4M8
7274F1o2m6O5n3J4J1o0Q7p6l2K27q8p8Q6l6p4j4J8O7k1l9J3Mr8J82m4p3lM6K9
7304A3j8n0J0n3J69K5k35J42j3J6j25K02j30N3L0N9j36M9N8r6oN1q5L5L8K4j50
7331a23O0N4j7J32j12k5K9n4O3J5n9p0J63p3k5K3J18j58N8L1p7P0Lj06J50q4P6
7358F2J2r5M8K7l0L2j23M5L7kK2m6L0m0m2k6P8l2J01l0Q0j35j04J35N1r6N6oo6
$$ plain form
7162 -7 -117 19 45 -22 60 69 75 3 -35 -56 -13 -30 -141 -97 -78 -52 -86 34 131 41 36 -38 54 13 -38 39 -100 -10 -76 21
7192 21 80 39 60 47 40 -96 59 109 -30 -62 3 86 58 28 -57 12 44 80 -36 -158 -45 -48 106 -34 12 120 -51
7219 -51 -88 21 11 31 72 -145 46 -90 -20 -73 37 42 -191 9 68 38 34 49 -35 41 -17 165 -50 -59 -13 27 8
7246 8 35 72 15 -6 33 58 46 -127 -3 23 -25 38 63 80 90 43 -84 58 84 -60 52 -27 42 -12 15 -21 13 61
7274 61 -1 -47 18 -35 -21 -10 -70 17 -59 -91 136 48 -30 56 20 -54 -68 -50 17 -4 -43 -30 -26 -124 58 14 -59 -62 -16 13
7304 13 -5 -55 -45 -98 71 96 -139 3 -10 6 -119 83 -47 6 36 95 -41 8 66 -30 -36 15 -70 -35 3 27 -123
7331 -123 -63 -9 -26 106 -6 -31 -2 -56 7 22 -37 -107 56 -17 -42 -19 99 -59 -1 30 -47 23 26 -80 70 -14 62
7358 62 74 -21 27 54 24 56 -67 -22 15 13 35 -11 19 -21 -63 -89 -11 -43 58 28 108 -27 -131 4 55 -41 15 9 -57
7387e7L9N1o5J10j14M1q2k2J63j33J68l2l2p8L2M0K2kPJnmrj02J9n7J55k6j0l9
7417b1o2K00k29J13k7P2Pj40J31o5N1M4r1J16m0n7N3m4J77k38R4j49Q0N5j9N5
7443F6j38Q0r5N6J98j23p3Mm3J29l7l3%k3J43m5Pn7O0l2k4L8j6j82J86n6n3J64
7471A01j52K22j24o8J47j59R7L3j11J4o7J02o8j4O7N1j42M4J46j00O8J9o1k9P6
7496I2j15p7Q3O5r5O3NO2j52J75k11J40J4m3J04o5j12M6L2J9%J6J4j11N2R8k6
7523G3j3r4J66j71J37M9k22R3j25P9k2N2p6l0J10j4N5o6M6R4j30Q5q4J6L0o9J81
7550A50j84NJ55J8o1n2o0Q6j46K8J05l2n6R1J10m9j36N1j9j15J09k3L4o5q0O4
7576g2Q8M7r2K1M5q9j03J98k2j03J57j47J03P0j16M9J9p9j35K03j25N3N2j59Q9
$$ plain form
7387 -57 -18 33 -32 78 -36 5 -77 -99 64 -69 99 67 35 -43 -11 29 51 49 56 57 52 48 39 -63 -44 -101 54 28 18 -21
7417 -21 -83 117 -112 1 -26 46 53 -87 44 -21 30 74 -17 99 59 2 55 11 188 -50 44 -105 -25 30 11 66
7443 66 -72 8 -87 -31 167 44 -29 -25 -68 61 24 -9 -9 -32 111 66 73 16 76 44 20 58 42 -140 46 -10 -63 101
7471 101 -51 171 47 -21 126 -33 64 97 -14 0 -67 35 -33 -47 20 71 -71 -27 119 19 87 106 45 16 92
7496 92 -23 -100 -17 48 -47 16 21 83 -69 106 -105 35 49 6 110 45 -67 -21 11 30 30 46 60 -51 1 99 73
7523 73 60 -34 132 -39 98 147 -75 18 -107 -28 -50 2 -74 -104 6 -8 47 -19 27 121 -9 76 -8 8 38 -31 150
7550 150 -34 -29 126 144 83 31 -29 57 -89 -61 44 12 -44 47 157 108 -28 23 4 -111 -2 -25 9 -56 -136 -72
7576 -72 16 63 -29 -8 37 -52 -155 43 21 -82 75 -72 31 101 -15 34 53 -26 -161 42 -83 -30 22 -137 -48
7601d8K1Q1%q6m5N6J06P4j48j38O7PM9R2m0J1m0k3O7M1Jj14j20J15J54j23M5l1
7629C1j08Q4k5J72j37J08j16L2j39M1R6l6L4J7p6O0j6q5J5L8O0k2O6P1j25l3r
7656bl1J22m0Km8oj7J16o4p8Q6K1j54O2O8m0k8lJ49j61J21N6q7r0l0k4Q1P6j03
7685d6j35J10N5k5OJ69j32m0L5lO6l6M0l9O6o8q8J17o0l6j4R5P8j43M5K3k9J20
7713A31q4K0j00j8J7j6P5l1J74j83n7Q8j43Q1J34j75J08p3o2J74L2j38O4MO3j08
7739b3J61k49J65j7rQ3j12j1r1J19P0N1q4J6jm3n6Q2j9m1j3N0n6l6j7Q3M0k0j03
7768h1R7L0l8P5m2p0Q8j59L2R1j06R5m1N8Q1r4%N0j13L0K1r6J67j7m6R8j03J7
7796B4R3j11N7n9m7O2o4O7Nqqj22K32k03O2J24q1N0j28K6O4m9K9Mj0r2N6Q8j40
$$ plain form
7601 -48 -27 54 54 -32 -77 -21 85 159 11 -127 -60 -53 -4 88 48 59 19 -4 63 104 105 -9 -129 -14 140 17 62 31
7629 31 -77 7 -18 154 17 125 9 41 -98 -57 39 3 37 54 -22 38 22 -63 -48 -10 50 28 94 165 40 7 -2
7656 -2 -33 89 49 51 3 -3 -20 96 32 -46 40 61 -93 -31 37 -3 -31 -34 115 -46 75 131 44 -46 -76 -100 -19 57 -46
7685 -46 -181 -71 -16 -41 -35 134 2 -38 -3 -6 60 24 64 25 91 23 -65 52 -8 -44 -58 37 115 -28 17 40 11 131
7713 131 47 67 -33 -51 -34 -50 25 -6 168 -15 -72 16 -127 -46 88 -87 21 -52 -114 60 92 -46 18 22 85 -23
7739 -23 138 -111 54 37 28 111 -1 -12 -103 16 86 137 53 69 68 25 -31 51 32 -9 -22 28 -28 -64 -81 2 42 22 -81
7768 -81 16 46 8 83 41 -29 59 -100 -68 23 -83 12 -29 29 110 16 16 66 -47 -17 4 -92 75 58 12 110 7 24
7796 24 117 6 63 4 -43 19 -45 22 27 19 11 -111 121 -82 -20 104 23 73 -55 -29 35 -14 15 19 9 -83 -27 61 -79
7825g9Q8rL5n2K5k0m3K3M2K2j26N4J09l7k1j07M7j8J07j8nn6R9l6k2j08Q4kQ0
7854E6k2q2K8o4l3O4R8l7l5j21K04k3M0j15K4l3M6l5J9L8l3m6J06j13O4J27p4
7881D8q9J14j27R0p7LR1j9o7P4k5O3ok7m2Q4m3j06j55J43M7P4j4j29Q8p4J14r7
7909f4J36n0O2r8L3p4NK06p6p7%J8J31r5M9n6j10J02P9l1l6Ro0k1kQ5j0Jn5j16
7939a15J73K3k9K3k0j88R7l2J64n2Jo6J15m8m8Q8q6q5J4K8j14J58n4o9Q3Q9N3
7966A03l0Lj09Q8l5m9R4n1K7q6J9M5M0j44J05o4O0j25J71mj50J86l8M7o9Qm3N6
7994E5r1Q9P0k03R3n8k7J79j05M2m9j6m1N2J8o1L1m6o1J45j2j5J26j18p5J49k7
8021D4m3J21p1j88M1J41l2R2q2m9J9M5N3n5k75K36j4L0Q9j6r4l5N7JJ0M2J2j65
$$ plain form
7825 -79 9 0 35 -17 8 -12 -55 -32 10 32 -94 -40 69 32 11 -96 -49 -67 40 22 17 -39 60 24 2 -106 -22 -24 56
7854 56 34 -48 -20 -84 -117 -53 45 8 -27 -148 56 33 73 -42 -18 -51 -5 -40 -21 17 -16 -62 44 -69 -5 122 48
7881 48 -41 73 -54 36 -41 -38 53 34 -33 41 16 79 73 46 4 88 45 -61 -216 -73 -26 48 34 -95 -7 -81 33 -64
7909 -64 72 22 84 -14 19 -55 -50 156 80 3 3 21 152 57 106 50 -60 42 121 90 54 63 3 -18 -20 65 55 56 1 -115
7939 -115 58 81 52 75 55 -133 -36 -68 96 44 45 -21 94 46 -2 86 0 -85 -71 -43 -157 1 -53 -122 -39 50 103
7966 103 73 76 -33 55 20 -29 65 14 41 -45 -26 19 59 -85 20 -44 16 -109 62 58 -92 94 56 103 34 42 -1 55
7994 55 -36 53 123 -80 13 -45 -72 107 2 44 -5 -21 -62 -10 8 -53 -22 -68 -129 16 4 -11 115 -3 -78 71 44
8021 44 1 122 51 -137 -96 45 13 105 23 -26 -7 38 91 36 -239 -3 -17 13 102 86 -8 -43 14 15 25 67 79 -86
8049h6P5k7j6Q3N6j39O0K4l7l7N5j10N8L5N8K8j24j49J75m5P0J6J6K3j74Q9n1
8076g4J16L6j32J16j3j56J79n1J0J3r6J88j42L8k8j2q0J47o8J08j29k6p5L9J31
8101C9nl6r4O2J11n3j02J40j44J1P3n8L8L8k1k1o0J10K8k0K5J4n6n7m8K39j21
8128C2Lj10kJ48l1n1l2J11n3l7o7J06p1p4J09N7lm5l8J6O1l4R8n8j18J21M8l5
8156E1j11J47Mk9J6k2o7Kjj10M3rJ40o3l5P0l9k9rJ61r6K0M6j91M0Q4qj02L7P3
8186A3j7jj8J24j00
$$ plain form
8049 -86 -11 -38 -54 29 85 -54 6 30 -7 -44 11 -99 -41 -6 52 80 -44 -193 -18 -63 7 23 39 62 -112 -23 -74
8076 -74 42 78 -54 62 49 -107 72 21 31 44 -52 136 -6 32 4 -8 -88 59 -9 99 -30 -56 -131 -92 39
8101 39 34 -2 -96 -34 77 24 -78 62 -82 -71 2 -56 -18 20 -1 -22 -82 28 56 36 61 75 19 -38 -86 153 32
8128 32 35 -75 -77 71 40 -11 -43 68 15 -22 -89 17 -54 -128 -19 38 35 -10 -48 -32 29 -5 93 35 -83 38 86 51
8156 51 -60 87 91 62 78 56 -11 -9 -10 -120 -77 -86 54 -9 -44 26 -13 -42 -51 110 14 34 80 -111 -71 13 5 -97 -60 13
8186 13 -4 -5 -23 101 1
8191A
$$ Imaginary data points
##PAGE= N=2
##DATA TABLE= (X++(I..I)), XYDATA
0@%%%%%%%%Ll%qJ6j6J6k0K8l2L2l6M4n3N9o6Q0q8R6j10J24j40J56j72J92k14K36
35A24k62K90l20L55l92M30m76N29n86O50p24Q10r08J026j168J342j560J840k218
54a218K743l519M763o974J1621k4923J26275M84253m01514m72372K29403J08838
66E7376l18561J38615N30356j30735n83661K1859M06119j9399j33842K04294q774
77A63647m29019o2977M48592J48750k57654m1759J02030j70744j05642K82469
87G7693J51365k71192j43262K10283Q6162j34455J7534R4225j30253j35031J45375
98c1556J75773n0043j16144m6227j9028O4974J41518p449j72913o9533P0617M4424
110a5587P2294J32141o9167k81144p5296K14970J28825k6635L1831m2013k47786
$$ plain form
0 0 0 0 0 0 0 0 0 0 3 0 0 -8 8 -8 8 -12 16 -16 16 -20 24 -29 30 -36 44 -44 52 -58 66 -74 82 -90 102 -112 124
35 124 -138 152 -168 187 -205 225 -251 278 -308 342 -382 428 -480 546 -622 720 -840 1000 -1218
54 -1218 1525 -1994 2769 -4205 7416 -17507 108768 593021 191507 -280865 -51462 57376
66 57376 -261185 -122570 407786 277051 -306610 -284751 121368 101969 -31873 172421 163647
77 163647 -265372 -328349 120243 268993 11339 -30420 71610 -99134 -204776 77693
87 77693 229058 -42134 -185396 24887 111049 -23406 -5872 88353 -41900 -176931 -31556
98 -31556 144217 94174 -21970 -68197 -87225 -22251 119267 111818 -61095 -130628 -60011 -15587
110 -15587 56707 188848 119681 -161463 -236759 -21789 107036 80401 112232 70219 -177567
121a77567o6471L11137J94653j89640j64819L7024m3927l9487K48812K00952k50175
132F0492k96631J03879J68641n5181M7515J85411j32463l32685O4227L39102J7401
143A69708k08496M255N6886j35193p935K58678O6643k54297j05402J49819L1565
154B6231p7931R4307R2811j70901j41539J68595J61502j13641j17824O0111J4052
165d227p3447P8034J53030p6475k04837N688J61782L4738o5487P152O826r2566
177f9789l3833J38792J16110q3341j49293k6127O5557N8855N4937L3318p3114
188C2072j35967j8914J28315R5914l2261o4952l5123m0216k345J05924J01089
199A33536o3114j43728l0388P1928N0163L0337L1879m8810j17484j6119J15925
$$ plain form
121 -177567 -244038 67099 261752 72112 -92707 -55683 -99610 -139097 109715 310667 60492
132 60492 -236139 -132260 36381 -18800 28715 214126 81663 -251022 -186795 152307 169708
143 169708 -38788 -34533 22353 -112840 -120775 137903 204546 -49751 -155153 -5334 26231
154 26231 -51700 42607 135418 -35483 -177022 -8427 153075 39434 -78390 -18279 -4227
165 -4227 -77674 360 153390 76915 -127922 -122234 39548 74286 8799 15951 22777 -69789
177 -69789 -103622 35170 151280 67939 -81354 -107481 -41924 16931 71868 105186 32072
188 32072 -103895 -122809 5506 101420 69159 4207 -30916 -71132 -73477 32447 133536
199 133536 70422 -73306 -103694 -31766 18397 48734 80613 31803 -85681 -101800 14125
210A4125O7684n0892m5945L000k0226j6160O3125O4147m6256q7033l144N5354
222b221K7575k57m701k6490l3962J2228N1382K0298l5991m0078L186L1705J8394
235B1068j829m768j5303l3211n121N5906M5194l8011n9540L645K8004K169J9578
248A7781L5314l7863q1347J4766Q8479R991n3102N551J9590n4447k5646Q6812
260B5879N2284p5563n4445M4216J5863l5569L3061N7119n5475p8002M8230O9492
272D7090m1319l7660N4464J1157p6001k889Q3500R86p0434J1204N1282l2960l9026
285d0606N2161L3224n9301k3558N8964Q708n7160N300N4015j3876m4492K1509
297e112K9446l1440j5913M1340Q966m3834m623L5729m158k4934J7694K0254k7785
$$ plain form
210 14125 81809 30917 -15028 -12028 -32254 -48414 14711 78858 32602 -54431 -57575 -2221
222 -2221 25354 25097 20396 -6094 -40056 -27828 23554 43852 7861 -32217 -29031 2674 21068
235 21068 19239 14471 -832 -34043 -39164 16742 61936 23925 -35615 -31970 -3966 -1797 17781
248 17781 53095 15232 -66115 -51349 37130 47121 -5981 -430 19160 -35287 -60933 25879
260 25879 78163 2600 -51845 -7629 8234 -27335 5726 62845 7370 -70632 -22402 47090
272 47090 5771 -31889 22575 33732 -42269 -45158 38342 39328 -31106 -19902 31380 -1580 -40606
285 -40606 11555 44779 -14522 -38080 20884 29592 -27568 -22268 31747 17871 -26621 -5112
297 -5112 24334 -7106 -23019 18321 27287 -16547 -21170 14559 10401 -14533 3161 23415 -4370
310d370k2084K4939J9630j1953n529J474j6148n143K9206J5837k4420j7787R670
323f678L247k485J6152R541k4534k0572J4877J8482J666K871m325k8101j2971
336c2830L3787L1576j5510k7261l934O44K447K5305K0216k6861l8885M740K9708
349C142J3837M979j24k8909l5945J5045N2181J8913k6696k8437j4159j178K7500
362A49M0188k646m8556l0618J6427K9670K0472J0854j7775m7450k3048L6171M9859
375C3697P378k8590l1802j7915J1817M2284K8913k4494m8376j5915K4083L3335
387A4415K1419m024l6319m0256L364M6815L7018q150l7729l1742j351L4257M1663
400C9380L958m2726m4475n9M0528M2189R224l1182m6936k0852K7561N0784K4240
$$ plain form
310 -4370 -26454 -1515 18115 6162 633 2107 -14041 -19184 10022 25859 1439 -16348 -6678
323 -6678 -3431 -5916 10236 19777 -4757 -25329 -10452 8030 9696 12567 8242 -19859 -32830
336 -32830 957 32533 17023 -10238 -14172 -13528 -11081 14224 34440 7579 -31306 -26566 3142
349 3142 16979 21958 21834 -7075 -43020 -27975 24206 43119 16423 -12014 -26173 -27351 149
362 149 40337 37691 -10865 -41483 -25056 4614 25086 35940 18165 -29285 -52333 -16162 33697
375 33697 41075 12485 -19317 -37232 -25415 16869 45782 21288 -27088 -43003 -18920 14415
387 14415 35834 31810 -4509 -44765 -41401 5414 42432 34282 -3447 -35189 -36540 -2283 39380
400 39380 43338 612 -43863 -43922 -3394 38795 48019 16837 -30099 -50951 -23390 27394 51634
413E1634k4675m8832k6970K0140M9737L2805j8302n4257l7309J6425N3110L9395
425E2901q106m6356m4074l323M1794M8545P604m0713m8068r345L6821M9223J6578
438E3481l5267n7128k2516L6815N8113K3675k8513n1582l0889J6966N1798L7634
450E2587j5542n2685l6368J3327M9032M1807l923n0900n2140n17N2951N3120M302
463E5051m4288n0702j1981L7054N1119J6017l4256n0850j9999L0721N4804K6568
475E9258k9128n7210l0732K2045N3239L7988j2619n4463m2264J4155N2119L4094
487D6482j0624m0560l9980m171M5671N5443K392n3521m8489k421L3710M5334K5852
500E5118k6362o2975k7170M1621N5699J0769k8653l8656k8355J0164N6487M5799
$$ plain form
413 51634 26959 -21873 -48843 -28703 21034 53839 35537 -18720 -56029 -39604 13506 52901
425 52901 44795 -1561 -45635 -48958 -7164 41381 48985 8272 -39796 -49141 -12320 36903 53481
438 53481 18214 -38914 -61430 -24615 33498 57173 28660 -22922 -53811 -36845 14953 52587
450 52587 37045 -15640 -52008 -38681 10351 52158 48235 -2665 -54805 -55322 -2371 50749 55051
463 55051 10763 -39939 -51920 -14866 36253 52270 18014 -32836 -52835 -22114 32690 59258
475 59258 30130 -27080 -57812 -35767 17472 55460 42841 -11622 -53886 -39731 12388 46482
487 46482 35858 -4702 -44682 -48853 -3182 52261 54653 1132 -47357 -49778 -16068 29266 55118
500 55118 28756 -34219 -61389 -19768 35931 46700 18047 -20609 -48964 -38800 17687 63486
512F3486k2811o1867l0686J6549L7232L7259J0929m1234n7845j668N6853M2498
524D8695j0989l7219l2802j3132K6856N5933K4022m2059n8215j1432L3237L9347
536B2242K0942j2118m5040l8114J7088N7465L1507k6104m7992k4405J0681L6098
548B250L9162N920m3451n1255m89M7511L7266l526k6337k8921j8290J7412N0120
561B7372K5075l8253n1749l070L2257K4986J3979r79l5414m1217J4662N5839J8967
574D2455l1167k6115n118l206J7665M4342P553n7576m3070K8651M5170Q080n424
587B2240p823l5998l0037L6985O2628k647n2803k4263Q139P442K4039M0351q863
600C9390o7047l3539M2068M6040K833r634j2915l5840k0734M2187N4329r738m8624
$$ plain form
512 63486 40675 -21192 -51878 -35329 1903 39162 50091 8857 -48988 -50656 6197 48695
524 48695 37706 487 -32315 -45447 -18591 37342 61364 19305 -38910 -50342 -17105 22242
536 22242 43184 31066 -13974 -52088 -35000 22465 53972 27868 -20124 -44529 -33848 2250
548 2250 41412 47332 3881 -47374 -47863 -352 36914 33388 7051 -21870 -40160 -22748 27372
561 27372 52447 14194 -37555 -40625 -8368 16618 30597 29618 -5796 -47013 -32351 23488 42455
574 42455 11288 -14827 -19945 -23151 -5486 38856 46409 -11167 -54237 -25586 19584 27664 22240
587 22240 14417 -21581 -51618 -14633 47995 45348 -7455 -31718 -23579 -16137 7902 48253 39390
600 39390 -27657 -61196 -19128 26912 29745 20111 7196 -28644 -49378 -7191 47138 37400 -11224
613a1224j7888J0204P875J8234K8377q716m8700k1131L2780L2240k597j2496p417
626d59j4576o927K3495K6361j1800l1179n017J8986J0713n74O41p238j9077l027
640a9678K7485K1426j6826l0013k846J7754J0530N315N204j4012l2153l763L9694
653H117K8547j8792k8223m919j597r66K7782L2447k2038n2613m967L7049J4564
666A4391m169J0627p287m5500j2743N2884L3927l0982k3858J3216r579k3692L2002
679g63M8461k6879n5028J3174L6203j6436j2996L7410N737n4087j0005N3588Q391
692B6770m3608N828L7522k2340l6713L2243L3774l7971k5949M2872J7671m4946
704a4847r362M1331l869l7737K0540L9558l0432m3273K7705L5715k1997j5899
$$ plain form
613 -11224 -29112 -18908 -11033 7201 35578 26862 -21838 -42969 -10189 22051 19454 6958 -459
626 -459 -15035 -21962 1533 27894 16094 -15085 -20102 -1116 9597 9023 9664 2426 -16651 -19678
640 -19678 7807 29233 12407 -17606 -20452 -2698 7832 13147 18351 4339 -27814 -31577 8117
653 8117 36664 17872 -10351 -15270 -16867 -17833 9949 42396 20358 -32255 -37222 -173 14391
666 14391 10222 20849 13562 -31938 -44681 8203 42130 11148 -12710 506 -9073 -32765 -763
679 -763 47698 20819 -34209 -21035 15168 -1268 -14264 23146 28883 -25204 -35209 18379 26770
692 26770 -16838 -11010 26512 4172 -32541 -298 33476 -4495 -30444 12428 30099 -14847
704 -14847 -24209 17122 13253 -24484 -3944 35614 5182 -38091 -10386 25329 3332 -12567
716a2567K7646j248m1990J256M6267P628l0796n298J0258j3017n942K8235J7450
729B7882k2311k2516L030Q480O040J0805L285j2235j2945l654N387J5784J2731
742A9763j1106j9010K211P524p240N474K4027n055l4063o40K8536n045j9750K2514
756H140K1599l6054k8044L5637K3244l2246n431L8715j0381n0802J3723N1957
768C0057j4342l8241K5690K3884m5235k1299N6138K2404n0735j2274M1401j0051
780G397m1998K8374M8390l1803m5299K9188K8097l4154r476M6305K091n2135p64
793b5787M4403o396l2161K0617K7282l1096k5870L1234J8848k7996n283K9530
805A7325m405l2784O432K8270p441j6926J4763J0060k4160j1737K3000J3143j2659
$$ plain form
716 -12567 15079 13831 -28159 -26903 19364 26992 -3804 -9102 1156 -11861 -17803 10432 27882
729 27882 5571 -16945 -13915 -5435 605 11410 14695 2460 -10485 -14139 -8752 7032 19763
742 19763 8657 -10353 -8142 -618 -7858 -2384 21643 16588 -17475 -18115 10421 5376 -14374 8140
756 8140 29739 -6315 -34359 1278 24522 -7724 -13155 25560 15179 -35623 -21900 30057
768 30057 15715 -22526 3164 27048 -18187 -39486 16652 39056 -11679 -23953 17448 7397
780 7397 -34601 -6227 42163 10360 -34939 -5751 22346 -11808 -21284 25021 27112 -25023 -25787
793 -25787 18616 12220 -19941 676 27958 -3138 -29008 2226 21074 -6922 -12205 17325
805 17325 12920 -19864 -13432 14838 7397 -9529 5234 15294 -8866 -20603 2397 15540 2881
818B881l920O447j0088j2838J3231K0464k514j5115o288q91P58Q653J1278J43
832A2201j2234j2993j925J2294J5062N00j1280p715l016j890R075J7444k15k0925
846e617r315J1009N503k635Q490O140j7515j5066J5627J7129r868r582J0692N17
860E509j7099K794K2010k494k1624L944J9216p499j7368J0174J4310j3221r947
873a1295J8902Q060k3640j0481K2086J0063j5898j654J3566j0322k0037J4603
885f047K8149r022k5480L374J1739j0084j094K4993M933l2161j4552K3503J2970
898A1221j0996K960J1110j8265k2608J9218K9446r412k0914N613M415j5241M045
911i408K8468P48l0446o636K0196J845j0041J1031R649k0246j4595J9662J5173
$$ plain form
818 2881 -1039 5408 -4680 -17518 -4287 16177 13663 -1452 -7740 -8631 -7873 780 12058 12201
832 12201 -33 -13026 -14951 -2657 12405 12905 1625 -6090 -9106 -10996 -1921 15523 15308 -5617
846 -5617 -14932 -3923 1580 -1055 7435 13575 -3940 -19006 -3379 13750 3882 -5700 4992 5509
860 5509 -11590 -8796 13214 10720 -10904 -6960 12256 4757 -12611 -2437 11873 -1348 -11295
873 -11295 7607 15667 -7973 -18454 3632 13695 -2203 -3857 9709 -613 -20650 -6047
885 -6047 22102 13080 -12400 -9026 2713 -7371 -8465 16528 21461 -10700 -25252 -1749 11221
898 11221 225 3185 14295 -3970 -26578 -7360 22086 12674 -8240 -2627 1788 -13453 -9408
911 -9408 19060 19808 -10638 -17274 2922 4767 -5274 5757 15406 -4840 -19435 227 15400
924A5400j3606q356J0148j401j2289P908J5523q905j5225O901J0396n865l771
937c142P045k105j0220M946J2426l211j0639N1L281j286M593O895n845j0817J256
952f772O765K212K557K107r350j0037P413J2679j144m769N02o019q526R281J6814
967A3713m237j5098K97N009m769L151J4905k758k0466j933J6242K047p618O031
981D516L446j6331o034J9760R363j5733o354J0641k744j0209J1247J3286j3950
994I04j5327J1630J1769r305l806J0556l663j5078O499J7568n161j4565M141P494
1008C656p135p74J2933j053j6725p23J4178J441p574L612K605j0699l711J4213
1022D244O657j0474n695M782q58k972P979O098r414q804N449N957j781Q59L158
$$ plain form
924 15400 1794 -6562 3586 2185 -10104 -2196 13327 4422 -10803 -3902 6494 629 -3142
937 -3142 3903 1798 -8422 -3476 8950 5739 -4900 -4849 -1568 -2854 1739 8634 2789 -8028 -6772
952 -6772 -7 2205 4762 6869 -2481 -12518 -5105 7574 6430 1661 2163 -3856 -12382 -3101 13713
967 13713 9476 -5622 -5325 -316 -5085 -1934 12971 10213 -10253 -12186 4056 6103 -1515 4516
981 4516 7962 -8369 -14403 5357 14720 -1013 -7367 3274 530 -9679 1568 14854 904
994 904 -14423 -2793 8976 -329 -4135 6421 2758 -12320 -5821 11747 6586 -7979 -3838 3656
1008 3656 -3479 -4253 8680 7627 -9098 -9821 4357 5798 -1776 1836 4441 -6258 -9969 4244
1022 4244 10901 427 -5268 -486 -1344 -4316 3663 9761 347 -8457 -3008 2949 1168 2027 5185
1037E185o047p055N570Q161k192m513Q28q47l400L732O549l027o927J051L631
1052F99r18N61L043k641o061K202O548o40l947N97J62l159K023O285r04p128j071
1069d349M227Q18j98K795r72o609j102O975L091l402j608L92k818r79O136L848
1085F245m898n124J410K395K08J929J645l678m514J982M580N04j441o19j966j922
1101c264K273M434m83l736j408P27P22J393J662r31l283j244K329K430L4j206
1117D49j481j093N89K219J411j108j908r97P45J607R33j44j103j551l48K071J627
1134A918p78j931k71J088l4K73J290m67k603j86K847Q52j904l10O38j125m17K690
1152A570R85l271j452K157J137j266O38J268k534k309K791L136j920k175J164
$$ plain form
1037 5185 -862 -7917 -2347 5814 3622 -891 -63 -910 -4310 -578 5971 2944 -3983 -2932 699
1052 699 -219 342 3385 744 -5317 -3115 3433 2793 -1154 -557 -395 -3554 -1531 4754 3850 -3278 -4349
1069 -4349 -122 696 498 3293 2321 -4288 -5390 1585 4676 1274 -334 58 -2760 -3739 2397 6245
1085 6245 1347 -3777 -2367 28 236 2165 3810 132 -4382 -2400 2180 2684 1243 624 -1342 -3264
1101 -3264 -991 3443 2960 -776 -2184 -1457 -735 658 2320 1389 -1894 -3138 -809 1621 1655 449
1117 449 -1032 -2125 -1536 683 2094 986 -922 -1919 -1174 433 1366 1222 119 -1432 -1780 291 1918
1134 1918 1140 -791 -1062 26 -8 265 1555 1088 -1515 -1701 1146 1998 94 -216 422 -703 -1120 1570
1152 1570 2555 -716 -2168 -11 1126 -140 498 1766 -768 -3077 -286 2850 930 -1245 -81
1167h1j47j814J692L104j625l493P85J888n61K4K064r55l455N29L275p8j362N70
1185C60rk085N01K860m0k111k6Q57j194N47K255n64k778M97K195j226r49K440
1203A530K26l332r9L678o16l029J545K251k850j738L778J138m231j33M192j156
1219A154m093K371L620l548k769M407J812n140o82N121n03m747K069M317l772
1234c83l957M911L312m984k088M950M94n470J199N683j765n130K083L801k650
1249Fk645L786J909m001j467L440P62k623J18K591j005k414P59J969n56q94N02
1266B37M90p58j076L61J819K69j499q05R70j19j164J288K428j508l495R26K765
1283A129j097j179K762M88m678j126N247J482m407J65L656k817m196M458N268
$$ plain form
1167 -81 -228 -2042 -350 2754 1129 -2364 -1579 309 -252 -228 1836 881 -2574 -2045 1230 1152 -210 360
1185 360 351 -1734 -1233 1627 1587 -524 -550 307 -887 -340 1915 1351 -1427 -930 1265 39 -910 1530
1203 1530 1756 -1576 -1675 2003 1387 -1642 -97 2154 -696 -2434 1344 2482 -1749 -1882 2310 1154
1219 1154 -2939 -568 3052 -496 -3265 1142 2954 -2186 -2868 2253 1750 -2997 -928 3389 -383
1234 -383 -4340 571 3883 -1101 -3189 1761 2255 -3215 -2016 3667 1902 -3228 -1145 2656 6
1249 6 -2639 1147 3056 -945 -2412 1028 1790 -833 -715 1876 871 -1543 -784 1185 629 -265 237
1266 237 727 -31 -1107 -746 1073 1342 -157 -962 8 -111 -1275 13 2441 933 -2562 -1636 1129
1283 1129 32 -1147 1615 2103 -2575 -3701 1546 3028 -1379 -1214 2442 -375 -4571 -113 5155
1298E155m253m970L829K730m459l65O082l66o905M28N849j005m212K681L247m424
1314i58k843M780K709m586j379M015n5l874Q25L567j105k878J376K417j747k407
1330b143J327J881j98j038K73J17j326o93J916K347j017l096n36K060M1k82K467
1347B100R66n161l194M984M070l071j660L124k098n841L402Q517j780p911J142
1362b411M499l953j899P810K881r529m083P754K358n623K026N970n443p722N816
1377a549P642n125m876N655J667p590p7Q835n43q132J575O722l395n527M347M584
1393D213m717l134N471J553o273j302N790J412l559m5J954k553k616L354M230
1408C778j093l634j672P97J146J625J780J62l333l909R89N190K199k430j813k96
$$ plain form
1298 5155 902 -4068 -239 2491 -1968 -2333 3749 3383 -3522 -3094 2755 1750 -2462 219 3466 -958
1314 -958 -3801 979 3688 -898 -2277 1738 1683 -2191 -1366 2201 1096 -1782 -406 2011 264 -2143
1330 -2143 -816 1065 867 -171 102 219 -1107 -1800 116 2463 1446 -1650 -2186 -126 -85 -367 2100
1347 2100 3066 -2095 -5289 -305 3765 694 -966 2158 60 -5781 -2379 6138 4358 -3553 -2411
1362 -2411 2088 -1865 -3764 4046 6927 -2602 -6685 1069 3427 -2196 -170 5800 357 -7365 -1549
1377 -1549 6093 968 -3908 1747 3414 -4176 -4253 4582 4039 -4093 -2518 4204 809 -4718 -371 4213
1393 4213 -504 -3638 1833 3386 -2887 -4189 1601 3013 -546 -591 1363 -1190 -3806 -452 3778
1408 3778 2685 -949 -2621 -1824 -678 947 2727 2889 -444 -4353 -3364 1826 4025 1595 -218 -514
1424e14k354p68N349M865m753o019K033L272k395M44N914j425q673l85Q341P10
1440C642n706J743M287n034m795O327N271o186l876N648J694o100N15O200j831
1455A799n892L289N374m410m723M401L632m571j041N245r84o575R25O956J12m750
1471a213M33J826l143j130N343L131m440m263J412J884K88J595J807k758m283
1486c511mM146K573q70k014j471j099l3K674L297q25m414k052K593K086o62R11
1503A325R98l206l564L009M888j478l808J401J573l123n57N072Q01n347q70M575
1519A689o8l885J656L648l110l002L901K469m613k005M878J082m182M01L846k409
1535B96m440L661N256l204m848K503K343l113j27N190P0o348j595M840J816k222
$$ plain form
1424 -514 -2868 -3636 1713 6578 1825 -4194 -2161 1111 -1284 -840 5074 3649 -5024 -5409 2932 3642
1440 3642 -2064 -321 3966 -1068 -5863 464 5735 -451 -4327 1321 3015 -3085 -2570 3630 1799
1455 1799 -4093 -804 4570 160 -4563 -162 3470 -1101 -2142 3103 2119 -4456 -3531 3425 3537 -1213
1471 -1213 -780 1046 -2097 -3227 2116 5247 807 -3456 -2044 -160 128 1723 3530 772 -3511
1486 -3511 -3515 631 3204 2334 320 -1151 -2250 -2283 391 3688 2863 -1551 -3603 -1010 1076 414 1325
1503 1325 2323 -883 -4447 -1438 3450 1972 -1836 -435 1138 -1985 -2542 2530 3331 -2016 -2886 1689
1519 1689 1621 -2264 -608 3040 -70 -3072 829 3298 -1315 -3320 1558 2640 -1542 -1141 2705 296
1535 296 -4144 -483 4773 1569 -3279 -776 1567 -1546 -1673 3517 3587 -2761 -4356 484 2300 78
1551G8O49J298l483k703L623L996j390k699q9l59j050J700L474o20l704j236J671
1568h44J008K56Q18L02k232j835J426K451L43j508q22M47k08m35J280J218j267
1585C98j864Q78J732p10j254R93Q76j434m96J719J26k109r5K391L39k163n3J367
1603F41r46j338K232K132k622k520J766J638j350K03K019r69l423L52L657L09
1619A781k407N33Q14k037r43L173J850k743j983J653P94j405R80K117j583k674
1635b080R28K422o79j199J140M18k025k37K385L60j932l45J486l61j146R81J180
1652A296j279j122J242R38j037o91J024J26r98J63Q94k43q69R5Q53j54m07K24
1670E5k37k78K74M90l5l81j75j4J6L13L54k28k84j11l2N9M98K79o89k35L45N1
$$ plain form
1551 78 727 2025 -1458 -4161 -538 3458 2068 -631 -720 -1079 -2129 -429 3045 2425 -1279 -2515 -844
1568 -844 164 420 1238 1540 -692 -2527 -1101 1350 1693 185 -637 -190 -398 -833 447 1665 398
1585 398 -1466 -588 1144 434 -820 173 1049 -385 -881 838 964 -1145 -1240 1151 1490 -673 -726 641
1603 641 -305 -1643 589 2721 99 -2421 -655 983 -367 -164 1855 886 -2537 -2185 1472 1781
1619 1781 -626 -93 721 -1316 -2259 914 2764 21 -1962 -309 485 -920 60 2177 594 -2080
1635 -2080 -1152 1270 591 -608 532 950 -1075 -1312 1073 1433 -499 -844 642 281 -865 116 1296
1652 1296 17 -1105 137 1075 38 -653 371 497 -501 -338 556 313 -556 -461 392 238 -169 55
1670 55 -182 -460 -186 304 269 -112 -287 -301 -285 28 382 154 -130 -241 -273 -214 284 563 -126 -361 -16 35
1692C5j90J91M53n64m68N38M99m14m08M43L00q59Q1R98k25r07M56O88p55n68Q21
1713A45M81r24k15R96mj263L73J079m49j006O92O16r44k35R94L02r12m19R06K3
1733B36o09L22O41p08p86Q37O13o47k65M12P6n76K78Q87n30p83L71M79k41L8M11
1754D56j86p66J95P45Q1o27J51N0l66J34O68jp76j98L30J93l7L58k06n32j56M80
1776a0M44l00q3k00k23j77O76L93l87m47q1K28J86J92R9m63l62K07N39L0q1j19
1798F1m14j4M17O75j69o86l56Q9L65M02L96n24p86j20O07N78N5k18n17n49L05
1819d03P43N18m27o33k50k16N74N93L07p52p31K11N36N10m3m14n39l97N95O03
1839C85L00n90n23m0J66N05L24m0r62l63N51Q19j32k58l14m45Q6Q28P04m41r84
$$ plain form
1692 35 -155 36 489 -75 -543 -5 494 80 -328 115 415 -444 -363 635 410 -497 -41 647 -108 -676 145
1713 145 626 -298 -513 483 479 -784 -411 668 219 -787 -95 521 -423 -658 336 638 -274 -693 213 236
1733 236 -373 -51 590 -118 -904 -67 546 -101 -366 46 122 -454 -176 711 181 -602 -231 248 7 45 456
1754 456 270 -496 -301 444 525 -102 49 99 -267 -133 535 534 -242 -440 -110 83 46 404 198 -334 -490 -10
1776 -10 434 134 51 -149 -372 -549 127 520 133 -314 -395 -167 19 211 310 -153 -515 -308 231 261 180 61
1798 61 -353 -367 50 725 556 -130 -486 -397 -32 370 766 242 -544 -664 -57 521 576 358 -159 -708 -403
1819 -403 340 858 431 -202 -452 -668 -94 499 806 54 -677 -466 70 580 537 123 -416 -813 -218 385
1839 385 685 95 -428 -468 -302 203 527 487 -475 -838 -287 532 400 142 -172 -617 -531 297 1001 560 -424
1860d24l12L68L14O47K81n43j235j5J201N53j69l89m80o52J55J376N00p78j106
1879g08J57M7N21O63K30j136p74M18Q96K64k31l04o19k89O19J042k43p27m74K50
1899c98K00N93L14n60p30j79O51O93J08m72r17j59N66Q69K62l77p81q57M94J384
1919G04M35o07r40l11K2O08J192K46j409j175M26J090K77J60lj249j026R83J589
1938A012J72j196m91N9l28O24J359r5j819o05J083O96j89J86Qj240q08J645J310
1957A383q15r93j19O9O9P45R30o90j730j7J331O38j47l38m12q14n6J378R57o50
1977G19j325k02O17L37L79K39k67j142o66J361J166p02j013L11J70o14O36J415
1995A419q55k014L46J836j30r10P41J33j638k91K371P27k234q14J407J13q67J104
$$ plain form
1860 -424 -736 -368 -54 593 874 331 -904 -919 282 835 666 277 -203 -855 -700 676 1176 398 -708
1879 -708 -551 -504 17 680 910 -226 -1000 -582 314 578 347 43 -576 -865 -246 796 553 -174 -648 -398
1899 -398 -198 395 709 149 -581 -760 -109 584 692 220 -697 -856 -290 579 841 464 -317 -1174 -680 704
1919 704 1139 532 -408 -719 -697 -89 1103 1349 -60 -1235 -809 281 558 718 715 -534 -1560 -577 1012
1938 1012 1184 -12 -503 -444 -772 -148 1211 1116 -703 -1308 -225 471 282 468 476 -764 -1572 73 1383
1957 1383 568 -425 -544 -475 -406 339 1269 579 -1151 -1168 163 801 654 316 -96 -910 -966 412 1369 719
1977 719 -606 -808 -191 146 525 764 497 -645 -1311 50 1216 514 -499 -188 -18 -632 4 1419
1995 1419 564 -1450 -1104 732 602 -308 433 566 -1072 -1363 1008 1735 -499 -1313 94 207 -660 444
2013D44J272k000k016J771K116j086r38R08m68j710J014K745m44k725j29J303
2029E7k55j41J727K94k628j021J911J401p16l43Q2j135p28J255J793n45j401o08
2047a001K55N27N97M98k59r56n39O9J188Q28q79j106M17L16m72N54J188p63j874
2066a412O18K029r63j392J438Q61j949o64K662K32k837o3L051m83k528J176K011
2083A787k251j747L087J729l206j618L010K18k638J369L093k199l730K248L042
2098B194j883j652K468L28l652J0M173K72l288O7J890j643j386L064J708k837
2114a67j945J996R09j448O44J831j333k371P00J961j62q97P12k0j179j29R53O06
2132F61k81l32n51J35L61M1k75O49K86r47n33R68M36j218M63J376q12j981J002
$$ plain form
2013 444 1716 -284 -2300 -529 1587 501 -437 471 3 -1707 -693 2052 1608 -1117 -1246 57
2029 57 -198 -339 1388 1682 -946 -1967 -56 1345 629 286 368 -767 -1495 -240 1553 1008 -393 -1001
2047 -1001 -746 -219 378 876 617 -339 -878 -809 379 1207 328 -778 -361 -45 -517 37 1225 462 -1412
2066 -1412 -794 1235 272 -1120 318 1179 -770 -1434 1228 1460 -1377 -1440 1611 1128 -1400 -224 1787
2083 1787 -464 -2211 876 2605 -601 -2219 791 1009 -1629 -260 2833 634 -3096 -848 2194
2098 2194 311 -1341 1127 1455 -2197 -2187 1986 2258 -1030 -963 927 -716 -2102 962 2670 -167
2114 -167 -2112 -116 793 -655 -11 1820 487 -1884 -1184 777 615 -282 430 410 -769 -898 55 661
2132 661 380 48 -503 -368 -7 34 -241 408 694 -253 -786 182 618 -600 -137 1239 427 -1554 -552
2151e52J706j152r39K016L27k966l43L197K48k671O25K239j973k433K804K585
2167B718k768j928K627N40k976N28L614p86l660Q99K882j759j907K868J570l400
2183i38j435L176O52k660M54K746j252k967J430K348j135j601J996P48k727p76
2199a941K636R01j702l55J175q60j335J236J919o05j697p6N14j90K27J170J44
2216A161j389j170N94J356K72m99l43p8r21j27J690J127j316j591P71P48p63K08
2234b70J516l33k393N2K433J5j856M82J416j305j230J898J398k153j366K105Q74
2251A283j749m44J807m28j952J285K240j326k479R40J692q55m97J707Ok828m56
2268b054K857J253j881o67N86q37p36J851K136j542k708J52J647M03K1Q83o38
$$ plain form
2151 -552 1154 2 -937 1079 1406 -1560 -1903 1294 1542 -1129 -504 1735 -238 -2671 133 2718
2167 2718 -50 -1978 649 1189 -1787 -1259 2355 1569 -2091 -1192 1690 -69 -1976 892 2462 -938
2183 -938 -2373 803 1455 -1205 -751 1995 743 -2224 -794 1554 419 -1182 814 1562 -1165 -1941
2199 -1941 695 1596 -106 -461 714 -146 -1481 -245 1674 1069 -628 -704 -190 -380 -153 1017 1161
2216 1161 -228 -1398 -804 552 824 325 -18 -96 -1017 -1144 546 1673 357 -1234 -463 285 -478 -270
2234 -270 1246 913 -1480 -1428 1005 1020 -836 -354 1062 -243 -1473 425 1823 -330 -1696 409 1283
2251 1283 -466 -910 897 469 -1483 -198 2042 716 -1763 -823 869 14 -483 1224 1230 -1598 -2054
2268 -2054 803 2056 175 -492 94 -743 -1479 372 2508 966 -1742 -1590 57 460 481 1364 726
2285G26k341o39K621J662j224j280j5k80k98J487J777j157k658j25J827P38n00
2302C21M60k88j722o51K542J447j629j571O49L68l53J034J212j386k484O94K400
2319A043L56j196j41l37j173N35K450O16k275j643P42J168L42O99j17j880j493
2336b304J421K325L55j360j061q33Q1J453J793j58k241j629O71J955R57K9j091
2353C63j539p86J223K381O75j922j961J6J070J182R24j47k172j833J119K807N16
2370A916j314q12p87n95J106K594J11k757j723J257J473K85O31m31k187j360K084
2387e09K579m16j797p04l95j14J787K138j477k767m34J774J162K59J87j204k313
2404b244K42K775J538j237j704o69k34J128K156N49k198k022L38J590J205O61
$$ plain form
2285 726 -1615 -2254 367 2029 805 -475 -490 -770 -1068 419 2196 1039 -1619 -1744 83 821 321
2302 321 781 493 -1229 -1880 662 2109 480 -1091 -442 -74 -427 607 1819 433 -2051 -1357 1043
2319 1043 1399 203 62 -275 -1448 -913 1537 2153 -122 -1765 -1023 145 487 1186 1069 -811 -2304
2336 -2304 -883 1442 1797 437 -624 -1457 -1376 77 1870 1712 -529 -2158 -1487 468 1425 1454 363
2353 363 -1176 -1962 -739 1642 2317 395 -1566 -1550 -480 702 1626 1479 -693 -2526 -1407 1400 1916
2370 1916 602 -210 -997 -1592 -486 2108 2219 -538 -2261 -1004 469 754 1385 954 -1233 -2593 -509
2387 -509 2070 1654 -143 -847 -1242 -1356 431 2569 1092 -1675 -2109 -335 827 1086 1273 69 -2244
2404 -2244 -2002 773 2311 1074 -630 -1299 -1533 -405 1751 2300 102 -1920 -1582 8 1213 1874
2420A874q84k292r80J623K098M72j074j580j111N00K159J488j052k102q86J62
2436a585J711J745J91k166k019M69J652J513N2q13k298q51J685K403J66j437j379
2453i61p19K93K198J644j294k538m96J081J143J103K13j757k222N67K352J344
2469A951p15j257j064o59J218K191N07k119j751M80R35J150R51o08k388r53J633
2486d98J804K22p38j267j122P8K032J595q11k065p19M59J001J406K86j550j922
2503a809L09J626J029Q0r87j398p27J296J874K95j240j314n62P33J322J107o98
2520I36j697q34P51J306R48j55j361j458L35J652R83k50j065j077m36J262J407
2537A247K77j448j000j40P31J168N33o20j784m16R95J177L12k04j152r09J96J495
$$ plain form
2420 1874 990 -1302 -2282 -659 1439 1911 837 -743 -1854 -1354 805 2293 1241 -861 -1747 -1585
2436 -1585 126 1871 2062 -104 -2123 -1654 -2 1511 1563 750 -1548 -2399 -714 1689 1855 418 -961
2453 -961 -1680 -1387 811 2455 1161 -1377 -1873 -792 351 1454 1667 -90 -2312 -1745 607 1951
2469 1951 1236 -21 -1085 -1744 -526 1665 2172 53 -1698 -1218 -283 867 1818 1210 -1178 -2131 -498
2486 -498 1306 1528 790 -477 -1599 -1521 511 2106 1295 -770 -1489 -1030 -29 1377 1663 113 -1809
2503 -1809 -1500 126 1155 1235 248 -1150 -1877 -581 1293 1588 348 -966 -1528 -795 527 1634 936
2520 936 -761 -1595 -844 462 1410 1255 -106 -1564 -1229 423 1406 1156 91 -986 -1422 -160 1247
2537 1247 1524 76 -924 -1064 -333 835 1368 748 -1036 -1452 -457 720 1032 828 -324 -1233 -1037 458
2555D58Q06n19j090o76O7Q33J107J35j427j048M38Q97P23P5n77q80m13O99J098
2574G06L91q84o84l63M88P70N68l90j063m41N02P09N36j93p19o21J29M85P92J03
2594H21o82r04J63P77L68l00K1n88l64L39P64L61p07n53K51L1J4O19J46r10n49
2615h82R54L61l73k47L83k11o01L13R54l44r16K36P49l67l70O10J81p89j82R51
2635D10J78p93j72P20k74m48L68N87m70o75O27M51n47k52N80J22n94J24L18k2
2655B38n59J10O18k16l49M1K52k01n5K52Ql02l26M41N29k46l57o2j5j00J51P08
$$ plain form
2555 458 1264 745 -345 -1021 -954 -121 986 1121 -306 -1354 -916 -19 704 779 202 -678 -1091 -392 706
2574 706 1097 213 -471 -834 -346 424 992 602 -461 -902 -400 309 845 652 -67 -688 -559 -74 718 821
2594 821 139 -765 -602 175 543 243 264 -324 -688 -349 415 776 69 -484 -233 -202 -188 431 577 -333 -882
2615 -882 72 433 60 -187 196 -15 -616 -303 651 307 -609 -373 376 9 -361 249 430 -359 -541 410
2635 410 588 -205 -377 343 69 -379 -11 576 106 -569 58 509 -38 -290 290 412 -182 -58 260 238
2655 238 -321 -211 407 191 -158 -117 135 -66 -121 131 139 -163 -489 -48 481 235 -122 -184 -199 -299 -148 560
$$ [...]
8191a04
##END NTUPLES=NMR FID
##END=
