##TITLE=1H_2PEDM2511
 CDCl3, 8 sc, 
 26.11.2020
##JCAMPDX= 6.0         $$ Bruker NMR JCAMP-DX V2.0
##DATA TYPE= NMR FID
##DATA CLASS= NTUPLES
##ORIGIN= UXNMR, Bruker Analytische Messtechnik GmbH
##OWNER= root
$$ XWIN-NMR		Version 3.5
$$ Thu Nov 26 10:51:45 2020 Russian Standard Time (UT+4h)  she@DPX200
##.OBSERVE FREQUENCY= 200.1315066352
##.OBSERVE NUCLEUS= ^1H
##.DELAY= (6, 6)
##.ACQUISITION MODE= SIMULTANEOUS
##.ACQUISITION SCHEME= undefined
##.AVERAGES= 8
##.DIGITISER RES= 18
##SPECTROMETER/DATA SYSTEM= spect
##.PULSE SEQUENCE= zg30
##.SOLVENT NAME= CDCl3
##.SHIFT REFERENCE= (INTERNAL, CDCl3, 0, 15.7039)
##AUDIT TRAIL= $$ (NUMBER, WHEN, WHO, WHERE, WHAT)
$$ ##TITLE= Audit trail, XWIN-NMR		Version 3.5
$$ ##JCAMPDX= 5.01
$$ ##ORIGIN= Bruker BioSpin GmbH
$$ ##OWNER= she
$$ F:/spectra/data/she/nmr/H-F/1/audita.txt
$$ ##AUDIT TRAIL=  $$ (NUMBER, WHEN, WHO, WHERE, WHAT)
(   1,<2020-11-26 10:50:27.26 +0400>,<she>,<DPX200>,
      <created by zg, POWCHK disabled, PULCHK disabled
       configuration hash MD5:
       00 E9 B6 7A A2 85 ED C7 34 08 36 98 17 FE 4E 26
       data hash MD5: 16K
       77 6C 88 43 36 69 A0 30 5F 36 33 A7 88 4F 71 62>)
$$ ##END=
$$ 
$$ hash MD5
$$ F9 58 38 C8 B1 BC 08 B9 82 10 CB 9B EE AF 2E 6F
##$RELAX= 
##$RELAX= 
##$RELAX= 
##$RELAX= 
##$RELAX= 
##$RELAX= 
$$ Bruker specific parameters
$$ --------------------------
##$DU= <F:/spectra>
##$EXPNO= 1
##$NAME= <H-F>
##$PROCNO= 1
##$TYPE= <nmr>
##$USER= <she>
##$AMP= (0..31)
100 100 100 100 100 100 100 100 100 100 100 100 100 100 100 100 100 100 
100 100 100 100 100 100 100 100 100 100 100 100 100 100 
##$AQSEQ= 0
##$AQ_mod= 1
##$AUNM= <au_zg>
##$AUTOPOS= <>
##$BF1= 200.13
##$BF2= 200.13
##$BF3= 200.13
##$BF4= 200.13
##$BF5= 200.13
##$BF6= 200.13
##$BF7= 200.13
##$BF8= 200.13
##$BYTORDA= 1
##$CFDGTYP= 0
##$CFRGTYP= 5
##$CHEMSTR= <none>
##$CNST= (0..31)
1 1 145 1 1 1 1 1 1 1 1 1 1 1 1 1 1 1 1 1 1 1 1 1 1 1 1 1 1 1 1 1 
##$CPDPRG= <>
##$CPDPRG1= <>
##$CPDPRG2= <>
##$CPDPRG3= <>
##$CPDPRG4= <mlev>
##$CPDPRG5= <mlev>
##$CPDPRG6= <mlev>
##$CPDPRG7= <mlev>
##$CPDPRG8= <mlev>
##$CPDPRGB= <>
##$CPDPRGT= <>
##$D= (0..31)
0 1.2 0 0 0 0 0 0 0 0.06 0 0.03 0 0 0 0 0.0002 0 0 0 0 0 0 0 0 0 0 0 0 
0 0 0 
##$DATE= 1606373426
##$DBL= (0..7)
120 120 120 120 120 120 120 120 
##$DBP= (0..7)
150 150 150 150 150 150 150 150 
##$DBP07= 0
##$DBPNAM0= <>
##$DBPNAM1= <>
##$DBPNAM2= <>
##$DBPNAM3= <>
##$DBPNAM4= <>
##$DBPNAM5= <>
##$DBPNAM6= <>
##$DBPNAM7= <>
##$DBPOAL= (0..7)
0.5 0.5 0.5 0.5 0.5 0.5 0.5 0.5 
##$DBPOFFS= (0..7)
0 0 0 0 0 0 0 0 
##$DE= 6
##$DECBNUC= <off>
##$DECIM= 32
##$DECNUC= <off>
##$DECSTAT= 4
##$DIGMOD= 1
##$DIGTYP= 9
##$DL= (0..7)
0 120 120 120 120 120 120 120 
##$DP= (0..7)
150 150 150 150 150 150 150 150 
##$DP07= 0
##$DPNAME0= <>
##$DPNAME1= <>
##$DPNAME2= <>
##$DPNAME3= <>
##$DPNAME4= <>
##$DPNAME5= <>
##$DPNAME6= <>
##$DPNAME7= <>
##$DPOAL= (0..7)
0.5 0.5 0.5 0.5 0.5 0.5 0.5 0.5 
##$DPOFFS= (0..7)
0 0 0 0 0 0 0 0 
##$DQDMODE= 0
##$DR= 18
##$DS= 0
##$DSLIST= <SSSSSSSSSSSSSSS>
$$ [...]
##$SUBNAM2= <"">
##$SUBNAM3= <"">
##$SUBNAM4= <"">
##$SUBNAM5= <"">
##$SUBNAM6= <"">
##$SUBNAM7= <"">
##$SUBNAM8= <"">
##$SUBNAM9= <"">
##$SW= 16.9725356469052
##$SWIBOX= (0..15)
0 0 2 0 0 0 0 0 0 0 0 0 0 0 0 0 
##$SW_h= 3396.73913043478
##$TD= 16384
##$TD0= 1
##$TE= 0
##$TE2= 300
##$TE3= 300
##$TEG= 300
##$TL= (0..7)
0 120 120 120 120 120 120 120 
##$TP= (0..7)
150 150 150 150 150 150 150 150 
##$TP07= 0
##$TPNAME0= <>
##$TPNAME1= <>
##$TPNAME2= <>
##$TPNAME3= <>
##$TPNAME4= <>
##$TPNAME5= <>
##$TPNAME6= <>
##$TPNAME7= <>
##$TPOAL= (0..7)
0.5 0.5 0.5 0.5 0.5 0.5 0.5 0.5 
##$TPOFFS= (0..7)
0 0 0 0 0 0 0 0 
##$TUNHIN= 0
##$TUNHOUT= 0
##$TUNXOUT= 0
##$USERA1= <user>
##$USERA2= <user>
##$USERA3= <user>
##$USERA4= <user>
##$USERA5= <user>
##$V9= 5
##$VALIST= <valist>
##$VCLIST= <CCCCCCCCCCCCCCC>
##$VD= 0
##$VDLIST= <DDDDDDDDDDDDDDD>
##$VPLIST= <PPPPPPPPPPPPPPP>
##$VTLIST= <TTTTTTTTTTTTTTT>
##$WBST= 1024
##$WBSW= 4
##$XGAIN= (0..3)
0 0 0 0 
##$XL= 0
##$YL= 0
##$YMAX_a= 102806
##$YMIN_a= -70175
##$ZGOPTNS= <>
##$ZL1= 120
##$ZL2= 120
##$ZL3= 120
##$ZL4= 120
##$ABSF1= 10
##$ABSF2= 0
##$ABSG= 5
##$ABSL= 3
##$ALPHA= 0
##$AQORDER= 0
##$ASSFAC= 0
##$ASSFACI= 0
##$ASSFACX= 0
##$ASSWID= 0
##$AUNMP= <proc_1d>
##$AZFE= 0.1
##$AZFW= 0.1
##$BCFW= 1
##$BC_mod= 2
##$BYTORDP= 1
##$COROFFS= 0
##$CY= 11.3945322036743
##$DATMOD= 1
##$DC= 2
##$DFILT= <>
##$DTYPP= 0
##$F1P= 15.9154993809931
##$F2P= -4.1035820241983
##$FCOR= 0.5
##$FTSIZE= 0
##$FT_mod= 4
##$GAMMA= 1
##$GB= 0.15
##$INTBC= 1
##$INTSCL= 1
##$ISEN= 128
##$LB= 0.24
##$LEV0= 0
##$LPBIN= 0
##$MAXI= 10000
##$MC2= 0
##$MEAN= 0
##$ME_mod= 0
##$MI= 1.114404
##$NCOEF= 0
##$NC_proc= 0
##$NLEV= 6
##$NOISF1= 3.799351
##$NOISF2= 2.8
##$NSP= 1
##$NTH_PI= 0
##$NZP= 0
##$OFFSET= 15.70392
##$PC= 1
##$PHC0= -10958.71
##$PHC1= 8.800879
##$PH_mod= 1
##$PKNL= yes
##$PPARMOD= 0
##$PSCAL= 0
##$PSIGN= 0
##$REVERSE= no
##$SF= 200.130013532006
##$SI= 16384
##$SIGF1= 3
##$SIGF2= 2
##$SINO= 400
##$SIOLD= 16384
##$SREGLST= <1H.CDCl3>
##$SSB= 0
##$STSI= 0
##$STSR= 0
##$SW_p= 3612.71676300578
##$SYMM= 0
##$S_DEV= 0
##$TDeff= 0
##$TDoff= 0
##$TI= <>
##$TILT= no
##$TM1= 0
##$TM2= 0
##$TOPLEV= 0
##$USERP1= <user>
##$USERP2= <user>
##$USERP3= <user>
##$USERP4= <user>
##$USERP5= <user>
##$WDW= 1
##$XDIM= 8192
##$YMAX_p= 0
##$YMIN_p= 0
$$ End of Bruker specific parameters
$$ ---------------------------------
##NTUPLES= NMR FID
##VAR_NAME=  TIME,          FID/REAL,        FID/IMAG
##SYMBOL=    X,             R,               I
##VAR_TYPE=  INDEPENDENT,   DEPENDENT,       DEPENDENT
##VAR_FORM=  AFFN,          ASDF,            ASDF
##VAR_DIM=   8192,          8192,            8192
##UNITS=     SECONDS,       ARBITRARY UNITS, ARBITRARY UNITS
##FACTOR=    0.0002944,     1,               1
##FIRST=     0,             0,               0
##LAST=      2.4114304,     0,               0
##MIN=       0,             -70175,          0
##MAX=       2.4114304,     102806,          0
$$ Real data points
##PAGE= N=1
##DATA TABLE= (X++(R..R)), XYDATA
0@%%%%%%%%%%%%%qJ6j6J6j6K4l2L2m0M8n6P2q8J01j14J33j52J68j92K23k52K84
$$ 0 0 0 0 0 0 0 0 0 0 0 0 0 0 -8 8 -8 8 -8 16 -16 16 -24 24 -32 40 -48 53 -61 72 -80 88 -104 119 -133 151
35A51l19L57l98M44m98N54o14O82p56Q35r23J018j122J237j362J500j652J821
$$ 151 -168 189 -209 235 -263 291 -323 359 -397 438 -485 533 -589 648 -714 786 -866 955
53I55k009K220k456K722l030L387l803M301m908N666o642P949r795J2618j7489
$$ 955 -1054 1166 -1290 1432 -1598 1789 -2014 2287 -2621 3045 -3597 4352 -5443 7175 -10314
68a0314K8108q7969K8512J19246j01849P8476j17075L1601J16696j14250J9497
$$ -10314 17794 -70175 -41663 77583 -24266 54210 -62865 -31264 85432 -28818 -9321
79i321r991j251J00648j05418j876K6707r929N8694p7436O978O4903n7662J2914
$$ -9321 -19312 -20563 80085 -25333 -27209 -502 -10431 48263 -29173 -22195 42708 -14954 -2040
92b040j1745R565L6401m3528k291J6999J0920j0121l1685K5276J3723J9302l3825
$$ -2040 -13785 -4220 32181 -11347 -13638 3361 14281 4160 -27525 -2249 11474 30776 -3049
105c049m9610O7646J2617k1779j9357k5604P8953j3229n5178J7863j1514O1871
$$ -3049 -52659 14987 27604 5825 -13532 -39136 39817 26588 -28590 -10727 -22241 39630
117C9630j2151p2620M5964m560K4159J576p6512O5372J9143l6893J0232l7170
$$ 39630 27479 -45141 823 -3737 20422 21998 -54514 10858 30001 -6892 3340 -33830
129c3830M6523J7784n5053K7968p598P139J5906m7358K9794J4484j9693J2845
$$ -33830 12693 30477 -24576 3392 -4206 2933 18839 -28519 1275 15759 -3934 8911
141H911l0546K0630K9823m5038L425J9298P46O520l2778J524L8688j2517j4814
$$ 8911 -21635 -1005 28818 -16220 -12795 6503 7249 13769 -19009 -17485 21203 8686 -6128
154f128l291Q64K7149r206k8653J0953J4276J1489j4727k9086K6635J7587j6145
$$ -6128 -9419 -8555 18594 9388 -19265 -8312 5964 17453 2726 -26360 275 17862 1717
167A717p000q138J9543R665k4420K305N073L992Q767j8491k250J5599j377n637
$$ 1717 -5283 -13421 6122 15787 -8633 -6328 -1255 2737 11504 -6987 -9237 6362 4985 -652
181f52n970N849R937r018r046R881N957p680j929r11O186M931j3046K374L953
$$ -652 -6622 -773 9164 146 -8900 981 6938 -742 -2671 -3582 2604 7535 -5511 -3137 816
196H16k69R261j7821m15J9005j0092J067p672P3K0728j8628j120Q603r606J4973
$$ 816 547 9808 -8013 -8428 10577 485 1552 -6120 -6047 14681 -3947 -5067 3536 -6070 8903
211H903r747o449J3211j1366J1328l668j3615J9533q723j668N914j0416J2575
$$ 8903 -844 -7293 5918 -5448 5880 2212 -11403 8130 -593 -2261 3653 -6763 5812
224E812o553m322J2407j2459M428M196o692O601p465L781N247r526N897j576j360
$$ 5812 -741 -5063 7344 -5115 -687 3509 -3183 3418 -4047 -266 4981 -4545 1352 -224 -1584
239a584M690m802J750j299J351M079p764J284M804j10k462n183P341J903o203
$$ -1584 3106 -1696 54 -1245 106 4185 -3579 -2295 2509 2399 -63 -5246 2095 3998 -2205
254b205J134m21M570p64n851K696L38M216r01r371N734N629k431m982m280J1676
$$ -2205 -1071 -1492 3078 2314 -3537 -841 -503 3713 2812 -6559 -825 4804 2373 -2609 -6889 4787
270D787K506j1280n58L204O575j295r687K883N393K064l466r574O529J0159n024
$$ 4787 7293 -3987 -4545 -1341 5234 3939 -5748 -2865 2528 4592 1126 -8448 -1919 8240 3216
285C216q076j670J0452L514j1732j904Q025M435m578q693K955R058J7o823m982
$$ 3216 -4860 -6530 3922 7436 -4296 -6200 1825 6260 1682 -7011 -4056 5002 5019 -1804 -6786
300f786O821Q133p658r268N297J1543j340j3151k067J2047M326q985o376N763
$$ -6786 35 8168 510 -8758 -3461 8082 6742 -6409 -8476 3571 7897 -1088 -7464 -1701
314a701R240l159j0802j035J0419O544q857j0420P132J1599m993j1707J223J3114
$$ -1701 7539 4380 -6422 -7457 2962 9506 649 -9771 -2639 8960 3967 -7740 -6517 6597
328F597K538j2986n392Q897Q568m322j0775J386J1208J850j0893o712J0259J1129
$$ 6597 9135 -3851 -9243 -346 8222 3900 -6875 -5489 5719 7569 -3324 -10036 223 11352
342A1352q132j2729L827J3059l32j2446k518J0979O332r170r276N050J0679O65
$$ 11352 3220 -9509 -5682 7377 7045 -5401 -7919 3060 9392 222 -9054 -4004 6675 7340
356G340j1839m249J1903N612r275r134O129J4278n355j3742J955R518N413r615
$$ 7340 -4499 -8748 3155 8767 -508 -9642 -3513 10765 5410 -8332 -6377 3141 8554 -1061
370a061q723J0200P270m240r337l216J4552M384j3102m641O157J0486m739j4365
$$ -1061 -9784 416 7686 3446 -5891 -9107 5445 9829 -3273 -7914 -1757 8729 3990 -10375
384a0375O493J1129j391q527o810J0056Q803q972o744K260R070L309j3833l870
$$ -10375 -3882 7247 5856 -2671 -9481 575 9378 406 -6338 -4078 4992 8301 -5532 -9402
398i402J2862M976o971r431K991J3302l311j1331J841O253N339n680j0484P561
$$ -9402 3460 8436 1465 -7966 -4975 8327 5016 -6315 -4474 1779 7118 1438 -9046 -1485
412a485P886l407n138m813R617O047j2974j521O505M404m99j2575L837J1426n111
$$ -1485 6401 2994 -2144 -6957 2660 8707 -4267 -5788 717 5121 4622 -7953 -4116 7310 2199
427B199l799m060M371J1397j0267p521N679M828N702j1776p182J4555K168n575
$$ 2199 -1600 -5660 -1289 10108 -159 -7680 -2001 2827 8529 -3247 -10429 4126 6294 719
441G19n461j855J3343o74j1265J878J873O007m6j1488M494O553k272j730n107
$$ 719 -4742 -6597 6746 6072 -5193 -3315 -1442 4565 4519 -6969 -2475 4078 1806 76 -5031
456e031M877O231q345q53M272j05J040n298N91P432l944l448R90O43O297m136
$$ -5031 -154 6077 -2268 -3121 1151 1046 2086 -3212 -2621 4811 867 -2581 -1591 -948 5349 1213
472A213q419P339L958j583l431o687R920N363j0430J38l31M573O263j2801R90
$$ 1213 -7206 133 4091 2508 -923 -7610 2310 7673 -2757 -2619 -2950 1623 7886 -4915 -3925
487c925N790j785O465j1071j383J2697p757K368k134n113J3206q547j649P185
$$ -3925 1865 80 6545 -4526 -5909 6788 -969 1399 -735 -5848 7358 -1189 -2838 4347
501D347r884Q898j795o181J0165r240K881M523q308R453o152l856J0581o766K469
$$ 4347 -5537 3361 1566 -4615 5550 -3690 -809 3714 -4594 4859 -1293 -5149 5432 -1334 1135
516A135j629n157J1449m315m553K963k563N874n21n999J410K151K366j175l809
$$ 1135 -494 -5651 5798 1483 -3070 -107 -2670 3204 2683 -3316 -1906 245 2611 1436 -2373
531b373q29N141J546n523J659j426J536N138q022K979K97l387J0027r095j136
$$ -2373 -3202 1939 3485 -2038 -379 -1805 -269 4869 -3153 -174 123 -3264 6763 -2332 -3468
546c468P176q138R530m191p500J1854q611N262K832j3539J2675l012k474P105
$$ -3468 3708 -4430 5100 909 -6591 5263 -3348 1914 4746 -8793 3882 870 -1604 5501
560E501j3221R396K869r165R326q571J982Q040j0215O203k872k918R409p989J717
$$ 5501 -7720 1676 4545 -4620 4706 -3865 -1883 6157 -4058 2145 -727 -3645 5764 -2225 -508
575e08K267n532O790k591j611K611m915N122J280m901J308q37K674J848m462j039
$$ -508 1759 -3773 3017 426 -1185 1426 -3489 1633 2913 -1988 -680 -1517 1157 3005 -1457 -2496
591b496K235J952K63k894k730M145L342m138j696J6K639L481n920o85L226j192
$$ -2496 -261 1691 1954 -940 -3670 475 3817 -321 -2017 -2001 638 4119 -1801 -2486 740 -452
607d52L419l953k453N938k640O67j85l595N998k368k683M966m132J234J341l644
$$ -452 2967 -986 -3439 2499 -141 526 341 -3254 2744 376 -2307 2659 -1473 -239 1102 -2542
623b542N788l112l538N638l006J983M23o665O761J009l689J994n572N613M492
$$ -2542 3246 134 -3404 2234 -772 1211 1634 -5031 1730 2739 -950 1044 -4528 1085 5577
638E577q931K496m0J193M978r263J688M832l079M159o437p84Q243n160R18j407
$$ 5577 -3354 -858 -898 295 5273 -3990 -2302 2530 -549 3610 -2827 -3611 4632 -528 390 -1017
654a017j750P501n508j481L598k741L752k843j803M628l214J010k50j178L631
$$ -1017 -2767 4734 -774 -2255 1343 -1398 2354 -489 -2292 2336 -878 132 -118 -1296 2335
669B335l004o19J301M27J298l703O86K604k64p15l343L194K092k567K92k766L602
$$ 2335 -669 -1288 13 440 1738 -1965 -1279 1325 1061 346 -2997 197 2289 -278 14 -2752 850
686H50K231n001J543j102K618K205o963L101J616r28K121n914L576L030m760L097
$$ 850 3081 -1920 -377 -1479 1139 3344 -3619 -518 1098 170 2291 -3623 -47 2983 -1777 1320
702A320l224J519M033o311K786J60r64L632n855K278L307l894K100k649J560L443
$$ 1320 -1904 -385 3648 -2663 123 283 -681 2951 -2904 -626 2681 -1213 887 -1762 -202 3241
718C241n332J778L68j74K600m625J174K315j276J195l280J144L247k631q8q36
$$ 3241 -2091 -313 55 -119 2481 -2144 -970 1345 69 1264 -2016 -872 2375 -256 -344 -1180
734a180J267J963l177M96N52L35R30k557J005J027o45M75j863J355J411k107L35
$$ -1180 87 2050 -1127 -631 -79 256 1186 -1371 -366 661 16 491 -1372 -17 1394 -713 -378
751c78j67J197L88k672J486P33k64oj867J727R63j396R6r11J450J086k386K72
$$ -378 -545 652 1040 -1632 -146 587 323 317 -1550 177 1140 -256 -160 -1071 379 1465 -921 -649
769f49N74P98J71k286J070J212o11l02q66R92R18j148k74M1O84O53j458k37J041
$$ -649 -75 723 894 -1392 -322 890 279 -23 -889 103 1021 -127 -401 -360 324 977 -481 -718 323
788C23L34m64r31M81J047m95p77K65K93L95l94o65O97J41j29j02o13R11K13j086
$$ 323 657 193 -738 -257 790 295 -482 -217 76 471 77 -588 109 250 121 19 -594 317 530 -556
808e56N01P2K74q7j122J287M9p38L98o52R61R6j087O20k98N92K49j505R03L46
$$ -556 -55 17 291 204 -918 369 418 -320 78 -574 387 483 -604 16 -282 310 559 -946 -43 303
828C03r5q5j097J339J02p37K61m99Q80r8o37L82l84Q20k47p63P68m81P86m59q82
$$ 303 208 123 -974 365 467 -270 -9 -508 372 274 -363 19 -365 455 208 -555 213 -268 518 59 -823
849h23J638j105K93L82j189J624j041r4J228j837J428j80j155J889j726O86O44
$$ -823 815 -290 3 385 -804 820 -221 -315 913 -924 504 324 -831 1058 -668 18 662
866F62j658K076j377m24J801j748J122l34j098K087j404o4J016j535J305l4j036
$$ 662 -996 1080 -297 -721 1080 -668 454 120 -978 1109 -295 -359 657 -878 427 393 -643
883f43R89o33J57P32j009J30O84p77N59K13j163R75j64k44Q21j558Q23R73j504
$$ -643 346 -287 -130 602 -407 -277 407 -370 189 402 -761 214 50 -194 627 -931 -108 865 -639
902f39J189j119j18K167k263Q24j6j149K872k144o43J878j676J902r20j741K746
$$ -639 550 -569 -687 1480 -783 41 25 -1124 1748 -396 -1039 839 -837 1065 145 -1596 1150
919A150j390K51O65j998J924j52r12R35j003M99O46r64L82L25p95M39O29q68L47
$$ 1150 -240 11 676 -1322 602 450 -462 473 -530 -31 615 -349 33 358 -437 2 631 -237 110
938A10l10m09K110j734o39J401j422K578j416k409L345j656J422n3m148M801o34
$$ 110 -200 -609 1501 -233 -872 529 -893 1685 269 -2140 1205 -451 971 918 -3230 1571 937
955I37j692K117m362M013J262m446L421k816J316L253n459K709Pj426L719m232
$$ 937 -755 1362 -3000 1013 2275 -2171 1250 -1566 -250 3003 -2456 253 260 -1166 2553 -1679
971a679J125K014l215L189j569r35K424k823J860P93k259J193o26M96J454j850
$$ -1679 -554 1460 -1755 1434 -135 -1070 1354 -1469 391 1184 -1075 118 -508 -12 1442 -408
987d08j018J433J037m17r10j438J710K367k842l51Q5M63L115l822n85K314j412
$$ -408 -1426 7 1044 627 -283 -1721 -11 2356 -486 -837 -752 -289 2826 -996 -1581 733 -679
1004f79L136l071k092N019k905J132K75l811N315k018j791L446l918K648M99l220
$$ -679 2457 -614 -2706 2313 -592 540 815 -2996 2319 301 -1490 1956 -1962 686 1185 -2035
1020b035L971k532l54K384k838K858j190k492L642j343K93o3k626L452M23k416
$$ -2035 1936 -596 -950 1434 -1404 1454 264 -2228 1414 71 364 301 -2325 1127 1550 -866
1036h66M15n90J717J220k972m41J805O21R1j932r07L000Q7j752M4q39K384M46
$$ -866 -451 -1041 676 1896 -1076 -1517 288 909 1000 -932 -1839 1161 1248 -504 -460 -1299 1085 1531
1054A531l241J761j79M0J830l441J323J666k391K109j408m75K478k955J565Q53
$$ 1531 -1710 51 -128 -88 1742 -1699 -376 1290 -1101 1008 -400 -875 1603 -1352 213 1066
1070A066k259K006j680P52K031l416J279N25p43K465l278k90L106j522O69j332
$$ 1066 -1193 813 -867 -115 1916 -1500 -221 304 -439 2026 -1252 -1542 1564 42 711 -621
1086f21j271L734q75j857N47n58K093Q4k720J027O53L32L52k184O91J645j077
$$ -621 -1892 1842 967 -890 -343 -901 1192 1276 -1444 -417 236 568 920 -1264 -573 1072 -5
1103eJ70n09l61J806j303l47J249j308P86J59j106J618j008p12J588r52N87k28
$$ -5 165 -344 -705 1101 -202 -549 700 -608 178 337 -769 849 -159 -871 717 -235 352 124
1121A24j516K262l27r94N56j196J797L82k342J266j75K63J156k547Q86J199j021
$$ 124 -1392 870 543 -451 105 -1091 706 1088 -1254 12 -163 100 1256 -1291 -405 794 -227
1138b27R42j429JJ976j500J16J03n43J522j102m09J007r09Q82l33p33J159o16
$$ -227 715 -714 -713 1263 -237 -121 -18 -561 961 -141 -550 457 -452 430 97 -636 523 -93
1156i3j13N43o66N85k01n22Q29k78j57M0j26M33K9m99P1K48k0Pj82j13M81j30
$$ -93 -206 337 -329 256 55 -467 362 84 -73 -33 -159 274 303 -196 -125 123 103 110 -72 -185 296 166
1178A66l80J96p7L38k7o68O12j30j79M94p55M66J34n33O94n39k1N70p54N97j18
$$ 166 -214 -18 -95 243 216 -452 160 30 -149 345 -410 56 190 -343 351 -188 -209 361 -393 204 86
1199H6n27P82n71K40K47q20Q05j25l38M19n88N48J10o49N23k21J14K78p13M49
$$ 86 -441 341 -230 10 257 -563 242 117 -221 198 -390 158 268 -381 142 -79 35 313 -400 49
1219D9J06j81J75m69L97K27m39M7oK61J05n51J63K22M4m9l94K92K35j35k09j50
$$ 49 155 -26 149 -320 77 304 -135 -88 -94 167 272 -279 -116 106 150 101 -293 -1 234 99 -110 -260
1241b60M30R3l96n9J97K77j74m43K83L19p4l22k44M95K89m00l53J31N63j0o75
$$ -260 170 263 -133 -192 5 282 108 -335 -52 267 193 -129 -373 122 411 11 -342 -211 352 342 -333
1262c33p3N05L25l16o47L36N90j65l81k88M79M60n35l35J76M02J71p06p8O81m4
$$ -333 -406 99 424 108 -539 -203 387 222 -159 -447 32 492 -43 -378 -202 200 371 -335 -413 268 224
1283B24j90n10L44O84n40l56J16L77M15q03l13P06K11l2p92o3J084j88m82l43
$$ 224 34 -476 -132 552 12 -344 -228 149 564 -239 -552 154 365 333 -459 -522 562 374 -108 -451
1303d51K40R31n25o90L00L24L99n59n50O80K61j78m89j0O96p9n16j38M85L11n10
$$ -451 -211 720 195 -495 -195 129 528 -31 -581 99 360 182 -307 -317 379 300 -216 -354 131 442 -68
1324f8l57K82O32j94p53J37N31K92m50q30P70N85l90m01n55J101M02j073l0Q3
$$ -68 -425 -143 489 295 -458 -321 210 502 52 -778 -8 577 187 -214 -769 332 734 -339 -369 -286
1344b86O56K74j380L67P04j46R0j007M89R77p92k14q1M19O07r97k41O81J70J3
$$ -286 370 644 -736 -369 335 189 279 -728 -239 738 -54 -268 -349 70 677 -320 -561 120 290 303
1364C03p17j14J015n1p32q0K88N32k3j111L52Q56l83M5o77K94J215j174m9K03
$$ 303 -414 -528 487 436 -296 -376 -88 444 421 -690 -338 518 135 180 -497 -203 1012 -162 -211 -8
1384hk25J121j215k97J324r60N71m17o45J827j295k28P61p89J354j001q24J709
$$ -8 -233 888 -327 -624 700 -260 311 -106 -751 1076 -219 -447 314 -475 879 -122 -946 763
1402G63q58L34k95r49J924o35p47M28n40J340l75j263P85K43L24l89q65O75O02
$$ 763 -95 239 -56 -1005 919 284 -463 -35 -575 765 390 -873 -88 155 479 90 -775 -100 502
1421E02j87p15L6M31L17n8j102P02N27o62N66j049O07Q88j549J069l72m62J491
$$ 502 315 -400 -364 67 384 326 -776 -74 453 -209 357 -692 -85 803 -746 323 -49 -511 980
1440I80j795Q88O00j689J809j189P5J488k421J562J35j110J800k163P53J476k003
$$ 980 -815 73 673 -1016 793 -396 -321 1167 -1254 308 443 -667 1133 -1030 -277 1199 -804
1457h04J359r61k31K103k017L34L28o64J675j315n15J071n23P22n37p35R80r3
$$ -804 555 -406 -637 1466 -551 -217 111 -553 1122 -193 -708 363 -160 562 25 -710 270 177
1475A77l2j54l46L26L01j51l93L30k42K22M51r83O11j03m03J182j186Q7P22j003
$$ 177 145 -9 -355 -29 272 121 -272 58 -184 38 489 -494 117 14 -389 793 -393 -306 416 -587
1495e87J361q72p15J536j211Q86o0j502J930q25j42Q70j791J504Q9j147J336j294
$$ -587 774 -98 -813 723 -488 398 338 -1164 766 -59 -201 669 -1122 382 471 -676 660 -634
1513f34M75J001j516R94m31m41J359j076J28L32p68J139l36p25O63m33N06K62
$$ -634 -159 842 -674 320 -111 -552 807 -269 -141 191 -577 562 226 -499 164 -269 237 499
1531D99j051L88M50k08K66o91j31J126n11l01J07m18J041k00r83P15k31L39K51
$$ 499 -552 -164 286 78 344 -347 -478 648 137 -164 -57 -475 566 366 -617 98 -133 206 457
1550D57j173Q43J84n93O45q13M02N90j086O58L8m32O43p68K86P10r52K47R0n4
$$ 457 -716 127 311 -282 363 -450 -48 542 -544 114 152 -280 363 -405 -119 591 -361 -114 -24 -78
1570g8O68r52j81R84k72m2l85l74J293k79q48L42j63O97J09j405Q24M41k29R1
$$ -78 590 -362 -543 441 169 127 -258 -632 661 382 -466 -124 -287 410 519 -886 -62 379 150 241
1590B41j073P84R36j093J19j95K73R17j322k7P49k91M10r09l0J203p23j40j21
$$ 241 -832 -48 888 -205 -86 -281 -8 909 -413 -440 309 18 428 -481 -511 692 -31 -171 -292
1609b92Q7Q75p62n07P60K00q9n77k43J011Q7q03k56L51P76k88q80P7R18Q2o93
$$ -292 -205 670 -92 -599 161 361 272 -305 -548 463 550 -253 -509 -158 618 330 -550 -473 445 527 -166
1630a66m04L85R28n01r20M44M48L75o44q43J044M05n22k81m75J269J01j212K44
$$ -166 -570 -185 743 242 -678 -234 214 589 -55 -898 146 551 29 -252 -727 542 643 -569 -325
1649c25J60P02j88j225P85O31l19l07o46R23O16j104Mp4P30K66j281K32P71J57
$$ -325 -165 537 349 -876 -91 540 221 -86 -732 191 807 -297 -293 -367 363 629 -652 -420 351 508
1669E08l87r95O93Q27n14m46j95Q84K58q97l05M63P12k91r43K64O97K66p60n43
$$ 508 121 -874 -181 646 132 -314 -509 375 633 -264 -569 -106 606 315 -628 -364 333 599 -161 -704
1689g04P81N17l85o63o0J034lq02j76L84Q07n47q57M90N55J59p30n01Q86L94n64
$$ -704 77 594 209 -454 -514 520 517 -285 -461 -77 730 183 -674 -184 371 530 -200 -701 185 579 15
1710A5n06J33Q59k2r14ON23N84o53o75N69N59j41o64j36P74K90p32l27K50P75
$$ 15 -491 -358 501 479 -435 -429 94 678 25 -650 -81 478 337 -327 -463 311 601 -131 -458 -208 567
1731E67l10o43J74N14J25n23m60N96N00l37o52R3P12M7n31k16L86K99k45n26N3
$$ 567 257 -386 -212 302 427 -96 -556 40 540 203 -449 -356 356 403 -128 -344 42 341 96 -430 -377
1752c77O47J02p03j18O00K27l45m48J86O15j81m31q6M38K54m63k87L12L30l7m83
$$ -377 270 372 -331 -449 151 378 33 -415 -229 386 205 -226 -312 126 380 -83 -370 -58 272 235 -248
1773b48LM17Q2k88k80K54L47j59l82R1L12Q2k96j95K62K58k08k41P7J64J59l02
$$ -248 -245 172 254 -34 -314 -60 287 128 -254 -163 149 231 -65 -260 2 260 52 -189 -112 52 211 -91
1795i1j46L07j9j2j92qL53j96n4L1r5L66k48k37K99j38J68p0j76L54j83r0J78
$$ -91 -237 70 51 39 -153 -161 192 -4 -58 -27 -122 244 -4 -241 58 -80 88 18 -158 196 13 -77 101
1818A01k13J98k9k40L22j25o6J71k39K13Nk30K23j02k1J44k28J54M2k30K14n2
$$ 101 -112 86 57 -183 139 14 -52 119 -120 93 98 -132 91 -11 -32 112 -116 38 80 -150 64 12
1840A2j3P8j69J07J51k79O4J03j4J07k95kL67j53p9r6m8M80k07m02K72K8K11j25
$$ 12 -1 77 -92 15 166 -113 -49 54 40 147 -148 -150 217 64 -15 -111 -159 321 114 -288 -16 12 223 98
1864I8n45N43J94l05l1k44K87M11o37J06Q0M8K94o47R3M98k43P4k37l7O86o32
$$ 98 -447 96 290 -15 -46 -290 -3 408 -229 -123 -43 5 299 -348 -255 243 0 74 -163 -200 486 -146
1886a46j33L78j38L67n13k88R45l36k09o8j72Q67l28p51M72J34L28k91p98P42
$$ -146 -279 99 -39 328 -185 -473 472 136 -73 -141 -313 554 226 -525 -53 81 409 118 -680 62
1906F2M52m55k15l04O27M75q56j88L83L06J43q08o0Q34j08l61k14N2P87l86o75
$$ 62 514 59 -156 -460 167 642 -214 -402 -19 287 430 -378 -438 396 288 -73 -287 -235 552 166 -509
1927e09M61J97Q3j37p02Q95K22o92J3j07O73J69j230L35O25p1O0j015N37J027
$$ -509 -48 149 232 95 -607 288 510 -182 -169 -276 397 566 -664 -329 296 225 285 -730 -193 834
1947H34q21l58l0L01Q98j057m82Q28J42K03p97m37J330j43n51j49j33J040k23
$$ 834 13 -345 -375 -74 824 -233 -715 113 255 458 -339 -776 554 411 -140 -289 -422 618 395
1966C95j047N12K58K17j29r40P88N05o68%k05N07M10r97N0O35q5j1p09K82R22
$$ 395 -652 -140 118 335 206 -734 54 559 -109 -109 -314 193 603 -394 -344 291 206 195 -514 -232 690
1987F90o09m07O9L08O79q46o14Q64K53o9o19l94J114K08q61j67J36P52M3j105
$$ 690 81 -326 -257 51 730 -116 -730 134 387 318 -301 -695 419 627 -234 -401 -265 487 530 -575
2007e75J77P04M6k02p10L15Q85n67l26L5J95N92o97l76P58j17j3k70l15R79l22
$$ -575 -398 306 352 150 -560 -245 640 73 -253 -218 -23 569 -128 -504 254 137 124 -146 -461 518 196
2028A96o38M01p4M60k23q34Q61J89k86j28n06Q45L01q70Q8J7N08J54r66K20N86
$$ 196 -442 -41 -115 345 122 -712 149 338 52 -76 -582 263 564 -306 -218 -201 307 461 -505 -285 301
2049C01m9j10o61J34R79n00k90N5J86N12o08k66K81K90j6l99k10O57Rm85J22P4
$$ 301 252 142 -519 -385 594 94 -196 -141 45 557 -51 -317 -36 254 238 -161 -371 286 295 -190 -68 6
2071FJ43k0n08K51M49l08o9j62J76M83o36r9L43lK31m69j53O47k24q8j10j49O46
$$ 6 149 129 -379 -128 321 13 -56 -218 -42 441 -195 -294 49 46 277 -192 -345 302 78 -10 -120 -269 377
2094C77l03l32K40j9K75k20l31L81N0q7m8j86L36K1k67P3lJ07oj73N2J75q9p4
$$ 377 74 -258 -18 -37 238 18 -313 68 118 31 -17 -203 133 154 -113 -40 -43 64 58 -115 -63 112 23 -51
2118e1K4lJ40j32j17K19j6o3Qj40K35mj98J22o6J02M9k71K34k3p9J29j84J27N2
$$ -51 -27 -30 110 -22 -139 80 64 1 9 -131 104 100 -98 24 -42 60 109 -162 72 49 -30 99 -85 42 94
2143I4k11J71o6QQ8k05J75m1p3R1p8R4k2j14J19k8k8Jn3J24k5r2K4J5J16r3p6
$$ 94 -117 54 -12 -4 84 -121 54 13 -60 31 -47 47 25 -89 30 2 -26 -25 -78 46 21 -71 -47 -32 84 -9 -85
2170h5N2R5Oj49PJ23K8n2j64R7J78j02n5r9J37J58k45j6P8O7P2l05R1J69k1o3
$$ -85 -33 62 68 -81 -74 49 77 25 -139 -42 136 34 -21 -120 17 175 -70 -86 -8 59 131 -174 -83 86 65 2
2196Bj47J36J93k00o8K4J56O3k74j1J90P2q2k21J02K28o4j89q2K18J51j99j78
$$ 2 -145 -9 184 -16 -84 -60 96 159 -115 -126 64 136 54 -167 -65 163 99 -90 -172 46 197 -2 -180
2219a80P0K64m3j20j74L02P8k72q3J38J38Lj96j07L25J2j12j57R9J26j0k63QR9
$$ -180 -110 154 111 -9 -183 119 197 -75 -158 -20 118 121 -75 -182 143 155 43 -114 -15 111 101 -162 -154 -55
2243e5J72j00j55J22J14o4j90Q2J93O3k45j40K06J99k21j69J55K30j37k21K0K96
$$ -55 117 17 -138 -16 98 34 -156 -74 119 182 -63 -203 3 202 -19 -188 -33 197 60 -161 -141 155
2265A55J4k61j58QL69Om03J02K79J35l58p5K10Q0J13l45p8L18Kq2l47L73J60k21
$$ 155 169 -92 -250 -242 127 133 -270 -168 111 246 -112 -187 23 103 216 -129 -207 111 113 31 -316 57 217 -4
2289dm0m5J48J43l04LJ93o0jl03K19J97j78k5J3N0J65l09m8K00Q5N4k87l1K71
$$ -4 -44 -89 59 202 -102 -99 94 34 33 -270 -51 146 -32 -57 -44 6 171 -138 -186 14 99 153 -134 -165 106
2314A06L3k00p7O6K04n1k22M8J70Mr8j66J38J94j67q8O5M8J70k69OJ52o6P9j34
$$ 106 139 -61 -138 -72 132 81 -141 -93 77 81 -17 -183 -45 149 -18 -106 -41 7 177 -92 -86 66 0 79 -55
2339e5q1L20j64q6P5l8J82j46j85K77q3K8k8j72K74l3j73Q4o0J48K1k51J41P1
$$ -55 -136 184 20 -66 9 -29 153 7 -178 99 16 44 16 -156 118 85 -88 -4 -64 84 105 -146 -5 66
2363F6n7J9j27Q5J62j66l0O0l5J60j39j34K35j03K7L2k04K31j2j72J83j62J6J88
$$ 66 9 28 -99 -14 148 -18 -48 12 -23 137 -2 -136 99 -4 23 55 -149 82 70 -102 81 -81 -65 123
2387A23k92K58m8k14L62k78R9L9k60L06M1k65K04k21K09J15m19L18j51MK54l15
$$ 123 -169 89 41 -173 189 -89 10 49 -211 95 136 -129 75 -146 63 178 -241 77 -74 -70 184 -131
2409a31Q3J00j17K12k10l4K04j31O0lj43J44po1J03j08j5J13o8J0M1j38J55Qj67
$$ -131 -48 52 -65 147 -63 -97 107 -24 36 33 -110 34 27 -34 69 -39 -54 59 -9 1 42 -96 59 67 -100
2434a00J32j23R4J46l04J39M9j20K79l11lK82k69J89q6j96M15k64J1J62l28L55
$$ -100 32 -91 3 149 -155 -16 33 -87 192 -119 -122 160 -109 80 -6 -202 213 -51 -40 122 -206 149
2456A49r0k15L12k65J06J45l11K46j44o3K96k93J16P1j89K34q4j33J88j65J34
$$ 149 59 -156 156 -109 -3 142 -169 77 -67 -130 166 -127 -11 60 -129 105 21 -112 76 -89 45
2477D5N7k64J84J5j36J54j58N4J52j14j2j4p9K06n2j19J11r8J04O0k41J68K6o9
$$ 45 102 -162 22 37 -99 55 -103 -49 103 -11 -23 -37 -116 90 38 -81 30 -68 36 96 -145 23 49 -20
2501b0J30j90M9J50j61N1L8j43J82j41PJ60j98J35j1j34J96j61JJ40j88J40J4
$$ -20 110 -80 -31 119 -42 9 47 -96 86 -55 -48 112 -86 49 38 -96 100 -61 -60 80 -108 32 46
2524D6k21L16j57mQ6k24K26j1j79J84q9J5J36k38J33L1j15J50j63L0J50j61J05
$$ 46 -175 141 -16 -20 66 -158 68 57 -122 62 -27 -12 124 -114 19 50 -65 85 -78 -48 102 -59 46
2547D6p0p5K23j30n0Q7r9J44q2r9J35m0J3J2j05R5J9o0J4k6O1N5r1MN8j3k3Jo9
$$ 46 -24 -99 124 -6 -56 31 -68 76 -6 -105 30 -10 3 15 -90 5 24 -36 -22 -48 13 68 -23 -19 39 26 3 4 -65
2576f5J21n1p6Q9l4L5Kp9P0N8j03N5p7R0R3k07N1L6RL9j48L8J35p5lp2L1J71j65
$$ -65 56 5 -71 18 -16 19 21 -58 12 70 -33 22 -55 35 128 -79 -28 8 17 56 -92 -54 81 6 3 -69 -38 133 -32
2605c2k8N7J8Q6j38o6J49j3lq7j9J86n7j09K1J2J08l9j48J06N5lp9q0J31O2r1
$$ -32 -60 -3 15 101 -37 -103 46 33 30 -57 -76 110 53 -56 -35 -23 85 46 -102 4 59 56 -23 -103 28 90 -1
2632ap1J4J27k0j22J0Q1N0p0q8O0J02l4j15lJ14L9r5p6Q3J23o2j12K1R1N7j31
$$ -1 -72 -58 69 49 -73 -63 18 68 -2 -90 -30 72 38 -77 -80 34 73 -22 -98 -15 108 46 -66 -45 46 103 -28
2659b8o6J42L7l8j24lJ79j7j05l1K4J61j22j24J00Q8m5j37K3O8J17j51q5J56k4
$$ -28 -94 48 85 47 -77 -80 99 82 -23 -54 -30 131 9 -115 -15 73 28 -109 -86 -18 99 -52 -137 19 -5
2684eN9j27K6M3J13j26r0R4N1J1q9m5J25M9j14n6N4R7l4j02J5Q5N8r7o9P5R2n9
$$ -5 54 -73 -47 -4 109 -17 -107 -13 38 49 -40 -85 40 89 -25 -81 -27 70 36 -66 -51 34 92 -5 -74 1 93 34
2712C4j01J4R6J4j07j4M1R1o6p4L5P9L0j21pP8N4m4q5K2J02k8p6j8O5N8p1m9O9
$$ 34 -67 -53 43 57 -50 -64 -23 68 2 -72 -37 42 72 -49 -56 22 76 32 -53 -31 71 43 -33 -51 14 72 1 -48 21
2741B1M9j5j05j1J00K6n4o9N7P8l2r2KP1mk6o5M7O3l0m5%L1O1r7j2P1j0K3o9J1
$$ 21 70 55 -50 -61 39 65 11 -58 -1 77 45 -47 -45 26 22 -4 -69 -22 41 11 -34 -34 -3 58 -39 -51 20 10 33 -36 -25
2772b5O9m1Jlj4N7m5l3O3l5N2l2p8R1k0rJ3m4O4k5o2Q2rj6Jl4M0j8mK9l3K8K7
$$ -25 44 3 4 1 -13 44 -1 -34 29 -6 46 14 -64 27 7 -2 11 -33 31 6 -56 26 17 1 2 -32 8 -10 -14 15 -18 10 37
2805C7k9l1N4m4M4j1m9L1J5k7K5l8RO7n1J9j7l6J07p7l6M9m8Q4n8m9Q8m2M0Rj33
$$ 37 8 -23 31 -13 31 20 -29 2 17 -10 15 -23 -14 53 2 21 4 -32 75 -2 -38 11 -37 47 -11 -60 28 -14 26 35 -98
2836i8J21k0l8N5p4O3L1j10P2k3J9K9p1M0N1p8kK8J0N0r2jQ1oj9k8m2J35k8r5
$$ -98 23 3 -35 20 -54 9 40 -70 2 -21 -2 27 -44 -4 47 -31 -33 -5 5 55 -37 -38 43 37 18 -10 -52 83 55 -40
2866d0M1j5O5J6j72J06L4j1Mj36J05Q6j22O8q2M3J11j83K5P4k1N6j02j2J56j09
$$ -40 1 -14 51 67 -105 1 35 24 28 -108 -3 83 -39 29 -53 -10 101 -82 -57 17 -4 52 -50 -62 94 -15
2892a5Rk6JJ38j09o3J06l8M0m3o8J47j0r8qJ5O4j1j05M8Q5j3l2j07N4J31r3q3
$$ -15 -6 -32 -31 107 -2 -65 41 3 43 0 -68 79 69 -29 -37 -22 42 31 -74 -26 59 46 14 -93 -39 92 -1 -84
2920h4M7N1R5j40r9J58Kj6m0r3J94k7j12P0m0J17m6j55J33K7k0J7j28J04J04j59
$$ -84 -37 14 109 -31 -130 28 30 14 -26 -119 75 48 -64 6 -34 83 37 -118 15 42 22 39 -89 15 119 -40
2946d0L2j5O2O4j96M4J06l2J0j21O3J39j33l7K2N1O3j03r2J32QJ1o9p1J47J7j12
$$ -40 -8 -23 39 103 -93 -49 57 25 35 -86 -23 116 -17 -54 -32 19 82 -21 -113 19 27 38 -31 -102 45 62 -50
2973e0K1%R6j8j16L9Q6k7j4n8M6R7j06k9K2J1N7r2k9J16k8j8o3M3O1m3p6N8P1
$$ -50 -29 -29 67 49 -67 -28 58 31 17 -41 5 102 -4 -33 -11 0 57 -35 -64 52 24 6 -57 -14 47 4 -72 -14 57
3002E7ln9m5K8J03o2l4LM3O3j18k4O0L4K0q7n0J47n1rl3oJ26j10l2M4J5J1m0m4
$$ 57 54 -5 -50 -22 81 19 -15 -12 31 94 -24 -48 12 46 66 -21 -71 76 25 16 -17 -23 103 -7 -39 5 20 31 -9 -53
3032e3J16l1k7j8k0P7%q1L1pN4k7p8P1K4k0k7j5P6Qr6J8K2L2On5K6K7j4l8J0K2
$$ -53 63 32 5 -13 -33 44 44 -37 -6 -13 41 14 -64 7 31 11 -16 -31 45 53 -43 -25 -3 29 35 -20 6 33 19 -19 -9 13
3064A3L6j8n5K4L0%j6m3K3N7n2pnnM9n4nM0j1Pn6K1O1o3L6j6j3P5p1mN1k1kj0
$$ 13 49 31 -24 0 30 30 14 -29 -6 51 -1 -8 -13 -18 31 -23 -28 12 1 8 -48 -27 34 -29 7 -9 -22 53 -18 -22 29 8 6 -4
3098dqL9Pl9lqM1j6j2N3m1J8l7QJ6l8K0J0mpJ3k4K6k4NNpK1pmKk5K5J1k2L3j9
$$ -4 -12 27 34 -5 -8 -16 25 9 -3 50 9 27 -10 -2 14 -24 -4 6 2 -5 8 -16 10 -14 -9 -4 -11 10 3 -1 1 -24 1 12 -10 23 4
3135DLlj1jlK2Pm3L1rLKLKJ2k8J4J0j8k3KO1l1k1K2j4PJ0j5J3j7J1k1JK5qj5L
$$ 4 7 4 -7 -8 -11 11 18 -25 6 -3 0 2 5 7 19 -9 5 15 -3 -26 -24 37 6 -15 7 -7 0 10 -5 8 -9 2 -19 -18 7 -1 -16 -13
3173a3L5k9J9j0K5j6j6K0l0M1j4k3J0K3Ol5l0N0J2l5kK0nOj5%LK2l0NQk9K2Kl6
$$ -13 22 -7 12 2 27 11 -5 15 -15 26 12 -11 -1 22 28 -7 -37 13 25 -10 -12 8 3 9 -6 -6 -3 19 -11 -6 2 -27 -5 -3 -39
3208c9M0J0j3j5M1J0o5J2J9j5J8j7J8Rp4j8O0l9P0n6R7r6q1J56l6m8K2M0k5M6
$$ -39 1 11 -2 -17 24 34 -31 -19 0 -15 3 -14 4 13 -61 -79 -19 -58 12 -44 53 -43 -124 32 -4 -52 -30 10 -15 31
3238C1o8O1Kqj6J3qj2j6MJ7krJ1J1j9%J3mJ0j4j3L2k6L0k8lJ2J5j5j2K4j8K3k6
$$ 31 -37 24 26 18 2 15 7 -5 -21 -17 0 -2 -11 0 11 -8 -8 5 1 11 -3 -16 16 -10 20 -8 -11 1 16 1 -11 13 -5 18 -8
3273hj9K6pknL6l4QN5jl1O1m0n8JLj6K8oK0jl%j0K0Ql9OJ3J3ol1K0K2j9j4J2R
$$ -8 -27 -1 -8 -10 -15 21 -13 -5 50 49 18 79 39 -19 -18 -15 -31 -3 -9 11 10 7 7 -3 17 25 -14 -8 5 18 12 -19 1 23 4 -10 2 11
3311A1j1k1J8J5pMlk4J4Mk5K5j1K8Kl3KoJ5Pl7L5lPK0rrp%J5klrj3J1RkJ6j2k
$$ 11 0 -21 -3 12 5 9 6 -18 -4 0 -25 0 -11 17 19 -14 -12 -18 -3 4 -33 2 -1 6 26 17 8 1 1 16 14 11 2 -11 0 9 7 23 11 9
3351Ipqj5J5Kj2K2j2J6Kj2J0j1jJ3k4LL3l6M0k7j1K8qj4L0j7Nmj5lK7j0%oNPl3
$$ 9 2 -6 -21 -6 -4 -16 6 -6 10 12 0 10 -1 -2 11 -13 -10 23 -13 27 0 -11 17 9 -5 25 8 13 9 -6 -9 18 8 8 2 7 14 -19
3389a9L1mJ5k2J3k0OrJ1Qj7NjJ7pk2K4k1J5jnjj0OK2j3RJ7k2%J1kj1J5j0K1k8
$$ -19 12 8 23 1 14 -6 0 -9 2 10 -7 -2 -3 14 7 -15 9 -12 3 2 -3 -4 -14 -8 14 1 10 27 5 5 16 14 3 18 8 29 1
3426Aj1K9kk7J7J0rJ2qkJ2j1qj6K2J3k1nk4K7jJ9j9KNmJ2j7PJ3Rj0lQk5K1J3j5
$$ 1 -10 19 17 -10 7 17 8 20 12 10 22 11 3 -13 9 22 1 -4 -28 -1 -2 17 -2 0 5 1 13 -4 3 16 25 15 12 20 -5 16 29 14
3464A4nJ3k7K2k0j6K0j9J7j5J5Pj3pJ1j1L0k4Nj1QllJ3Kj3J5nJ2j1J3K1l4QRj2
$$ 14 9 22 -5 17 -3 -19 1 -18 -1 -16 -1 6 -7 -14 -3 -14 16 -8 -3 -14 -6 -9 -12 1 3 -10 5 0 12 1 14 35 1 9 18 6
3500F%%j0K4j8K2j8k1NJ1o%M0mr0J09k8n9L0j6RML3k4k2J6nQJ8l3J5OMoj1L6k1
$$ 6 6 6 -4 20 2 24 6 -15 -10 1 -5 -5 35 31 -59 50 22 -37 -7 -23 -14 -10 23 -1 -23 -7 -12 -4 14 -19 -4 2 6 0 -11 25 4
3537Dj6K0j4J0NKNj8OJ0k4j0K1J1nmLol2J0K9j7nq%K1Qk6J6j5J7j2qL4j6J6j9
$$ 4 -12 8 -6 4 9 11 16 -2 4 14 -10 -20 1 12 7 3 6 0 -32 -22 7 -10 -15 -23 -23 -2 6 -20 -4 -19 -2 -14 -22 12 -4 12 -7
3574gj2J2K9Ok8kJ1K1nk9J7j3O%rJ5oj0ONLlRmpJj2KJ5Mm8LJ6L9k1m2L7KJ3ro
$$ -7 -19 -7 22 28 0 -2 9 30 25 -4 13 0 6 6 -3 12 6 -4 2 7 10 7 16 12 5 6 -6 -4 11 15 -33 -30 -14 25 4 -38 -1 1 14 5 -1
3615aK2k5j7K8k2J4J7ol1M1Kk7nKJ7Rl0%J7Rl9Pj1J2K9%j1kJ3l0PlJ2J5k6j2L5
$$ -1 21 -4 -21 7 -15 -1 16 10 -21 20 22 -5 -10 -8 9 18 -12 -12 5 14 -25 -18 -29 -17 12 12 1 -1 12 -18 -11 -14 -2 13 -13 -25 10
3652A0Jj2joKJ3nj3NL7k6lLJ4kj0j8J9Klj9LK6l3JJ3rNRj4K1Kj5rNJ4qJj4%J6
$$ 10 11 -1 -2 -8 -6 7 2 -11 -6 31 5 2 5 19 17 7 -11 8 10 7 -12 -9 17 -16 -15 -2 -11 -6 3 -11 10 12 -3 -12 -7 7 -1 0 -14 -14 2
3693Bj7J0J0J8rk2j1NJL4l5rK0L2l1j9NJ9JplnK7l2nQK9k6j7J9j2J1JoK5j1Ll0
$$ 2 -15 -5 5 23 14 -8 -19 -14 -13 21 -14 -23 -3 29 -2 -21 -16 3 4 -3 -6 -11 16 -16 -21 -13 16 -10 -27 -8 -20 -9 -8 -14 11 0 3 -27
3731b7L1j0j3J7j3L2qNrk0M8j6j8K1pNj5jLQk8M4k7J5j0j5J3mmkJ7qnj8J3lJ2
$$ -27 4 -6 -19 -2 -15 17 9 14 5 -15 33 17 -1 20 13 18 3 2 5 13 -15 29 2 17 7 -8 5 1 -3 -5 12 4 -1 -19 -6 -9 3
3768CqJ1lj2JJ8QorNL6k9kKmJ1Opk4K7j8Qj8mL2m2Rj0RL1j5l5J0K5k4Mj8M3Jk0
$$ 3 -5 6 3 -9 -8 10 18 12 3 8 44 15 13 15 11 22 28 21 -3 24 6 14 -4 -8 24 -18 -9 -19 -10 21 6 -29 -19 6 -18 -14 -32 11 12 -8
3808hLkM0k2m0MN0qj7oJ2M5k9m7L3RJ1k6l0M9K0l6j1j6N3j6l3mL9Pk8n3L4P3m6
$$ -8 -5 -7 33 11 -29 -25 25 17 0 -6 6 51 22 -25 8 17 28 2 -28 21 41 5 -6 -22 31 15 -18 -22 17 24 -4 -57 -23 50 4
3843Dql1L5N2o2k1K0K5Rl9j8P1J8p0j3L4L4k5m3QN8j4j7k4L0M0n6j1QK4K1q2Q
$$ 4 -4 -35 0 52 -10 -31 -11 14 23 -16 -34 37 55 -15 -28 6 40 15 -28 -20 38 24 7 -17 13 53 -3 -14 -6 18 39 -43 -35
3876c5N7Qrm9J2N3k0m6jK6N9l7o9N2K7J1l3m9O1L8n0k6J0N5rp4J1O8Pn2k0L1N6
$$ -35 22 30 21 -28 -16 37 17 -29 -30 -4 55 18 -51 1 28 39 6 -43 18 56 6 -20 -10 45 36 -38 -27 41 48 -4 -24 7 63
3909F3p0k6K3L7K3q6j9O5L8m2k2j7O5J9q6j9L3M6k4n0J5N1Nm9j7N0L7m4k3J8L7
$$ 63 -7 -33 -10 27 50 -36 -55 10 48 6 -16 -33 32 51 -35 -54 -21 25 1 -49 -34 17 22 -27 -44 6 43 -1 -24 -6 31
3940C1J1p4kO1K5m5l8K3N2k8k4JL6km9j1L3L2k4l1QL7kn1KL2K9j8m2ON3rl4l0
$$ 31 42 -32 -34 27 52 7 -31 -8 44 16 -8 -7 29 27 -22 -33 0 32 8 -23 -15 22 20 -31 -29 3 32 14 -28 -22 31 22 -12 -42
3974d2L7M4o1oJ5K4Pm0L2L3rk8k9oN4%m9oJ9K1j7l6P0K5k9p8KP8L9m1O0j48O6
$$ -42 -5 39 -22 -28 -13 11 18 -22 10 43 34 6 -23 -29 25 25 -24 -30 -11 10 -7 -43 27 52 23 -55 -53 25 64 23 83 -65 1
4007Alm4k2L1L5j6Mj7J7J6K4m5J8O8o6j0nN5l7j8J7j6M6n8K1J1kJk8K0J4qOl7
$$ 1 -2 -46 -68 -37 -2 -18 -14 -31 -14 2 26 -19 -1 67 1 -9 -14 41 4 -14 3 -13 33 -25 -4 7 5 6 -22 -2 12 4 10 -27
4041b7K9J7k8JKJJ0Pnq%j2oK3lKj5j6L7LKl3L0j1j0L0j0KlnJ8j8KQj7j5Qk0K9
$$ -27 2 19 -9 -8 -6 -5 5 12 7 -1 -1 -13 -19 4 1 3 -12 -28 9 12 14 -19 11 0 -10 20 10 12 9 4 22 4 6 14 -3 -18 -10 -30 -1
4080aK7l4kOK%MLj8K5pk0K5QPj3k4QJ6j1j4K4L5n2j0K3LNj6k2K5J2pl5K5J3Pj7
$$ -1 26 -8 -10 -4 -2 -2 2 5 -13 12 5 -15 10 18 25 12 -12 -4 12 1 -13 11 46 -6 -16 7 10 15 -1 -23 2 14 7 -28 -3 10 17 0
4118@nJ8Nj5l7L3kJ6m5JM5ol5RK3K5k4l5J4L7K3k6k6J6K7j4m6NM3j3k6LL5J9j4
$$ 0 -5 13 18 3 -34 -1 -3 13 -32 -31 14 8 -27 -18 5 30 6 -29 -15 22 45 19 -7 9 36 22 -24 -19 24 11 -15 -12 23 42 28
4153B8n7J5L9K8n3m1N3K1k2m5MN4jn0j7O4J1l4j4j4N9k6l0QN6Om0l4K5O0k2m8
$$ 28 -29 -14 25 53 0 -41 12 33 11 -34 -30 24 23 -27 -44 20 31 -3 -17 -31 28 2 -28 -20 36 42 2 -32 -7 53 31 -17
4185a7KN9j6l9k0M8J9j8l5NK6Km2j4M5M1j8o2K4M2l9k2j6N4J7l8l4LP0Pn9j1L8
$$ -17 -15 44 28 -11 -31 17 36 18 -17 -12 14 16 -26 -40 5 46 28 -34 -10 32 -7 -29 -45 9 26 -12 -46 -43 27 34 -25 -36 2
4218BL2po9K6O9m7k4j1L3L8m4l0L1K3nk7j9N5Jn4LQM1l0j9j1O7j8m4l3N4L6j4
$$ 2 34 27 -42 -16 53 6 -18 -29 4 42 -2 -32 -1 22 17 -10 -29 26 27 -27 -24 -16 25 -5 -24 -35 32 14 -30 -63 -9 27 13
4251A3j2j7K4J9n1PRM3j9n6K4N1pm0mM3K9m4n3L3K8j3nk0N1l4Lk1J2K0%m6mM3
$$ 13 1 -16 8 27 -24 -17 -8 35 16 -40 -16 35 28 -12 -16 27 56 12 -41 -8 20 7 2 -18 33 -1 2 -19 -7 13 13 -33 -37 6
4285FJ3k5k2K3K4j5rk6L6M6m7l4J9M2rj6m1M1K5n5K6k5N1ro7L8L0qj2j3PK8l3
$$ 6 19 -6 -28 -5 19 4 -5 -31 5 51 4 -30 -11 31 22 6 -35 6 31 -24 2 -23 28 19 -48 -10 20 12 0 -13 -6 22 -11
4318a1JrM7j8k9MJ6kj2jKN1p7J5J2QL2k7k6M5k6K0rk5K4Rj5%rL3On2J3M1m5M1
$$ -11 -10 -19 28 10 -19 -15 1 -1 -13 -14 -12 39 -38 -23 -11 -3 29 2 -24 21 -5 15 6 -19 5 14 -1 -1 -10 23 29 -23 -10 31 -14 27
4354B7k5k0O3n6J6MpJ0k1pJ6j4RlkJ7q%KJ9Mk5j4J5j6nL1oJ2Rk2J2joJkJJ8j6
$$ 27 2 -18 45 -11 5 9 2 12 -9 -16 0 -14 -5 -8 -10 7 -1 -1 1 20 24 -1 -15 0 -16 -21 10 4 16 25 3 15 14 8 9 7 8 26 10
4393A0j6J7j0Rm2K6L5l4PJ7j9j5jJ8J4k4K4j1j9M4l3qK1J4jl9j6K9J0J0j0nPJ5
$$ 10 -6 11 1 10 -32 -6 29 -5 2 19 0 -15 -16 2 16 -8 16 5 -14 30 -3 -11 10 24 23 -16 -32 -3 7 17 7 2 9 24
4427B4l5K6k5J7j6j0J1L5k7Pkj5M6o4o4J04j6K0k4j1K3L9j09R5p6Q1p4l6o6J12
$$ 24 -11 15 -10 7 -9 -19 -8 27 0 7 5 -10 36 -28 -92 12 -4 16 -8 -19 4 43 -66 29 -47 34 -40 -76 -142 -30
4457c0jj31K78j52J70k6j37M8k4M8r1N9J5j4jl0RL0Om5pL0J3k7oL3%k9nmj6L2
$$ -30 -31 -162 116 -36 134 108 -29 19 -5 43 -48 11 26 12 11 -19 -10 20 26 -19 -26 4 17 -10 -16 17 17 -12 -17 -21 -37 -5
4489ekqJ6OJ5m8K1K0k3lNK3J7j7k6J9J0j0l8KK5K2j3%l2M0Ml9LJ6J0l8l0K5K6
$$ -5 -7 -15 1 7 22 -26 -5 15 -8 -11 -6 17 34 17 -9 10 20 10 -28 -26 -1 21 8 8 -24 16 20 -19 -16 0 10 -28 -58 -33 -7
4524glrj1J3L9o7K1J4J2Jl3ML1J1j5k9K3K1J7l5j2K6J3j0l8J2L2Jj8j5L4j3l2
$$ -7 -10 -19 -30 -17 22 -45 -24 -10 2 3 -30 -26 5 16 1 -28 -5 16 33 -2 -14 12 25 15 -23 -11 21 22 4 -11 23 10 -22
4557b2QK4kjl6K0K2pPk5ML9k4l1K1nJ3Ml1PM7j6m0J4L0J3m5J7MJ4ok1%ROj3k9
$$ -22 -14 10 8 7 -29 -9 13 6 13 -12 -8 31 7 -24 -3 -8 5 9 -22 -15 32 16 -24 -10 20 33 -12 5 9 23 17 -4 -4 5 11 -2 -31
4594c1K5J8jj7J2lj3Jj4K7j1j2lJ4PNj9nRL7j9k1K5jmlk1J9M5l0l4L8J0k8k6J3
$$ -31 -6 12 11 -6 6 3 -10 -9 -23 4 -7 -19 -22 -8 -1 4 -15 -20 -11 26 7 -14 11 10 6 3 -18 1 46 16 -18 20 30 2 -24 -11
4630a1M5om6J7QJ1k0L7j9j6Nk2j5mL8L4r6M6Ok4K1kL9Q8j19RK2l9M3m9M0j8N2
$$ -11 34 28 -18 -1 7 18 -2 35 16 0 5 -17 -32 -36 2 36 -60 -14 -8 -32 -11 -13 26 114 -5 4 26 -13 30 -19 21 3 55
4663E5j08p2K39j19o2N7P5pj08M4J0n2k1K7kN5j07R3r3Q5J00r1n2j9M1KN6n0J13
$$ 55 -53 -125 114 -5 -67 -10 65 58 -50 -6 4 -48 -69 -42 -44 11 -96 -3 -96 -11 89 -2 -54 -73 -32 -30 26 -24 89
4692H9q1J7N8p7LJ2j9P2j17L9J1K6mk9j29R7M6N1q1O4j21N3j0koK6M4l6nK4r0
$$ 89 8 25 83 6 9 21 2 74 -43 -4 7 33 29 0 -129 -32 14 65 -16 48 -73 -20 -30 -32 -38 -12 32 -4 -9 15 -75
4723g5N8k6N8jj8jJ7n5J4l9L4j4R1l8o0R0M9o3n9M5qM3m2k6J4P5l1o1L6jol0J1
$$ -75 -17 -43 15 14 -4 -5 12 -43 -29 -68 -34 -48 43 5 -55 35 84 21 -38 7 -1 42 0 -26 -12 63 32 -29 7 6 0 -30 -19
4756a9J9OK8n6J4Oml1O6m1OpRM7k7j8pj1O3n0Lm5K3P9m6k7m6R1o3Q3mm8P4m4k5
$$ -19 0 6 34 -22 -8 -2 -6 -37 29 -12 -6 -13 -4 43 16 -2 -9 -20 43 -7 -4 -49 -26 53 7 -20 -66 25 -38 45 41 -7 67 23 -2
4791bJ6l3L0j9j2M8l7K1lo2P8l9K5pkK1nm0PJ7j7J8j6MM3m9K9k1k3M5pj4oPJ4
$$ -2 14 -19 11 -8 -20 28 -9 12 9 -53 25 -14 11 4 2 23 18 -22 -15 2 -15 3 -13 -9 34 -15 14 -7 -30 15 8 -6 -12 -5 9
4826Ik7J8Mj4K1j8k0L4Ok1PRqJ5k4J9oJ5l0ML3%k5j1RJ1J6l6kM2o3O0m3J0J1R
$$ 9 -18 0 4 -10 11 -7 -27 7 13 -8 -1 8 0 15 -9 10 4 19 -11 -7 26 26 1 -10 -1 10 26 -10 -12 30 -33 27 -16 -6 5 14
4862A4j3L5Jp0K6j7K5O7Lo2nK1n8J1M6K3l6L3n9J14r8J1%l0R7j15jK6jJ7J7p6
$$ 14 1 36 37 -33 -7 -24 1 68 71 9 4 25 -33 -22 24 47 11 44 -15 99 1 12 12 -18 79 -36 -37 -11 -12 5 22 -54
4894e4L7K2k5j28J49K3m1j6O0j4r6Q5m5N9k01K54k6J3k6o4P8n3rK4Njj9RQk6j
$$ -54 -17 5 -20 -148 1 24 -17 -33 27 13 -83 2 -43 16 -185 69 43 56 30 -34 44 -9 -18 6 11 10 -9 0 8 -18 -19
4925a9NMK0l4pM2j9%K8j4rJ5k9K5j6K7lj2kK5j3J1m0M0Kn0L1lnK9l3mJ1k5J8J2
$$ -19 -14 -10 10 -24 -31 11 -8 -8 20 6 -3 12 -17 8 -8 19 16 4 2 27 14 25 -15 25 27 -23 8 5 0 29 -4 -8 3 -22 -4 8
4961Hj9NMJ3olMrnoQPj7%K2kPojJj5J9jKk2J6rJ2NMk2K9k7J4Pl3LJ7Lmj3RNl0
$$ 8 -11 -6 -2 11 5 2 6 -3 -8 -14 -6 1 -16 -16 6 4 11 5 4 5 -10 9 8 10 -12 4 -5 7 12 16 -6 23 -4 10 17 -16 -13 4 7 3 -10 -1 4 -26
5005b6J8j3L3%j4prlM4l8K6kl2L0pJ5JrJkJ2k2KnJ8OmQkKl1J1%J4Kl3K0j0Pnj0
$$ -26 -8 -21 12 12 -2 -9 -18 -21 23 -15 11 9 -23 7 0 15 16 7 8 6 18 -4 -2 -7 11 17 13 21 19 21 -10 1 1 15 17 -16 4 -6 1 -4 -14
5046a4pL2k2kkJL1j9K1k2LknJ0rj1L8Ml7J0mJ2j9L1rj5J2%pJ0k2JQJ4k3LNK0l4
$$ -14 -21 11 -11 -13 -15 -14 17 -2 19 -3 0 -2 -7 3 -6 -17 21 25 -12 -2 -6 6 -13 18 9 -6 6 6 -1 9 -13 -12 -4 10 -13 -10 -5 15 -19
5085a9QLRlK4l4OM2m2prM0Jl5KRK6Nk4NJ8j5k8J7oK6pQk4PK0j3j8J4llrk1K2r
$$ -19 -11 -8 1 -2 22 -12 -6 36 -6 -13 -22 18 19 -16 -14 -5 21 26 2 7 25 10 -18 -1 -7 19 12 20 -4 3 23 10 -8 6 3 0 -9 -30 -8 -17
5125a7PKoK0qj2K9mKj8k7K2J4mkk5L8Ql4L9j7M5m8l9J3M7l7J1%N6p7k3L8J5J9
$$ -17 -10 -8 -14 6 -2 -14 15 11 13 -5 -32 -10 4 0 -2 -27 11 19 -15 24 7 52 4 -35 -22 25 -12 -1 -1 55 -22 -45 -7 8 27
5160B7rm2k7P0J2Lk8o8P2j9O7j15O1qL3Kn2P0p0q6J65n9M3j5mJ2j9O5q8J3J02
$$ 27 18 -24 -51 19 31 34 6 -62 10 -9 58 -57 4 -4 29 31 -21 49 -21 -107 58 -1 42 27 23 35 16 81 -7 6 108
5191A08j15j0K0K6j2L9q4pM9L2m5l0L1L2j05K6j5O8MrO6%k9m5J1m5j01P3Q8o6
$$ 108 -7 -17 3 29 17 56 -28 -35 14 46 1 -29 2 34 -71 -45 -60 8 12 3 69 69 40 -5 6 -39 -140 -67 21 -45
5221d5K6O6n0Ok5M2M2l2K1mm2k2NJ7M1j3n5JM6j7j6k3L3K6l1j8K5qPj9LJ6K0j0
$$ -45 -19 47 -3 3 -22 20 62 30 51 47 5 -17 -12 5 46 33 -22 -21 25 8 -8 -31 2 28 -3 -21 4 -4 3 -16 -13 3 23 13
5255A3k9QJ7j2k0K7lK4k7k5L8K5k9Nj7J8J6k2%KL5k4k9qK7j3j3J4oJ6J0l9J6j3
$$ 13 -16 -8 9 -3 -23 4 1 25 -2 -27 11 36 7 12 -5 13 29 7 7 9 44 20 -9 -17 10 -3 -16 -2 -8 8 18 -21 -5 -18
5289a8L2j0j5K5Kqjj2L7k6n5N6j9J6Lk0K3L2m4KqK5K3l3mnj5M2l3KK4j7mj3QK3
$$ -18 14 4 -11 14 16 8 7 -5 32 6 -49 7 -12 4 7 -13 10 42 -2 0 -8 17 40 7 3 -2 -17 25 -8 -6 18 1 -3 -16 -8 15
5325A5l0jK4pjLk3K1J4l1J4J6j3K1l1J2NJMk5J2jJRj8J7Ml7J5J0j5K7J8m7K7k2
$$ 15 -15 -16 8 1 0 3 -20 1 15 -16 -2 14 1 22 -9 3 8 9 13 -12 0 -1 0 9 -9 8 12 -25 -10 0 -15 12 30 -17 10 -12
5361a2J0Llj5Q%L3m7pN4j7j6qK1Joj4K5mK1l2OL2k7Lj6K4mJ1k6nQPk5jK3L9l7
$$ -12 -2 1 -2 -17 -9 -9 24 -23 -30 24 7 -9 -17 4 5 -1 -15 10 6 27 -5 1 33 6 9 -7 17 13 24 -2 -7 1 8 -17 -18 5 44 7
5399Gqk4L8K6l4j9K2K5l4j2k3O0qJl0rL0rj8J4K8jj2m1M3K3l5j8NK8Qm0lL2Nr
$$ 7 -1 -25 13 39 5 -14 8 33 -1 -13 -36 24 16 17 -13 -22 8 -1 -19 -5 23 22 10 -31 12 35 0 -18 -13 15 23 -17 -20 12 17 8
5435Hm2L5KK2l0pK1K9k6o3M2K0J6n6KM5J6n3JJ2L5ln3PM3Ok8n5O1N0l8l3NN6L
$$ 8 -34 1 3 25 -5 -12 9 38 12 -51 -9 11 27 -29 -27 18 34 -19 -18 -6 29 26 -27 -20 23 29 1 -54 7 57 19 -14 -9 47 50
5470E0m8j1MM8j5o2L3K7K9r2%N0K8l7m3J8L5J4l5n7Q9K8n1n0K7O0Jp2%O6J8n3
$$ 50 2 -9 -5 43 28 -34 -1 26 55 -37 -37 13 41 4 -39 -21 14 28 -7 -64 25 53 2 -48 -21 39 40 -32 -32 34 52 -1
5502ak5J4N7j9n2J6M2J2m1l6L2M8m4k2k9Q2K7q9j2M7L7m4m0J0P0Jn6k3M7J4k1
$$ -1 -26 -12 45 26 -26 -10 32 44 3 -33 -1 47 3 -19 -48 34 61 -28 -40 7 44 0 -40 -30 40 41 -15 -38 9 23 2
5533Bk4J6L7Mm6JL7L8n4n8M3O0k7m4k8M7O3o0k1J5L3j1l3j6M3M8o4n0O5K7m3k5
$$ 2 -22 -6 31 35 -11 -10 27 65 11 -47 -4 56 29 -15 -43 4 67 7 -14 1 34 23 -10 -26 17 65 1 -49 16 43 0 -25
5565b5pP4j0m4k7L9K8qo5lP1J2l0m1L1J8Ll5NL5J3o0J0K1N3o9k4N2J4pk2k4K1
$$ -25 -32 42 32 -12 -39 0 28 20 -45 -48 23 35 5 -36 -5 13 16 -19 -14 21 34 -26 -16 5 58 -11 -35 17 31 24 2 -22 -1
5598aL3m4k4L9L3j7o3J4M8Nj4l1J2M4k8l5LK6K8n2j2L8K3j4l0K3K7l5JpK8J4l0
$$ -1 32 -12 -36 3 36 19 -44 -30 18 23 9 -22 -10 34 6 -29 -26 0 28 -24 -36 2 25 11 -19 4 31 -4 -3 -10 18 32 2
5631BrNK8k9j4pM3Jk5j2K6J0k0j3j3M1Mk4KL1ppk6J8j3J8j4LJ5j1MrJ3Qj2k0J6
$$ 2 -7 -2 26 -3 -17 -24 19 20 -5 -17 9 19 -1 -14 -27 14 18 -6 -4 27 20 13 -13 5 -8 10 -4 -1 14 3 7 -2 11 19 7 -13 3
5668CppL7mk5J3nJ2j6OlJ0j0J9m0jK1j2Rk4J1J3lnlj0M1k1pMJ2j4J1j2K8oj3J6
$$ 3 -4 -11 26 22 -3 10 5 17 1 7 4 14 4 23 -17 -18 3 -9 0 -24 -13 0 -3 -8 -11 -21 20 -1 -8 -4 8 -6 5 -7 21 15 2 18
5706A8j1lJ6n2J8M0m9L2l5K5J3j7%OJ4k0j1oJ5PRk3j6M8Kl5M0M8n1m8r1J06P6
$$ 18 7 4 20 -32 -14 26 -23 9 -26 -1 12 -5 -5 1 15 -5 -16 -22 -7 0 9 -14 -30 18 20 -15 25 73 22 -26 -117 -11 65
5739F5m3l1mM3J4n2LlN1k5m4L2L1km7mM8Lm4l3M4OK1l7k8M4L5l2m8L2M4j0o6J6
$$ 65 22 -9 -13 30 44 -8 -5 -8 43 18 -26 6 37 35 -12 -16 32 35 -9 -42 2 8 29 -8 -36 8 43 11 -37 -5 39 29 -37 -21
5773b1M5J2n5l8O0M2j0o3QL2L3l8m1L8K9k4k5k4R1on0j7PM4k1o4L3N9j6l5m1P7
$$ -21 24 36 -19 -57 3 45 35 -28 -20 12 45 7 -34 4 33 9 -16 -40 51 45 -5 -22 -15 29 8 -56 -23 36 20 -15 -56 21
5805B1K8m6l5J5K2K4o0rO3J1k8l4RO8l2k3k7M9M0n5m0M3K2mm4mN6K5o9k3N6J9
$$ 21 49 3 -32 -17 5 29 -31 -40 23 34 6 -28 -19 49 17 -6 -33 16 56 1 -39 4 26 22 -22 -26 30 55 -14 -37 19 38
5837C8k8m7J7J8J1l7k0O6K7m0m5J8N7ko5qN2K3k4n6L2O0l2m8K9J8K4m3l8N9J8
$$ 38 10 -37 -20 -2 9 -28 -48 18 45 5 -40 -22 35 33 -32 -40 12 35 11 -45 -13 47 15 -33 -4 14 38 -5 -43 16 34
5868C4l2k4J7L8J2m8l2M2K1J3o9J7M3Po9pQN8l0l2lO2j1m2kK8K3k9j1J9M1k6k4
$$ 34 2 -22 -5 33 45 -3 -35 7 28 41 -28 -11 32 39 -30 -37 -29 29 -1 -33 -36 26 15 -27 -29 -1 22 -7 -18 1 42 16 -8
5901hk2L6L1k6m4L5M2k2l5j7N1J0m3lK8Mml3OM1nk3k9J5L6ll5MM1%l4j1PL2j2
$$ -8 -30 6 37 11 -33 2 44 22 -13 -30 21 31 -12 -15 13 17 13 -20 -14 27 22 -1 -30 -15 21 18 -17 -13 28 28 -6 -17 -10 22 10
5936A0k5MK8Ol7J2J3Nj3l7L1J7ok6%K6rKjJ5Nj0jPj5k6J0OJ0Pk0mrM0j3k6J8P
$$ 10 -15 -11 17 23 -14 -2 11 16 3 -34 -3 14 8 -18 -18 8 -1 1 0 15 20 10 9 16 1 -25 -15 -9 1 8 -12 -16 -25 15 2 -24 -6 1
5974Aj5J0pQJ6k5NJK1k0kQjOK1l7kL6j7j8J4L1pk6J1Rj5qPoMnjPjmJ2poRj4oK0
$$ 1 -14 -4 -11 -3 13 -12 -7 -6 15 -5 -7 1 0 6 27 -10 -12 24 7 -11 3 34 27 1 12 21 6 -2 5 -1 3 -2 -3 4 3 -1 11 4 -2 7 -7 -13 7
6017Gj2NrJ1Qj4qj2O1k4k3J8NPk0rj2J0K1pk8L3ornrJ7J3pj5J5%qqOK5m0J6j8
$$ 7 -5 0 -9 2 10 -4 -12 -24 37 13 -10 8 13 20 0 -9 -21 -11 10 3 -25 8 2 -7 -12 -21 -4 9 2 -13 2 2 -6 -14 -8 17 -23 -7 -25
6056b5N7j0mk6J1QJj3K2JJ1m2mM3k4K0l9JK6nk7nL4J4j4j3k8N7Lm6QJ1J9k5k7
$$ -25 32 22 18 -8 3 11 12 -1 21 22 33 -9 -13 30 6 26 -13 -12 14 9 -18 -23 11 25 11 -2 -30 27 30 -16 -8 3 22 -3 -30
6091c0kL3Om0K0K6kk6j9J0K2j7OQnkj9N4l3L8kp3M7L2Oo7pJ4J8L2o8o5J27o1O6
$$ -30 -32 1 7 -33 -13 13 11 -15 -34 -24 -2 -19 -13 -5 -10 -12 -31 23 -10 28 26 -47 0 32 38 -29 -36 -22 -4 28 -40 -105 22 -39 27
6126B7r7K6J10l5j22R1O5j00N4k3O1l5o5rl0R5oq5J10p6Q3j5K6n3q0K14o9j35
$$ 27 -70 -44 66 31 -91 0 65 -35 19 -4 57 22 -43 -52 -82 13 7 -78 32 -44 39 24 50 -3 -83 131 62 -73
6154g3N3Q0l5p0N1r7J81j00m6M4J4l2K5llmj1RK4pqj0K1Mj4l0N0%j3NjoK3j3%
$$ -73 -20 60 25 -45 6 -91 90 -10 -56 -12 2 -30 -5 -8 -11 -15 -26 -17 7 0 -8 -18 3 7 -7 -37 13 13 0 5 4 -2 21 8 8
6189HKOk4MJK2rj8j4K9Mj1lpL0Kl5j1RJ5%%l3M6j6j2J9lOPk1J0J4k5J2LPj4qP
$$ 8 10 16 -8 -4 -3 19 10 -8 -22 7 11 0 -3 -10 20 22 -13 -24 -15 0 0 0 -33 13 -3 -15 4 1 7 14 -7 3 17 -8 4 7 14 0 -8 -1
6229aK9j3j8K0kqMk6OJ3Oj9OLkPPk4K1k3J5Rk2L3l4mJ8JMKj5J2K7k2j9jK8J1j9
$$ -1 28 15 -3 17 15 7 11 -15 -9 4 10 -9 -3 0 -2 5 12 -12 9 -14 1 10 -12 21 -13 -17 1 2 6 8 -7 5 32 10 -9 -10 18 29 10
6268A0mJ6jl2JQL1l5J0pQJ7m0L3k1J3J1rj5P%j8K8LKk1jPJ1qj9MOm%Rj4K9k0N
$$ 10 6 22 21 -11 -10 -2 29 -6 4 -3 5 22 -18 15 -6 7 18 9 -6 1 1 -17 11 14 16 -5 -6 1 12 4 -15 -11 -5 -9 -9 0 -14 15 -5 0
6308@RJ3k2qK2q%jj9jK3j8MNJ9k8Oj2P%j2J7k4K5L1Jl1mL1l9K1j8J2Nj1OLj9K1
$$ 0 9 22 0 -8 14 6 6 5 -14 -15 8 -10 -6 -1 18 -10 -4 -16 -9 -9 -21 -4 -28 -3 28 29 -2 -6 25 -14 7 -11 1 6 -5 1 4 -15 6
6347Fj3J4rj0jL8qj4rjJ5%j8J3l1J7QKj1QMk4K2Kj0lMKJPj1J2JLj4J5kJ2rjnq
$$ 6 -7 7 -2 -12 -13 25 17 3 -6 -7 8 8 -10 3 -28 -11 -3 -1 -12 -4 0 -24 -2 0 -10 -13 -9 -7 -6 1 -10 2 3 6 -8 7 5 17 8 7 2 -6
6389fJ0j4OMMKJ9j6l1L2j3K2l4j6P0m6J4j3J6nj5K0rJJ3l4K3j3nP%J7Npj3J9j5
$$ -6 4 -10 -4 0 4 6 25 9 -22 10 -3 19 -15 -31 39 -7 7 -6 10 5 -10 10 1 2 15 -19 4 -9 -14 -7 -7 10 15 8 -5 14 -1
6426apJ3pJ4j1jQPjk6J1K0k0Mlj1JJ9j8J4RrJpMk1K2kQoJ0Qpj1j0K3j1Mj2KKP
$$ -1 -8 5 -2 12 1 0 8 15 14 -12 -1 19 -1 3 0 -11 -10 9 -9 5 14 5 6 -1 3 -18 4 2 10 4 14 22 15 4 -6 17 6 10 -2 0 2 9
6468Ij1okJ9rjRl6J8J2k1PlJ0k1K2J9j7j2j5L9mj3NkpkOpnJ3oOJ1Nj0K8j4lPj1
$$ 9 -2 -8 -10 9 0 -1 8 -28 -10 2 -19 -12 -15 -5 -26 -4 15 -2 -14 -29 10 6 -7 -2 -4 -11 -13 -7 -14 -19 -6 -12 -6 5 10 0 28 14 11 18 7
6509GJ0pKrmQK7k2k3J5Lj6Pj2Om4R2L1r1L2k0J2j3Lj5K6Mj1j5K5jkJ7Lk0o%KJ8
$$ 7 17 10 12 3 -1 7 34 12 -11 4 7 -9 -2 -14 -8 -52 40 71 -20 12 -8 4 -9 -6 -21 5 9 -2 -17 8 7 5 22 25 5 -1 -1 1 19
6548A9k5K2Pk5qOMJ9k2LnRNk5MLoOmj6K1J9j6QQl2J3Lk0J8rJ9nJ0j9K3j6J0j5
$$ 19 -6 16 23 -2 -10 -4 0 19 -3 0 -5 4 9 -16 -12 -9 -15 -9 -13 -29 -8 11 -5 3 11 -21 -8 -5 -25 -7 -16 3 -2 8 -11 12 -4 6 -9
6587iJ8j0j0LJ9J2Ll5K5k2J9k0J2k0J%kOJ8j2rj1LJ8j5QK7j2pJ5k2J5Kj7j2K6
$$ -9 9 -1 -11 -8 11 23 26 -9 16 -6 13 -7 5 -15 -14 -14 -16 -10 8 -4 -13 -24 -21 -3 -18 -10 17 5 -2 13 -9 6 8 -9 -21 5
6623EnJ1j2rK9k3RJ4j4j1J3j1PK2j4k6K5Rj6j9J0J4nnkk3N6m1j5K9Lj3J7j9K0
$$ 5 0 11 -1 -10 19 -4 5 19 5 -6 7 -4 3 25 11 -15 10 19 3 -16 -6 8 3 -2 -4 -27 29 -12 -27 2 5 -8 9 -10 10
6658A0nOj0pJ1J8j3k2NJMQj7Q%J7%Mk8J3jNkNJ2k0kJ2nj6J7mj1JJ6pkj0kJ1J6
$$ 10 5 11 1 -6 5 23 10 -12 -7 -6 -2 6 -11 -3 -3 14 14 18 -10 3 2 7 5 10 22 2 0 12 7 -9 8 4 -7 -6 10 3 1 -9 -11 0 16
6699A6n0J6n2Q6Pn5J1j8J00p2J00O8j34j2o1P5l0K3kNk8Rl0O3n3K2rJ5n0N5J1
$$ 16 -34 -18 -70 16 23 -32 -21 -39 61 -11 89 157 23 11 -50 25 -5 18 16 21 -7 2 -28 35 -18 4 -5 10 -40 15 26
6730B6l1J0k3J0j2J8JPnj7JK5k1pL6Ok8PoL0j9k5PK0K0k1J0k1M5l1kj6L1j3qj3
$$ 26 -5 5 -18 -8 -20 -2 -1 6 1 -16 -15 10 -11 -18 18 24 -4 3 -3 27 8 -17 -10 10 30 9 19 -2 43 12 10 -6 25 12 4 -9
6766iljPPr7O9M7k1l5N7n6NM2K0Jm1O5k8r0K0k7J65j68J08j00Q7j1l1m4P3j02
$$ -9 -12 -13 -6 1 -96 -27 20 -1 -36 21 -35 -30 12 32 33 -8 57 29 -61 -41 -68 97 -71 37 -63 24 13 -18 -62 11 -91
6797i1J10m8L3J1j3l9N7K0Pr3P8mo0OmL3j8M1J2m0OK0o9J68j41m1K9M0r9O6M8
$$ -91 19 -29 4 15 2 -37 20 40 47 -46 32 28 -32 -26 -30 3 -15 26 38 -2 4 24 -45 123 -18 -59 -30 10 -89 -23 25
6828B5L0J13j67K0l3K3j2J3l2J2nOO4o0k9L0j7J1nK1j2Jj6J0JlrJ7K2k1ooK9n
$$ 25 55 168 1 21 -12 11 -1 12 -20 -8 -13 -7 57 -3 -32 -2 -19 -8 -13 8 -4 -3 -19 -9 -8 -11 -20 -3 19 -2 -8 -14 15 10
6862A0j2%PJ7rmk6J6J2%pL3j1j06O7K9j6jk8O1k6k7J9JO8n1j7J0l2K6Qk1J3j7
$$ 10 -2 -2 5 22 13 9 -17 -1 11 11 4 37 26 -80 -13 16 0 -1 -29 32 6 -21 -2 -1 67 16 -1 9 -23 3 11 -10 3 -14
6896a4K8j1rK3j7L5l3kqJ4Ok6MJ2L4k6k8jL3k1J0j2Nj1K3j1jMoJ3k2J5j8LJ5k1
$$ -14 14 3 -6 17 0 35 2 0 -8 6 12 -14 -10 2 36 10 -18 -19 14 -7 3 -9 -4 -15 8 -3 -4 0 -6 7 -15 0 -18 -15 0 -21
6932b1L%K2k1MjK6k0kj3n9K0J0P8mn6M0ml6M2NOk3LqJ7j2jlJ5llrRj9OQqNQj9
$$ -21 -18 -18 4 -17 -13 -14 12 -8 -10 -23 -82 -62 -52 26 22 -34 6 2 -34 8 13 19 -4 -1 -9 8 -4 -5 -8 7 4 1 -8 1 -18 -12 -4 -12 -7 1 -18
6973a8MkJ0K1k3K3l2J7j0J2%j6K0J3mj1%Onj6J7J3j7j5J7k%rJ5kNj0l%K2j3J6
$$ -18 -14 -16 -6 15 -8 15 -17 0 -10 2 2 -14 6 19 15 4 4 10 5 -11 6 19 2 -13 4 2 2 -7 8 6 11 1 -2 -2 20 7 23
7010B3m0KJ5pPPMk0J9j7J7nq%NK1oLj1J%%j2JJ8j1j4K1%rk0J7J3k4Oj3L1ooj6
$$ 23 -17 -15 0 -7 0 7 11 -9 10 -7 10 5 -3 -3 2 23 17 20 9 10 10 10 -2 -1 17 6 -8 13 13 4 -16 1 14 -10 -4 -17 14 8 2 -14
7050a4K8j0l3J7nJ5j3MJ7oJ6nj7RJ3nJj0K0l1L4k2MJpj6lJ8nj1K7j6P%j1J2kO
$$ -14 14 4 -29 -12 -17 -2 -15 -11 6 0 16 11 -6 3 16 11 12 2 22 -9 25 3 7 8 1 -15 -18 0 -5 -16 11 -5 2 2 -9 3 1 7
7088Gnl2L1qJj2PJ8j8J8pJ3rMNj1Rj5OjmMRmRKkJk8J4Jk1OK1mrK0nj4J8k3rK2
$$ 7 2 -30 1 -7 -6 -18 -11 7 -11 7 0 13 4 8 13 2 11 -4 2 1 -3 1 10 6 15 17 15 16 -12 2 3 -18 -12 9 5 -4 16 11 -3 15 -8 -17 5
7131El8N7l8lQmJ3%j4J6j7llM0j0qJ0Nj2jpJ5k0J6pqj1L2nnQnj4J6j1jmJ3jnj3
$$ 5 -33 24 -14 -17 -9 -13 0 0 -14 2 -15 -18 -21 19 9 1 11 16 4 3 -4 11 -9 7 0 -8 -19 13 8 3 11 6 -8 8 -3 -4 -8 5 4 -1 -14
7172a4KK4mmj4Oj6J4kOj4K8j9J9j0koRJ0j6J4j0KJ8j4mK1j4rj8K3L7q8M9Jj1J6
$$ -14 -12 12 8 4 -10 -4 -20 -6 -8 -2 -16 12 -7 12 2 0 -6 3 13 -3 11 1 3 21 7 3 24 10 1 -17 6 43 -45 4 5 -6 10
7209A0j2K2j9q6N1M9K9j04J0Q0r9J06j3p8P2Nj3N8l5l1L7Nk9k5onJ0J3Nj7Rk1
$$ 10 -2 20 1 -85 -34 15 44 -60 -50 30 -69 37 24 -54 18 23 10 68 33 2 39 44 15 -10 -16 -21 -11 2 7 -10 -1 -22
7241b2M2qlk4lJ8pK0nj8K3j0klk5J2J4lJ0qKLJ5Mk2qJJ2k3K8Rj4j1J8jrj1Rj0
$$ -22 20 12 9 -15 -18 0 -7 13 8 -10 13 3 1 -2 -27 -15 -1 -4 6 -2 0 3 18 22 0 -8 -7 5 -18 10 19 5 -6 12 11 2 -9 0 -10
7280a0J3oj1OK5j3j0lnJ6j8K2JpJRk0J4j5K9k2pJ7j3K5lk6J3oLOLlmn4J15m2j5
$$ -10 3 -3 -14 -8 17 4 -6 -9 -14 2 -16 6 7 0 1 10 -10 4 -11 18 -4 -11 6 -7 18 15 -11 2 -4 -1 5 8 5 1 -53 62 20 5
7318Ej5j1K6j7oL2Lk4Nlj3L2l5LK6j6KoKj0J1MJ2MKJ0j8j4J3J5j6j0J5LJ2pj6
$$ 5 -10 -21 5 -12 -18 14 17 -7 -2 -5 -18 14 -21 -18 8 -8 -6 -12 -10 -20 -9 -5 7 11 13 23 5 -9 4 19 3 -7 8 11 23 16 0
7355@POj5J2k6QL8l9K2j5N6r8Q4k5m5J45j31l2K6L4j1k5l0O6n9LQ3onl2j9QR9
$$ 0 7 13 -2 10 -16 -8 30 -9 13 -2 54 -44 40 15 -30 115 -16 -48 -22 12 1 -24 -54 12 -47 -44 39 33 28 -4 -23 -15 84
7388H4j11L6Nk1l9M8k9J8rjn6M3qnQ7o5O6n2j1L7MJ5p3QN1j6m5Q4J0k8l0n8O4
$$ 84 -27 9 14 -7 -46 2 -27 -9 -18 -19 -75 -32 -40 -45 42 -23 43 -9 -20 17 21 36 -37 -29 22 6 -39 45 55 27 -3 -61 3
7421CP3j3o5kk8O4km2mjNL8k7mj9L2mK8m7L7k3O4k3o6P9r1J34k01O0O9k5oK2m8
$$ 3 76 63 -2 -4 -32 32 30 -12 -16 -17 -12 26 -1 -5 -24 8 4 32 -15 22 -1 63 40 -26 53 -38 96 -105 -45 24 -1 -7 15 -33
7455c3L6k1J2j3J4KJ9m8L9lj1k0M7omjk9K1mJJ1q%J4oQook5K0Nj4Kj1J2J1kj2
$$ -33 3 -18 -6 -19 -5 -3 16 -32 7 4 -7 -27 20 14 10 9 -20 1 -3 -2 9 1 1 15 9 17 11 5 -20 0 5 -9 -7 -18 -6 5 3 -9
7493iJ2OqkokJ1oJQqK2rJj7K0j6mOjMKMlNj7J9k9K4Rj3K1j7J6l1pJ3K3k3J2j6
$$ -9 3 9 1 -1 -7 -9 2 -4 -3 5 -3 19 10 11 -6 14 -2 -6 0 -1 3 5 9 6 11 -6 13 -16 8 17 4 25 8 24 -7 -14 -1 22 -1 11 -5
7534eljRj7MJ1J0qOJJPKk5J8jnpj0K9Kj5J2J8k6MqKJ0j7lJ2k1J0OJ1k0qnnK5J0
$$ -5 -8 -9 0 -17 -13 -2 8 0 6 7 8 15 17 -8 10 9 4 -3 -13 16 18 3 15 33 7 11 3 5 15 -2 -5 7 -14 -4 2 13 -7 -15 -20 -25 0 10
7576A0Jl4L7jj3K0k0J6k9M4J4m3J5K5l1pJ8pnj9J3J1k0J9j4J5m3J2J1j9K9J3l1
$$ 10 11 -23 14 13 0 20 0 16 -13 31 45 2 17 42 11 4 22 15 10 -9 4 15 -5 14 0 15 -28 -16 -5 -24 5 18 -13
7609a3nK2k8j9L4L4j4m5J2J5k2o7M9L9Q2m3o7Q5l7L8q4N5J1m6J8K6K3q9P1Nn5
$$ -13 -18 4 -24 -43 -9 25 11 -34 -22 -7 -29 -96 -47 -8 74 31 -36 49 12 50 -34 21 32 -14 4 30 53 -36 35 40 -15
7640a5Q9m2l8P3p3l3M6l6K8k4j31J96M7q4P0p1%j2J2k1mK1PkMk3J0rK5j3J0jn
$$ -15 74 32 -6 67 -6 -39 7 -29 -1 -25 -156 40 87 3 73 2 2 -10 2 -19 -23 -2 5 3 7 -16 -6 -15 10 -3 7 6 1
7673Ap%POj6Lj2NK7j9MJ6j2j1mJ9k0J4k6K7oRj4rpL9k3o3J2K6K9Lj9M8n0N2l7
$$ 1 -6 -6 1 7 -9 -6 -18 -13 14 -5 -1 15 3 -8 -12 7 -13 1 -25 2 -4 5 -9 -18 -25 14 -9 -72 -60 -34 -5 -2 -21 27 -23 29 -8
7710hK5q8QJ49j53O8m2O8o6O0qKk1J4onj7J6k5M5j13M6N2Q8p3J2m6n4J3N6jJ1
$$ -8 17 -71 -63 86 -67 1 -41 27 -39 21 13 15 -6 8 2 -3 -20 -4 -29 16 -97 -51 1 89 16 28 -18 -72 -59 -3 -4 7
7742GQk2NmKJ5j8J7j1J8mj3Nj6OllJ5Ok6lJ0Qpj2J8j2QqPlJ0j1J6j6J9j0JqnL1
$$ 7 15 -7 -2 -6 -4 11 -7 10 -1 17 13 0 5 -11 -5 -8 -11 4 10 -16 -19 -9 -1 -8 -20 -2 -14 -6 -14 -7 -10 0 -11 5 -11 8 -2 -1 -9 -14 17
7783A7l0K6j5mj2M6k6j6jL3lk4k%K4oj3K8k7j9M0rqj4LL0k2J1j2J0j8J4k2J6J6
$$ 17 -13 13 -2 -6 -18 28 2 -14 -15 18 15 -9 -11 -11 13 7 -6 22 -5 -24 16 7 -1 -15 -12 18 -4 7 -5 5 -13 1 -21 -5 11
7818A1k6J7Pk3J%JJ3jpK3j4nJ6kpkL0l7lOj7J0K7k2Pj5L2j0J1l4J5qJMk2K9%j9
$$ 11 -15 2 9 -14 -13 -13 -12 1 0 -7 16 2 -3 13 11 4 2 32 -5 -8 -2 -19 -9 18 -4 3 -12 20 10 21 -13 2 -6 -5 -1 -23 6 6 -13
7857a3MNQkk2J7JOlOjJ0j3J3Jnj3pK1j6MPj2k3K6rK8k5j7NK6pj7J6%j6J4MLnJ
$$ -13 -9 -4 4 2 -20 -3 -2 4 1 7 6 16 3 16 17 12 -1 -8 13 -3 1 8 -4 -27 -1 -10 18 -7 -24 -19 7 0 -17 -1 -1 -17 -3 1 4 -1 0
7898@Lj3kKPJ0rJ5j3j8K5pJ4j4J1oRrMj9K0lOj6Mlk3J8k1M5l5PJ2nk6J9j5J7J3
$$ 0 3 -10 -12 -10 -3 7 -2 13 0 -18 7 0 14 0 11 5 14 5 9 -10 10 7 13 -3 1 -2 -25 -7 -28 17 -18 -11 1 -4 -30 -11 -26 -9 4
7937Dj5mNljJ8j2lJ3lrj1J4PJLj5K0jj2J9j1mJ5k1OJ1k8J8J2lJ9n5JQkJ4j0OJ
$$ 4 -11 -15 -10 -13 -14 4 -8 -11 2 -1 -10 -21 -7 0 1 4 -11 9 8 -4 15 4 0 15 -6 0 11 -17 1 13 10 29 -26 -25 -17 -19 -5 -15 -9 -8
7977hj1%K0j7L2qk4K0oLkrj0K2kK0ok1J1MJjj1J7k9PNJ2k4J8kj7L1j2Nk1%J1%
$$ -8 -19 -19 1 -16 16 8 -16 4 -2 1 -1 -10 -20 2 0 20 14 -7 4 8 9 8 -3 14 -15 -8 -3 9 -15 3 1 -16 15 3 8 -13 -13 -2 -2
8016bj3J0qK8j2j2J0j1K8j1mmj5kK4J0k8K9j3J2j8RknMpNmpK1qkPj9OKlOnk2J1
$$ -2 -15 -5 -13 15 3 -9 1 -10 18 7 3 -1 -16 -18 6 16 -12 17 4 16 -2 7 5 0 4 -3 2 -2 -9 12 4 2 9 -10 -4 -2 -5 1 -4 -26 -15
8057a5LNMk9L2kj6K9l6L6k0OJ8j3Km3L1K7j4K1o9O3l3O7N4j97J09K3l1j5Pj5J3
$$ -15 -12 -7 -3 -32 0 -2 -18 11 -25 11 -9 -3 15 2 4 -39 -8 19 5 26 -43 20 -13 54 108 -89 20 43 12 -3 4 -11 2
8090Bk3J5jJ2OJl1K7j3jLmJ5j7L8m8J6J1krk8M5j8K4k6jJ3mJ0j3Nj1J1j4K6l0
$$ 2 -21 -6 -7 5 11 12 -19 8 -5 -6 -3 -7 8 -9 29 -19 -3 8 6 -3 -31 14 -4 20 -6 -7 6 2 12 -1 4 -7 4 -10 16 -14
8126a4J7Pj8Nj4K3j8LpNK1k0Lj5K1k7J4K5lPj2%LqOQp%LqJ7nl3J6LrL2l2JJ0j6
$$ -14 3 10 -8 -3 -17 6 -12 -9 -16 -11 10 -10 -7 -22 -1 -28 -14 11 8 15 3 3 6 -2 4 12 5 5 8 0 17 12 -21 -5 -2 -11 21 -11 -10 0 -16
8167a6J4j5L3n4K1%Qj6PK%j6K9J1k6L0l1K5j1POj9rM3
$$ -16 -2 -17 16 -38 -17 -17 -9 -25 -18 -16 -16 -32 -3 8 -18 12 -19 6 -5 2 8 -11 -20 23
8191B3
$$ Imaginary data points
##PAGE= N=2
##DATA TABLE= (X++(I..I)), XYDATA
0@%%%%%%%%%%%%%%%%%qJ6j6J6j6K4l2L2m0M8n6O4p2Q5r5J08j24J42j62J84k06
$$ 0 0 0 0 0 0 0 0 0 0 0 0 0 0 0 0 0 0 -8 8 -8 8 -8 16 -16 16 -24 24 -32 32 -40 45 -50 58 -66 76 -86 98 -108
38a08K30k60K92l26L61m01M45m93N46o03O66p32Q05q88R79j077J185j305J439
$$ -108 122 -138 154 -172 189 -212 233 -260 286 -317 349 -383 422 -466 513 -564 621 -684 755
57G55j594J768j963K190k456K771l150L615m200M954n939P142j0534J09447j05520
$$ 755 -839 929 -1034 1156 -1300 1471 -1679 1936 -2264 2690 -3249 3893 -6641 102806 -2714
72b714n334L37n7383J59282j03964m0593O7486l6208P9825o2938o2063Q9019k8287
$$ -2714 -8048 -7711 -65094 94188 -9776 -50369 17117 -19091 60734 -2204 -64267 24752 -3535
85c535L4827l6337l8743Q9163m8259k0611L0044j4446L7698l4971j8575L3890
$$ -3535 31292 -5045 -43788 45375 -2884 -23495 6549 -7897 29801 -5170 -23745 10145
97A0145m58o601k6085K1638K3994r896j5631m4269N7100L4325n4338m055j1720
$$ 10145 9687 3086 -22999 -1361 22633 12737 -2894 -47163 9937 44262 -10076 -14131 -25851
110b5851N1520J2954q1424K9298J6093J9249J1781q4354L9490L4599k1078J9535
$$ -25851 25669 38623 -42801 -13503 2590 21839 33620 -50734 -11244 23355 2277 21812
122B1812o4294L5570N6163o6610Q932o069J4257M0226o4103J1963K4985j9625
$$ 21812 -42482 -6912 49251 -17359 -8427 -14496 -239 39987 -24116 -12153 12832 -6793
134f793K3681l5152P752L7781l5023O796p233j005L8594l9163j1938L6447p714
$$ -6793 16888 -18264 -10512 27269 -7754 -958 -8191 -9196 29398 -9765 -21703 14744 7030
147G030k584j6948n865M0996r490k8150P835M580J6622l551l1373J3062K1407
$$ 7030 4446 -12502 -18367 22629 13139 -15011 -7176 -2596 14026 10475 -20898 -7836 13571
160A3571j859j1518k3565K1555K6123k5183r465L038J1506J2590k5257k923J6486
$$ 13571 11712 194 -23371 -1816 24307 -876 -10341 -7303 4203 16793 -8464 -11387 5099
173E099j992M614j2318p030J9481j343r867j826M558Q920p782r712R618P882r530
$$ 5099 3107 7721 -4597 -11627 7854 6511 -3356 -5182 -624 8296 514 -9198 420 8302 -1228
188a228l523L818K737M515j0682j866J0819l996M275q401p678K2461p590r114
$$ -1228 -4751 -933 1804 6319 -4363 -6229 4590 594 4869 -3532 -11210 11251 3661 -5453
202e453M050m913J8182j0432j3559J8297q610N170J578j5226J6343n146j639P702
$$ -5453 -1403 -6316 11866 1434 -12125 6172 -2438 2732 4310 -10916 5427 281 -1358 6344
216F344j7665J5338K144j3576J1984q441M817L696j2307J3397o110m656J1282
$$ 6344 -11321 4017 6161 -7415 4569 -3872 945 4641 -7666 5731 -379 -5035 6247
229F247r119L544n94l193R269r258J406M730n572N332l175j276K654j716M195
$$ 6247 -2872 672 78 -3115 6154 -3104 -1698 3032 -2540 2792 -383 -1659 995 -721 3474
244C474n421j524P291k033k568l103M673M613q189P22K540J200R06o540K674L121
$$ 3474 -1947 -3471 3820 1787 -781 -3884 789 5402 -2787 -2065 475 1675 2581 -3959 -1285 1836
260A836n7N89p969L685Q115n325m093j566Q210M411j3069n99P288K965j154r226
$$ 1836 1779 2368 -5601 -1916 6199 874 -3219 -4785 3425 7836 -5233 -5832 1456 4421 3267 -5959
276e959K471P939j348l543o298M875J0840o848q763J686Q826L530j1788k530J0259
$$ -5959 -3488 4451 3103 -440 -6738 -1863 8977 2129 -6634 -4948 3878 7408 -4380 -6910 3349
291C349K573o006o788L746R450j830p878k446O443O981p489q698O911J0242l321
$$ 3349 5922 -84 -6872 -3126 6324 4494 -3384 -5830 613 7594 105 -8593 -1682 8560 5239
306E239j2612m99J2953L329j0673n254P270P828m506j0292J379J0775L847r737
$$ 5239 -7373 -7872 5081 8410 -2263 -7517 -247 7581 3075 -7217 -5838 4937 8784 -953
320i53q811P977J1318o238j1549L308J2221Q44j3574l966J1301O956o423r932
$$ -953 -9764 -1787 9531 3293 -8256 -4948 7273 8117 -5457 -9423 1878 8834 2411 -7521
334g521K751J1142M0j1101m106J0630R213r514j2244O074J2961j821j2966r87
$$ -7521 -4770 6372 6412 -4689 -8795 1835 11048 1534 -10710 -4636 8325 6504 -6462 -7449
348g449J1774M333j0225q064P517J0053k162j1277k864J2142M934j0882o908P473
$$ -7449 4325 8658 -1567 -9631 -2114 7939 5777 -5500 -8364 3778 8712 -2170 -9078 -1605
362a605J1957n608j4977M394J1442J697q941p966J0478Q096q002p529J7J2159
$$ -1605 10352 4744 -10233 -5839 5603 7300 -1641 -9607 871 8967 965 -6564 -6547 5612
376E612M606j5082l891R545P085m398j3398O019J3322m934r252k978R055Q785
$$ 5612 10218 -4864 -8755 790 7875 3477 -9921 -3902 9420 4486 -4766 -7744 1311 10096
390A0096j0290p675O013P189J146j1746l919J4225M010j0082o946M420J1803k825
$$ 10096 -194 -7869 -1856 5333 6479 -5267 -9186 5039 9049 -1033 -7979 -3559 8244 5419
404E419j3134L276Q687J247n188q833O880R952o495n792q61O584O769j2373l685
$$ 5419 -7715 -4439 4248 5495 307 -8526 -1646 8306 1811 -3981 -4842 1742 8511 -3862 -7547
419g547J0748J528k382q863J351J3630n820p337J401K604R048p727j0466R727
$$ -7547 3201 4729 2347 -6516 -5165 8465 2645 -4692 -3291 -687 8361 634 -9832 -105
433a05M932L35p575q149J4741M421j1037k420O67R835J465j3969K398O510J308
$$ -105 4827 5162 -2413 -10562 4179 8600 -2437 -4857 -4190 5645 7110 -6859 -4461 2049 3357
448C357M53j0007K387R941m580l245j535K514O892p324l731P179o74j003k388
$$ 3357 3810 -6197 -3810 6131 1551 -1694 -3229 -715 6177 -1147 -4878 2301 1627 624 -1764
463a764j044P320k733n900L433J398K664j716q478O494O523n619k556l183O384
$$ -1764 -2808 4512 1779 -4121 -688 710 3374 1658 -6820 -326 6197 578 -1978 -5161 1223
478A223P416j1789k053N789O21N117r689l479J1512l606J574m183o294J4776m703
$$ 1223 8639 -3150 -5203 586 1207 6324 -3365 -6844 4668 1062 2636 -1547 -7841 6935 2232
493B232n748N094o809R822j515r913J1180o611J231O189j0971Q781k395n107R997
$$ 2232 -3516 1578 -5231 4591 3076 -6837 4343 -2268 -1037 5152 -5819 2962 567 -4540 5457
508E457q598L702K099r339J1369l091m650M777o417Q385L68r607N647l78J874
$$ 5457 -3141 561 2660 -6679 4690 1599 -3051 1726 -4691 3694 4062 -5545 102 -276 1598
523A598J666p192J886L839M25j483l402M25M232J817o030R1K809j387M866n660
$$ 1598 3264 -3928 -2042 1797 2222 739 -2663 -2238 1994 3811 -2219 -2128 681 -706 4160 -1500
539a500j784O168n506O497k729p788J1243n743J428M030j2094J1138j367n141
$$ -1500 -3284 2884 -2622 3875 1146 -6642 4601 -1142 286 4316 -7778 3360 1993 -3148
553c148R328j3100O626O604j1039Q757p642P34J1007j3036N727J52n934J1795
$$ -3148 6180 -6920 -294 6310 -4729 4028 -3614 -2880 8127 -4909 818 970 -4964 6831
567F831q892k34N127p348Q903l784m679P229n851L599J724n769M406k815J399
$$ 6831 -2061 -2295 2832 -4516 4387 603 -4076 3153 -2698 901 2625 -3144 1262 -1553 -154
582a54L997o419J004J870L00K033m245j226L533J350r44k446j522L449L454m579
$$ -154 3843 -2576 -1572 298 598 2631 -1614 -2840 693 2043 1099 -1347 -2869 580 4034 -545
598e45k526K477J605K372m507k695N627j081L85q30m217O179n12l178K406l400
$$ -545 -3071 -594 1011 3383 -1124 -3819 1808 727 1112 282 -3935 2244 1732 -1446 960 -2440
614b440L682J197n660M929j293k417M167l801K768P94o067N823k43k565L135n677
$$ -2440 1242 2439 -3221 1708 415 -2002 2165 -1636 1132 1926 -4141 1682 1439 -1126 2009 -3668
630c668L677M649o888J876j354J038O772q954m67N258k293M187o054k335Q863
$$ -3668 9 4658 -2230 -354 -1708 -670 6102 -2852 -3319 1939 -354 3833 -2221 -4556 4307
645D307m158N29j297m097R348l365l878L168l142N896k120n518O174j980N56N70
$$ 4307 149 678 -619 -4716 4632 1267 -2611 557 -2585 3311 1191 -4327 1847 -133 423 993
661I93m125N072j416j947K380k271K835j223k488K976k84N70k266n67L823j189
$$ 993 -3132 1940 524 -1423 957 -1314 1521 298 -2190 786 502 1072 -1194 -1761 2062 873
677H73j214j685J711L480l801k92j71J055L653n436J84K282n03K998n800N27N168
$$ 873 -341 -2026 -315 3165 -636 -928 -1099 -44 3609 -1827 -1643 639 136 3134 -2666 -2139 3029
694C029l379J513l023J38N912n725R03J046k072N300n141m71M179l424L103k962
$$ 3029 -350 1163 -1860 -1722 4190 -1535 -632 414 -1658 3642 -1499 -1970 2209 -1215 1888 -1074
710a074j254N910m492J52Q34j315M432m484o70L561k169K200k737r76M326k193
$$ -1074 -2328 3582 -910 -758 76 -1239 3193 -1291 -1961 1600 -569 1631 -1106 -2082 2244 51
726E1L0j042n43M094k549j456J157P2K143k736p10K263o80P80j777o9K233j356
$$ 51 81 -961 -1504 2590 41 -1415 -258 -186 1957 -779 -1489 774 94 874 -903 -972 1261 -95
744i5J41p20J90K144k210k79J048M2Q03k342O65J940j306R0j086Q17J768k005
$$ -95 46 -674 -484 1660 -550 -829 219 261 1064 -1278 -613 1327 21 111 -975 -158 1610 -395
762c95j17K07M59J402k311k80J625o4J65j798M61J980j129n65j94N35J121j267
$$ -395 -512 -305 154 1556 -755 -1035 590 526 691 -1107 -646 1334 205 -360 -554 -19 1102 -165
780a65n41O65L06N04j183m75J367J72o85o62M35J058n04r70M24N37L7k80o69O45
$$ -165 -706 -41 265 769 -414 -889 478 650 -35 -697 -262 796 292 -678 -254 283 320 40 -629 16
800A6M31n20nl26M79N75j199K66O18l28K14r40P45P69j352M86j00K37N93j327
$$ 16 447 -73 -78 -404 75 650 -549 -283 335 7 221 -719 26 795 -557 -71 -171 66 659 -668
820f68M79M09k05N67j328M28J081p86J11p09O88Q32j361L65k2K76M23j047M73
$$ -668 -189 220 15 582 -746 -318 763 -23 88 -621 67 899 -462 -97 -119 157 580 -467 6
839FJ7J44L04j080P32O8j45L72j274J381j93r38J224j213Q52K04j308J694j259
$$ 6 23 167 471 -609 123 191 46 418 -856 525 332 -606 618 -595 257 461 -847 847 -412
858d12Q2J265j935J552m20r50J841j811J043K77j813K258j075l50J123j702J651
$$ -412 -330 935 -1000 552 132 -818 1023 -788 255 532 -1281 977 -98 -448 675 -1027 624
875F24j95j429J741j158K65R54j556Q16R2n10Q94p20l39J011o09n9O33r99M10
$$ 624 429 -1000 741 -417 -152 802 -754 62 154 -356 538 -182 -521 490 -119 -178 455 -544 -134
894a34O38q70Q11r10j37J888j696K02M71j186K238j385q71J751j706J926m95k310
$$ -134 504 -366 445 -465 -602 1286 -410 -208 263 -923 1315 -70 -941 810 -896 1030 535 -1775
912a775K767j006N6Q21k563K457K4j615J670j712Q76J117j861R37k46k95J094
$$ -1775 992 -14 42 863 -1700 757 781 -834 836 -876 0 1117 -744 193 -53 -348 746
929G46r66j01P49o85M9Q36p68k12N16o59J382n88j849K241q48N60N51l351L136
$$ 746 -220 -321 428 -257 -208 628 -140 -352 164 -495 887 299 -1550 691 -157 403 954 -2397 739
948G39K25j557J808l783K878K291m447K577j995O68M000n684J967R14k063M501
$$ 739 964 -593 1215 -2568 310 2601 -1846 731 -1264 -596 3404 -2280 -313 601 -1462 3039
964C039m512r0L513l381L007j810j826M293l289J120J100k989K995j518k78K355
$$ 3039 -1473 -1563 1950 -1431 1576 -234 -2060 2233 -1056 64 1164 -1825 1170 -348 -626 1729
980A729k818O60Q27o05J398j485j144J721J002r72j008m05J106K279k521j536
$$ 1729 -1089 -429 398 -207 1191 -294 -1438 283 1285 313 -695 -1100 6 2285 -236 -1772
996a772J967k05K007k192k456M048j162N70k74l753N152p88k543K824l772L144
$$ -1772 195 -10 1997 -195 -2651 1397 235 805 531 -3222 1930 1142 -1401 1423 -2349 795
1012G95J326m743M056j866n91L260m208K565L42k992L641k110L67J418l664L302
$$ 795 2121 -2622 1434 -432 -1023 2237 -1971 594 936 -2056 1585 -525 -158 1260 -2404 898
1028H98K91k091J405k179K114J746l508M77P49N18J223k645p81K611L21q37j169
$$ 898 1189 -902 503 -1676 438 2184 -1324 -847 -98 420 1643 -1002 -1783 828 1149 312 -857
1045h57o91K614O12k709L13L31R66J195l395Q35J833j455J672k069n65L285k570
$$ -857 -1548 1066 1678 -1031 -718 -387 579 1774 -1621 -786 1047 -408 1264 -805 -1370 1915 -655
1062f55N48P75k063K804j670o34K561k778J151L59j243K668k697l36K547j804
$$ -655 -107 668 -1395 1409 -261 -895 1666 -1112 39 398 -845 1823 -874 -1210 1337 -467
1078d67J520j348j837L973j180j205N18j607L007J89l198J195L48P37O91k873
$$ -467 1053 -295 -2132 1841 661 -544 -26 -1633 1374 1563 -1635 -440 -92 645 1336 -1537
1094a537O70J824o57J75j425K8K251j135p07M47n79J409m27j359J622p49k46J113
$$ -1537 -867 957 300 475 -950 -922 1329 194 -513 -66 -645 764 337 -1022 600 -149 -395 718
1112G18j397R51J39j523J721k99o63P52j475J509O96k051R09l42N10J203k539
$$ 718 -679 272 411 -1112 609 310 -353 399 -1076 433 1129 -922 -13 -355 155 1358 -1181
1129a181O54J208q56J124j712k34K335j430J20j46q19K146j019r72J111p67J027
$$ -1181 -527 681 -175 949 -763 -997 1338 -92 28 -118 -937 1209 190 -782 329 -438 589
1146E89k40j274J447n36k1N09j186J057o1p95Q72n04J25L49q23O11J86o17K74
$$ 589 349 -925 522 -14 -35 474 -712 345 284 -511 361 -143 -18 331 -492 119 305 -312 -38
1165c8l3J43R6n09J37L78n0k09Pr3L68Q6o84K82K19m8J62o25L52L57n73N16l92
$$ -38 -71 72 168 -341 -204 174 124 -85 -78 -171 197 283 -401 -119 100 52 214 -411 -59 298 -275 241 -151
1188a51r3O69p22L81M8n30P91n34K6M83p97O18l8m16O55p58L77M43p86M95k23
$$ -151 -244 425 -297 84 132 -398 393 -141 -115 368 -429 189 151 -265 390 -368 9 452 -334 161 -62
1209f2MN07p89L12K27l44M65n72J21M73m41J66k35J20M64n49l0K33M3J23m63N3
$$ -62 -58 449 -340 -28 199 -145 320 -252 -131 342 -99 67 -168 -48 416 -133 -163 70 113 236 -227 -174
1231a74M14j27j17k16J74L54k71j93j8L06J65m58p9L08J43j50m14K67L76k17k57
$$ -174 240 113 -4 -220 -46 308 37 -156 -174 132 297 -161 -240 68 211 61 -353 -86 290 73 -184
1252a84j06L99K53m98k54K82M31o4o22k5O19J43l81m97L24O65k99m68p6M29M32
$$ -184 -290 109 362 -136 -390 -108 323 259 -363 -388 231 374 -7 -504 -180 485 186 -282 -358 71 503
1273E03n54l90L92L12N7n69j68P61o6l74j85J72O67m81n26M01K76K12o08m31Q69
$$ 503 -51 -441 -49 263 320 -249 -417 344 278 -96 -281 -109 558 77 -449 -48 228 440 -168 -599 270
1294B70K13l93m43j50J082j05q30JK49P46l75r16N03M68M3l97n52O81L88m56l22
$$ 270 483 90 -353 -503 579 474 -356 -355 -106 640 265 -651 -148 320 363 -34 -586 95 483 27 -295
1315b95K2O33m6o29OM83K27n26l06L93M71j92p45J69P11Om44o38O49P84p43l73
$$ -295 -273 360 314 -315 -309 174 401 -125 -431 -38 433 241 -504 -335 376 382 -62 -700 -51 733 -10 -383
1337c83j41P27O44j306j09O27K28K66j167M3J197m39j78m34J04J174q07n47M27
$$ -383 -524 203 847 -459 -568 59 287 553 -614 -571 626 187 9 -425 -321 853 46 -501 -74
1356g4J82N16p95m92R73J19l41l85j42R21L8r15L2M71L06r8q80J46J134n36l45
$$ -74 108 624 -171 -663 310 429 88 -297 -439 482 520 -395 -363 108 414 316 -564 -418 716 180 -165
1377a65n8j41J208q68o80J054m38O65m94j008J621n68m34O02j052J459l92j289
$$ -165 -223 -364 844 -24 -704 350 -88 577 83 -925 696 128 -306 296 -756 703 311 -978
1395i78J487o54L91Q1j485J771k01q28O51j080J404J81j636R19j68M97K53j601
$$ -978 509 -145 246 327 -1158 613 412 -416 235 -845 559 740 -896 23 -145 352 605 -996
1413i96Q13O90l13j68p14N98P23m47o52R7O43M2j32p28K77J038r71K13j72k39
$$ -996 -183 507 194 26 -688 -90 633 186 -466 -369 274 316 184 -544 -267 771 -200 13 -159 -398
1433c98J363j366J11Q61j247J413q77n35J768j884R36L71j411K030j728M4J750
$$ -398 965 -401 -290 571 -676 737 -140 -675 1093 -791 145 516 -895 1135 -593 -549 1201
1450A201k016J364o64q81K511j993J13P93j369K138j207r89J613j036J029l58
$$ 1201 -815 549 -115 -996 1515 -478 -365 428 -941 1197 -10 -999 614 -422 607 249
1466B49j391J624l27p8J40j027J016K36n60R5k97L42K65j72m29K41J65j76N01
$$ 249 -1142 482 155 77 217 -810 206 442 -118 -23 -320 22 287 115 -314 -73 92 -84 417
1485D17p31N3O75q41Q90m30p72J375r19M26L02j528J684m92m59J060j758J321
$$ 417 -314 -261 414 -427 463 33 -739 636 -283 143 445 -1083 601 109 -350 710 -1048 273
1503B73M17j451J387j199L38J336j856R87j41p21J664j418J32P31j111J287n10
$$ 273 690 -761 626 -573 -235 1101 -755 232 91 -630 1034 -384 -252 479 -632 655 145
1520A45p59J038p55N53L13j219P62N7j57N05r42J06Q75m70k1k10l52J103k22q39
$$ 145 -614 424 -331 222 535 -684 78 135 -22 483 -459 -353 522 52 31 -179 -531 572 350 -489
1540d89M78k10N12K13j212O23L68l44M41r32L33Q68r85M58j76k61R36r59J15O74
$$ -489 -11 -221 291 504 -708 -85 283 -61 380 -552 -219 649 -336 122 -54 -315 621 -338 -223 451
1560D51p78N00j95l35R58q06j76O56l56M20m73n38J136j29n18N7l42R14J36j260
$$ 451 -327 173 -22 -357 601 -205 -381 275 -81 339 -134 -672 464 335 -183 -126 -468 446 582 -678
1580f78M73K88J37L05j234L52J112p86J43m91L6J327j183l32O01j56Q11q73n18
$$ -678 -205 83 220 525 -709 -357 755 -31 112 -379 -343 984 -199 -531 70 -86 725 -148 -666
1599f66J255m81o3p2n33J263o32o61O89j97N36l83q01J104K5k75l83l11J042J03
$$ -666 589 108 45 -27 -560 703 71 -590 99 -98 438 55 -746 358 383 108 -275 -586 456 559
1619E59r65q4M91N32l05q51K17R00J3q62j76N01O75m01j037N79O78q0m28p39Q83
$$ 559 -406 -490 1 533 228 -623 -406 494 507 -355 -531 -30 645 244 -793 -214 464 384 -44 -783 100
1640A00O86r65j29p3P10M04j365K10O83J6J10j218N41J046o80k99l01N81P69j129
$$ 100 786 -179 -308 -381 329 733 -632 -422 261 277 387 -831 -290 756 76 -223 -524 57 826 -303
1660c03k30N68K48K60j162J11J029j70l44o82N42P49n80m80R8P25L60j007k89
$$ -303 -533 35 283 543 -619 -508 521 351 7 -675 -133 616 36 -444 -346 379 739 -268 -557
1679e57O69N12l59r11L13Q12Ko68n09Q46N27o33n22R3Q76O6j018k3N71M84m05
$$ -557 112 624 265 -646 -333 479 481 -187 -696 150 677 44 -478 -385 491 557 -461 -484 87 571 166
1700A66r36O01O81j90o00l80R37L84p76l95J89P97n1r18J21O93O4k72o70M06P49
$$ 166 -770 -169 512 322 -278 -658 279 663 -113 -508 -319 478 427 -491 -370 323 387 115 -555 -149 600
1721F00m04l41k93Q79J60r98m0M67M63j75r00L45N82R0n91m45O98L99m68n63L05
$$ 600 196 -145 -438 441 601 -397 -437 30 493 318 -582 -237 345 435 -156 -601 97 496 28 -535 -230
1742b30N48M0n55l16P08L45m35m52K32N18o8n58p3L74K39l89l57K71M43q6m92
$$ -230 318 358 -197 -513 195 540 105 -347 -115 403 335 -223 -296 78 317 -72 -429 -158 285 199 -293
1763b93N2L84K11l61m67M27L16r1m61KN25j2l36j74K29L28k18l41J24L27J9l10
$$ -293 -241 143 354 -7 -474 -47 269 178 -283 -281 244 232 -104 -278 -49 279 61 -280 -156 171 190 -120
1785a20j66K87K53k20k88J62K12O2l23q2L41O0j80o0o4L51r8l23N2J50j2J70m05
$$ -120 -286 1 254 34 -254 -92 120 182 -141 -223 118 178 -2 -62 -126 225 127 -196 -144 6 -6 164 -241
1808b41L14L8j77J92l14K58P8l13K47j08NJ60l16K38M8k54K45j50J8J99l27J51
$$ -241 73 111 -66 126 -188 70 148 -165 82 -26 -21 139 -177 61 109 -145 100 -50 -32 167 -160 -9
1830iP7j59J84j05m6J84k36R9J20j78J11q4OK01k44o3K29o6M3j64j02M04j01k61
$$ -9 68 -91 93 -12 -58 126 -110 -11 109 -69 42 -42 -36 165 -79 -142 87 21 64 -100 -202 202 101 -160
1854a60O7l4L41m4n34L07K11j01K1m72L64M29m89o6K5J50L81o00j19M86j31J91
$$ -160 -93 -127 214 170 -364 -57 154 53 74 -398 -34 395 -94 -160 -135 15 396 -204 -323 163 32 223
1876B23m14k83Q45j79l99J16j50O67l33o01P06j02L8j44m99Q94q0o15K34j00N47
$$ 223 -191 -474 371 192 -207 -91 -241 426 93 -508 198 96 134 -10 -509 385 305 -310 -76 -176 371
1897C71j2r79N37M21j62q1p14N95O93p39k58L6M37M77q54l17P14J44n8n52j93
$$ 371 359 -620 -83 338 176 95 -619 -24 669 -70 -328 -292 145 622 -232 -549 165 309 251 -301 -494
1918d94R47j00o10nJ50N13j30q23M78M19k13k36l71N25N49r19K5L23N4M43j043
$$ -494 453 353 -257 -262 -112 401 271 -552 -74 345 132 -104 -475 50 599 -320 -295 28 82 525 -518
1939e18O1J036m26j69m40K63J024p77p60O02J71N45p04p78J137J75k70l96m86
$$ -518 -457 579 153 -16 -456 -193 831 54 -706 -104 67 612 -92 -870 267 442 172 -224 -710
1958g10J190J37j020J53P5O29M3j185M58O59k53m8o71M52Q03q40j91K66J50M19
$$ -710 480 617 -403 -250 -175 454 497 -688 -230 429 176 128 -543 -91 712 -128 -319 -53 97 516
1978E16q63j77R45k06k39k86K3R49n14o98M46K46L86n85p38R78L85n38l44k27
$$ 516 -347 -524 421 215 -24 -310 -287 662 148 -550 -104 142 528 -57 -795 183 568 30 -314 -541
1998e41R09L34j112o5M59M27N2j021N4R94j50l95m00J51R83n24o45L84J51L61
$$ -541 368 702 -410 -475 -16 411 463 -558 -504 490 340 -55 -455 -304 679 155 -490 -106 45 406
2018D06m15o17Q44R8m41P2l31P08R0r59M99K51l2N9q50O27N84p05j1k23N09N08
$$ 406 -9 -626 218 316 -125 -53 -384 324 414 -545 -46 205 173 232 -618 9 593 -112 -123 -346 163 671
2040F71j032K0M57R9K06q78O5Q85l19k28l11J85O80n65k10J06J94K51l48l40M46
$$ 671 -361 -341 116 215 421 -457 -392 493 174 -54 -365 -180 500 -65 -275 -169 25 276 -72 -412 34
2061C4L26k25j91j41L29J19m79j02M80j5r0k76R9N33l23l05J60k4M73m17l70N88
$$ 34 360 135 -56 -197 132 251 -228 -330 150 135 45 -231 -132 401 78 -227 -67 -91 382 -35 -405 183
2083A83n8j5k05k70O47j01l78J57j35M60j06n40L63R0Nnm12L52J99k90L3j17K08
$$ 183 125 110 -95 -365 282 181 -197 -40 -175 285 179 -361 2 92 97 92 -320 32 231 -59 -26 -143 65
2106F5J39l42M5J52oQj62N6J79r1j26P5M0M6n9j32J57O4j24M1j11J34Q6k67J31
$$ 65 204 -138 -93 59 53 61 -101 -45 134 43 -83 -8 32 78 19 -113 44 108 -16 25 -86 48 134 -133 -2
2131bN4o3J03k36J24J46k13J16o1k9J98k42J06M2j01J45j13P5J3j43Q1j5m0J19
$$ -2 52 -11 92 -144 -20 126 -87 29 -32 -61 137 -105 1 43 -58 87 -26 49 62 -81 0 -15 -55 64
2155F4j55J08N7j03L8l5P2K2j25K7L1P6p2r2Q2O1Pj27l5J70Mp7j00L5J96r7j08
$$ 64 -91 17 74 -29 9 -26 46 68 -57 -30 1 77 5 -87 -5 56 63 -64 -99 71 75 -2 -102 -67 129 32 -76
2182g6L0M9J52k05j02J91K0J9j69J5K28q7r1o0Q1J70j63j28J30Q8L9k15o5K75
$$ -76 -46 3 155 -50 -152 39 59 78 -91 -76 152 65 -26 -86 -5 165 2 -126 4 92 131 -84 -149 126
2206A26K0j55j37R3K39r2k39l2K56R0k15j62J27J75M1l99J17K08O8j88j30J77
$$ 126 146 -9 -146 -53 186 94 -145 -177 79 169 -46 -208 -81 94 135 -264 -147 61 129 -59 -189 -12
2228a2J25q3j48PL07j8k12l9jL18j91k55Q4L36n6l32j41L86J45l21L8M5J79m9
$$ -12 113 30 -118 -111 196 178 -34 -73 -74 244 53 -202 -118 218 162 -170 -311 75 220 -101 -63 -18 161 112
2252A12l11Q0J74o6N4j87J13K25p3k88K4L38K6k48j97J81K34j41k03JK10J61l46
$$ 112 -199 -119 55 -11 43 -144 -31 194 121 -167 -143 195 221 -27 -224 -43 191 50 -153 -152 58 219 -127
2275a27m2J23J63K7l04n2L68o1m5k87J55L35k84j59J91J37L7k39j03K85n9m1k56
$$ -127 -169 -46 117 144 -160 -212 156 95 50 -237 -82 253 -31 -190 1 138 175 -64 -167 118 59 18 -238
2298b38J81L04k76p4J19j1L0k54l5K81L7k1j24p4K82J8j84q1R3J49m6k28O4K14
$$ -238 -57 247 -29 -103 16 5 35 -219 -254 27 64 43 -81 -155 127 145 -39 -120 -27 122 76 -152 -88 126
2322A26l3j28q2O1K48j63j30R3L0Q9j27j69K86p7r5M9j36K94n0k41J65m3Q9l0
$$ 126 93 -35 -117 -56 192 29 -101 -8 22 111 -16 -185 101 24 -71 -22 -158 136 86 -155 10 -33 56 26
2346B6k35K63K8j18O8j61J89R2l01J46kK8P3k16O6J92j33k1n9N0J72j55j21J50
$$ 26 -209 54 82 -36 32 -129 60 152 -149 -3 -5 23 96 -120 -54 138 5 -16 -75 -25 147 -8 -129 21
2370B1j4K2oj82J95M6j62J23j57J02J43k57J53J2j67L05k80M9J60l06K86o3j57
$$ 21 7 29 23 -159 36 82 -80 43 -114 -12 131 -126 27 39 -128 177 -103 -54 106 -200 86 23 -134
2393a34L23l97L25K1k61J25K4J9J25k59L9J85k46L11k57o9K47j51P8k9j73K74
$$ -134 189 -208 117 138 -123 2 26 45 170 -89 -50 135 -111 200 -57 -126 121 -30 48 19 -154 120
2415A20r7o8J01j37R5O5j40P7Mo0J17p0p8R9o7M8J02k32J14J9q3K39k43j5K26
$$ 120 23 -45 56 -81 14 79 -61 16 20 -40 77 7 -71 28 -39 9 111 -121 -7 12 -71 168 -75 -90 136
2440A36k27J62o7k00L83k01m8J54k96L28l2k95L29k19J04J55l88K98o7j41L20
$$ 136 -91 71 4 -196 187 -14 -62 92 -204 124 92 -203 126 -93 11 166 -222 76 9 -132 188
2461A88l47J34J01k77L54j04j68K42k18J04R8k46J98o4l6J96k74N9J94j73J03
$$ 188 -159 -25 76 -201 153 49 -119 123 -95 9 107 -139 59 -5 -41 155 -119 -60 134 -39 64
2482F4j12l6K23j64k8P2q8J30O9k38J06K0JR2k20O9J39j54J03q1m8J84j29l3J32
$$ 64 -48 -84 139 -25 -53 19 -69 61 130 -108 -2 18 19 111 -109 -40 99 -55 48 -33 -81 103 -26 -59 73
2507G3j69J24L1j76K25j35j7J45j92R6K6j40K18j44pJ51j99J50j5j51K22j51j
$$ 73 -96 28 59 -117 108 -27 -44 101 -91 5 31 -109 109 -35 -42 109 -90 60 45 -106 116 -35 -36
2530c6J44k39J44N3j56K01j89lJ90j89Q8l7p7K16j54j8R7j24J46k6j60J70p0M7
$$ -36 108 -131 13 66 -90 111 -78 -81 109 -80 8 -29 -106 110 -44 -62 35 -89 57 31 -129 41 -29 18
2554A8L1j60J33K0m1J1o2P6N9j11J8K4J5J1m8m2Q5j9l9L4k0L4L2j45Q2M5o8O4
$$ 18 49 -111 22 42 1 12 -50 26 85 -26 -8 16 31 42 -6 -48 37 18 -21 13 -7 27 59 -86 -4 41 -27 37
2582C7j12O3Q4j13OJ1j0J12j50mJ24m4L1r5nJ78j09l7J4k8J66q6j51J69m0N1n5
$$ 37 -75 -12 72 -41 -35 -24 -34 78 -72 -76 48 4 35 -60 -65 113 4 -33 -19 -47 119 33 -118 51 11 62 7
2609Gj31J85mn6l2m4J43J2j43M3J2O5m4j29J15O8m8n3n3J04O3r3o2O3P3J7j52
$$ 7 -124 61 57 1 -31 -75 68 80 -63 -20 -8 57 13 -116 -1 67 19 -34 -87 17 80 -13 -75 -12 61 78 -74
2636g4K0J12L8q6q9R6Q1m9j23L7R0L4j10m8O6J15p8j25M0J10Or9q2J53K8p5o0
$$ -74 -54 58 96 10 -79 17 98 49 -74 -37 53 87 -23 -71 -5 110 32 -93 -53 57 63 -36 -118 35 63 -12 -72
2663g2KJ56l9j39K7O7P2p5j08J08P2l5m6q6J79J0j14j21M7K75j13j66M3J09kn0
$$ -72 -70 86 47 -92 -65 2 74 -1 -109 -1 71 36 -10 -96 83 93 -21 -142 -95 180 67 -99 -56 53 51 1
2689Aj10J10Q4m4j09kR3O3j37m6J02N9k7j29L2J20Rr9n2N8J11o7r8M5J06Nr3m6
$$ 1 -109 1 85 41 -68 -70 23 86 -51 -97 5 64 37 -92 -60 60 69 -30 -82 -24 87 20 -78 -33 73 78 -15 -61
2717f1Q9N3o1p9L9J00l4p6j8Q6L2n6o2K3J06m9p7J3O0L7q6o0P6O7n3m4k9Q7J0
$$ -61 28 81 20 -59 -20 80 46 -30 -48 38 70 14 -48 -25 81 32 -45 -32 28 65 -21 -81 -5 62 9 -35 -64 23 33
2746C3m7n0N9N0j9q4J6R2l2k4l9K8Q7o5m8K2L0M2n1n2R7j8rk8l5J02m9l6L6j4
$$ 33 -14 -64 -5 45 26 -58 -42 50 18 -6 -45 -17 70 5 -43 -21 9 51 0 -52 45 27 18 -10 -45 57 8 -28 8 -6
2776fK8nr2J07l4LJ5o6N2K4o6O0l9K1K1n2K7K7l1J7l8L9K4k3j0J4j8L4k1l8O0
$$ -6 22 17 -75 32 -2 1 16 -50 2 26 -40 20 -19 2 23 -29 -2 25 -6 11 -27 12 36 13 3 17 -1 33 12 -26 34
2807C4k8RK1m6K6Ok2Rk4k2O6l1%mn3J15m1o2N6l8M7Nj00R7j9l4P8j05P1N0j04
$$ 34 6 15 36 -10 16 22 0 9 -15 -37 29 -2 -2 -6 -59 56 15 -47 9 -29 18 23 -77 20 1 -33 45 -60 11 61 -43
2838d3N3k6J0O6j16N4L3m6L7l2kR2r8MK4j3M8n7n2J00j5l8Qm7J10Lj30O7K6qK3
$$ -43 10 -16 -6 60 -56 -2 31 -15 22 -10 -12 80 -18 -14 10 -3 45 -12 -64 36 21 -17 -9 -56 54 57 -73 -6 20 12 35
2869C5j20M7J32r2oo8P1J27j51k1L2jJ22j41m7J39n3K1n9l5J68q0p2Q3o4J01o6
$$ 35 -85 -38 94 2 -4 -72 -1 126 -25 -46 -14 -15 107 -34 -81 58 5 26 -33 -68 100 20 -52 31 -33 68 2
2896Bj04J37J3m3j7n2Q9J1j01qM9O0j5j09K8J47o0n2l5M1J17p9j08P5M7M4q8r7
$$ 2 -102 35 48 5 -12 -64 25 36 -65 -73 -24 36 21 -88 -60 87 27 -25 -60 -19 98 19 -89 -14 33 77 -11 -108
2924a08J49L2o2l2l5R9O8j96O1M0J8K4j66Q6J15j20K9p6P0J14j64j0P8pN4j32
$$ -108 41 73 11 -21 -56 43 111 -85 -24 16 34 58 -108 -22 93 -27 2 -74 -4 110 -54 -64 14 7 61 -71
2950g1k4J75m6o4k7J2J62j10r1R5J8J9l5r8J04P4j01j0l9J01M3j48L1L6L4k1j03
$$ -71 -95 80 34 -30 -57 -45 117 7 -84 11 29 48 13 -85 19 93 -8 -18 -57 44 87 -61 -30 6 40 19 -84
2977h4M6J10o1m5j0pJ30j27l2Q6J4L8j05l1J28op0KOO9m1p1O4K7rm7rM8R9j12
$$ -84 -38 72 11 -34 -44 -51 79 -48 -80 6 20 58 -47 -78 50 44 -26 -24 -18 51 10 -61 3 30 21 -26 -35 13 112 0
3007@p3L9P6L4j18k7J06qMp6j3J30m4p3L2k9R3l1j03R8Oj7J6q7Q5M9r7Pj0P6q
$$ 0 -73 -34 42 76 -42 -69 37 29 33 -43 -56 74 30 -43 -11 -40 53 22 -81 17 23 6 22 -65 20 69 -28 -21 -31 45 37
3038C7p4L6LL3j8q1Q0L9n5Jj1J3O3q2j2M9pQn0J8K2J0l8k9M2L4j7m7lM4Rl1j8
$$ 37 -37 -1 2 35 17 -64 16 55 0 1 -10 3 66 -16 -28 21 14 22 -28 -10 12 22 -16 -45 -3 31 14 -33 -36 8 17 -14 -32
3071c2L8J8k3j7K0rK4k2j8M5j1j2j9oN9pm2K2m1O0l0k2L6J5l9K5k5L6j0l2JRQ
$$ -32 6 24 1 -16 4 -5 19 -3 -21 24 13 1 -18 -24 35 28 -14 8 -33 27 -3 -25 11 26 -13 12 -13 23 13 -19 -18 -9 -1
3104amm6M6K3m2K5j1jLj0J8OkRk7K2Oj5RnJ2J2Kk4j0ROj6ljkJ9j7J1%j6J8mK5
$$ -1 -5 -51 -5 18 -24 1 -10 -11 -8 -18 0 6 4 13 -14 8 14 -1 8 3 15 27 29 5 -5 4 10 -6 -9 -10 -12 7 -10 1 1 -15 3 -1 24
3143B4m7lK6k4K0l1K1L7j8j1pMJ3Jj4K1Nkj4MJmRJ8qJk6mK6k1kJj9L0k5j6K5l
$$ 24 -23 -26 0 -24 -4 -35 -14 23 5 -6 -13 -9 4 5 -9 12 17 15 1 5 6 2 11 29 21 22 -4 -8 18 -3 -5 -4 -23 7 -18 -34 -9 -12
3181a2NLPk1K5j8j3OJ0K7j7pj1M9m1kjLK9j4JJj1J6rMK4ok0j8K4k2Pj3KjM7k3
$$ -12 -7 -4 3 -18 7 -11 -24 -18 -8 19 2 -5 -16 33 -8 -10 -11 -8 21 7 8 9 -2 14 5 9 33 27 7 -11 13 -9 -2 -15 -13 -14 33 10
3219A0m4P9qm7l5N6j02J06j06J85j09K3O2p9P2m2j5j9J4lopM2k0m1M4Mj6K4k6
$$ 10 -34 45 37 -10 -45 11 -91 15 -91 94 -15 8 70 -9 63 21 6 -13 1 -2 -8 -15 27 7 -34 10 14 -2 22 -4
3249dNOj4J9Kj6J2lj7jK2%nj9j0J6Rk9L9pj1J0j1Qj8J4K5l8K1Nj8K9PrRj22J06
$$ -4 1 7 -7 12 14 -2 10 7 -10 -11 11 11 6 -13 -23 -7 2 -27 12 5 -6 4 -7 1 -17 -3 22 -16 5 10 -8 21 28 19 28 -94 12
3286A2K0k3On9O5mkl3jK5PLl3kM7l9nj4K0K1ol2M4k0Kj4L0l1M5l0MjJ4j9j0L3
$$ 12 32 9 15 -44 21 17 15 -18 -19 6 13 16 -17 -19 28 -11 -16 -30 -10 11 5 -27 17 -3 -1 -15 15 -16 29 -1 3 2 16 -3 -13 20
3322B0lLj0j2qJ1LpOnK6k7j0Nj1K4kj0K1k5NNj4K1l6J0J6K4j7OopJ2k8K3Qk2P
$$ 20 17 20 10 -2 -10 1 4 -3 3 -2 24 -3 -13 -8 -19 5 3 -7 14 -11 -6 -1 -15 6 -30 -20 -4 20 3 9 3 -4 8 -20 3 11 -11 -4
3360d%OQj0J6k2J0J1k1K3K0l9lJ6oolqJ5okKj8JpK2J2Pj2Nj9J1rlK6rlomK2k6
$$ -4 -4 2 10 0 16 -6 4 15 -6 17 37 -2 -5 11 5 -1 -4 -12 3 -3 -5 -3 -21 -20 -27 -5 7 14 2 7 -12 -1 -10 -13 13 4 1 -5 -9 13 -13
3401a3RNQjKlj2J8k2J0j8L8k7KJ9l0RNk1QQj8K2mnJ7k8K8l4J8Qj1K8k4K3l8M2
$$ -13 -4 1 9 8 10 7 -5 13 -9 1 -17 21 -6 -4 15 -15 -6 -1 -22 -14 -6 -24 -2 -6 -11 6 -22 6 -28 -10 -2 -13 15 -9 14 -24 18
3438A8j3qJ2k0J2KJJ2%J3j4j2lJjK4l6lOK2j3KOoj3PJqJ5nnkLrNqJ0Oj4QjJ9M
$$ 18 5 -3 9 -11 1 3 4 16 16 29 15 3 0 1 0 24 -12 -15 -9 13 0 2 8 2 -11 -4 -3 -11 4 -1 -6 -8 -5 -14 -9 -17 -7 -1 -15 -7 -8 11 15
3481A5k1J9j5K3k2QNRk9LLQ%%j3Nlj0J5nk5PK8%j3j7J9Rqnk4j3P7j3j6k3N1k9
$$ 15 -6 13 -2 21 -1 7 12 21 -8 -5 -2 6 6 6 -7 -2 -5 -15 0 -5 -30 -23 5 5 -8 -25 -6 3 -5 -10 -34 -47 30 17 1 -22 29 0
3519@pOJ2l0J9JRRk6jJ3LJ2m1ORJ9j7rKJJ4k0J5ojQokJkJ0j5J4Lj4PJ1k5J0J0
$$ 0 -7 -1 11 -19 0 1 10 19 -7 -8 5 8 20 -21 -15 -6 13 -4 -13 -11 -10 4 -16 -1 -7 -8 0 -6 -8 -7 -9 1 -14 0 3 -11 -4 7 -18 -8 2
3560Bj7J4J4k0J0Lj0J5l2QJ2MRj8MQj5j1J6K0ln0M0j2oJ4j1LJ4j1j3NK4j2J1j7
$$ 2 -15 -1 13 -7 3 6 -4 11 -21 -13 -1 3 12 -6 -2 6 -9 -20 -4 16 13 -37 3 -9 -15 -1 -12 -9 5 -6 -19 -14 10 -2 9 -8
3596hK6j2MKlnJ5j9kj0M5k1j3J0n%J8j9j3J5Krj2K6k0k6J8JL3ll5kK4j6Oj9J0
$$ -8 18 6 10 12 9 4 19 0 -2 -12 33 12 -1 9 4 4 22 3 -10 5 7 -2 -14 12 -8 -34 -16 -15 18 15 -20 -22 2 -14 -8 -27 -17
3633a7K7jl1K4K2j2j7j4J8ROk4K1jPll0J0L1l3rJ1J8mk6j2K2J1j3k0K5j3Rkj5
$$ -17 10 9 -22 2 24 12 -5 -19 -1 8 14 -10 11 10 17 14 -16 -6 25 -8 -17 -6 12 8 -18 -30 -8 3 -10 -30 -5 -18 -9 -11 -26
3668b6RJ5nj4PJ7Qk2J7rJ7k7OJLL5l9J2J3j2j1j4K0KQj6j0K2Lj4%J7j4k6K0PQ
$$ -26 -17 -2 -7 -21 -14 3 11 -11 6 -3 14 -13 -7 -6 -3 32 -7 5 18 6 -5 -19 1 3 11 -5 -15 7 10 -4 -4 13 -1 -27 -7 0 8
3705HQl0jlJ0%JpMJJ8j8J8jpNJJ1j1lKj7KJ7rKLj0jj8K3JnJj6M1l3Qj0RnqJ4n
$$ 8 16 -14 -15 -18 -8 -8 -7 -14 -10 -9 9 -9 9 8 1 6 7 18 7 4 6 -11 -9 8 -1 1 4 -6 -7 -25 -2 -1 -6 -5 -21 20 -13 -5 -15 -6 -11 -19 -5 -10
3749a0JJ1j8LOJ4qnJ9MLk1m4P0k3K6k2LJ0j6J7k3K2m2K5k4K5j2nJ0qj6J0J7Nj1
$$ -10 -9 2 -16 -13 -7 7 -1 -6 13 17 20 -1 -45 25 2 28 6 9 19 3 20 -3 19 -23 2 -22 3 -9 -14 -4 -12 -28 -18 -1 4 -7
3785gqM6j6m6J2L2j2nk9K6NlOonM0j7k1K0J9j8k3kL2k1L8l7nJ8J8n1j0J6M6m5
$$ -7 -15 31 15 -31 -19 13 1 -4 -33 -7 -2 -5 1 -5 -10 30 13 -8 12 31 13 -10 -12 20 -1 37 0 -5 13 31 -20 -30 -14 32 -13
3820a3j5j1M7rk2l0M6L0l3k3J6K6Mm0J8K5nj1l0J8N0j8m1jM4J3n8%L4K0pk7l3
$$ -13 -28 -39 8 -1 -23 -53 -7 23 -10 -33 -17 9 13 -27 -9 16 11 0 -30 -12 38 20 -21 -22 22 35 -23 -23 11 31 24 -3 -36
3853c6N7jm2PK9Mqn8K3M9j9Qn2M7J9m3rJ2J4L5o9mO9j9j1n2K1Q2k1p4K9L9Rk8
$$ -36 21 20 -22 -15 14 18 10 -48 -25 24 5 13 -39 8 27 -16 -25 -13 1 36 -33 -37 32 13 2 -50 -29 53 32 -42 -13 26 35 7
3887Gn6N1O8m8l1lM3K1o1k7J6M8no6J3N9l6k0qJ3N3l4l8K4L3J5o9OK0O2o2j3O
$$ 7 -49 2 70 22 -9 -12 31 52 -9 -36 -20 28 23 -43 -30 29 -7 -27 -35 -22 31 -3 -41 -17 16 31 -38 -32 -12 50 -12 -25 -19
3920a9N6Nm9j3N3Kmr1O6L6m3Pk8K7N0o1k3L6J4Oo3jK9M0l9l0L5M7k5o1K3L4J6
$$ -19 37 42 -7 -20 33 35 31 -60 6 42 -1 6 -22 5 55 -6 -29 7 21 27 -36 -37 -8 32 -7 -37 -2 45 20 -41 -18 16 32
3953C2n9k9N5M2k9m5L1K0J3n0j2L4M6l9o4M2O1k1m0j9L6L1l1o0M0L3nj8j03Q6
$$ 32 -27 -56 -1 41 12 -33 -2 18 31 -19 -31 3 49 10 -54 -12 49 28 -12 -31 5 36 5 -55 -15 18 13 -5 -108 -22
3983b2O7n8k7J8N9j4n3MM9nj5l6J5P8n0m0NJ4M1m7j3P3m5L5o4J34j12O6lp7M4
$$ -22 45 -13 -40 -22 37 23 -30 -26 23 18 3 -33 -18 60 10 -30 -25 -11 30 -17 -30 43 -2 33 -31 103 -9 57 54 -23 21
4014B1m6J11j32M6J16l7n5pJ2j6k4k3J5O9J3p8J0RMj6k0K3J0J9k3k0L9k7J2j8
$$ 21 -25 86 -46 0 116 79 24 17 29 13 -11 -34 -19 50 63 -15 -5 4 8 -8 -28 -5 5 24 1 -19 20 -7 5 -13
4044a3K1llQj9J3J1j9J5j7%RJ2k2MJ6J1j9k9J9j8KJ1LrK6l4J5J7l2M2l5P%J6j
$$ -13 8 5 2 10 -9 4 15 -4 11 -6 -6 3 15 -7 -3 13 24 5 -24 -5 -23 -21 -10 -7 -16 10 -24 -9 8 -24 18 -17 -10 -10 6 5
4080Ej6KQlL8l6LJ2pjRlLNm0J9J5qk9PJ0klj2RK2nl1J3L8j1l1j0J1L8lm5K2K5
$$ 5 -11 -9 -1 -4 34 -2 1 13 6 5 14 11 14 19 -21 -2 13 5 -24 -17 -7 -9 -12 -24 -15 7 2 -29 -16 22 11 -20 -30 -19 19 16 -29 -7 18
4119A8%jn3O4Ok4k3lM6jk3j6J9Oj3k7K2OMk5j1M0K3k5n0L3M2j4m8JM1J6k8l6L5
$$ 18 18 17 -36 28 34 10 -13 -16 30 29 6 -10 9 15 2 -25 -3 3 7 -18 -29 11 34 9 -41 -8 34 20 -28 -27 14 30 2 -34 1
4154AK9k1k1JL2Lj4k8J3L6ll2j8N7Rn1l4M0N3k8m0PL0ll5j2K4J6j0m8J0O2j6k7
$$ 1 30 9 -12 -11 21 24 10 -18 -5 31 28 -4 -22 35 44 -7 -41 -1 52 24 -16 -9 21 18 -17 -29 -5 11 1 -47 -37 25 9 -18
4188a8k1L6L6k5n1RN2K0n5k2N4L4l1p2N7K8j5l5rM2L7o1j8K5M1ln9kM5J1l2k3
$$ -18 -39 -3 33 8 -43 -34 18 38 -17 -39 15 49 18 -54 3 31 16 -19 -28 14 51 -10 -28 -3 38 35 -24 -26 19 30 -2 -25
4220b5JO1m5lj5N4Mn3j4L8K4l4m3K6N8qn7NJ6N6k1o6J3P2k2l1jL0K2m5l6L1M3
$$ -25 -24 37 -8 -11 -26 28 32 -21 -35 3 27 -7 -50 -24 34 26 -31 -26 -10 46 25 -41 -28 44 22 -9 -10 20 42 -3 -39 -8 35
4253C5ql6l2N5J1k4l4QN1k4m4J3M6J5j8m6L4M1l0j4k7K6J8k4k3L9PQm7J8K9kk7
$$ 35 27 -9 -41 14 25 1 -33 -25 26 2 -42 -29 17 32 14 -32 2 43 13 -1 -28 -2 16 -8 -31 8 15 23 -24 -6 23 21 -6
4286fl5M0L1j9m6K3L2K3n1l0L6K6j6m0J1P5l7l3k2J8K7oj9j4O4k6j2j8L4L0l4
$$ -6 -41 -1 30 11 -35 -12 20 43 -8 -38 -2 24 8 -32 -21 54 17 -16 -38 -20 7 1 -18 -32 32 6 -6 -24 10 40 6
4317Fj4MQL9m0oK9mqj1j2K8nn2M2lK6j4l8L2J2k3j1oK1J6k1kL2l4K7k8jL3l3J
$$ 6 -8 -4 4 43 3 -3 26 22 14 3 -9 19 14 -38 4 1 27 13 -25 7 19 -4 -15 -21 0 16 -5 -7 25 -9 18 -10 -11 22 -11 -10
4353a0J2k8K4klK5%%jl2K6J0m5M1j8K1j0pJ2j0K6k6j1QMk4K1j0kJ6j5J8J0m9J9
$$ -10 2 -26 -2 -4 -7 18 18 18 17 -15 11 21 -24 17 -1 20 10 3 15 5 31 5 -6 2 6 -18 3 -7 -9 7 -8 10 20 -29 -10
4388a0nOOk2PL6oj4jjL2m0J7%JQrk5M3j1Pkj8Qkj9L1Rl4pkJ1J4k9L1JJ0qk9K4
$$ -10 -15 -9 -3 -25 -18 18 12 -2 -3 -4 28 -12 5 5 6 14 5 -20 23 12 19 17 -1 7 5 -14 17 26 -8 -15 -17 -6 8 -21 10 11 21 13 -16 8
4428HokLJk2K5j6j2J5J3J1j5j5j5Q0k3%m5L3K0j9n1m1O9L4o6Q2j07Q8L5j19n0
$$ 8 2 0 3 4 -18 7 -9 -21 -6 7 18 3 -12 -27 53 30 30 -15 18 38 19 -32 -73 -4 30 -36 46 -61 27 62 -57 -107
4460a07J73l7k8n6N9L1m0rK4Nl0j2K3J1k1LjM4j4Om1L3jml2J7K3K6l1n0L4K8P
$$ -107 66 29 1 -55 4 35 -5 -14 10 15 -15 -27 -4 7 -14 -11 -12 32 18 24 -17 16 15 11 -21 -4 19 45 14 -36 -2 26 33
4493C3m2K1J5j6l2kM4mk3k7K4J0J9k5k7M3Ol5J0J1J4k1j4QRM0l8k5L9J0k5LkL0
$$ 33 -9 12 27 11 -21 -23 21 17 -6 -33 -9 1 20 -5 -32 11 17 -18 -8 3 17 -4 -18 -10 -1 39 1 -24 15 25 0 3 1 31
4527C1j8rk3J4J7mnj7K9rjl6L8K6l2k4nM0mj8k2L7LJ0n3J4L2nNj3J7pKl0j0O2
$$ 31 13 4 -19 -5 12 8 3 -14 15 6 5 -31 7 33 1 -23 -28 12 8 -10 -32 5 8 18 -35 -21 11 6 11 -2 15 8 10 -20 -30 32
4563C2l0J7k4J4J7j4k6J0M4l4j7j8M1Lk1mj6N2j1o3K5K1kj6J2Nj7L4m0K1K0ok2
$$ 32 2 19 -5 9 26 12 -14 -4 40 6 -11 -29 12 15 -6 -10 -26 26 15 -48 -23 -2 -4 -20 -8 -3 -20 14 -26 -5 15 9 -13
4596a3QK2kK0m3j2M2rj5l0L0J2J6k7j5K8J6k6j8J1J6Lj5m1M2K5Km1J9R%l5LK4
$$ -13 -5 17 15 35 -8 -20 22 13 -2 -32 -2 10 26 -1 -16 12 28 2 -16 -5 11 14 -1 -42 0 25 27 -14 5 14 14 -21 -18 6
4630FJ7l5rPN8n9K1l9K4L7l4J0m2M8K9Jj0Lk0PNj9J6k5J4l3K9o6N7j7J5N7m1p6
$$ 6 23 -12 -21 -14 44 -15 6 -33 -9 28 -6 4 -38 10 39 40 30 33 13 20 25 6 22 -3 11 -22 7 -59 -2 -19 -4 53 12 -64
4664f4J02l8j04J47q8J39o4p7M8O2q7O8k9j43J14o7N3p6J32p9R7l0p5J17r7N0
$$ -64 38 0 -104 43 -45 94 30 -47 1 63 -24 44 15 -128 -14 -81 -28 -104 28 -51 46 16 -59 58 -39 11
4690A1K5kl6l5L2K5J1K6N2p8o2J8J9L9p8O9j5mK2qrjM0j39J24p4L0LJ1K0o3N3
$$ 11 36 34 -2 -37 -5 20 31 57 109 31 -31 -13 6 45 -33 36 21 17 39 31 22 21 61 -78 46 -28 2 5 16 36 -27 26
4722B6j8Pn9J66j13L2k0J1K3j0r2Q1Lo2M3K7n0K9j6J6o2R6k5m2k2L2jj7K7j5L1
$$ 26 8 15 -44 122 9 41 21 32 55 45 -47 34 37 -25 18 45 -5 24 8 24 -38 58 33 -9 -31 1 0 -17 10 -5 26
4753B6l8L%%J0j1J1K1j3LkJ8l4K3j9N2k2j4J4m7OL0j0n3P9p3N9j5J6QRl9j3j5
$$ 26 -12 -9 -9 -9 1 -10 1 22 9 12 10 28 -6 17 -2 50 28 14 28 -19 -13 17 7 -46 33 -40 19 4 20 28 37 -2 -15 -30
4787c0J01m8m9K5rO5q1j1M2K7l9L1l9K6jRk9K0l0O6n6K4j3L2m4J6j8K5k9K8j0
$$ -30 71 23 -26 -1 -10 55 -26 -37 5 32 -7 24 -15 11 10 19 -10 10 -20 46 -10 14 1 33 -11 5 -13 12 -17 11 1
4818Aj8M2n9OK8lJ6n4K1L8Ol0Jk6J3M5m0j2K6mjNJ1QqpNk4K8k8K3kj4K1nl%l1
$$ 1 -17 25 -34 -28 0 -3 13 -41 -20 18 24 -6 -5 -31 -18 27 -13 -25 1 -3 -4 1 12 20 12 5 10 -14 14 -14 9 7 -7 14 9 6 6 -25
4856b5L7Mk1L3j1m8N2l1k3nM0L6j6o7O9j3N0k6m9j4Jj3K1L2Rj8l2M3K6n2O0q5
$$ -25 12 16 -5 28 17 -31 21 -10 -33 -38 2 38 22 -45 24 11 61 35 -14 -28 -27 -40 -19 13 22 4 -28 15 41 -11 49 -36
4888c6j7K1P3p0K0j11J38N0ojR5o2j11m9P2Q3rj47N9K7o9Q9m4OL7q2L1L7k7L9
$$ -36 -53 -32 41 -29 -9 -120 18 68 62 61 156 94 -17 -66 6 89 80 -67 -8 19 -50 39 -5 1 38 -44 -13 24 -3 36
4918C6n0L1j1MoQJ3l5O6m1k6J0J9Kj3RKprRj0kJ5rk3NK6j9j3K6j0j3K0oj5K5n
$$ 36 -14 17 6 10 4 12 25 -10 56 15 -11 -1 18 20 7 16 18 11 2 11 1 -1 14 5 -18 -13 13 -6 -19 7 -3 -16 4 -2 -17 8 3
4955CJ0mmnNk4L1J5k9J4Rk1Nk5L6Lj0kk4L2pMj0J0j3Kk0K2Lpj2L0l2J3kqK2k7
$$ 3 13 9 5 0 5 -19 12 27 -2 12 21 0 5 -20 16 19 9 7 -17 15 8 12 2 12 -1 1 -19 3 6 -1 -13 17 -15 -2 -4 -12 10 -17
4993a7L1l0J3KjpK2rlK0k2kQqqRLLjpK8m1K3NOqnjrmJ4Mj0j1j0JK3qj7K6LKNj1
$$ -17 14 -16 -3 -1 -2 -9 13 4 1 21 -1 -3 5 -3 -11 -2 1 4 3 -4 24 -17 6 11 17 9 4 3 -6 -10 4 8 -2 -13 -23 -22 1 -7 -24 2 5 7 12 1
5037AJ1k7J7kJ4Oj3mMJLokj6K2j2J2rRpj6j7L1K3k6J6k3K8k1jj1J4LLj6RJ8j4
$$ 1 12 -15 2 0 14 20 7 3 7 8 11 5 3 -13 9 -3 9 0 9 2 -14 -31 0 23 -3 13 -10 18 -3 -4 -15 -1 2 5 -11 -2 16 2
5075BppRK9rk1NL3%m6J3J9kj5rlK4K3l1j6L4lj8j7K7kj9Pj5J4jlk5K5K3j7j7n
$$ 2 -5 -12 -3 26 17 -4 1 34 34 -12 1 20 18 3 -6 -9 15 38 7 -9 25 22 4 -13 14 12 -7 0 -15 -1 -2 -5 -30 -5 18 1 -16 -21
5113b1L3j3j3j0M1j7plJ4OJ1oj3kJ6k0lj0K5Ok4J1J7ql2J2lN2j6No1P9l3J2n3
$$ -21 12 -1 -14 -24 17 0 -7 -10 4 10 21 15 2 0 16 -4 -7 -17 8 14 -10 1 18 10 -22 -10 -13 39 23 28 -33 46 13 25 -28
5148b8K2L6k4j8k4M3L4k9k7l3J5O2o9N2RN9j48P2K0qMm4O9nqm6k4Q2J3j7j43J13
$$ -28 -6 30 6 -12 -36 7 41 12 -15 -48 -33 29 -40 12 21 80 -68 4 24 16 20 -24 45 40 32 -14 -38 44 57 40 -103 10
5180A0Jll5K7M4m4j8n5Q2nL0l9k0O3n9ln1N7M4j34O4M3J05m3m6j2M1n1k4j5P6
$$ 10 11 8 -27 0 44 0 -18 -73 9 4 34 -5 -25 38 -21 -24 -75 -18 26 -108 -44 -1 104 61 15 3 44 -7 -31 -46 30
5211C0J5p0O3J6q8J77j51m9R2k9J05j33LP1m6l1j9J8R9n4l3kK3K7k5n5M1K3%l6
$$ 30 45 -25 38 54 -34 143 -8 -57 35 6 111 -22 -19 52 6 -25 -44 -26 73 19 -14 -16 7 34 9 -46 -5 18 18 -18
5241a8J3LK2k0oK0M5m7k0RK2nk2j1K1J2Lm3K1K6j6nj7J6L3n5j1rN0Nl5kJ8J0k7
$$ -18 -5 -2 20 0 -6 14 59 12 -8 1 23 18 -4 -15 6 18 21 -22 -1 25 9 4 -13 3 36 -19 -30 -39 11 16 -19 -21 -3 7 -20
5276b0j0J6K2ojk5M2J3k1k7L1J0kk9nL5%k0nKJ4%l0mL6j2j5J1j4J9J0k9J5mM3
$$ -20 -30 -14 8 2 1 -24 18 31 10 -17 14 24 22 -7 -12 23 23 3 -2 0 14 14 -16 -20 16 4 -11 0 -14 5 15 -14 1 -3 40
5311D0m2lJ4j3J1KkK1j1k2K3k4K1j9qL7j6JMk2K0Pj1J0k5J2Qk3j2K3nK1j5lnJ2
$$ 40 -2 -5 9 -4 7 9 7 28 17 -5 18 -6 15 -4 -12 25 9 10 14 -8 12 19 8 18 -7 5 13 -10 -22 1 -4 17 2 -1 -6 6
5347Fj7j4K9J0j8pRkmRk1K4j8PMMj6K8kPLk6L6ol9L6l3L8ql8K2K3k3Rk3K6j3r
$$ 6 -11 -25 4 14 -4 -11 -2 -4 -8 1 -20 4 -14 -7 -3 1 -15 13 11 18 21 -5 31 25 -14 22 -11 27 19 -19 3 26 3 12 -11 15 2 -7
5385gJKJ1lk8qL8j2Mk2PM7k4pk7M2J4n7K5J4rl%j0K4K6m6j0K2J9k0l3JM0J1l7
$$ -7 -6 -4 7 4 -24 -32 6 -6 -2 -24 -17 30 6 -1 -28 14 28 -29 -4 10 1 -2 -2 -12 12 38 -8 -18 4 23 3 -30 -29 11 22 -15
5421a5qJ8L0l6rPM0j5m8JM8K3l5k4mN5jn8RN0Ok9l3L4L8j7m8K1K6K1m0k9J1O1
$$ -15 -23 -5 25 -11 -20 -13 27 12 -36 -35 13 36 1 -23 -27 28 27 -31 -22 28 34 5 -28 6 44 27 -21 0 26 47 7 -22 -11 50
5455E0l9m8K8K0Ol2j6K1M1m0j8%M2J6m9m1O5K1Jp6K2N8mn5j6O0L6m3n6M6M5Oo6
$$ 50 11 -37 -9 11 17 -15 -31 -10 31 -9 -27 -27 15 31 -18 -59 6 27 28 -48 -26 32 28 -27 -43 17 53 10 -46 0 45 51 -15
5488a5JL2K7n0l3M0M2k6l8j1O4kn3j0K8N7k4n9J0M1J2m7m4O8K7k2o5L9K5kl9j
$$ -15 -14 18 45 -5 -38 2 44 18 -20 -31 33 31 -22 -32 -4 53 29 -30 -20 21 33 -14 -58 10 37 15 -50 -11 14 12 -27 -28
5520b8N4J4j9m7QO9j0n7j5M6L7n2k5K0M7lp7OL8M3l6n7K7M3qm9qM6N0p2m4O5K1
$$ -28 26 40 21 -26 -18 51 41 -16 -31 15 52 0 -25 -5 42 39 -38 -32 6 49 13 -44 -17 26 18 -31 -39 7 57 -15 -59 6 27
5553B7k9k9%O0ll8l8M8N6m3k3k3N4K1m0l0L8K8k6k5JO4j8l7k0M4K2k9m0J8N1j1
$$ 27 -2 -31 -31 29 26 -12 -50 -2 54 11 -12 -35 19 40 0 -30 8 36 10 -15 -14 50 32 -5 -25 19 41 12 -28 -10 41 30
5585C0o9JM7K1l8l4J8N3k3l7J7K4knk7K4M3n2k3OM2oj9QJ2J4Jm1J2L1k3Nm4N8
$$ 30 -39 -38 9 30 -8 -42 -24 29 6 -31 -14 10 8 3 -24 0 43 -9 -32 -26 16 10 -9 -1 11 25 26 -15 -3 28 5 10 -34 24
5619B4Oj7k4nM5k6n6K9L8jk3l%K6j6j8J4K1Ll4jJ2J4jLj6L0J6l4k2K9j2QMk3P
$$ 24 30 13 -11 -16 29 3 -53 -24 14 13 -10 -13 -13 13 -3 -21 -7 14 17 -17 -18 -6 8 7 10 -6 24 40 6 -16 13 1 9 13 -10 -3
5655cK7k2j1%J5Jjj0k6M8k6j7L0qmK1j0jj3J1Rk9K0kpJ1j4K9k3J1Mj5J6QMk0k4
$$ -3 24 2 -9 -9 6 7 6 -4 -30 18 -8 -25 5 -3 -7 14 4 3 -10 1 10 -19 1 -1 -8 3 -11 18 -5 6 10 -5 11 19 23 3 -21
5692b1K4LNl1M9m8M0l8J0L1j9rj3%J5j5J0j4JN6m1j8NL1k7mJ7K6j5l0OJ8K6n4
$$ -21 3 6 11 -20 29 -19 21 -17 -7 24 5 -4 -17 -17 -2 -17 -7 -21 -20 36 -5 -23 -18 13 -14 -18 -1 25 10 -20 -14 4 30 -24
5726b4K4j0L8Lj10O1K7J0Pj9l4Q6n7Rm2P0k6l7j6K3K7j0n3K4M9j1j7l5L1N5n2
$$ -24 0 -10 28 31 -79 -18 9 19 26 7 -27 59 2 11 -31 39 13 -24 -40 -17 10 0 -53 -29 20 9 -8 -43 -12 43 -9
5757ik3K7J3K2m3j1N3K1m3m9M3M0k1n4J3N2Nm9k6L9M0l5l2K8J7K3p3l4P3L2k6
$$ -9 -32 -5 8 30 -13 -24 29 50 7 -42 1 41 20 -34 -21 31 36 -13 -39 0 40 5 -27 1 18 41 -32 -66 7 39 13
5788A3m4J2N3rm3k7O1K2k3n7J6P3j2n9j9N4K7m2l2L6L7Ko8OO9kn5l0L1O1m9k9
$$ 13 -31 -19 34 25 -18 -45 16 38 15 -42 -26 47 35 -24 -43 11 38 -4 -36 0 37 39 -29 -23 46 44 -11 -41 -10 51 2 -27
5820b7k4O8J9m1n0O2L6m8l7J3N6K6p2j4M3L4l9o1L6N1po1J4L2L5m9k0J2N3k8r
$$ -27 -51 17 36 -5 -55 7 43 -5 -42 -29 27 53 -19 -33 10 44 5 -56 -20 31 24 -37 -23 9 44 -5 -25 -13 40 12 3
5851CpM2j1l6j8K2M9j3p0qO2J6n5k6M4K0j5m0LM4J8n6j1M1L9l1m0J3M6J7n0k1
$$ 3 -4 38 27 -9 -27 -5 44 31 -39 -47 15 31 -24 -50 -6 14 -1 -41 -38 6 24 -32 -43 -2 37 6 -34 -21 25 42 -8 -29
5883b9N1K9n0k0PM3Jl8mL4J3j2n5K7K6J0n1%K8krl8M5K5k1k6J4J9Jn1K2J0L7k5
$$ -29 22 51 1 -19 -12 31 32 -6 -10 24 37 25 -30 -3 23 33 -18 -18 10 8 -1 -39 6 31 10 -16 -2 17 18 -33 -11 -1 36 11
5917A1m3K8L5nj3m0L2L2l8oJ6K2kl9kN2j4m1j0L7Jnk6j7M5J3k6j9JK9Kl3J3NK0
$$ 11 -32 -4 31 26 13 -27 5 37 -1 -7 9 31 29 -10 -12 40 26 -15 -25 12 13 8 -18 -35 10 23 -3 -22 -21 8 10 -23 -10 -5 15
5952A5k5j5QM0l6pjM6k7jpJ5J7j2k8L0J3k0Rj8OJ2%KJk9PnJ5jL%rOojPjj8LJ6
$$ 15 -10 -25 -17 23 -13 -20 -21 25 -2 -3 -10 5 22 10 -18 12 25 5 14 -4 2 14 14 16 17 -12 -5 -10 5 4 7 7 -2 4 -2 -3 4 3 -15 -12 4
5993DLNj8onM8k2j0j2J7QOj2nL5m8K0oK5nj7j5L8lm0L2j4K0k3j8J7NOj3m0M6J5
$$ 4 7 12 -6 -12 -17 31 9 -1 -13 4 12 18 6 1 36 -12 8 2 27 22 5 -10 28 25 -15 17 3 23 0 -18 -1 4 10 -3 -43 3 18
6030A8j6l3K1RPprL2pk2mMK9J5n4KJ8OoQJ7k1j4%J3K7qJ1l9pNJOoJ5Lk5NJ2lj2
$$ 18 2 -31 -10 -1 6 -1 -10 22 15 -7 -11 -7 22 37 -17 -15 3 9 3 11 28 7 -7 -7 6 33 25 36 -3 -10 -5 -4 2 -4 11 14 -11 -6 6 3 -9
6071ik6K0J5L0l6KK0Oj6j5J4K5om2J4K4j3Kk5L8nj1Pl0M8Kk1k1J1K1k0k1oN4k5
$$ -9 -35 -15 0 30 -6 -4 16 22 6 -9 5 30 24 -18 -4 20 7 9 -16 22 17 6 13 -17 31 33 12 -9 2 23 3 -18 -24 30 5
6106El8n3J09L0p8N9n8N6nn8l4J12ln4k3l6n2J95j03jj8K2O2JMr6J26n2K3L7K8
$$ 5 -33 -86 23 53 -25 34 -24 32 27 -31 -65 47 44 -10 -33 -69 -121 74 -29 -30 -48 -26 36 37 41 -55 71 19 42 79 107
6137A07j51J9J62j01j2j04J1O2k%J4k9J09r5L6K4q8j1P2r1R7m3m8j0Q3K0o6M2
$$ 107 -44 -25 137 36 24 -80 -69 -7 -9 -9 5 -24 85 -10 26 50 -38 -49 23 -68 29 -14 -62 -72 11 31 -35 7
6165GQK6j8k0p%K1k3J5JnRj9K6k4J6j4nOK9m0J6j4J7lj5%lK1lqqJ1J8k0rRR%j4
$$ 7 15 41 23 3 -4 -4 17 -6 9 10 5 14 -5 21 -3 13 -1 -6 0 29 -11 5 -9 8 5 -10 -10 -13 8 5 -3 -11 0 18 -2 -11 -2 7 7 -7
$$ [...]
8190bM
8191B
##END NTUPLES=NMR FID
##END=
