##TITLE=1H_2PEDM2307
 CDCl3, 8 sc, 
 24.7.2019
##JCAMPDX= 6.0         $$ Bruker NMR JCAMP-DX V2.0
##DATA TYPE= NMR FID
##DATA CLASS= NTUPLES
##ORIGIN= UXNMR, Bruker Analytische Messtechnik GmbH
##OWNER= root
$$ XWIN-NMR		Version 3.5
$$ Wed Jul 24 14:19:23 2019 Russian Standard Time (UT+4h)  she@DPX200
##.OBSERVE FREQUENCY= 200.13155
##.OBSERVE NUCLEUS= ^1H
##.DELAY= (6, 6)
##.ACQUISITION MODE= SIMULTANEOUS
##.ACQUISITION SCHEME= undefined
##.AVERAGES= 8
##.DIGITISER RES= 18
##SPECTROMETER/DATA SYSTEM= spect
##.PULSE SEQUENCE= zg30
##.SOLVENT NAME= CDCl3
##.SHIFT REFERENCE= (INTERNAL, CDCl3, 0, 15.7039)
##AUDIT TRAIL= $$ (NUMBER, WHEN, WHO, WHERE, WHAT)
$$ ##TITLE= Audit trail, XWIN-NMR		Version 3.5
$$ ##JCAMPDX= 5.01
$$ ##ORIGIN= Bruker BioSpin GmbH
$$ ##OWNER= she
$$ F:/spectra/data/she/nmr/H-F/1/audita.txt
$$ ##AUDIT TRAIL=  $$ (NUMBER, WHEN, WHO, WHERE, WHAT)
(   1,<2019-07-24 14:18:16.25 +0400>,<she>,<DPX200>,
      <created by zg, POWCHK disabled, PULCHK disabled
       configuration hash MD5:
       00 E9 B6 7A A2 85 ED C7 34 08 36 98 17 FE 4E 26
       data hash MD5: 16K
       FB 9F 8B 62 A9 75 61 E3 1B C5 E0 1B FB 62 87 EE>)
$$ ##END=
$$ 
$$ hash MD5
$$ 25 BE 49 6E 08 85 CF E1 5F 57 B6 66 25 9B C1 7A
##$RELAX= 
##$RELAX= 
##$RELAX= 
##$RELAX= 
##$RELAX= 
##$RELAX= 
$$ Bruker specific parameters
$$ --------------------------
##$DU= <F:/spectra>
##$EXPNO= 1
##$NAME= <H-F>
##$PROCNO= 1
##$TYPE= <nmr>
##$USER= <she>
##$AMP= (0..31)
100 100 100 100 100 100 100 100 100 100 100 100 100 100 100 100 100 100 
100 100 100 100 100 100 100 100 100 100 100 100 100 100 
##$AQSEQ= 0
##$AQ_mod= 1
##$AUNM= <au_zg>
##$AUTOPOS= <>
##$BF1= 200.13
##$BF2= 200.13
##$BF3= 200.13
##$BF4= 200.13
##$BF5= 200.13
##$BF6= 200.13
##$BF7= 200.13
##$BF8= 200.13
##$BYTORDA= 1
##$CFDGTYP= 0
##$CFRGTYP= 5
##$CHEMSTR= <none>
##$CNST= (0..31)
1 1 145 1 1 1 1 1 1 1 1 1 1 1 1 1 1 1 1 1 1 1 1 1 1 1 1 1 1 1 1 1 
##$CPDPRG= <>
##$CPDPRG1= <>
##$CPDPRG2= <>
##$CPDPRG3= <>
##$CPDPRG4= <mlev>
##$CPDPRG5= <mlev>
##$CPDPRG6= <mlev>
##$CPDPRG7= <mlev>
##$CPDPRG8= <mlev>
##$CPDPRGB= <>
##$CPDPRGT= <>
##$D= (0..31)
0 1.2 0 0 0 0 0 0 0 0 0 0.03 0 0 0 0 0 0 0 0 0 0 0 0 0 0 0 0 0 0 0 0 
##$DATE= 1563963495
##$DBL= (0..7)
120 120 120 120 120 120 120 120 
##$DBP= (0..7)
150 150 150 150 150 150 150 150 
##$DBP07= 0
##$DBPNAM0= <>
##$DBPNAM1= <>
##$DBPNAM2= <>
##$DBPNAM3= <>
##$DBPNAM4= <>
##$DBPNAM5= <>
##$DBPNAM6= <>
##$DBPNAM7= <>
##$DBPOAL= (0..7)
0.5 0.5 0.5 0.5 0.5 0.5 0.5 0.5 
##$DBPOFFS= (0..7)
0 0 0 0 0 0 0 0 
##$DE= 6
##$DECBNUC= <off>
##$DECIM= 24
##$DECNUC= <off>
##$DECSTAT= 4
##$DIGMOD= 1
##$DIGTYP= 9
##$DL= (0..7)
0 120 120 120 120 120 120 120 
##$DP= (0..7)
150 150 150 150 150 150 150 150 
##$DP07= 0
##$DPNAME0= <>
##$DPNAME1= <>
##$DPNAME2= <>
##$DPNAME3= <>
##$DPNAME4= <>
##$DPNAME5= <>
##$DPNAME6= <>
##$DPNAME7= <>
##$DPOAL= (0..7)
0.5 0.5 0.5 0.5 0.5 0.5 0.5 0.5 
##$DPOFFS= (0..7)
0 0 0 0 0 0 0 0 
##$DQDMODE= 0
##$DR= 18
##$DS= 0
##$DSLIST= <SSSSSSSSSSSSSSS>
##$DSPFIRM= 0
$$ [...]
##$SUBNAM2= <"">
##$SUBNAM3= <"">
##$SUBNAM4= <"">
##$SUBNAM5= <"">
##$SUBNAM6= <"">
##$SUBNAM7= <"">
##$SUBNAM8= <"">
##$SUBNAM9= <"">
##$SW= 24.9336996594482
##$SWIBOX= (0..15)
0 0 2 0 0 0 0 0 0 0 0 0 0 0 0 0 
##$SW_h= 4990.01996007984
##$TD= 16384
##$TD0= 1
##$TE= 0
##$TE2= 300
##$TE3= 300
##$TEG= 300
##$TL= (0..7)
0 120 120 120 120 120 120 120 
##$TP= (0..7)
150 150 150 150 150 150 150 150 
##$TP07= 0
##$TPNAME0= <>
##$TPNAME1= <>
##$TPNAME2= <>
##$TPNAME3= <>
##$TPNAME4= <>
##$TPNAME5= <>
##$TPNAME6= <>
##$TPNAME7= <>
##$TPOAL= (0..7)
0.5 0.5 0.5 0.5 0.5 0.5 0.5 0.5 
##$TPOFFS= (0..7)
0 0 0 0 0 0 0 0 
##$TUNHIN= 0
##$TUNHOUT= 0
##$TUNXOUT= 0
##$USERA1= <user>
##$USERA2= <user>
##$USERA3= <user>
##$USERA4= <user>
##$USERA5= <user>
##$V9= 5
##$VALIST= <valist>
##$VCLIST= <CCCCCCCCCCCCCCC>
##$VD= 0
##$VDLIST= <DDDDDDDDDDDDDDD>
##$VPLIST= <PPPPPPPPPPPPPPP>
##$VTLIST= <TTTTTTTTTTTTTTT>
##$WBST= 1024
##$WBSW= 4
##$XGAIN= (0..3)
0 0 0 0 
##$XL= 0
##$YL= 0
##$YMAX_a= 45836
##$YMIN_a= -53850
##$ZGOPTNS= <>
##$ZL1= 120
##$ZL2= 120
##$ZL3= 120
##$ZL4= 120
##$ABSF1= 10
##$ABSF2= 0
##$ABSG= 5
##$ABSL= 3
##$ALPHA= 0
##$AQORDER= 0
##$ASSFAC= 0
##$ASSFACI= 0
##$ASSFACX= 0
##$ASSWID= 0
##$AUNMP= <proc_1d>
##$AZFE= 0.1
##$AZFW= 0.1
##$BCFW= 1
##$BC_mod= 2
##$BYTORDP= 1
##$COROFFS= 0
##$CY= 11.3945322036743
##$DATMOD= 1
##$DC= 2
##$DFILT= <>
##$DTYPP= 0
##$F1P= 18.9103706918063
##$F2P= -1.10871071338519
##$FCOR= 0.5
##$FTSIZE= 0
##$FT_mod= 4
##$GAMMA= 1
##$GB= 0.15
##$INTBC= 1
##$INTSCL= 1
##$ISEN= 128
##$LB= 0.24
##$LEV0= 0
##$LPBIN= 0
##$MAXI= 10000
##$MC2= 0
##$MEAN= 0
##$ME_mod= 0
##$MI= 1.114404
##$NCOEF= 0
##$NC_proc= 0
##$NLEV= 6
##$NOISF1= 3.799351
##$NOISF2= 2.8
##$NSP= 1
##$NTH_PI= 0
##$NZP= 0
##$OFFSET= 15.70392
##$PC= 1
##$PHC0= -8939.603
##$PHC1= 11.60096
##$PH_mod= 1
##$PKNL= yes
##$PPARMOD= 0
##$PSCAL= 0
##$PSIGN= 0
##$REVERSE= no
##$SF= 200.130013532006
##$SI= 16384
##$SIGF1= 3
##$SIGF2= 2
##$SINO= 400
##$SIOLD= 16384
##$SREGLST= <1H.CDCl3>
##$SSB= 0
##$STSI= 0
##$STSR= 0
##$SW_p= 3612.71676300578
##$SYMM= 0
##$S_DEV= 0
##$TDeff= 0
##$TDoff= 0
##$TI= <>
##$TILT= no
##$TM1= 0
##$TM2= 0
##$TOPLEV= 0
##$USERP1= <user>
##$USERP2= <user>
##$USERP3= <user>
##$USERP4= <user>
##$USERP5= <user>
##$WDW= 1
##$XDIM= 8192
##$YMAX_p= 0
##$YMIN_p= 0
$$ End of Bruker specific parameters
$$ ---------------------------------
##NTUPLES= NMR FID
##VAR_NAME=  TIME,          FID/REAL,        FID/IMAG
##SYMBOL=    X,             R,               I
##VAR_TYPE=  INDEPENDENT,   DEPENDENT,       DEPENDENT
##VAR_FORM=  AFFN,          ASDF,            ASDF
##VAR_DIM=   8192,          8192,            8192
##UNITS=     SECONDS,       ARBITRARY UNITS, ARBITRARY UNITS
##FACTOR=    0.0002004,     1,               1
##FIRST=     0,             0,               0
##LAST=      1.6414764,     0,               0
##MIN=       0,             -53850,          0
##MAX=       1.6414764,     45836,           0
$$ Real data points
##PAGE= N=1
##DATA TABLE= (X++(R..R)), XYDATA
$$ [...]
442D319l817m137m78L262M225J284l180n010j526L506M824J399k793m484k172
457d778K340N051K426k809m999k081K413M537K624j749m800l104J693M734L059
472D557j298m419l418J020M628L496j057m366l506N13M282M070m19m504l801M50
488c772L741L756N67l609m731n30M401M242r1l294l635j410K506N147K036l859
504A465n153p27L144L655J818j590m843l094K886N470J482k861l505j969O79M107
520I64M032j517n687k676K612L726J896k84l152m218J8N292L996j909m384k257
536c548M24K615L943J182m171m917M71M501K949l81k228l165j913K455N160J441
552D818l962m142j36K406K706J752j050m095k662K457M520J002k576k674j125
$$ y = [4319, 502, -3635, -4113, -851, 3374, 4658, 1478, -3532, -5058, -1552, 3272, 4671, 1878, -2606, -4778, -2438, 2613, 5039, 2230, -2769, -4850, -2437, 2100, 4724, 2975, -1825, -4929, -3236, 1498, 4557, 3259, -1160, -4578, -3558, 1070, 4566, 3509, -857, -4363, -3850, 432, 4502, 4083, -421, -4222, -3772, -31, 3725, 4292, 683, -4048, -4578, -177, 4065, 3974, 680, -2955, -4365, -1859, 3288, 5324, 1465, -3688, -4415, -1271, 2384, 4202, 2612, -2231, -5325, -2439, 3031, 4513, 1652, -1853, -3822, -3143, 964, 4996, 3479, -2208, -4884, -2272, 1454, 3350, 3066, -86, -4304, -4286, 1006, 5002, 3093, -1291, -3548, -3124, -509, 3434, 4616, 445, -4472, -4001, 500, 3449, 3068, 840, -2325, -4238, -1783, 3377, 4818, 856, -3286, -3422, -1016, 1690, 3442, 2392, -1703, -4365, -1908, 2612, 3614, 1038, -1636, -2761]
567b761O29K865K950j023m433k125K454L182O94r88j864k460j52L933L425j943
583B383m553j319J992K111J722P91k717m398J42N044K988k051k895j366q47J302
599a671M569K195m292m954Q32L526J468N98K51l177l944J913N656J019l601j903
615a515J55o65J091L925O15m625k629K720K299o73L0M16k308j757K886L081j851
632A195k930N13J288l02O24J399j477k827Q56L308N74k133j194L0q0J025K256
649B125K49k950k413J240K863J091q56j333j466r68J393L373J101l130l082O73
665b090K018Q17R78O89k644l465J526M329L19k525j00J69k345K54M628J005m702
682a139j660L211K44k312K121K780l494l453L547L027l359j581L649R1m132R96
$$ y = [-2761, -2132, 733, 3683, 2660, -1773, -3898, -1444, 1738, 2432, 1444, -420, -2880, -3032, 901, 4326, 2383, -2170, -3489, -1497, 614, 2336, 3127, 410, -3988, -3846, 1198, 4186, 2135, -760, -2126, -2973, -1671, 2898, 5093, 801, -4153, -3321, 205, 1673, 2271, 2522, -655, -4599, -2686, 2970, 3989, 388, -1515, -1360, -2025, -934, 2991, 3606, -1019, -3648, -928, 1371, 698, 728, 1144, -1164, -2921, -35, 3046, 1195, -1735, -1222, 66, -236, 388, 1787, 310, -2517, -1661, 1647, 2221, 88, -1106, -1076, -1156, -131, 2125, 2374, -576, -2989, -1749, 1114, 2205, 1349, 16, -1450, -2418, -1025, 2348, 3449, 319, -2763, -2090, -72, 745, 1723, 2412, -232, -3697, -2171, 2158, 2477, -48, -148, 21, -2324, -2070, 2558, 3563, -1139, -2799, 412, 656, -1656, 465, 3245, -249, -3702, -155, 2872, -487, -2068, 1581, 1672, -2460, -1464]
698a464M210j907l812K821L294l392k558L523J213l701M39M352j389m826J327
713a870M115j260k333K263R05l808q90M313J514l087j103J424o84j121K220K105
729B703j921k627L77J465L59K69M90o60j571n50J243J684J25j398q09M06p1k95
747g81J356J353j617k144J044J579j014l70K133j52l179j30L040j9k096J294J707
764B004k776k133L187K236k637j045K429p21l152J640L835j469l265J391J657
779A181k301m72L579L66l868m77K937l31j969J816J827k746k076K567J676k110
795d01m91K208n30k635P09K580o59j805J091J140j828j133K042J220j541o44J254
812E77l70j729P66K382k71k117j21J059n56m43J837J038k276j931J456J692o12
$$ y = [-1464, 2746, 839, -2973, -152, 3142, -250, -2808, 715, 1928, -1773, -1334, 3018, 1629, -3197, -1870, 2245, 985, -1348, 915, 1820, -1988, -2878, 1435, 2949, -138, -1241, 183, -501, -1622, 598, 2703, 782, -1845, -1468, -3, 356, 625, 1115, 455, -1116, -1666, -423, 1261, 1386, -12, -821, -415, -486, -781, 575, 1928, 311, -1833, -789, 790, -224, -594, 1539, 1387, -1792, -1922, 1118, 1099, -997, 297, 2004, -772, -2905, 282, 2518, -119, -1164, 1265, 544, -2608, -968, 2867, 1398, -1867, -476, 1181, -1120, -1592, 1987, 2353, -1515, -1992, 945, 614, -1355, 461, 2288, -458, -2534, 33, 1709, -401, -892, 1316, 786, -1849, -1140, 1440, 781, -1024, 67, 1207, -621, -1754, 288, 1508, -33, -677, 577, 207, -1522, -756, 1626, 1355, -762, -883, 176, -380, -823, 1014, 2052, -224, -2155, -699, 993, 381]
829C81k27J023r06k372O44K970K87k042k99O45j045l32K397J154k425j711J402
846d56R33p63N05J235j279k029R38K013l66j132M47K90j064q4J402L11j207l45
864f51Q16J59n93l4M71M7k85M3L27k05p32M7J172M86j092p53N64K30m24Q16J126
885A535j319k038Q42K021l10q31P92l24k201L68L121L07k590l45J287r75o45K628
903A323J126l211j680K485J038j628O58J699k112k413K353K606j844j629J674
918D45R5k224R56K882j153k853J098J997j322r37J961J80k483J67K543l78k046
935a072O84J305j161n86J700J31k032nJ857p2j154M40L99j182o7J690K45j498
953c78l23O30j62Q3J033j20j508k78J062K91j41M28l79j333J33J563K83r12q1
$$ y = [381, 154, 1177, 271, -2101, -1457, 1513, 1800, -242, -541, 104, -941, -1273, 1124, 2278, -147, -1858, -456, 477, -286, 219, 1454, 175, -1854, -916, 1097, 731, -401, 46, 336, -728, -812, 590, 901, -306, -651, 165, 324, -269, -303, 168, 215, -70, -27, 300, 95, -637, -590, 582, 1068, -24, -777, -213, 17, -407, 409, 1535, 216, -1822, -980, 1041, 731, -100, 692, 368, -1833, -1465, 1656, 1963, -627, -972, 315, -660, -1305, 1323, 2449, -762, -2442, 43, 1081, -547, 111, 1810, -302, -2715, -362, 2244, 400, -1229, 445, 540, -1684, -728, 2154, 1001, -1852, -754, 1243, -79, -1016, 945, 1125, -1358, -1191, 1352, 974, -1072, -388, 917, -244, -830, 870, 1001, -1031, -1036, 821, 749, -405, 35, 434, -748, -815, 875, 1120, -378, -701, -71, -233, -150, 883, 763, -745, -1023, 39, 330, 189, 617, 238, -1095, -962, 601, 884, -28, -109]
972a09N7p84K08J588R4j543l00Q44j39k29J074J35j693l98J613M28j083J44O75
991E82r72o85J542Q77j522q33J162K91q56M95Q87j086j122J199J130r43o57P18
1009B07j42q99P54J290q47j390N57Q97m30j27P77l87j291L32J391m7q74Q2J81
1028C4n99J24J141M2j135k82O86P0j79M63R0q92k85Q40M30m41j92J45k90j26O18
1049B62L31o11m00L35K01q0J80Q4m73k97M81M21k51k71K1j17l9M09K78m33m10
1070c79J60K37M7J32L8m20l39L76M79j15k71m6j11j14L41M04k27m97k2K89J08
1091G0M1R8j96l75R5M70J31k72j60j1p2J45L42K1m25k24K23K20M5K5p7k98j28
1114c12L38L18j39k57n9l7K1K50K25k29l82K7K63O6k5N4j35k70P9L65M2k70n7
$$ y = [-109, -52, -836, -628, 960, 1054, -489, -789, 55, -84, -313, 761, 896, -797, -1195, 418, 846, -237, -93, 582, -390, -1075, 467, 1344, -178, -1011, 151, 442, -414, 81, 968, -118, -1240, -41, 1089, 146, -511, 207, 65, -834, -80, 1210, 363, -1027, -470, 427, -3, -130, 647, 260, -1031, -699, 692, 645, -229, -147, 34, -565, -441, 700, 742, -393, -675, 11, 81, -98, 365, 455, -437, -722, 118, 548, 107, -85, 60, -230, -356, 262, 593, -18, -418, -83, 118, 38, 218, 302, -171, -468, 13, 434, 183, -88, -67, -184, -223, 186, 464, 31, -379, -219, 18, 65, 197, 235, -185, -524, -148, 331, 216, -55, -101, -212, -326, 15, 419, 192, -305, -327, -38, 70, 111, 209, 13, -362, -267, 203, 334, 62, -98, -109, -181, -36, 306, 327, -98, -322, -99, 121, 166, 191, 114, -184, -312, 26, 344, 205, -52, -111, -148, -127, 123, 348, 119, -263, -236, 27, 93, 68, 122, -13, -283, -204, 161, 203, -67, -124]
1137a24R8p9j4K46L9l17r3K74J07j95NJ10j35j11K56J64k63j89K06J15j02N2J05
1160A55j93k14K43K79j49j96Q3j6j25J56K61j43l10J3K03K8j2N9p3k32J3K46J03
1183A79j31r8l1l4M9J51K2j18j02j2Q6R8kq1n5kJ1M9R5oj62m7J52M3r7K6Q6q9
1211b0j05J55R9j46m8J23J4j41O0J28j06j02J70O9j91o6J74M0j53L4J46j09j75
1234a50J06J93q4j40M4N5o1l6J05O7j11j17M8J30m2q9P6O6j28j27J96J51k01j22
1258a71K35N5l24K3L94o3l79J29L38k72k94M50K53m97j89M90J1m86K47N43m11
1279H2n73M72M47n12j77O19o4q15K21Q44k60o96L70M40o26k66Q65J94q98j29P41
1300B79j10n67M16M90o39m71O75L39n92p2N24j85n40L62N06l97l51L77J56l77
$$ y = [-124, -26, -105, -119, 127, 166, -151, -244, 30, 137, -58, -53, 57, -78, -189, 67, 231, -32, -221, -15, 100, -2, 50, 155, -38, -252, -9, 270, 121, -75, 8, -8, -133, 23, 284, 141, -169, -156, 47, 75, 63, 122, 49, -183, -170, 76, 179, 48, -50, -81, -115, -66, 85, 107, -11, -113, -125, -39, 59, 57, -24, -79, -81, -70, -21, 74, 68, -94, -141, 11, 54, -43, -17, 69, -20, -125, 30, 129, -17, -65, 58, 72, -69, -9, 119, 13, -89, 81, 150, -41, -107, 67, 107, -46, -12, 134, 25, -150, -44, 149, 65, -75, -31, 24, -37, -73, 32, 99, -12, -129, -81, 49, 7, -82, -6, 60, -68, -195, 1, 152, -49, -171, 64, 119, -205, -182, 212, 149, -230, -101, 237, -35, -329, 121, 374, -123, -312, 178, 189, -297, -50, 493, 82, -491, -19, 428, -84, -261, 358, 294, -521, -300, 544, 284, -412, -42, 398, -228, -494, 371, 565, -333, -462, 279, 169, -398, 18, 508, -131, -602, 73, 412, -180, -252, 272, 87, -453, -91, 415, 18, -333, 44, 200, -177]
1320a77K1L69j29l05K14K09k43r4J80Pr2J39K8k40l5K27%n7J66j12m03J08N05
1343B86n4l20J48N4m89N9P82J4p53m0M72k72k48P37K94j002m19Q70K63o35K14
1364c9O12o73q05Q14Q62p09n49O69O1q55K64J071l52j007L91P53n92m19Q19K35
1384E51r43q2R48j20q57L22P31m38n51N58L23p21j75Q34J50p31j33M77j34k69
1404b60M51L30n57n06L30L94l6LO4l37l65K41N20J27k81k93j32K8K52L14O4k88
1426F3m23o1L81L44r2j85p4j60j27L56M41k28n05M0L19r8r5L41M5n21q7N17R1
1449B82m35K2L73j72l06K97K46m32j99N22J83n08j18L79j15l14M18M04n78n33
1469e84M66M49l12j20L81k12o81K58Q89p0p11ML07k62j01O75K17q00m28N56L32
$$ y = [-177, -156, 213, 84, -221, -7, 202, -41, -135, 45, 52, -40, 99, 127, -113, -148, 79, 79, 22, 188, 76, -327, -219, 286, 232, -88, 60, 114, -375, -316, 466, 480, -273, -313, 159, -113, -361, 376, 670, -332, -751, 119, 382, -253, -39, 573, -100, -905, -91, 771, 62, -487, 182, 243, -612, -348, 723, 371, -636, -245, 508, -84, -503, 316, 551, -392, -474, 474, 354, -503, -181, 550, 112, -439, 119, 442, -279, -454, 380, 530, -201, -334, 143, 9, -260, 191, 521, -36, -542, -212, 182, 146, 149, 213, -124, -489, -248, 272, 399, 118, -175, -307, -279, -27, 287, 351, 63, -360, -421, -40, 304, 212, 27, -47, -207, -334, 22, 463, 235, -270, -230, 89, -9, -104, 237, 282, -239, -326, 191, 282, -153, -131, 242, 70, -236, 61, 307, -125, -324, 198, 381, -127, -245, 134, 19, -295, 123, 527, -51, -584, -118, 331, 19, -101, 280, 68, -613, -355, 534, 464, -247, -243, 64, -198, -299, 376, 593, -207, -635, -79, 253]
1490B53k39R1K42m55n06M67O69k50m46J42N8l28J37O12n5o69r7M63M7k17J89J62
1512B70l73k67L81L11k72k24J94O0j92L7K32j00k52J07K57p6k45L4J47o0pJ61
1534A23lk97j24K88K53j30j88Nk6p8J63L30o8m45j57K99J90m1M8K3l34k30L42
1557e7M29j33l21j5J4j21J72L87r7m74n2K97J1n9J87J8l87j30M16J64k75p4K07
1580A07j20k20K15K89k61k63K28J95k07j10K21J5k37O7K75j16k82P5K32m8j03
1601d8J04ok16J8K97N9k20j01Q9k6k0J87J09k20k06R4J83J2l0Nr6j19O4J92O2
1626A67j34j12J0K9K3Q0M2j03j37M0J33L6p0j9J2o1j8J16O8j38o6Q5M4m6qP8m7
1653Dj03O6J30o1j10N6P4o8j7Q6J6j33j9J54Rj17KQ8n8p0J06Q1j28q3J11O5p9
$$ y = [253, 14, 105, 347, -108, -614, -147, 522, 272, -174, -32, 26, -302, -165, 447, 392, -277, -374, 89, 136, -81, 108, 270, -103, -370, 11, 322, 50, -174, 20, 80, -112, -75, 157, 57, -195, -88, 169, 93, -152, -118, 29, -31, -38, 123, 120, -177, -301, -13, 240, 110, -78, -73, -99, -177, -14, 316, 248, -197, -354, -55, 135, 94, 142, 165, -169, -399, -57, 372, 239, -82, -97, -83, -204, -32, 355, 258, -216, -268, 29, 40, -19, 168, 186, -201, -331, 85, 249, -26, -100, 107, -13, -233, -18, 271, 10, -253, -25, 170, -37, -147, 74, 89, -148, -81, 194, 78, -204, -129, 103, 55, -48, 56, 50, -166, -148, 149, 208, -12, -113, -24, -50, -70, 117, 226, 6, -200, -106, 77, 89, 59, 64, -32, -151, -87, 105, 167, 33, -79, -69, -40, -17, 63, 105, 2, -135, -95, 38, 74, 4, -15, -3, -64, -82, 34, 102, -36, -102, -17, 27, -19, -27, 51, 4, -99, -33, 97, 36, -74, -18, 56, -12, -29, 57, 73, -60, -79, 75, 84, -33, -31, 57, -1, -71, 35, 116, -12, -95, 16, 81, 2]
1680Bj5P8o2j05Q2J16q1q0N5M0p3qJ18j1j41PJ21j0p4K9M9p5m0Q7K9o2k5Q4j7
1709A8n5L3M2m3j8L9K9o2j6N8J7l9JL2l8lL5J8j7l3jOJ5K2nm2j5J9LJ2J2k5m3
1742d4J5M3qnmk7l9N3M9mo9kJ9j2K4N2k6q7J0O5K0k7J3k1m4K7P5J6o8k5L2rPO5
1776F4Qr1k2O0L6l2qKl9j0Q6L4o5o2K0J7J3M2op3n3O5P7k7k5k1n5j9R1P5o2p7
1808e7k8K1L9O0K9q4q0M1N8M4koq7m7Q8O9j2l9l7l4K7Q7K8n6n8%L7M1L6k8o4n1
1840f5O8O9j5l9j2m0rJ01M9r1p9J9K0L2N7J6j18r1Q0R2Pk2m1q4k0J20R9m5r5m6
1870h3J2K5R7N0q8j18K0Q2M0J2mq4n9O8J02K9p2m6j7%Q2N7m5r2j3M5K7N7pr6l7
1901e6M9P3nrn0p3J1J15M9q8p6K4j5RJ24K2j57r9R6J14l7kJ9j04q4J42J37r5j24
$$ y = [2, -13, 65, 3, -102, -20, 96, 15, -65, -10, 30, -43, -51, 67, 56, -85, -78, 43, 33, -41, -12, 37, -38, -78, 9, 38, -24, -49, 35, 18, -37, -4, 38, -5, -23, 16, 45, -17, -33, 25, 42, 3, 4, 36, -2, -5, 30, 48, 31, -2, -3, 3, 18, 40, 35, -7, -22, -3, 0, 12, 24, -1, -44, -29, 14, 6, 1, -3, -30, -69, -16, 33, 29, -40, -42, -23, -35, -11, 41, 15, -72, -62, 3, 23, -4, 9, -12, -56, -29, 46, 62, -6, -31, 1, -8, -1, 64, 72, -19, -41, 19, 55, 23, 15, 17, -22, -32, 54, 88, 23, -39, -19, -2, 11, 53, 47, -26, -79, -14, 63, 36, 11, -10, -65, -84, 7, 82, 20, -57, -85, -64, -25, 35, 64, -20, -100, -59, -1, 43, 41, 35, -52, -99, -11, 58, 46, 7, -30, -64, -37, 50, 78, 22, -36, -36, 1, 42, 78, 50, -14, -65, 3, 72, 57, 18, 6, -34, -43, 58, 107, 16, -63, -44, -24, 8, 65, 81, -37, -128, -48, 44, 51, 29, -12, -96, -116, 4, 103, 58, -37, -83, -71, -46, 51, 101, 13, -105, -85, -3, 37, 49, 45, -39, -98, -30, 72, 101, 29, -17, -34, -34, 48, 105, 60, -32, -45, 0, 27, 84, 77, -19, -56, -7, 66, 61, 52, 2, -71, -60, 55, 104, 16, -60, -36, -51, -42, 82, 104, -53, -152, -56, 58, 21, 19, 38, -66, -150, -8, 129, 34, -90]
1930i0L6J7m8J05J21j14j89P8J48k3k9N0o7j40Q1K25m2j48j8L4k5L4J51k8k03
1955h4m1J48O3l2J6k8j51%J71P5r1q4l4j2P6Q3K2j22o8J2M1R0M6r6j11K9O0L5
1983A3K0J3r4r9J13J07m3p5M2j8n8P4J34j01j45P8J19p2l5J12l3j76O3K21n7j84
2009h1N7Q6r2rJ72J4k60l3K27M4j46N0N8j65p3K08J37j80j43R6J4n8J26J02j48
2034Cj94R9J54j3m3K6o0j13N0J69K1j12p3K2K1K5Q9J0q9j02M0J36J5n6l1J0l9
2061c5lR7N6j14q3Q6P8p5k3Q3l3j18O3J50q4j39O9J07p6n8J18j4j55K1J74Mj72
2088g6J0R5o7l6J46N3k04p3J47P8q7J2N6r3j08R9J57m1j14RK3l7L2J07Lj23p0
2115a02P7P1j0l1N1l5j08M7J20Rj13%Q3m7q1Q7J17j19j15J22P4j31n5J63J0j87
$$ y = [-90, -54, -37, -85, 20, 141, 27, -162, -84, 64, 41, 12, 62, -5, -145, -64, 161, 119, -29, -47, -13, -38, -4, 147, 119, -84, -125, 23, 86, 54, 70, 42, -109, -109, 62, 137, 46, -38, -72, -84, -8, 75, 97, -25, -93, -81, -40, 50, 96, 0, -111, -82, -22, 13, 33, 46, -48, -147, -34, 73, 30, -45, -3, -21, -79, -5, 129, 28, -117, -39, 80, 8, -27, 85, 52, -124, -61, 160, 103, -81, -24, 62, -30, -39, 133, 147, -113, -146, 81, 125, -21, 29, 87, -78, -151, 57, 194, 14, -129, -33, -19, -77, 49, 151, 3, -191, -92, 62, 49, 6, 32, -28, -141, -91, 78, 99, -13, -86, -64, -43, -18, 71, 81, -8, -110, -70, 66, 81, 25, -6, 4, -35, -38, 59, 115, 1, -82, 4, 82, 7, -16, 67, 34, -84, -21, 129, 45, -94, -25, 82, 6, -52, 66, 52, -103, -82, 92, 96, -76, -66, 29, -38, -74, 72, 125, -79, -152, -5, 73, -14, -2, 54, -39, -147, -48, 109, 68, -46, -37, -14, -51, -19, 88, 91, -32, -102, -25, 46, 36, 5, 56, 21, -87, -40, 80, 89, -24, -24, 59, 12, -69, 18, 135, 16, -99, 23, 97, -34, -89, 74, 84, -103]
2141a03J6J76p7j53J39J49j90j26J86O9j74J5K12q2k35R8K11j19j30J55P3k21
2163a11m5K68L2k21J5J59j02j27J62J30j67j15J58M3j28K1J36n2j40O6Q7n6m0
2186b7P6J3q6k6N1L9j0k5Kl2j8J6L1O0j9q9k3O7oj9N6K9j32o5J48P5r3k4Q5q6
2216c2j27J40J85j29j51J11O2j27PK11n7k51N5K25q0j36J44P3k09m1K37L6k41
2239i5K7J87q3j48J59J04j97j14K27P0j96l1J51l0j35J30J22j55j66J35J09o1
2261A0l1P9p6j26Q7J73k9j37pPj0N5J14k4j49o3P2J00L9k6o5o2lP0R8J7j08j01
2289i6K4J06N0k0j4o9q6N3J66Lj42m9N5j2K7R2J9j79p5J49J12r6l9L3p8m0J39
2316C3J34j44j70O9J13k8J9O7j08j58Q1K17Kj46l6J9n1O4J71j4k13r1J34J06%
$$ y = [-103, -87, 89, 12, -141, -2, 147, -43, -169, 17, 86, -88, -73, 139, 57, -178, -80, 131, 12, -118, 37, 110, -111, -156, 112, 144, -77, -62, 97, -5, -132, 30, 160, -7, -122, 36, 79, -49, -28, 108, 56, -84, -18, 69, 13, -27, 49, 62, -24, -50, 1, 40, 30, 5, 7, -25, -43, -27, 4, 64, 45, -44, -67, 0, -6, -25, 31, 60, -72, -137, 11, 86, -7, -31, 54, -32, -159, -19, 166, 37, -114, -3, 59, -68, -61, 150, 93, -158, -103, 122, 42, -94, 50, 123, -86, -127, 110, 146, -95, -68, 119, 36, -112, 47, 151, -46, -160, 67, 137, -59, -90, 61, 31, -104, 26, 148, -7, -173, -38, 71, 10, -21, 58, -18, -144, -57, 116, 87, -50, -57, -50, -60, -5, 109, 85, -64, -127, -55, 45, 84, 58, -7, -69, -72, -2, 96, 113, 5, -96, -72, 34, 84, 64, 50, -19, -105, -52, 114, 117, -25, -74, -19, -31, -4, 88, 107, -72, -147, 2, 114, 18, -21, 12, -66, -106, 33, 167, 23, -147, -78, 35, 7, 26, 93, -15, -173, -92, 125, 127, -19, -55, -36, -87, -23, 148, 134, -79, -170, -36, 70, 70]
2341G0Rm4j53l9J75J69q4j55k8LM7J07Q4j05j94j1J83Q8l4n9r0q5O3J75O5j26
2367C1j46jP6P3O6j9j29j15Q1J64M9q9j09n3K9J02J16k7j49r5O2J39N8m5p6j17
2393a24J0J34J30l0j48r5K5J21R1J6j13j39k3J49J31Kj37j06kP1J44N0j13j80
2417a36j5J31J30K0q4j11q0O0J77P7j22j50l1P2J18P6l5j61j19Q6J90N2q5j15
2441e5p0J8J23J45m2j77r5P3J25P9%j00j64NJ74J34m7j28j00k2Q9J68K3j36j46
2466a26J2R5J21K3p6j55o4J28J61K8j12j32m0O7J41P0q0j65m9Q2J42O2n8j37q8
2491a50N6J53Q0o1j19r0N0J23R3m0j35q5L5J14J11mj45j17L9J18R3nq4j29k9J36
2517HJ22rj12r6k9R2J11L6r2j41kR1Q9M6p4j09p4Q0J49K4q0r9l8L6J02Q2n0j30
$$ y = [70, 79, 35, -118, -157, 18, 187, 103, -52, -80, -77, -30, 77, 161, 56, -138, -149, 34, 122, 88, 29, -61, -146, -83, 92, 157, 31, -115, -116, -40, 33, 99, 80, -49, -164, -83, 81, 130, 41, -68, -121, -92, 10, 126, 99, -50, -145, -83, 56, 114, 69, -7, -124, -114, 20, 150, 120, -28, -123, -98, 23, 114, 130, 17, -122, -145, 4, 135, 137, 0, -106, -108, -37, 107, 157, 44, -136, -151, -20, 110, 130, 46, -65, -145, -85, 92, 169, 47, -103, -134, -62, 56, 132, 97, -64, -183, -97, 93, 145, 60, -55, -125, -107, 16, 161, 119, -58, -153, -80, 45, 124, 124, 24, -140, -135, 39, 173, 126, -2, -102, -124, -35, 133, 156, 20, -126, -114, -19, 102, 125, 49, -106, -170, -42, 119, 147, 35, -97, -137, -70, 71, 141, 61, -104, -153, -71, 71, 133, 75, -62, -150, -94, 59, 139, 78, -41, -131, -81, 42, 135, 95, -40, -125, -90, 24, 135, 131, -14, -131, -92, 26, 119, 114, 30, -99, -128, 8, 130, 121, 9, -87, -116, -24, 87, 123, 31, -110, -112, -21, 68, 114, 40, -69, -143, -63, 86, 110, 30, -69, -107, -71, 31, 113, 63, -67]
2545f7o0M6J18M8k8p0j00K2J28Q2m1j16m7K7O3R4J0j18q9K9R1P8k0p4n1k4N6R8
2573H5J2r4p8J5O2M9L6n3q7l3O7Q5Jp4m1j5J0O2O6m6q0m1O1O0J7k8m5l8MO0N4
2604E3j5o2l5L8L2J2K0k6n7PO5L2m6l1J5j2PK9L1m9n0L0N1j5k9K1Nn0K4N2Lp8
2636b8lN6%m8M1J1o1nN7J3o4lN6Qp5K2N8m2n4N4M6o6l9O5M4n8j8P1k7o5L9Q5k8
2669D2r2J9O1k2pO4jj11l8J07P2n5n5J8k3k9Q4R1o6j34jJ04J7j9L6m6j07%J53
2698F2N7j02r2L9j4lJ10N5j34j36Q5J48l6n5L6k9j17O2J81j0j93k4J14K9l8R2
2724H7oj81o7K08J30j20r3J4j6j5J24J25j50j95M6J74M9m3j5q6j29O1K29P0j80
2749B1j42J5O4Q0J06mj84j59P0K37O2j15r8m9m6Q2K16M3k57j78J33J51J1kK0j65
$$ y = [-67, -127, -81, 37, 85, 57, -13, -113, -91, 37, 119, 78, -38, -85, -58, 5, 99, 109, -9, -98, -69, 22, 100, 80, 6, -45, -69, -13, 85, 97, 3, -75, -60, 2, 51, 87, 34, -53, -86, -19, 66, 67, -7, -48, -63, -53, 9, 75, 29, -51, -92, -31, 29, 46, 18, -27, -65, -61, -1, 53, 38, -24, -59, -21, 11, 23, 43, 17, -40, -33, 32, 64, 18, -13, 2, -10, -3, 26, 57, 8, -42, -12, 39, 24, -5, 16, 21, -29, -5, 47, 50, -28, -31, 25, 25, -23, 18, 29, -32, -37, 20, 33, -31, -34, 22, 30, -45, -23, 35, -7, -61, -7, 39, -27, -66, -1, 43, -15, -33, 38, 11, -54, -15, 70, 42, -50, -31, 30, 8, 1, 65, 64, -47, -85, 22, 94, 39, -16, 2, -21, -50, 34, 125, 59, -75, -76, 28, 45, 26, 62, 16, -91, -91, 62, 119, 17, -75, -36, -50, -53, 57, 112, -22, -158, -73, 75, 39, -16, 20, -9, -126, -64, 117, 107, -86, -110, 4, 33, -5, 87, 81, -100, -167, 41, 171, 51, -42, -28, -44, -59, 65, 190, 40, -155, -109, 65, 114, 71, 56, -30, -159, -98, 131, 201, 21, -121, -106, -42, 38, 144, 140, -44, -203, -133, 104, 166, 51, -47, -96, -142, -60, 156, 199, -58, -236, -103, 48, 59, 57, 77, -88]
2775h8j51J82K81p3k56lQ4l3N2K13n6l46l7L26J05j66l1K5j61l5L37J46l17k34
2799b36J69J14l5J22Q3k90k54K35L47o9k16j9l6j12J87L29r7m06r9K16J38L7O0
2822A68j18k99k9L16K44j37k20q3rR1K19J14j98k78k5K14K06j2j27j28q5M9K23
2845I6J73j42l03l3K09J15j2Mq4k22J6L27J45k59j97R6O6k4J58J18l10k63K45
2868h1L13j03j59L2p9j72K21L82j43m55j7K57L4J7J73j17m26k0M57K07k42j49
2890g0Pj35J3L75J99l54l57J32K29M6O9L7k58k67J77L72N8k39j19k2k7J21K60
2913B47j7l09j70J69K05K1o4o9j34n8J78K06m3k58j07J39J35J7Nn2j99o7K44K30
2937B49j22k57k6P7M7J36J22j92k99M6K99J07r9n9q6j70P8L54J08l09k19J00J10
$$ y = [-88, -239, -57, 224, 151, -105, -108, -24, -57, -5, 208, 152, -194, -231, 95, 200, 34, 3, 28, -133, -168, 169, 315, -2, -236, -67, 47, 12, 134, 217, -73, -327, -92, 255, 186, -30, -49, -85, -197, -10, 319, 222, -184, -283, -67, 71, 108, 168, 50, -249, -278, 38, 282, 145, -75, -158, -167, -76, 143, 257, 59, -219, -244, -30, 176, 164, 37, -91, -176, -127, 96, 269, 127, -176, -209, 0, 115, 103, 107, 23, -199, -183, 144, 289, 30, -167, -71, -5, -29, 129, 247, -63, -326, -81, 232, 129, -30, 2, -77, -249, -28, 354, 211, -244, -261, -4, 30, 47, 220, 103, -323, -343, 114, 321, 79, -70, -63, -198, -185, 190, 389, 35, -322, -190, 39, 85, 154, 191, -67, -334, -157, 215, 273, 34, -85, -107, -134, -13, 247, 230, -79, -249, -80, 125, 146, 82, 13, -121, -179, -1, 205, 162, -96, -203, -64, 71, 88, 93, 41, -158, -225, 19, 249, 127, -130, -156, -79, -32, 104, 226, 34, -265, -219, 80, 187, 88, 29, -57, -227, -149, 205, 313, 4, -215, -115, -5]
2960eL2J26O4k76k41J86K99Pj64m1o1r0J40K51k9k98q7J46R8jN7m5j93o5K02J78
2986A90j13j53jK3J7P4J19j15k15J6K35P6j41m7Rq0OK03R7k26j73J13J47jKM3
3012A05j43j73J49K33j7k04j5L1m5P9J99n0k71o6J95R6o5L3j4j67o3K07J60j28
3036F6j32J6JkJ04Q7j19j44L0J21L5l1k6m0n4L9J05K6q8m9rN2M7rj6l1k9J3O2
3065B5M1o3o9K8O9j5JJ7k8p5N2J12l9j02J2O9n2nJ06j6j61J3J40Nj09L4P3r3n7
3094h7J33P1j41n2J02Kq8N1Q6q6q1R8O5q4m8R2j2p8M4P6o1p1O9N9o2m3P3on8L1
3124fP3p0o2N0N5k2kJ8n0k1L7N7k6l7j0pkN9J3m5m5QK6K7L0oq8k3Q5L0rrl7o3
3158g2J5J09K0o4o1K0NK1P7jr8p2Q5O0j6j8Qp0k8R8P2n0q6j1L2L0N8J3p7q3K1
$$ y = [-5, 27, 153, 217, -59, -300, -114, 185, 192, 28, -13, -74, -164, -24, 227, 198, -100, -187, -41, 57, 56, 113, 68, -125, -190, 12, 190, 77, -76, -77, -54, -37, 37, 156, 41, -174, -158, 77, 153, 12, -35, -26, -106, -100, 103, 200, -26, -199, -86, 61, 60, 62, 105, -38, -211, -62, 171, 154, -50, -65, -34, -79, 0, 199, 149, -122, -188, 7, 103, 38, 71, 57, -110, -173, 34, 194, 66, -66, -50, -49, -51, 53, 140, 21, -123, -93, 28, 63, 32, 6, -34, -88, -49, 56, 82, -6, -55, -64, -12, 35, 26, 10, -21, -50, -37, 25, 66, 3, -66, -38, 31, 16, 17, 34, 6, -69, -17, 95, 56, -46, -34, 35, -17, -22, 84, 68, -93, -80, 60, 65, -44, -10, 63, -30, -87, 46, 117, -24, -76, 26, 28, -60, -9, 77, -9, -90, 8, 73, -11, -59, 33, 21, -57, -13, 63, 2, -69, 0, 59, -3, -46, 27, 21, -37, -6, 67, -3, -65, -15, 40, 18, 16, 34, -16, -37, 0, 57, 31, -6, -16, -23, -25, 34, 47, 2, -43, -35, -9, 18, 48, 42, -46, -69, 16, 46, 37, 28, -9, -72, -57, 52, 72, 8, -53, -33, -28, -7, 70, 69, -29, -101, -16, 44, 28, 10, 18, -52, -80, 18, 90, 40, -46, -57, -25, 5, 63, 76, -1, -84, -63]
3189f3R6L8j6m3p1k7Q1J08k9r2o2lN4J07J9p8j19J8P0P3L3m8j12m7R0R9K5o3r6
3218e8m6L7J31N6p8r6l9M3Q0R8l7j40o3O4J06K5op3j15J0J43R2n7j08m2j4O2J33
3246A08L5j48j23L7J24M4J3l7j35o7J27J46lj08p0m0L9J11P2p0j49l2Q8J01J5
3271G8k1j10p6O3J35N9q6j01m7L1J20P6n3j26n0N2R3Q7k6j19j01N3J06Q3j5j02
3297Cj23KJ41J21m4j11n6k2N1J44L9j41j22L2R1N5L3l1j33q2J18J53k1j09l8k4
3323g4mJ09J19q9j74j3J21N5j2K3o7j38M5J77O8j19q6pJ0M0J33K1j72j04P9J19
3349F0K8k3k5r3o1J06J31j5j15p8L1N0N0L7k3j35l6R5R7rq6m0kJ9N0P8l8j24m3
3378a14J19O0l0k6j8n3l6J39Q4j10j16M7O2j2K8P4p2j64N7J83%j20mL3o6JJ51
$$ y = [-63, 33, 71, 55, 12, -59, -86, -5, 103, 74, -18, -80, -83, -29, 78, 97, 19, -100, -82, -12, 61, 94, 46, -66, -113, -23, 76, 101, 38, -58, -104, -67, 64, 120, 42, -54, -93, -50, 30, 128, 91, -49, -112, -48, 58, 83, 77, 4, -111, -101, 42, 134, 77, -31, -73, -87, -25, 108, 143, -5, -128, -91, 33, 77, 90, 53, -82, -149, -22, 124, 121, 13, -57, -97, -58, 53, 125, 55, -94, -126, -38, 63, 78, 57, -53, -129, -66, 69, 128, 42, -59, -106, -75, 45, 121, 68, -58, -108, -56, 37, 124, 98, -21, -122, -69, 37, 120, 105, 3, -120, -118, 23, 144, 100, -11, -67, -89, -38, 106, 145, 4, -118, -86, 5, 60, 93, 62, -71, -153, -35, 118, 97, -12, -50, -74, -78, 31, 150, 61, -113, -126, -5, 50, 38, 61, -6, -144, -99, 78, 146, 27, -59, -66, -56, -16, 117, 138, -34, -138, -59, 60, 88, 65, 40, -53, -114, -8, 123, 108, -7, -85, -54, -4, 46, 83, 60, -75, -111, -16, 81, 72, -14, -54, -56, -37, 13, 91, 53, -71, -114, 5, 65, 35, 9, -9, -62, -98, 41, 125, 15, -101, -54, 8, -4, 24, 98, 26, -138, -81, 102, 102, -18, -22, 11, -55, -54, 97]
3405I7M4j93o8J51M9p6L5N0j16j11J33J47r7j07M5N5q0K6J19l9j62LJ48J2r4K3
3431fM4r0n2J41Q7j39r0P3N7o3K2P7l9j34L1J49qr7OP1o3n0R6Q0j23o8J11N4j01
3460b4k6J08mj23N2J14n2j35O6J22p2q9R6M8j35nJ40K6j63k7J38j1j13O9J10j19
3486ij24J15J26r0j00J09K9j47J0J81rj73j7J53k5j20Q5J05j11j22J29J09j28
3509b4o3J36L7j49k1J67k0j47N1J62r4j59R9J51j11r5J38M9j70m6K11K5j83nJ46
3534H5o6j19J10J52j49j62J38J18j17n5J52k3j98M0J99j7j72M7J09r2j03J51R9
3557A27j50j03J37N5j11qJ24l8j28M4J39m9j27O5J02q0q3J04O7j13m4J22N5j40
3581c3m4J25Qr9K3J13n2j44P4J36n3j04M3P1r7m4J32N5j53p5J34M7j03J4J26q9
$$ y = [97, 141, -52, -120, 31, 80, 4, 39, 89, -27, -138, -5, 142, 45, -62, -17, 38, -42, -16, 103, 64, -98, -95, 53, 65, -29, -6, 38, -52, -104, 37, 124, -15, -105, -32, 25, -38, -16, 61, 22, -112, -81, 68, 60, -37, -31, 40, -23, -73, 23, 103, -20, -88, 23, 77, -24, -50, 58, 54, -69, -17, 97, 45, -90, -24, 98, 26, -63, 33, 81, -54, -59, 81, 107, -56, -83, 55, 44, -69, 0, 110, -9, -133, -18, 108, 18, -82, 27, 56, -91, -81, 100, 91, -82, -99, 54, 29, -91, -6, 99, -12, -134, -5, 104, -24, -87, 49, 86, -63, -84, 83, 63, -84, -33, 129, 35, -124, -25, 126, 15, -80, 58, 107, -63, -109, 102, 127, -56, -61, 85, 19, -100, 10, 162, 13, -149, -11, 107, -10, -65, 87, 64, -134, -94, 105, 88, -84, -37, 72, -20, -123, 28, 127, -23, -126, 11, 66, -45, -53, 71, 33, -95, -51, 88, 39, -88, -23, 79, -1, -84, 20, 87, -26, -70, 52, 107, -33, -77, 48, 56, -43, -20, 93, 41, -103, -29, 107, 54, -50, -7, 64, -33, -77, 55, 110, -43, -118, 16, 63, -40, -26, 100, 11]
3607A1j62R8J62p3j30R1P6j56k5J87N7k08m2J59Kj38P1J47j13j65J36J44j29q9
3631h9J54M0k05%K16j5k00M4J62q1j39J15J22j51q1J67M6j68j7J67j2j64N2J34
3655I7q7j13J02J05j02r5J19L2j15lJ22j3j45L7J03m8n9O5O9j03n0Q0N2o6k4N1
3681A1Jn9lQ5K1p6j5M3J0k9K5N4m1q0J6P9Ln8J7L2n4n2R7P1r9q2P3N2o8J7R5l9
3713D7j61L9J43qj19N0O6j09o3J74N0j64m7J27J2j09P0J12j29j33J41J21j08q7
3737h5J23qj20M8J67n4j84N3J36n6m9J00pj53KJ75Pj26JM6l5l0J16N0j45r0J11
3764gO3l7QJ6q7n7J01J03n9q0j0nJ9Q2J7m6r2j3O2O0L0l3p7m5O7O2K8k2q0n6M8
3795d0R2K7o0n5j6KN3R7k3j24n2O5Q6nK1n1j06kJ29R0o3j02j7%J9J05N3j09j44
$$ y = [11, -151, -53, 109, 36, -94, -3, 73, -83, -108, 79, 136, -72, -114, 45, 47, -91, -20, 127, 14, -151, -15, 129, 0, -89, 65, 105, -100, -100, 116, 101, -99, -55, 107, 26, -113, 2, 124, -27, -108, 59, 105, -63, -80, 87, 75, -89, -37, 97, 10, -103, -1, 104, 2, -93, 26, 58, -57, -60, 62, 49, -96, -59, 44, -4, -63, 2, 71, -32, -82, -2, 50, -16, -40, 11, 12, -47, -50, 35, 56, -20, -35, 8, 18, -11, 14, 68, 27, -53, -37, 42, 45, -13, 4, 36, -18, -70, 27, 98, -1, -83, -10, 42, -26, -9, 86, 47, -114, -75, 68, 60, -59, -9, 57, -52, -115, 59, 109, -55, -102, 25, 37, -72, -2, 110, -19, -152, -11, 110, 2, -85, 38, 30, -90, -42, 125, 71, -113, -60, 76, 20, -29, 71, 64, -89, -87, 88, 95, -31, -30, 16, -19, -49, 67, 117, -28, -118, -7, 56, 19, 27, 43, -44, -101, 0, 103, 44, -36, -46, -51, -32, 50, 67, 21, -71, -84, -22, 38, 68, 35, -42, -87, -20, 42, 70, 48, -32, -88, -40, 52, 79, 19, -36, -52, -50, 3, 100, 77, -47, -99, -34, 52, 47, 68, 17, -89, -91, 38, 128, 65, -37, -54, -54, -35, 70, 123, 14, -130]
3824a30M9J11M0j1j8q8r2P7J54K9j28q3K2K8P1Q7n0j43o7R3J06Qj8o1q5j3J39
3851B7J05o5j30l1M5N9N7M0j03j23K2J37O6l7o9p0k6Q1J12Kj03r1K3P5O3K9n1
3878D4j25m2J07J14pq1p3k9M7J13N8q4j16j8O3P5N7m2j20o6P2J28K7m8j00n9K1
3905h4J21Q6n0j19o2M7Q4P7Pj19j13K8J21P0Or0r2k8R5J29jj19p9QL6J01P2q6
3933D6j58pJ12P6Pk1q5q5N9J36M1j11p9J0ON9J14l2j42o2Q3Q8Knm3j04qJ38R1
3962A26p8q9plL7Q3L8j14j01M3J00K8j7k7p4n3R0J19l0r0l6OK3O6N5o0j08qO2
3991a9P0Oj7p0n8L6J03Pm3n5j8J3O4N1l4o2m4K9N2O0pq4m5L4N0J9Nk1q4oP6P1
4023G9m7o2LjkO9M5p8p5L1O8Kk6K1k3q0L5J08j1r0lL8l1J4P4k2o1l9P8L1l6OJ3
$$ y = [-130, -81, 30, 70, 59, 41, -47, -139, -62, 92, 121, -7, -90, -68, -40, 31, 118, 68, -75, -142, -49, 57, 65, 47, -14, -99, -112, 27, 132, 67, -63, -94, -49, 10, 67, 107, 4, -119, -97, 40, 106, 69, 0, -70, -96, -15, 97, 99, -4, -95, -72, 3, 66, 95, 44, -81, -123, -16, 98, 91, 10, -63, -92, -45, 68, 126, 42, -74, -92, -29, 46, 103, 61, -59, -125, -53, 75, 102, 54, -46, -105, -84, 37, 123, 73, -46, -108, -61, 23, 100, 107, -12, -125, -97, 24, 94, 100, 10, -82, -110, -15, 114, 113, -6, -85, -77, -41, 60, 132, 46, -112, -119, -7, 69, 76, 55, -30, -115, -56, 80, 121, 10, -69, -59, -53, 6, 120, 88, -54, -116, -33, 55, 57, 52, 9, -95, -103, 35, 126, 48, -41, -48, -51, -14, 69, 107, -7, -108, -65, 35, 63, 46, 19, -55, -108, -18, 101, 71, -19, -55, -49, -26, 40, 95, 35, -73, -81, -19, 51, 57, 40, -30, -88, -52, 51, 58, 15, -40, -58, -45, 19, 70, 36, -26, -70, -41, 11, 71, 64, -20, -65, -31, 19, 38, 43, 22, -62, -68, 8, 79, 32, -30, -27, -28, -30, 39, 84, 6, -69, -38, 30, 32, 6, 27, 4, -76, -41, 67, 56, -34, -37, 1, -30, -16, 58, 36, -25, -64, 14, 45, 9, 15, 28]
4056B8o0k4N9O4n5n2K3L2k4J4L2j8o2J5N7jk6j1K4l1mK2M4l5l9K0L6j5k8K4L0
4087C9m6k8N0J3o0J7O8k7q2M0O2k4o2M6L9p9l0J14K4j02k0O5j0o0O6O6p9q3P0
4116a3Q5p7j9P1k2j01M3J21l7j07K7Q1n1j9Q0Nj07l6J24J9p4rL6m0k4Q0O1q4p8
4145f5L0N4K0k0J1k6o3K6J00J7p2p4K5K4LL3M5p6q7K7J26J7q0k3J3m2J3J26M3
4174A25j53q9R5P9k6j3L7q4j06J22J54n7j34J7L7n3N4J25k8j92k4J59M1p2RK0
4200D3j20j7J73Q3j42j19P4L8k5O9N6j06j50O5J83k0q8l3lm9M2J65rj75p1Q7J05
4227E6rQj9r9p6J19J68n2j43l5M2J4N1J04m7j79m7J57J12n5n4k3n9l0J55J27j08
4254G8j89J7J17%K5O9q1j93N1K08M5j30o7L0m2J6J37N2j67j35J06J18k0j1j2p5
$$ y = [28, -32, -56, 3, 67, 12, -40, -17, 15, -9, 5, 37, 19, -43, -28, 29, 28, 2, -9, 15, -16, -20, 2, 46, 11, -28, -8, 28, 13, -15, 9, 39, -7, -35, 15, 28, -32, -15, 53, 26, -56, -16, 46, 22, -40, 6, 45, -34, -64, 50, 74, -28, -48, 17, 7, -53, 13, 79, 0, -83, -13, 72, -5, -24, 47, 25, -76, -33, 88, 51, -56, -29, 52, 1, -18, 62, 67, -40, -76, 48, 67, -7, -16, 20, -20, -44, 36, 97, 13, -65, -35, 19, 39, 19, 30, 4, -59, -33, 67, 84, 12, -62, -37, -13, -10, 23, 68, -8, -95, -68, 58, 75, -5, -28, -15, -57, -44, 82, 125, -28, -117, -22, 57, 31, 18, 55, -29, -135, -13, 141, 84, -50, -33, 4, -49, 5, 130, 102, -90, -114, 45, 86, 14, 23, 43, -77, -94, 79, 162, 20, -99, -25, 13, -12, 57, 113, 7, -143, -78, 105, 85, -3, -36, -39, -88, -46, 119, 110, -65, -136, -49, 56, 47, 55, 36, -63, -139, -20, 148, 96, -47, -82, -40, -26, 25, 129, 82, -97, -144, 13, 125, 70, 16, -7, -66, -96, 59, 186, 78, -111, -94, 23, 23, 48, 117, 36, -157, -106, 102, 147, 17, -50, -20, -62, -46, 91, 143, -24, -159, -53, 65, 45, 34, 22, -53]
4280e3r6J19J66m6j51l9O2K3M2Q3m6j73l5J58J12o0p7l9k1PJ13J09j07j65RJ15
4306A0O5mj1n0j22J4J85Q1j31j03J5K7K0Q4O1j28j61O3J84Kp0l5k5p8N1J92j1
4333A25j90q1J27L9KN4Pj56r2J59J31o9j03J6pm0J06J28r9j58pJ42L3k8J2l3j21
4360a03J2J64O4j17r1L6K3J5P2L2j20j15P3J51Kp9k2m9j4N8J23j0j48o4O8O4K3
4387D8K3m1r8l3R8J18l0j00m3J2K3M1P3n5j12k2Q9P3j8m0rn0j5J10O2p6r3PN6
4416bL9J0K1o0q4J9J10M0p6m6LPK8N5K2q9p4N2Q1Jl3j4m2m1N8R3j8j00l0N2K0
4447BRM1k5q0k7Q8N9l2n5noj9O3O0n4r0L0N2O%J8l6o1K7Q4K1p4k1K0JpN3J3o6
4481a1m9O0M4j2j4mk5l1N3N0k2o8J1NJ5QL4l8n7K3N2J1l0k0KpJ5K0J5l1k9QL6
$$ y = [-53, -149, -30, 136, 90, -61, -100, -38, -15, 27, 110, 64, -109, -144, 14, 126, 66, -11, -50, -71, -64, 49, 158, 51, -114, -105, 10, 75, 71, 60, 10, -112, -98, 87, 168, 37, -66, -51, -24, -4, 80, 141, 13, -148, -85, 99, 101, 31, -4, -29, -107, -56, 136, 125, -65, -146, -19, 20, 22, 76, 83, -73, -165, -6, 125, 56, -47, -31, -38, -78, 28, 156, 57, -101, -108, 34, 67, 39, 51, 18, -103, -91, 73, 137, 20, -71, -35, -12, 3, 75, 107, -13, -128, -55, 96, 98, 19, -3, -52, -66, -8, 115, 105, -43, -107, -39, 25, 48, 71, 30, -68, -101, -3, 115, 85, -15, -58, -46, -23, 18, 91, 36, -76, -98, -9, 64, 46, 6, -3, -53, -68, 42, 104, 28, -65, -58, -2, 37, 47, 68, 8, -76, -57, 53, 93, 17, -29, -26, -19, 9, 64, 86, -3, -77, -25, 56, 57, 24, 10, -32, -73, -15, 78, 60, -40, -70, -18, 2, 11, 52, 27, -53, -80, 8, 67, 35, -20, -25, -31, -50, 13, 73, 19, -71, -41, 11, 17, 17, 35, -1, -62, -35, 49, 70, -4, -25, -5, -4, -11, 42, 55, -11, -60, 0, 44, 32, 18, 14, -11, -42, 11, 61, 39, -29, -18, -13, 2, 10, 44, 6, -51, -28, 24, 35, 5, -15, -13, -20, -5, 15, 30, -1, -30, -22, 14]
4514A4JJ0j7k9jK9J0Nk1k3J0PL2j5j6J5k7PL0J6m5j0RJ8J6j0Nj7j4J8L6j4k7l
4548aKkJ2J9mm7OK4lj4K6nk6MK1K3m1oLJ2j6J9J7m0pL4J0j6j3J9j7k3M4J8j3l9
4584b0J4K5j7kK0pl0J9K2j0j6KLNnK6pl3PJ1J1j3J1qk1KK5J6k3qjjJ1jQl4J4P
4622BNpjJrOK4rk1%J0nNKOk3JOK8j8Mjl1J5L0%pk0QrJ6K1j0j8j6J8OpjJ6k3j0
4664a6L1Koj0KJj0J9K1k3l4L0J1j8lJ1mj2NL1j4j5j2J3nPK6j3l3j0L4PrJpnqJ4
4702aK3ok6Rj0J6OOj2k4J4J8j2L%mpJ0Rnj8oOJ8oqJ5nj0MJ6nmoOjj0J5Lk0pK1
4744EJ1k0JkM%%K2ok8PJ3Kj4RJ1k3j0K7%qj2J4Mk6J8J9j7k0J5K2j4j3J7Mj2qJ5
4782GNk0QLPk3J5RpqKJ9j1j8OK2k3jRJ1j4LJ5j4k3J0J9nj5J9J0j0l0K9J6k1j1
$$ y = [14, 15, 25, 8, -21, -22, 7, 17, 22, 1, -22, -12, -5, 27, 12, -4, 11, -16, -9, 21, 37, -8, -18, -9, 9, 25, 15, 20, 3, -11, 7, 43, 29, 2, -1, 1, -1, 11, 30, 26, -21, -15, 9, 6, -8, 18, 13, -13, -9, 12, 35, -6, -12, -9, 3, -13, 6, 23, -17, -24, 10, 20, 4, -9, 10, -7, -30, 14, 32, 19, -20, -6, 19, 2, 0, 20, 13, -17, 2, 24, 14, -2, 0, 3, 8, 3, 29, 22, -11, -4, 7, 18, 5, 16, 8, -13, -11, 14, 30, 7, -1, -2, -3, 8, 7, 15, -19, -5, 2, 7, 0, -1, 0, -9, -3, 21, 12, -9, -9, 1, -4, 1, 3, 9, -14, -13, -7, 21, 3, 7, 6, -25, -10, 20, 20, 13, -7, 1, -8, 8, 29, 19, 1, -15, 3, 9, 2, 1, 17, -6, -16, 15, 17, 11, 1, 3, 4, -6, 13, 34, 11, -23, 7, 18, 0, -3, 8, 4, -8, -3, 28, 14, -1, -13, 0, -5, 2, 28, 15, -18, -28, 6, 13, 4, 5, -2, -7, -15, -1, 22, 16, -10, -1, -11, 5, 11, 17, 5, -19, -5, 13, 1, 4, 4, 0, -7, 3, 12, 7, -11, -17, -11, 7, 1, -7, 8, 3, -7, -3, 13, 8, 4, -2, 4, 3, -7, 8, 11, -9, -16, 5, 16, -4, -3, -5, -1, -1, -1, 21, 15, -13, -6, 7, 9, -5, 4, 15, -8, -18, 9, 9, 1, -11, 3, 7, -19, -1, 18, 1, -19, -4, 18, 4, -9, 8, 12, 0, -8, 7, 12, -8, 0, 3, 10, -13, 2, 11, 4, -4, -2, 17, 6, -12, -6, 16, -7, -8, 1, 12, -2, 1, 16, 2, -21, -11, 8, 3, -12, 7, 17, 7, -23, 6, 22, 1, -10]
4819a0K3lj9LK2rl7K3K7j8j9K8Lk6j0M1qk3j5M3j2k3K3K4l1j9L7Qj8k0K8Ol6J5
4853bK2j4k4J4K4j7j6NK0j5j5L5Ok7j4K6Rj4QPj7j7MM3k3j4JJ8j2j5L2Nl0j3K4
4888DK3l4J2J4j5l0J4L9j0l6K2J3j7pK1Ol1rM2kl4J8J1k3PPK6j0l2J5L0l0qJ9
4922A5nl2J4L6%m2J9Oj2pK3J2m5oK5K3j6k0J6Kj9LL0Nl5j2L7j9rK9Pk8j9K9K0
4957B5j5l1K3Jk3J5L5k8k3K1J6j6j5L4ml9RK6Ol1J3K4l2nK1K0l4j3K1K6l0LJ9
4990A9j1k5NK8qj5QmqMPRk2rK2J3j3mJ0Lk8J3J5lk5MJ2%jPJj3k7K9K1Rk4kQj2
5030gJ4J2pj7%J5Pj3J3Jk9LJ9K4j6k3QLk2J8K4j5k7KK6qoK1rl6NL2Nk3Jj0LJK5
5069A4Pj8l4K5J3qLPk9nJ3L1Jk7qJ7Qj5L1kk7j8K8L2k0j3Ok2jK2RMl0oJ7NJ4%
$$ y = [-10, 13, 10, -9, -6, 16, 7, -30, -7, 20, 2, -17, 11, 14, -12, -22, 19, 11, -12, -27, 16, 4, -19, 4, 28, -3, -22, 15, 23, 5, -15, 13, 19, -17, -2, 20, 6, -18, -4, 20, 3, -13, -8, 12, -3, -18, 17, 23, -4, -18, 8, 17, 3, 11, 18, 1, -16, -12, 31, 8, -6, -5, 13, 1, -14, 18, 23, -7, -20, 4, 27, -7, 5, 19, 4, -26, -12, 27, 17, -19, 3, 16, -1, -8, 13, 19, -12, -21, 21, 19, -15, 3, 14, -9, -2, 5, 31, 21, -11, 4, 34, 4, -4, 15, 10, -22, -8, 28, 28, -14, 5, 11, -1, -8, 15, 27, -18, -24, 1, 24, 8, -12, 4, 6, -13, -10, 20, 25, -10, -22, 15, -4, -13, 16, 23, -5, -24, 5, 25, 10, -21, 2, 3, -20, -5, 30, 2, -21, 0, 16, 0, -15, 19, 15, -24, -15, 11, 17, -14, -1, 23, -9, -14, 7, 27, -7, -20, 1, 27, -3, 0, 19, 8, -17, -12, 16, 8, -7, 1, -3, -11, -7, 0, 9, -13, -22, 0, 13, 0, -4, 6, 9, -19, -6, 9, 6, -19, -15, -3, -3, -4, 3, 4, -9, -36, -7, 14, 23, -1, -3, 5, -7, 7, 19, 12, -5, -5, 10, 17, 4, 17, 18, -11, -8, 11, 35, 19, -4, 4, 7, -15, 3, 27, 12, -15, -13, 13, 5, -1, 20, 11, -25, -20, 12, 17, -6, -5, -15, -12, -11, 14, 21, 3, -31, -6, 7, -1, 2, 9, -20, -25, -12, 19, 20, -7, -15, 2, 10, -5, 26, 24, -3, -21, 7, 39, 19, 6, 12, -10, -11, 11, 20, 24, -6, -12, 5, 10, 24, 24]
5107B4k5j6mK8J8j6nj8%K0J3Lk6k5K2RJ7j3mj7oK4J5Pl1k0lL1J7Rk2pk0J4L5K
5143C0k4j2%J1PJ4nj7k8K2J6Qrj1j6ROK9j5l8ljJ9L0j3nl9J0L1J4rk0jj5mM0O
5180A7l7m%J6J3Qrk4k8L4L8nk3krOJ7J2%m0j8K8K7J7j6k3k0J4L0J3j8j8j4RK5
5215A6K1%k8l2RK8Qqj4k2rL3J0Pk8prK4K1pj5k3MJ0K4nLl6lJ3K8J1k2j8j2J6J7
5252EJ7j8j5j4J2J8J7rj1j8LK4LNk8mnL1K4k3j1j7RJ3K8j7k9rMK1J9%k3j7pK0
5288bJ9knk7NJ0J6kj0j6lK2Pjmj9j4J8K2loj0k0J8J4Rnk3JJ2J5KJk7qJ5kJ7Qk0
5328Bk5K0OJ6kj2j4lK6NMj2lk0K3J4rrqpOPKMk5RMJJ4ok0NQRlOk6lOJ7KJ0j5j3
5372iPOQJj1j0JL1%k1n%jQLKoj9J5RRj2kolRRrQl0K2rJ1m%kj9J4NLlj0%NjJ4j5
$$ y = [24, -1, -17, -21, 7, 25, 9, 4, -14, -14, 6, 19, 22, -4, -29, -7, 2, 19, 6, 2, -15, -21, 3, 18, 25, -6, -26, -29, 2, 19, 28, 6, -1, -21, -7, 28, 30, 6, -6, -6, 5, 12, 26, 21, 4, -24, -2, 14, 22, 13, 2, -14, -5, 1, 30, 15, -23, -26, -27, -8, 22, 9, 4, -35, -25, 6, 20, 11, -9, -10, -25, -29, 11, 17, -20, -24, -24, -8, 5, 13, 4, -20, -48, -14, 24, 19, -4, -6, -15, -9, 8, 20, 20, -20, -38, -10, 17, 34, 18, -5, -25, -11, 19, 32, 14, -4, -18, -9, 16, 37, 37, 9, -23, -14, 14, 22, 14, 0, -22, -31, 2, 12, 19, -9, -16, -25, -1, 20, 13, -2, -25, -21, -11, 13, 8, 11, -25, -28, -15, 13, 24, 2, -16, -28, -12, 5, 22, 4, -11, -25, -13, 5, 22, 13, 2, -16, -13, 11, 14, 19, -9, -13, -18, 13, 37, 14, 3, -14, -5, 8, 36, 19, -10, -19, -15, 6, 25, 25, 2, -15, -22, -2, 17, 15, 10, -17, -12, -2, 14, 12, 2, -14, -17, 5, 12, 11, 7, -12, -26, -8, 14, 11, 5, -5, -25, -7, 7, 16, 11, -12, -11, 1, 16, 18, 19, -8, -16, -1, -3, 14, 22, 2, -23, -3, 3, 19, 17, 5, -9, -12, 14, 19, 23, 11, 8, -12, 11, 25, 16, 7, -1, -8, -2, 5, 7, 11, -14, -5, -1, 0, 14, 8, -12, -7, 1, 10, 7, 13, -13, -16, -10, 7, 9, 19, 4, -9, -2, 4, 12, 13, 2, -8, -7, 24, 24, 3, -2, -2, -3, 5, 8, 10, 4, -15, 0, 9, 18, 6, 4, -2, -5, 4, 13, 4, 12, -18, 4, -5, 6, 2, 2, 0, -19, -5, 0, 3, 0, -10, -10, -5, -6, 8, -7]
5419g%JJOmOj5J0J0%lprLMnK0j4ko%PNJ3j4J0j4J0OoMJj0NRj0j1lJ6qk%OOj2O
5465CnNj2mJ6kj5PnPOJMoj0J2Ok2J2JJ4j7qPQkoJ2rjpJ0k%jNqlJ0JLnRj7Q%Q%
5513Hj1jRjPJKj5QOj0oKJj2J6jjnj2J8Lj1OJ0k9QOJ6mj4oJ3JJ5mMk9qK9Oj3J3
5556A5j8j1J3J7pLl3J2QqJ4oMk4J6J9Mj1j4j3J3OJ8Ol5rJ4J8J1qj5j4jK5Oqk4
5593a7kJ3OJ2Nk0j9MJ6J8j1lj4%J5J9Nj9k5JK4oJ3Lk4j1J2K2lj0njoJ6K9k0l3
5630a6%J9J8nnj1k0OK3K7l2j9mK0ORKk0k9J2L7Qj3j4j0rL1J3Ok8k3NK3J0q%k0
5667a1nJ0K8Ok7k0jJ9J0Rnl8qL4K6nk2j0oML9J7m3k8jK6J2PLk6k7J2L8J3j3k9
5703a2%pK8J3oj9k0QK8J4Mk7rk6L2L1j3k3k3J8KK4Kj2k3j4K6L1j1k2%k5K2K3J3
$$ y = [-7, -7, -6, -5, 1, -3, 3, -12, -2, 8, 8, 5, -2, -11, -8, -4, -9, 11, -3, -5, -11, -11, -4, 1, 14, 0, 10, -4, 6, 12, 6, 10, 11, 1, 6, 15, 5, -6, -9, 7, -1, -3, -3, 3, 9, -3, 3, -2, 3, -9, -13, 3, 1, -14, -7, -12, -5, 1, 2, 6, 0, -10, 2, 8, -14, -2, -1, 13, -4, -12, -5, 3, 1, -5, 7, -2, -3, -10, 0, -2, -2, -3, 2, -6, -9, 1, 2, 5, 0, 9, -8, 0, 0, 8, 8, -3, -4, 5, 4, 11, 12, 14, -1, 7, 13, 3, -3, -1, 0, -12, 4, 3, 2, -3, -15, 3, 6, -5, 1, 11, -18, -10, -4, 12, 8, -6, -12, 1, 2, 17, 13, 17, -12, -20, 9, 15, 2, 15, -3, -14, -1, 16, 9, 12, -21, -9, -1, -9, 5, -1, 3, -21, -5, 14, 18, 7, -7, -20, -7, -1, 17, 23, -12, -21, -7, 11, 22, 14, -1, -15, -16, 9, 15, 7, -17, -19, -6, 0, 12, 17, -3, -22, -18, -2, 16, 5, 2, -12, -12, 3, 22, 27, 8, -17, -16, 8, 2, 15, 18, -6, -17, -5, 17, 14, 4, -1, -2, -8, 8, 37, 17, -16, -16, 3, 21, 16, 11, 0, -20, -14, 9, 36, 4, -15, -19, 1, 7, 16, 18, -2, -31, -19, 18, 26, 13, -1, -11, -20, 11, 24, 30, 2, -21, -16, 7, 17, 9, 9, -11, -16, -6, 22, 28, 1, -19, -20, -1, 9, 18, 13, -25, -33, 1, 27, 22, 0, -10, -16, -12, 27, 44, 1, -27, -28, -2, 10, 17, 20, -6, -33, -21, 17, 30, 17, -12, -12, -19, 9, 22, 16, -3, -23, -15, 13, 27, 31, 4, -5, -31, 1, 32, 19, -4, -27, -9, -7, 17, 19, 7, -16, -30, -4, 27, 16, -6, -6, -31, -9, 14, 27]
5738B7k1l0qK7K9Krk8j9K6J6K0j8k6lkK0PK2l3k0J9K0Rrk5j2JOM8j7j7k7K1NJ9
5774B0Nj1l5kK3K2jj7j8kJ0J5K6k4j7j9L9LJ0k7j3lRJ9J0j6k1j1K0J7J2kl6nJ0
5809a0L2Rpl4jLJ1K0Pl2k5J6K3J0%k0j1J1jK0nj2j3L%K7mok1k2L2J0njj0j5J1
5846a0L2mj0rk2J6JJ7j0jk8K0J9J5j5j8pKJ9lNr%JkK5j5Jk0mJ6J2Nj6qJJ0J3j4
5885EMj5%nK7rj4Pj4J0OQpk4J1KJ3JNj2j4J8Ok0NPLj6OJ3njpmJ6lRj4mPpJ6pk
5929AkpNRJmjKqNPj2J0mJ1j2pROqPLrJ1pOmmj0PNpOprOJ2Qj4pLqOK1rj4NKmJ9
5979A5rnoJJ4Jj4OpoPJ9nj2LkJ1OrqLn%J5lQj9j0J4J3J4j6j2mRKRqnrrJ7J0rq
6024cj5RQLRnk5KJ9Kmrj1J1jK7ok5nMJ2J5Oj9j0JRK5j0j3j0kJ6NM%k0nkK6kqm
$$ y = [27, 6, -24, -32, -5, 24, 26, 17, -11, -30, -4, 12, 32, 14, -12, -15, -17, 3, 10, 32, -1, -21, -2, 18, 27, 18, -7, -19, -18, -12, 36, 19, 2, -25, -4, 1, 20, 25, 14, -21, -23, 0, 22, 21, 4, -14, -16, -6, 9, 35, 11, -6, -25, 14, 17, 27, 0, -13, -16, -7, 12, 22, 6, -15, -26, -6, 11, 23, 21, -15, -20, -10, 22, 31, 24, -10, -11, -8, 3, 23, 30, -2, -27, -11, 12, 22, 22, 2, -9, 2, 1, 21, 16, 4, -9, -6, -6, 21, 17, 11, -10, -32, 0, 10, 5, 4, -6, -21, -10, 22, 18, 8, -1, -23, -7, -6, 11, 1, 0, -28, -8, 11, 26, 11, -7, -14, -12, 7, 4, 9, 0, 0, 1, -1, 24, 9, 10, -10, -14, 2, 14, 19, 3, -5, -4, 6, 19, 5, 9, -6, -6, -11, 16, 7, -7, 0, -14, -4, 2, 10, 3, -21, -10, -8, 5, 6, 11, -1, -15, 3, 9, -11, -6, 1, 4, -12, -6, 7, 2, 1, -6, -10, 6, 3, 12, -2, -6, 1, -6, 10, 3, 1, -1, -8, -3, 6, 7, 3, 2, 4, -4, 1, 8, -4, 6, 2, 13, 1, -6, 3, 9, 1, 8, 11, 2, 13, 6, 12, 8, 4, -6, 1, 6, -1, 5, -2, -11, -5, 7, 15, 1, -6, -3, -11, -5, 16, 7, -7, -2, 0, -4, 15, 6, 1, -5, -4, 10, 11, -3, 3, -4, -10, -3, 16, 11, -1, 2, 0, 11, 17, 8, 0, 3, -2, -2, 13, 10, 18, -1, -11, 3, 16, 30, 14, 2, -2, 7, 9, 18, 10, 5, -4, -13, 4, 14, 5, -3, -18, -9, -1, 2, 11, 6, -19, -17, 2, 4, 0, -9, -20, -9, -10, 17, 11, -14, -19, -15, -3, 12, 18, -1, -11, -10, -1, 24, 14, 1, -9, -11, 5, 10, 14, 14, -6, -11, -13, 13, 11, 3, -1]
6067apMJ4J6j9j7j1RQK6j1j3j6OK6Mrj5qrK3J8mk1j6nL4PRk7k0%RK3J2rj8nRK6
6107B2jj3j9rJ6L4Nk1j5k8K8MK3rj9j1rL6Nork7QK3K1pk8j5JJ7QJ9l2pjML8j4
6145A2k7Jj7K0M1rl2jj3J7K0J1j1l5LK1PJ2k6mj3J2RL3j6k0k0K4K1%j5j5rJ8P
6180FK0k2j5J%K1LJ4k4j3MK0%jj5lj1J4J9Mj2l2RJ0J6J6k1l1LNM4qj7j1rJ2J1
6217GJ9om4KJ1L1onJk0%L1Oqk8JLRJ0Qj0m0J3K5J4kpl0PNK0jj8orK4J4Kj2j8j3
6258b0K2J2J0k4j2NjOJ3Nl7QJ7K2j1ook4OJ4K2k0j4QQ%QNmk1J2J1J2pl7J1JOK5
6297B5rk0j3J0K9mlnj2%j6L8%k0jJ3j8J2LJpj1J6J2qqkj2mJ6J1j2k5J2J1LnJ3
6335A0Nk9NJ2MrmRj2J0nJ9j4pMQoj1J7kj2MROj7MJ9j7MJkPk1J5J4k3J1kOk1ON
$$ y = [-1, -8, -4, 10, 26, 7, -10, -21, -12, -4, 22, 11, -2, -18, -12, 14, 18, 9, -6, -14, -23, 0, 18, 14, -7, -23, -28, 6, 13, 22, -5, -25, -25, -16, 7, 19, 10, -8, -13, -4, 22, 21, 8, -11, -20, -4, 30, 35, 14, -1, -29, -1, 3, 26, 17, -2, -13, -22, 14, 19, 13, 4, -23, -15, 8, 29, 22, -6, -21, -20, -3, 5, 24, -8, -15, -16, -12, 26, 12, -15, -14, -31, -11, 30, 21, -11, -12, -25, -8, 12, 23, 12, -23, -20, 1, 8, 20, -6, -10, -23, -11, -2, 31, 15, -5, -25, -1, 20, 20, 5, -10, -19, -1, 6, 26, 4, -11, -10, -10, 11, 14, 28, 4, -9, -5, 15, 15, 14, -1, -4, -15, -1, 18, 22, 10, -22, -13, -3, 13, 29, 8, -23, -20, -15, 29, 21, 4, -7, -16, -4, 7, 26, 20, -24, -22, -11, 20, 14, 9, 10, -10, -10, 21, 27, 19, -9, -8, -5, 4, 14, 22, 12, -28, -15, 10, 24, 22, 15, -15, -8, -3, 17, 16, -2, -8, -17, 7, 21, 23, 11, -7, -20, 2, 14, 24, 0, -12, -7, -8, -2, 11, 16, -21, -13, 4, 26, 15, 9, 3, -21, -15, -1, 21, 1, -13, -5, 3, 3, 11, 16, 12, -9, 3, 14, 26, 19, -18, -7, -6, 0, 25, 16, -4, -17, -7, 22, 18, 15, 10, -2, -2, -18, 20, 20, 0, -1, 12, -6, 6, 9, 10, 3, -8, 8, 20, 12, 4, 2, -10, -14, 2, 13, 1, -24, -12, -1, 2, -3, 10, 15, -14, -9, 3, 7, -2, -6, 3, -9, 1, -4, 15, 1, -6, -2, 6, 0, -11, 6, 4, -8, -4, 5, 11, -6, -2, 17, 0, 4, 5, 3, 10, -11, 4, 18, -5, 6, 4, 10, -11, -5, 0]
6377@Pj1nK2j5m%jNj1J6MMoJLj1lJ3lj1jJ8j5jK1qpqK7j9qLJ0jJj2K0Jj5O%ll
6421@LOk0PJ3lj4QLk%Jklj0J2Pj6PlPqNMKj3K0opoJK2qj9J3mOpNonqJ9nKJ4oj3
6469glK5Kpl3K0RJ5k1%j0nJ1RJLqmRnJ3j1j3NKJ1oLKj3%OJ2oj1%J1j2JJ8Jj8p
6512a1RJ7pj6%kMJ1%j4lMmJ2LLqrmJ6Pj5NoLOLoLj3ONlOKnQnJ9j1j3jkJJ1Mmr
6560ckK1nKj4MoLPJ4j4k5J1lJ7Rj0j4JONJ1j3j0Pj5J7J8lj0j4LJ2Nnqkl%RQrj1
6603iRJ7j0Nqj3jJ8KJj2kj0J3QKLk1LNoPJ8l0%qL0lprOjjQJj5oJ9oRn%jpKJ4j0
6650aJ6j4lJ1k%Kqo%OMmJKpJ1KnlNrQkMj5RnPRrPj2MlKqJ4qKj6K5j5%N%mP%Lj0
6701cJQ%kJj4PKRn%j%mnOJLpJLKJP%njJ3mk4RPLm%oRj3MRLJrJoJ0nKlmj0KJ8j5
$$ y = [0, 7, -4, -9, 13, -2, -6, -6, -7, -2, -13, 3, 7, 11, 5, 6, 9, -2, -5, 8, 5, -6, -7, 11, -4, -5, 16, 8, 1, -7, 20, 1, -7, -4, 6, 5, 6, -6, 14, 15, 0, 6, 6, 3, 0, 3, 9, -11, -4, 9, 6, -8, 0, 3, 1, 1, 2, 0, -3, -13, -1, 6, -10, -3, -6, 1, -7, -2, 2, 4, -9, 11, 5, -2, -8, -7, 15, 7, -12, 1, -3, 3, -4, 1, -5, -10, -18, 1, -4, -2, 12, 6, -7, -10, 15, 17, 10, -23, -3, 6, 21, 0, 0, -10, -15, -4, 5, 6, 9, 1, -3, 6, 1, 14, 3, -10, -5, -3, 8, 2, 5, 7, -6, -6, 0, 12, 6, -5, -5, 6, -6, -5, 13, 14, -4, -11, -2, 15, 8, -8, -8, -10, -6, 5, 5, -9, -12, -8, -12, 0, 3, 6, -2, -11, -15, 1, 8, -7, -2, -8, -5, 1, 4, -2, 1, -12, -6, -1, -4, 2, 4, -1, 7, 2, 21, 10, -3, -4, -6, -5, 6, 10, 6, -3, -5, 16, 11, 13, -1, 3, -3, 0, 7, 21, 7, -18, -7, -10, 7, 16, 6, -8, -7, -1, 4, 15, 2, -8, -1, -16, 1, 19, 16, 6, -8, -5, 7, 12, 7, -1, -3, -6, -6, 3, 11, 2, -9, 0, 17, 7, 12, 4, -9, -10, 8, 10, 11, -1, -3, -13, 0, 8, 10, 13, -8, -5, 0, -6, 1, 19, -11, -11, -19, 11, 8, 1, -8, -2, -3, -4, 4, 5, -10, -16, 3, -3, 6, 1, 1, 0, -7, -5, 9, -1, 15, 1, -2, 9, 7, 7, 9, 1, -5, -5, 1, 5, 1, 2, 4, -3, 8, 10, 5, 2, 7, -2, 6, 4, 8, -7, 2, -3, 4, 13, 4, 11, -1, 3, 0, 2, -6, 8, 0, 2, -14, 11, -4, -4, 1, 1, -3, 4, 4, 7, -3, -2, 6, 6, 4, 5, -9, -2, 0, 9, 4, 4, 3, 3, -1, -6, 0, 1, 4, -3, -2, 1, 3, 4, 11, 11, 6, 5, 18, 14, -10, -1, 6, 9, 5, 5, -1, 8, -5, -1, 8, 11, 12, 3, 4, -2, 8, 3, 5, 2, -2, -12, -10, 8, -7]
6755gOolJ7j1kRojJJ2l%pQmjQpJnOkOJoJ3j5jJ4Mj3JjPklj0J3j6K4mj6MmMLn%
6804AR%j3nOoPqmKOkJ0mj5K1j3KJ0Mj6QKJ1j8KLkNPnNk2QPMoNOoj1J5pmMLmPo
6853Co%jJ3Pj4jloJOJ8j4qJ0JJlJLk0QPokQOj6MmJ8j1PnkOKj0KoJQKqOkmj2J8
6902CRqlN%NnNj2OnMQj4lJ0jj5J4KpkJ9j1lqPLJlkJnLmL%mJ1j3RJ%jlPPj3PlM
6953Fj5J0J0mj8J7o%MLj2lJJ7lo%J1pk%%lj%ML%JRj7kJkQjjJ0k1J2jqOkljLoP
7002bkMjjqJ8Kk3J7J3j6pQjMj0JRoLJ9mk5MK3j1mjNppJ3J2lk2MnRL%%lJPpnOr
7050ePj1KJ7Mk4NJ2j4QLnrJ3nJ1j1pK2nmJ0mj1OmjMNomoPOKj2oJ8Oj7JJ1j3KJ
7095aQKj2J3Mj8J3kKj0OL%rJLoLRoj9RJ9j9J0MJ2qj9J2PpMp%pNJ0oj2J2LpJ0q
$$ y = [-7, -1, -7, -10, 7, -4, -6, 3, -3, -4, -3, 9, 6, 6, -1, 7, 3, 2, 10, 3, 4, -1, 5, 3, 9, 10, 4, 17, 2, 1, 15, 19, 6, 7, 6, 13, 11, 8, -2, 11, -5, 19, 15, -1, 3, -1, 3, 6, 1, 1, 10, 10, -3, -8, -2, -8, -1, -9, -13, -11, -5, -7, 3, -1, -16, 5, -8, -6, 4, 8, -8, 0, 2, 13, -5, -3, 0, -2, 3, 10, 5, 10, -12, -4, 3, 7, 1, 6, 12, 6, -5, 10, 3, -1, 3, 6, 2, 9, 3, -3, -3, -4, 9, 16, 2, 1, -2, -8, -7, -1, 17, 3, -5, 5, 6, 7, 4, 5, 8, -12, -4, 3, -3, -5, 3, 9, -7, -3, -7, 11, 0, 7, 2, 0, 6, 8, -2, 0, -6, -5, 3, 5, -3, 3, 1, -3, -15, 3, 12, 4, 1, 6, 6, 11, 6, 11, -1, 5, 0, 4, 12, -2, -5, 5, 4, -11, 3, 5, -2, -4, 15, 4, 1, -7, 0, 3, 4, 1, -1, 0, -5, -2, -6, -3, -3, -7, 4, -9, 0, 1, 1, 0, -3, 4, 11, -2, 5, 2, 6, -9, 1, 11, 7, -11, 6, 0, 0, 4, 7, -5, -8, -7, 10, 7, 1, 1, 12, 5, 3, 3, 3, 0, -1, -1, 3, 6, 6, 7, 16, -1, -3, -2, -4, 4, 3, 2, 12, -9, 3, 2, -6, 0, -2, -5, -6, -3, -9, -2, -4, 0, -1, -2, -10, 8, 10, -13, 4, 17, 1, -6, 2, 1, 5, -5, -4, 5, -1, 2, 21, 17, -8, -4, 19, 8, 4, 3, 8, 1, -6, 7, 19, 16, -6, -2, -7, 2, 5, 5, 5, 2, 3, 10, 3, -2, 4, -5, 2, -9, -7, 10, 14, -10, -5, 7, -7, 1, 4, -1, -10, 3, -2, 9, -2, -9, 13, 8, 4, 14, 10, -1, 5, 1, 0, 4, 9, 3, -1, -7, 0, 6, 8, -4, -10, 8, 14, -3, -2, 9, -4, -2, -1, 7, 9, -3, 10, 14, -4, 9, 7, 9, -1, 5, 8, 8, -1, 0, 3, -3, 0, 9, 3, -16, -7, 12, -7, 3, 7, 19, 11, -8, 4, 11, 4, 8, 1, 1, -6, -1, 9, 3, -9, 3, 6, -1, 9, 1]
7140AQpNj2K3k4OQRj9RMjrMkPj3J0kj1kQOmqMJ1j4J0mKj1OqRkJ0OLk0PLNj6MJ4
7187A3j2J0j4Lj2J5J1j8mJ0J8k8J2R%j8MM%lQj%MJnmj0QJ2j0NKmKj3J6J3k6Np
7228dKJ1n%mLlJJj2K4%j4J5pj0Pj3J6J1k1J7j0l%Qj1nPlPq%RJoLLm%PoMnkkJ0
7275Ij1ONqlQKMj1Rj0NJQ%j0Mj3KjJ2nqOJ1j4OM%oj1K3j8oJ7j5K4nrjMqMjNqL
7322@KPKlj2J3j4%J5Qj6Pj0J3j4OM%Jj4PrJ2lkkNNqMNj1kKJ3qj0%OkPmLnLJ3j2
7369BMj1Pq%%K0k0oJ8oPmkoJJ9qjmJ3k2J1jJ6j1j0J1nJ5j3J0j4ljK0Jj7kpJ2O
7411A1lOj1qjQMj4MqJ8J0mpjk1NJ6JLmk1RJ5Onj5JQRklpqKMJ1Lmj5j1J3J1J6j4
7456Gj0nJ5MKlj3oJ2K1pj3KrjnJ8Jk6NO%J0Kj2j0QJ4J3moj8J3pQj5J0j3LQRQk0
$$ y = [1, 9, 2, 7, -5, 18, -6, 0, 8, 17, -2, 7, 11, 10, 1, 5, 3, 10, -3, 7, 5, -6, -8, 0, 6, 2, -6, -2, 9, -5, 5, 1, 3, -8, -2, -10, -1, -3, 7, 13, 16, -4, 3, 6, 11, -5, -1, 13, 1, 11, -3, 0, -12, 3, 14, -4, -8, 2, 20, -8, 4, 13, 13, -5, -1, 3, 3, 0, 8, 7, 7, 11, 12, 7, 3, -7, 1, 13, 3, 8, 10, 6, 8, -5, 11, 24, -2, 3, -4, -2, 9, 4, 4, 0, 3, 0, 1, 2, -10, 14, 14, 0, 15, 8, -2, 5, -8, 8, 19, -2, 15, 5, 2, 2, 10, -1, -6, 1, -2, 5, -3, -3, 6, 7, 1, 4, 7, 3, 3, 10, 4, 8, 3, 1, -1, 9, -2, 4, 9, 1, -2, 6, 8, 12, 1, 10, 0, 5, 6, 14, 14, 4, 8, -5, -3, -4, 8, 3, -5, 1, 12, -2, 4, 8, 8, 2, -9, 14, -4, -10, 7, -8, 16, 11, 2, 1, 5, -3, 1, 0, 5, -3, 0, 2, 9, 11, 8, -4, 9, -5, -5, 10, 18, 2, 9, -1, 12, -2, 4, 8, 8, 9, -5, 2, -7, 5, 2, 0, -2, 3, 8, 0, 4, 9, -2, -4, -2, 11, 3, -7, -7, -1, -3, 4, 0, 3, -2, 1, 14, 2, 6, -5, 2, -6, -6, -6, 14, -6, -12, 6, 0, 7, 3, 1, -5, -4, 15, 7, 6, 2, 15, -7, 4, 3, 19, 8, -2, 9, 4, 19, 6, 16, 2, -1, -2, 18, 19, 2, 0, -7, 5, 11, 8, 14, 3, -5, -6, 2, 6, -8, -4, -12, 6, 16, 12, 5, 4, -17, -12, 4, 5, 8, 4, -17, -8, 7, 13, 8, -7, -6, 2, 11, 9, 6, -1, -9, -7, -3, 8, 11, 7, -8, -19, -6, 5, 21, 7, -3, -8, 7, 11, 13, 10, -3, -9, 3, 24, 17, 4, 6, -3, -4, -9, 9, 10, -16, -11, -5, -5, 5, 7, -5, -15, -7, 7, 20, 16, 10, -8, 5, -2, 6, -9, 1, -12, -9, -1, 8, 16, -4]
7499djnJ4LNj2rlJ6K2Kk6Jj2K5KNj5rjJ0J0Pj2k2%J0OJ3nj5j2NJ3J0ok3kJ0J2
7539GK2rj7j1NMRJ2j6j2RJOJ2j3k4j1L3J8j5Mk6OlJ4K5k5rqOJ9J7pj8j6J3RPj7
7578AOj1J%L7j6k7kJJ8kPj3mj3K7J1Kk7joJ6PQk0lk4K9K2qj4k5LJ9MJ8lk5j2K2
7618CQkJ2j9j7OK4Rj4nrPNJ7Kk0k0QlK1JLk8j5K0K9jj1k8QJ5LJ4rk0j0PK5Ok1
7658AnnnK8J7k1k3JQNK0oj7j8QK6J7k8kqKRJ7Lk1j9J3K0PKk1j4rL4O%qj2j8J4
7698bJ5Joj9jJ1J9J1k3rqMK4Llk9jJK2J4oj7j5kK2Prj8JJ1JJ5mj5oKK0ro%J1j8
7740a1J0ROj4j7J2OJ1pmj2KJ0NpJ5j3Mj4J5J7k7nNJ6pmMMj9%J8Kj0jJlOJ0J3k3
7781Cj8J6%J3j3jJ5j4mJ4joqJ9k0jJ4Npj4mK2JlLQj4kNLooNkoKQpK%J7j7kJ0j7
$$ y = [-4, -5, -10, 4, 7, 12, 0, -9, -12, 4, 26, 28, 2, 3, -9, 16, 18, 23, 8, -1, -2, 8, 18, 25, 13, -9, -9, 1, 7, 20, 15, 0, -12, -7, 6, 16, 10, -13, -15, -5, 7, 29, 20, 3, -8, -3, 1, 10, 22, 6, -6, 3, 4, 10, 22, 9, -15, -26, 7, 25, 10, 14, -12, -6, -9, 5, 30, 5, -4, -12, -6, 13, 30, 23, 5, -11, 2, 11, 18, 1, 7, -4, -3, -3, 34, 18, -9, -11, -10, 8, 6, 13, 0, -4, -17, 10, 21, 23, -4, -5, -11, 5, 12, 20, 0, -3, -27, 2, 24, 16, 2, -23, -20, -1, 3, 21, 18, -7, -19, 3, 11, 9, 21, 2, -15, -9, 15, 24, 10, 5, -4, 3, 8, 25, 27, 7, -13, -5, -8, 13, 14, 17, -11, -26, -6, 23, 22, 11, -17, -9, 6, 9, 23, 14, -6, -16, -9, 16, 22, 1, -4, -9, -14, 14, 31, 10, -13, -12, -4, 1, 21, 15, -2, -20, -12, 14, 31, 3, 1, -7, -5, 4, 21, 24, 3, -16, -3, 17, 24, 26, 5, -9, -18, 16, 22, 22, 14, 2, -16, -2, 13, 14, 8, -11, -12, -1, 18, 29, 6, -3, -11, -7, 17, 20, 17, -12, -13, -12, 10, 24, 18, 1, -14, -16, 6, 13, 4, -14, -13, -2, -1, 14, 10, -5, -11, -9, 11, 2, -4, -4, 7, -11, -1, 8, 14, 0, -17, -5, 1, 12, 5, 1, -11, -9, 1, 6, -1, 14, 1, 5, -9, 6, 23, -4, -9, -4, 12, 5, 1, 5, 9, -10, -10, 8, 10, 0, -1, 0, -3, 3, 13, 26, 3, -15, 1, 1, 14, 1, 0, 15, 1, -3, 11, 10, 4, -4, 15, -5, -6, 8, 13, 6, -8, -12, 10, 11, 8, 11, 19, 5, 3, 8, 11, 5, -1, 4, 2, -4, -2, 6, -1, 1, 1, 18, 1, -1, 9, -8]
7826hRrJ3LKj3Okj4J6kQj6K0lj0RnKj1mJ8p%LonJ3Pkj2jJ1j6J4KkKqLPMmj6Mp
7872gRJ5rpqJ6OjMj4j1%J5K0j1j7j3JJ3J0nLk0OJ4Nj5kM%nOLRk0KLJ1K2k5prR
7915@J6J2j0l1RPJ4j0j0oj0K1K0Rj8j6j2J4J6Qpk6j6K0J6J3nj6k4J3J3J7kj8j7
7950a6pL0QJ3j8l1J2mL2J4l5jj4K3K5Kk3k7jJ2L0%nk7k1L0PJ0j0j0j9J7J3J9j2
7985A6jk8J3RJ6j0j9pOK3KPk6j8J5J6J6j0j2k2jK1J3J6k5j5j2J8J5Qk3k4PJ5J5
8020A4J5kk7k1J7J1J4oj8j1jK2K8j4l8j3J2K9J6pk4k5QJ8L6pk1k4PJ2M1j4l0p
8054a0j5K9J8qok2j6K9K4J1k8k3nK8J3J4j3l1j3K0K8J7j5k8j3OJ8J1Nk7k2J6K7
8087A9OJk3j4j1L2J7nj4k1oK8K4j3j9k4kK7K4Ol2oJJ5J3Qk1k2mJ4K0J9k9k4PK
$$ y = [-8, 1, -8, 5, 8, 10, -3, 3, 1, -13, 3, 1, 9, -7, 13, 10, 0, 9, 4, 6, -5, -9, 9, 2, 2, 5, -1, -6, 7, 14, 12, 0, -1, 10, -6, 8, 10, 8, 10, 2, 5, 12, 16, 12, -4, 0, -7, 2, 17, 8, 1, -7, 9, 15, 14, 18, 4, -7, -7, 8, 28, 17, 0, -13, -12, 1, 11, 6, 9, -11, -5, 9, 14, -1, -3, 1, 1, -4, 2, 5, 14, -6, -4, -1, 10, 32, 7, 0, -9, 0, 16, 28, 18, -13, -4, 3, 17, 7, -3, -9, -19, 2, 22, 31, 13, -3, -15, -1, 15, 23, 16, -10, -26, -6, 10, 23, 18, 2, -22, -9, 4, 21, 19, 1, -16, -23, 7, 15, 28, 10, -21, -9, -13, 19, 33, -2, -3, -17, 6, 31, 33, 10, -17, -18, -6, 24, 24, 19, -8, -29, 1, 8, 18, 8, -2, -21, -4, 9, 28, 16, 15, -13, 0, 9, 25, 15, -4, -11, -5, 18, 20, 27, 1, -17, -2, 14, 30, 20, 8, -14, -15, 6, 19, 35, 10, -5, -17, 1, 16, 24, 1, -23, -16, -1, 14, 29, 27, 0, -21, -4, 7, 21, 15, -3, -14, -15, 7, 35, 21, -17, -30, -18, 11, 27, 20, -4, -29, -21, -3, 33, 26, 5, -19, -12, 0, 41, 27, -3, -10, -25, 4, 22, 14, 8, -14, -30, -1, 23, 34, 6, -17, -22, 6, 19, 33, 20, -11, -24, -4, 24, 41, 26, -2, -15, -9, 9, 20, 25, -2, -24, -8, 19, 25, 26, 3, -11, -22, 10, 27, 22, 8, -13, -19, 9, 33, 20, 1, -23, -25, 2, 26, 32, 0, -6, -5, 10, 23, 31, 10, -12, -16, -2, 18, 37, 8, -16, -9, -7]
8123gJ8K5k5k1rRL2Kj2j9k3J4K1K2j5k6qJL3J3kk9mkOK4qj0j4j1K4K0jk2kj2K2
8160DK1j0lj9rJ4L0rJk6j2J0L9rj7nj4J3K5pnj0k1J3J5J6kk4j0J4J
$$ y = [-7, 11, 36, 11, -10, -19, -10, 22, 24, 12, -7, -30, -16, 5, 27, 12, -14, -22, -21, 12, 25, 23, -6, -10, -12, -6, 18, 10, 0, -14, -25, -1, 19, 18, -4, -6, -18, 4, 25, 15, 12, -7, -16, -2, 28, 19, 20, -6, -18, -8, 31, 22, 5, 0, -14, -1, 24, 17, 12, 2, -19, -6, 9, 25, 23, -1, -11, 3, 4]
8191D
$$ Imaginary data points
##PAGE= N=2
##DATA TABLE= (X++(I..I)), XYDATA
0@%%%%%%%%%%%%qJ6j6J6j6J6k4L2l2M0m8N2o0P2q0Q8j04J19j31J48j68J84k04
35a08K28k56K84l12L49l89M29m74N25n83O47p13P94q90R94j118J266j443J663
54H93j946K321k850L657n046Q087k5669J8309M8080m1222j5484K0181r915l3668
68c4272L0819M2571k4294m3678J5039K1204j0913L745K6774j5497l8887O419L2610
81A1640k303j1893J0500j005k3279N161K8898l314k7590N95J7188j877n158J0036
95G599k1j5953j716J4605L727p692m326k749k61J1052R909p530j2455l108n05
110i424M241J6735P576k0218j8313J0592J5437J3R87J140j7715j4876J8878K4514
124A9567o087j4678k00n989j0764J6328K6060j0519k8356J164J5365k069J262
$$ y = [0, 0, 0, 0, 0, 0, 0, 0, 0, 0, 0, 0, 0, -8, 8, -8, 8, -8, 8, -16, 16, -16, 24, -24, 28, -32, 40, -40, 48, -56, 63, -68, 80, -88, 96, -108, 120, -136, 148, -164, 185, -204, 225, -249, 276, -307, 340, -373, 421, -469, 525, -593, 673, -770, 893, -1053, 1268, -1582, 2075, -2971, 5116, -20553, -2244, 45836, 4614, -10870, 9311, -604, -34272, -3453, 39118, 14824, -28854, -13815, 7389, -3524, 221, 26995, 11498, -27389, -20970, 11640, 9337, -2556, 7944, 6939, -16340, -11179, 17719, 14405, -13185, -12590, 4598, 2721, -2437, 7599, 7578, -8375, -10091, 4514, 8241, 549, -3777, -6526, -6787, 4265, 14174, 6644, -5811, -8919, -9424, -5183, 11552, 19128, -1090, -19403, -8811, 6626, 6639, 7626, 8766, -8949, -23825, -4947, 19567, 13480, -1198, -1398, -7387, -18151, -1823, 24237, 13718, -14638, -13474, 1891, -178, 1084]
137A084J5476p130k9326q1K9112O696j6132q84N268j2294m554K0662Q875j9403
151b631j0126J2027M024n913O960O634j4880j1855J4482J3924r143r324N205Q70
165B54o210O461J1657p931j6779K858J5156K323o895m16n1p332q34J2833P465
180A2559j0201j1572J947P074L015L062J645q515j1213L857J4587M479p815n785
194b876j429k032L490J0852K542j1818q349N112O157O23K344J213q474p846O867
209c624J1006j032p005j670j57j572L823O612k076q165j428N211K503q78l67j338
225a57k706L51L733K011j729k947j510J473L239J038k141k175q22L32L070L612
241D672k200o198o12M865J585j303J379n52n726p74P685K868o042k327L275j704
$$ y = [1084, 16560, 9430, -19896, -19977, 9135, 15831, -301, -1185, 4083, -8211, -12765, 7897, 16772, -2631, -12757, -730, 3294, -2619, 4341, 10975, -3905, -15760, -1278, 12646, 3503, -5821, -616, 254, -5956, 505, 12162, 4231, -12548, -9690, 5466, 7789, 894, 478, 427, -6905, -7739, 5094, 12559, 2358, -9214, -7267, -193, 2822, 5884, 7529, -986, -12199, -8342, 6245, 10724, 2909, -2876, -4305, -6337, -2847, 8005, 10547, -1271, -9620, -4508, 1649, 2272, 4616, 5829, -2645, -10491, -3624, 7382, 6350, -655, -2325, -2482, -4054, -231, 6381, 4305, -3860, -5288, -77, 2426, 1548, 1181, -157, -2863, -2512, 1221, 3232, 1503, -1444, -2954, -1481, 1758, 2796, 655, -1520, -2342, -2010, 1060, 4672, 2472, -3726, -4338, 527, 2112, 809, 2188, 1636, -4090, -4864, 2821, 5689, -353, -2680, 595, -1109]
257a109k822N977N090o891o535M865M356l524J11M672l486o827M278P288l810
272A633n289M205K172n936j09P413n95p166J350N517l043l859M926K746n884j751
288c670N857L74n288J232M597k523l659L341K313l866p09M418m89m702R51M130
304B307j071k564J663Q64k740nL369n7k806J75J402j038j50K283j52k999l66K224
322C39N33m04O35q52k452N49L201M81k225q36K54k86J217K301r40l464n36K311
340a74J027K7P03j107l056L1L847J743k157k063n98k73J664L524L68m213k973
357c680J548K707J361N41j353l583j215L535L612o55k752k030j033J086L881K467
373D437k572m444r07K376K635J419q39l555k678K039M530J472k432l128j609P07
$$ y = [-1109, -3931, 2046, 7136, 245, -6290, -1425, 2931, -593, -482, 4190, 704, -6123, -1845, 5443, 1633, -3656, 549, 2721, -3215, -3324, 4089, 3494, -3672, -2322, 3195, 152, -3707, 1219, 3965, -1919, -3670, 2187, 2561, -2727, -1495, 3102, 579, -3080, 261, 2574, -1292, -2001, 2417, 1928, -2774, -1823, 2307, 1236, -1328, 335, 1199, -1541, -1546, 1823, 1766, -1040, -865, 537, -501, -651, 1632, 1480, -1519, -1885, 339, 872, 468, 1103, 251, -2201, -1652, 1549, 2030, -195, -1031, -777, -1063, 154, 2455, 1515, -1949, -2485, -174, 853, 880, 1583, 476, -2580, -2549, 1298, 3041, 884, -1179, -1777, -2050, -386, 3138, 3506, -707, -3680, -2132, 575, 1936, 2477, 1124, -2459, -3674, -139, 3473, 2818, 66, -1964, -2997, -1911, 1970, 4437, 1865, -2579, -3486, -1110, 1525, 2944, 2105, -1450, -4128, -2089, 2441, 3913, 1481, -1647, -3256, -2549]
389b549L204L024r02m112k421J618L351K012p31l289l158N28M261L459r32m041
405f78l126L90L489L525O6l748l742J60L825L682Q9l477m024p82L303M429J166
422D547l143m394j288K816M273J629k650m646j909K847M859J879k629m521k245
437d575J863M506K871j801m774k690J874M364K745j215m405l629J029M954L722
452D839j187m476l498L92M014M190j6m499m282L77M310L944J03l710m372p44L772
469h43M598Q05l459m403j224L158M668J412l258m593j421K839M596K021k717n010
485b831j975K807M469J934j867m364k999J802N260K750k486m479k169J134L720
500G06L769l94n167m112J688M791K701p35l214l888p11M434M855p08m729l075
$$ y = [-2549, 655, 3679, 2777, -1335, -3756, -2138, 1213, 3225, 2494, -795, -3953, -3425, 836, 4295, 3363, -678, -3804, -3414, 75, 3600, 3666, -82, -3824, -3664, 161, 3843, 3932, 455, -3569, -4351, -1048, 3381, 4547, 1404, -2990, -4278, -1462, 2811, 4440, 1790, -2856, -4765, -1918, 2941, 4820, 2191, -2330, -4575, -2712, 1794, 4665, 2864, -1910, -4600, -2726, 1638, 4383, 3168, -1237, -4866, -3837, 1117, 4839, 3652, -824, -4322, -3930, 84, 4274, 4258, -241, -4523, -4146, 164, 4108, 4211, 501, -3871, -4615, -843, 3755, 4560, 1101, -3302, -4526, -1368, 3300, 4712, 1454, -3139, -4560, -1721, 2875, 4896, 2179, -2831, -4806, -1999, 2470, 4404, 2537, -1827, -4826, -3024, 2236, 4986, 2500, -1979, -4148, -3014, 706, 4475, 4081, -1086, -5198, -3510, 1281, 3982, 3247, 33, -3855, -4566, -132, 4723, 4015, -714, -3789]
516c789M54K590L648J764l290n490o82M623L842k41k433l118k131J988N384K185
532E304m010m824l71K748L068K023r99m688l395K583N339J541k658l174j774L46
548b941L407L958o74n152l244K006L820J880l67k342l402p99L709M027p42l940
564g96k289P19K055K441J216k332m140o11L785L099q25k418j677p93J220L617
580B271J841l288m465K42L642K224pj011k729k755J726N264J605l864l502J33
596b673J311J905L034K12n013l963K690M804P42j547j085k343k111K973N257m22
612C771n041j915J814R62Q83K442m63m708j791L869K800j549j271K87j298r76
628b184K849K531k492l231J118K250k33k63P57j249k140J318L261j66k923j070
$$ y = [-3789, -3335, -745, 2903, 4667, 1377, -4113, -4795, -172, 3670, 3429, 996, -2122, -4253, -2265, 3119, 5304, 1294, -3530, -3901, -1153, 1915, 3938, 2939, -1749, -5144, -2561, 2778, 4319, 1661, -1513, -3287, -2941, 466, 4424, 3750, -1402, -4646, -2640, 1180, 3060, 2693, 351, -3051, -3850, -141, 3886, 3144, -796, -3085, -2366, -311, 2130, 3346, 1014, -3126, -3737, 48, 3147, 2322, -96, -1773, -2566, -1346, 2271, 4112, 824, -3641, -3399, 243, 2467, 2460, 1449, -1280, -4035, -2309, 2955, 4560, 696, -2806, -2673, -1362, 543, 3577, 3789, -1224, -5187, -2497, 2307, 3049, 1502, 417, -1926, -4037, -1064, 4193, 3771, -1270, -3185, -1371, -409, 474, 2916, 2453, -2255, -4046, -177, 2623, 1074, -197, 90, -1208, -2184, 665, 3196, 704, -2527, -1409, 841, 608, 345, 1102, -147, -2287, -969, 2292, 2126, -797, -1867]
644a867J074P99P70J192o33k919j401K327K960O6k096j597m50L87J812K372l07
661B489l663k363K003K947M06n71m14k158k144K370M280n14l672n68J218r46L39
678i61L689K87m951j545M004J193k579R60K407k988l196L649L395l403k370L436
694A027Q05l915M85M247j438m039K379L572l181k977L494J968l560l63L962j055
710A411m670J445M646j223l281J617J465l061p20M272J237l879j537K189L19j058
726h28J627J549k326k567J184K220K00n18q5p31j120J74J635J247n97j720o43
743a299Q79N29j74P96P50j662j876J350K039q82r64J484k1k765M3L280J93k589
761h89N52J769k115j870L145K317k961j793K410J45k713J339L584j631l736J320
$$ y = [-1867, -793, 6, 776, 1968, 1335, -1584, -2985, -658, 2302, 2368, 272, -1325, -1775, -1388, 424, 2796, 2489, -1174, -3537, -1534, 1413, 1819, 1248, 834, -1324, -3468, -1098, 3182, 2668, -1004, -1572, -354, -1300, -961, 2728, 3015, -1936, -3481, 523, 1716, -863, 97, 2504, -484, -3680, -31, 3364, -39, -2409, 1027, 1832, -2083, -1598, 2649, 1211, -2828, -449, 3123, -58, -3035, 459, 2427, -1133, -1496, 2466, 1411, -3259, -1814, 2832, 1609, -1672, -55, 1410, -1651, -2371, 1901, 3138, -741, -2278, -89, 230, -828, 799, 2348, 22, -2545, -1361, 859, 1059, 541, 456, -275, -1395, -1221, 414, 1661, 1064, -656, -1299, -420, 109, -65, 731, 1481, -181, -2057, -707, 1332, 450, -514, 970, 949, -1816, -1773, 1507, 1700, -889, -337, 1432, -683, -2553, 592, 2909, -52, -1845, 565, 710, -2003, -664, 2920, 1289, -2447, -1127]
777a127K502j714r43K994L08l908m88L494K29k389J048J788k394j986K777J994
793B185k303j142K076r6k422P15K710o56k238Q04J417j492j073K064J214j840
809g7j011J320J14j404O93K114n91k400j5J628p7o32J220O02k227j537J965K000
827A685r14j026O03m91j680R49K867j66k673m99J295k45l14J836O67k615j558
844b279J960J486r61j98Q88j046j693J220K163n95j635L14O43p36j02J327J65
861I21j354l56R98K67o74p3N25N2l82k9K78j46m88J83R88J79j208p06Q45O01m05
882A6K98O82j194j640J165K195n00j520L88J68j467N07K811m8l037m87J946j77
900A06q28J875P91l105j493K951J538j978k58J525j484k047K378K650k114k253
$$ y = [-1127, 1375, -339, -1282, 1712, 2020, -1888, -2376, 1118, 1347, -1042, 6, 1794, -600, -2586, 191, 2185, -118, -1260, 816, 720, -1702, -987, 1723, 1067, -1171, -367, 1050, -442, -1515, 549, 1763, -77, -1088, 232, 346, -1058, -365, 1749, 1158, -1242, -1257, 371, 294, -338, 882, 1484, -743, -2280, -315, 1685, 771, -255, 348, -143, -1823, -874, 1993, 1827, -846, -1345, -50, -295, -609, 1227, 1894, -721, -2279, -319, 1167, 206, 8, 896, -150, -1843, -623, 1540, 945, -690, -376, 267, -469, -571, 756, 921, -433, -789, 209, 476, -198, -271, 254, 306, -76, -105, 173, 27, -461, -278, 710, 889, -319, -1025, -180, 421, 16, 314, 996, -198, -1838, -673, 1522, 1022, -498, -110, 58, -1409, -902, 1909, 1861, -1176, -1663, 283, 106, -722, 1153, 1944, -1161, -2654, 297, 1835, -143, -401, 1124, -360, -2407, -29, 2621, 507, -1746]
916a746J654Q84j886N29K612j128k980J105K512j148j466J642M94k284O0K560
932A414k70k348N07J703r15r31J435L14j919k8J999rj561J96P45p94j47J493J16
951A000j692l56J121J78k25N98k08j362n2J378L87o00j5k02r33L31J583J07j309
970b71k88M48l06J77J250r5j672k55J249J68m92O04R6j438k89J760M56j365k08
989d71Q37n31o63J323P74j594r10J354O09r61Q4Q41q59r98J213J179j102r67Q01
1008d1K61p49M97J082q58j391P01J203m41n00N57k01j039M28J407j85j187K2M99
1027F5l04L9R25q0j226j92R74K27l93J69P3p13j72R23M06o82l48K63m0r5N00J98
1049E17o66m00M92L38j84m8O0l44j94N39L68l91l66J01R6QK92J33m77l71L14L86
$$ y = [-1746, -92, 792, -1094, -565, 2047, 919, -2061, -956, 1556, 408, -1058, 584, 1078, -1206, -1146, 1414, 1144, -1204, -697, 1006, 91, -840, 595, 909, -1010, -1038, 961, 952, -609, -413, 332, -462, -609, 884, 1000, -692, -1048, 73, 251, 26, 624, 416, -946, -998, 380, 767, 167, 152, -50, -983, -652, 931, 1038, -271, -559, -111, -417, -240, 1010, 915, -757, -1012, 237, 405, -87, 517, 613, -825, -1114, 646, 1102, -263, -471, 366, -165, -828, 495, 1269, -325, -1235, 119, 728, -233, -149, 692, -167, -1165, 48, 1227, 125, -842, -41, 220, -529, -32, 1050, 192, -1199, -498, 705, 264, -236, 321, 120, -919, -491, 916, 731, -456, -434, 65, -239, -200, 725, 645, -581, -773, 201, 428, 35, 204, 277, -436, -608, 315, 721, 39, -309, -46, -86, -181, 319, 517, -149, -549, -57, 281, 97, 49, 109, -235, -429, 110, 478, 87, -279, -178, -82, -74, 218, 351, -126, -497, -183, 203]
1071B03l1o8l6l24j75M48M36k52m06QQ5RK57K70l22m92J11M31Q4j14l1j58k45
1094c12J85M68J2l98j60J05P2J17K10p2m51j27L53K60r4j21j07j83%L59K42k56
1116A02l37J5J29P2J59R4k63l22J36L45M6j47l5p9j57J25L43j8l23o9J67J2k6
1139c1J63J7k94q1L38R8k21p6J45o5j00J98J45k73j84K35J66j32m4R9j44j62K46
1162D3K47k06k48Q8R3q4R6J80j47l31P5K86J6j24K2l8j70O6K58L7j84j10K9M2
1186f4O4R8k4j53n4O3J10O4l9j10l5N1L9L6M9l0j39j8J75N2j28j4Q1p2p9J29J00
1213A52j51r0J41K0j21L7J15q7j16J29Q9j67q9K02L7j63qJ48p0j78J22J88r9j80
1237a39N6J10m5n1J06K5j13r6Q9J54m0j25M9P8j02q7J74J40j85j57K21R5k75j1
$$ y = [203, 172, 104, 68, -256, -431, 17, 453, 201, -205, -197, -112, -103, 154, 424, 102, -390, -279, 152, 236, 122, 91, -67, -312, -127, 341, 353, -45, -205, -100, -28, 89, 299, 227, -224, -351, 2, 262, 168, 47, -60, -243, -243, 116, 358, 102, -235, -220, -91, -19, 140, 234, -29, -351, -215, 130, 176, 29, -6, -85, -242, -117, 226, 208, -115, -184, -17, -5, -31, 132, 149, -145, -226, 112, 210, -11, -87, 58, -7, -107, 91, 236, -37, -221, 14, 180, 48, 4, 103, -41, -203, 43, 290, 84, -164, -76, 17, -67, 29, 209, 62, -269, -194, 92, 108, -16, 6, -32, -202, -136, 122, 159, -25, -135, -106, -64, 0, 98, 74, -79, -133, -70, 40, 104, 65, -45, -80, -29, 10, 46, 95, 65, -74, -92, 83, 135, 7, -7, 74, 2, -77, 52, 152, 1, -89, 52, 72, -49, -12, 103, 16, -100, 29, 118, -49, -138, 64, 101, -62, -70, 78, 8, -170, -48, 140, 41, -139, -83, 27, -18, -69, 37, 62, -51, -147, -58, 96, 56, -69, -20, 58, -44, -131, 43, 183, -2, -159, 62, 157, -118, -129]
1261a29L91n5m04R8L60k07l13L65K79m89k29M88J05m72J13M99l56n62M58N19m79
1282b0l17N52M7p31J56Q48k39q08L07N68m92l38P64K16q97j59Q31K2o42K68N18
1303D54n56m82O76M22o29k10N39o7n19K98N24l83m40L94K63l72p6L73p6l37J81
1324b3K54k28j63K16P1j54O6M4k16j8K67J0j53P6m2k96J32M75p1m38P3J65l10
1347b63M7O49l2q05p0O29o2l36M99K46r05l68R58M00p22n4N81m67o99P96Q64p76
1369A10p37O71L08p53J25J009l44j084L74Q86m74n60P07L12r06j57R53j7q98K07
1389b68Q16l87o63N03M40o53k38P99J67q32j50O04J3l21K87K71n59m28M82M85
1409C68j53k20Kk04j97L30M99n7m55k51N4K02K54J65j10l52k77J36M55K54k62
$$ y = [-129, 262, 207, -197, -99, 261, 54, -259, 106, 385, -104, -333, 155, 260, -212, -99, 400, 44, -518, -60, 459, -20, -337, 215, 262, -469, -313, 535, 296, -512, -205, 363, -129, -467, 297, 513, -384, -543, 288, 310, -332, -64, 454, -102, -584, 92, 514, -115, -325, 214, 147, -372, -74, 450, 67, -373, 21, 284, -88, -164, 209, 133, -204, -23, 231, 3, -160, 56, 127, -27, 39, 83, -133, -151, 116, 126, -27, 49, 7, -289, -157, 318, 247, -191, -118, 47, -263, -216, 433, 401, -404, -474, 155, 93, -243, 256, 502, -403, -771, 187, 587, -135, -189, 392, -75, -774, 22, 886, 110, -627, 44, 352, -401, -276, 733, 389, -695, -321, 565, 91, -469, 238, 550, -356, -513, 440, 423, -475, -268, 548, 161, -502, 1, 441, -212, -450, 349, 516, -316, -466, 138, 151, -170, 117, 388, -171, -599, -117, 368, 215, -5, -3, -207, -404, -74, 425, 368, -87, -338, -284, -82, 172, 337, 227, -125, -402, -266, 189, 443, 181]
1430A81l06l8J6OL11K87l07n24J22M34n2j78K07L2m39p7N51R4m88m5L99j05l45
1453b64K44K76l58k11M63J97n30j49M31J9l08K50L20n02m69N30N30l71l09L23
1473A12q6n22K92Q07j56q46mN27j08j41M73J28p96l41P19M21l71j33J89l12l88
1494e36N45O29l74o08J71K41k03O9M93j21o95l3N86J11l61P3J82l01k30M08K90
1515C36l15k80K25J50k08RK03p6k35J22K53r6k72O7J92k7o1Q8j4k43k2L07K02
1538C05k16k56M0J08k1J32K11j50m43n0M03K34j77j09Lk02j09L81L58k57m09L3
1560a91J67l6J11K62j56m77J2M14P1j82O9K2l11p1M21J70l44j47K37j4k15J78
1582a0K61k41k88K38K56k28j53K22P0k28L4K33p8k80J08K64o2j69N8L8j62M2K52
$$ y = [181, -125, -163, -147, -141, 170, 457, 150, -374, -252, 182, 130, -48, 159, 191, -248, -325, 226, 320, -168, -213, 186, 81, -264, -20, 256, -102, -313, 150, 347, -183, -332, 99, 118, -190, 60, 380, -122, -591, -61, 469, 98, -211, 112, 26, -496, -204, 603, 447, -399, -403, 124, 16, -125, 348, 476, -320, -661, 58, 479, 108, -25, 164, -148, -536, 9, 638, 264, -344, -173, 68, -135, -66, 427, 306, -389, -422, 164, 275, -86, -13, 169, -132, -362, 46, 336, 21, -259, -34, 116, -92, -83, 120, 44, -191, -69, 184, 88, -184, -117, 75, 48, -13, 75, 61, -182, -204, 103, 305, 89, -167, -127, -19, -40, 92, 303, 153, -290, -340, 63, 297, 120, 11, 14, -188, -297, 84, 442, 185, -224, -191, -24, -60, 51, 313, 157, -320, -308, 106, 177, -5, 64, 86, -225, -296, 125, 295, -49, -196, 41, 27, -188, -10, 251, 10, -278, -40, 216, -12, -165, 57, 127, -101, -67, 166, 88, -192, -84, 180, 118, -51, 7, 45, -117, -75, 177]
1605A77K7k69q4J24M6k6J23K5k10j58J50K29l9j10k9m5p6J04J78K1k00j10P0R2
1629A0K2K3lj04r4Q2J52Pj18j5K0k7MJ07L4j32p4J00P1n1l7P2m3p2N6J15p0j15
1657h0O4J02o9n7R6K1j28lJ45Jj41j6J02j9p8Q1O0j23p7J17Q9r6n6Q2j8q8P6J02
1685H9q1j08O3P5p7JR0j8j08kJ21%r2L3P1p7l0O4N4p4k6O4J0p0J5O3l9l3L1L9
1715D8n4j4N5J2m6j3L6j4k2L3Rj9l4RJ6J2qpk8mK0J0Lrj6l8L9M4j3k5%k0j6N0
1749dM3j8p2J4L6J3j2L7k4o4J2R1J3n9j5K8m0K0O6mp2k9M9J2jQKp7nQ2L1o0k5
1782b4J5k1kO2K6q8m2M5M2nMKp6k9Q5P1m8m7pj8J3P9L7p7p7J0M9L5N0j3r7m4O7
1815b3P9Qk3m4o1J3Q6O4l3o6l4RL6O4Rp6q3L4O7J8%k9p3j5P5P0m2m9k2j1K8O1
$$ y = [177, 204, -65, -149, -25, 21, -5, 118, 143, -67, -225, -75, 154, 115, 5, -24, -69, -145, -41, 137, 158, -42, -152, -82, 10, 32, 55, 52, -52, -146, -64, 88, 95, -23, -38, -18, -45, -41, 66, 100, -32, -106, -6, 65, 14, -23, 49, 6, -66, -10, 105, 35, -80, -16, 86, 17, -40, 56, 77, -51, -54, 91, 92, -49, -65, 37, 18, -60, 21, 81, -42, -119, -2, 87, -9, -65, 17, -1, -89, -13, 89, 8, -100, -37, 38, -39, -38, 52, 34, -74, -76, 45, 45, -47, -14, 57, -20, -50, 14, 68, -6, -32, 32, 42, -28, -13, 50, 11, -22, 9, 48, -6, -20, 35, 47, 1, -12, 24, 10, -12, 21, 30, 11, -23, -14, 2, 14, 6, -1, -29, -33, -13, -3, 0, -9, -25, -63, -24, 20, 7, -18, -18, -38, -54, -4, 39, 21, -51, -37, -1, 12, 0, 37, 13, -51, -39, 52, 65, 6, -9, 19, -21, -1, 65, 61, -11, -40, 9, 21, 20, 28, 30, -47, -52, 30, 61, 1, -24, -9, -30, -32, 30, 56, -32, -74, -29, 13, 8, 12, 14, -62, -91, -6, 65, 17, -30, -37, -55, -42, 37, 74, -3, -80, -70, -21, 14, 64, 51, -46, -90, -23, 56, 64, 41, -3, -64, -51, 35, 99, 66, 0, -34, -25, 11, 75, 84, 8, -75, -41, 26, 44, 44, 15, -58, -73, 2, 72, 30, -19, -41, -52, -24, 37]
1847C7Rq3o5L8P3PL3k6j05m2J09J06l8o4m5l2J9J20Q6r7j22%N9N4N2Kr8r9O2J29
1877G9Rl9m2m8k9J00Q6l7q0n5K4K5P2J9p1r5M3O6K6j7j7p7k9Q5P8k5q0k2k4K6
1907d9J04K0j19o2N0M7J0N6Mj50o2J45J13p0n2K0n6m6J49J27j42j40O2N5j7N5
1933E2Q9j27j73J10J89m3j10M5k5j03R3J77o7j99pJ08oK3Q7n3j99PJ77P2j09j6
1959hk1q5K8J71L4j27j04K0N1O1O7l3j25n0O7O5M8Mr3r2O5J11Rk5k7n7n9J23J15
1988A33p1j20M0M2n3O3Q5q3j61J00J48o8q5Q8lj47M7J98n7k06K9J50o9n0J35j2
2014G3k23j1K60K7j78j0R7j06n8K26P8k17j29J38O7o0O3O4j26j70J37J89l5j12
2038a6K6l1o0P2J48k7j61n2Q9N2OL3j2r3o4P8J10nr6k8M0rj0P2L4j12q1J00R5
$$ y = [37, 46, -37, -102, -64, 9, 16, 49, 23, -82, -124, -15, 91, 53, -11, -56, -88, -69, 51, 137, 40, -82, -82, -23, 31, 83, 85, -13, -112, -50, 79, 88, 49, 7, -41, -70, 30, 116, 79, -1, -56, -32, -7, 65, 84, 13, -82, -39, 27, 53, 36, 19, -58, -87, -2, 76, 51, -29, -51, -75, -49, 55, 75, -44, -106, -56, -9, 1, 57, 61, -89, -151, -6, 107, 37, -15, 5, -51, -97, 52, 179, 37, -103, -41, 14, -3, 52, 141, 14, -159, -49, 140, 97, -13, 32, 7, -96, -3, 174, 107, -92, -99, 9, 3, 26, 113, 60, -139, -132, 45, 117, 8, -8, -29, -114, -86, 85, 119, -8, -112, -92, -41, 20, 87, 54, -71, -121, -54, 11, 59, 63, -30, -122, -57, 54, 63, 38, 11, -46, -105, 18, 133, 62, -58, -18, 24, -29, 34, 119, 36, -125, -25, 123, 55, -30, 58, 55, -92, -45, 153, 96, -110, -81, 69, 0, -50, 85, 73, -150, -161, 99, 126, -52, -62, 35, -71, -129, 97, 175, -42, -171, -33, 34, -26, 37, 101, -25, -195, -58, 131, 96, -16, 10, -21, -81, -9, 139, 112, -49, -101, -12, 40, 46, 79, 67, -26, -90, -12, 98, 93, -3, -31, 9, 0, -10, 62, 96, -16, -97, 3, 98]
2067I8r2n5P8qj03M5J29q2j31O6J37q4q0R1K4j34K0J81j7j72kJ21k0o1J06M5j80
2094h0o8J74J03r3m6N2m7r7J21J38o3j64J7P1j8K2O9j5j29l8J04Q0m5l5J2k5o4
2121f4L5J29j2j30j7R5k2p2O1R9j06j26J24J01j44m6J69Rj81MJ86n3j60J16J49
2146A44j76j28J76J10j88j6K05o0k21R3K27r4j89J38J07k00l9K42K7k33pJ78n4
2169D2j30J35J06j70j17J54P6j32%J17l6j42M3J23m5p6O9J0p4j7O7L8m3j9knj3
2196d1K3M4J9l3p7JQ3Nk2J7K8j12m8J45Q4j28n4J04l4j12J21J64j34j74J18J25
2222A12j27j7J75n1k54P8K29o9j70J02R2j74o0K42M0k47k4K17l6j84J11J37j67
2245d5j27K19R9k26m5J60J0j47R5J30j58j38J48J61j11o8O5k8j03R0J67o9j66
$$ y = [98, 6, -49, 29, 21, -82, -37, 92, 10, -121, -55, 82, -2, -82, 9, 33, -101, -81, 100, 83, -89, -91, 30, 10, -51, 55, 100, -80, -148, 26, 129, 36, -10, 42, -5, -102, 19, 157, 94, -70, -53, 18, 0, 22, 91, 76, -53, -91, 13, 93, 48, 13, 25, 0, -64, -29, 100, 88, -42, -59, 36, 14, -58, 3, 102, -4, -130, -6, 95, -49, -95, 74, 83, -98, -94, 92, 39, -121, -5, 144, -32, -160, 16, 126, -62, -78, 127, 67, -154, -61, 166, 72, -117, 21, 128, -72, -111, 131, 158, -75, -82, 96, 42, -88, 47, 153, -17, -134, 20, 96, -36, -36, 81, 45, -97, -54, 69, 24, -52, 17, 27, -47, -64, 3, 41, -2, -21, -23, -28, -41, -18, 26, 45, 12, -65, -64, 19, 24, 2, 19, 47, -65, -113, 32, 116, -12, -66, 38, 4, -108, 13, 177, 43, -131, -13, 112, -15, -32, 143, 92, -162, -84, 145, 76, -94, 8, 100, -74, -134, 108, 148, -99, -123, 94, 58, -126, -15, 122, -45, -172, 47, 146, -80, -125, 35, 45, -102, -7, 123, -35, -173, -25, 136, 25, -43, 22, -6, -109, -19, 148, 79, -87]
2268h7%P5K5J8O7n5j37k1J34Q9j4q2n7l1L6J00L8k6j08p9P3J12K1n4n0l7m1P5
2296a6J55l3j80m8J06L2j4N8j1j60k2J70R2j25r2O2j3m1J36Q5j58j58J28J44n3
2321D4l8M0p0j02Q9K15o6j79l2P5J6K8J08m1k05m0J92J01n5n6m4q5NJ85J13j40
2347E8j92J2J03O4M9K0j45j51O4K03N5q9j03m1nP3J46J8j79j23P1J34N9k2o5j17
2373a03m9J19J81k4j36j04K2P6R4N2p4j61l8J30J31Lr0j03m8Q3J27P1r5j55m1
2398a32J02J20M9p2j17r9N3J72R2r7j50o4P1J08Q4k2j38j22M5J79Q5n6j39p5%
2423a23J18J49qj52j46M3J44R0rq5j31l9J50J50j1j29j15NP4J30P4j26j78k7J32
2448b0J27J9p0j21p5N5J86P6j17j59k7N9J25R8m2j77j16Q1J73N6n8j14r9L0J41
$$ y = [-87, -87, -12, 13, 31, 98, 43, -94, -115, 19, 108, 94, 12, -45, -76, -40, 60, 98, 72, -36, -115, -42, 70, 91, 37, -13, -50, -91, -16, 139, 106, -74, -122, -16, 16, 2, 60, 49, -111, -133, 37, 129, 4, -88, -26, -39, -80, 56, 141, -17, -175, -47, 97, 44, 6, 46, -24, -126, -37, 178, 112, -67, -99, -24, -8, 20, 128, 87, -118, -158, 34, 135, 80, 24, -20, -105, -100, 85, 198, 58, -134, -122, -19, 45, 94, 114, -31, -182, -118, 85, 140, 51, -52, -93, -98, -25, 121, 139, -40, -163, -92, 42, 101, 79, 14, -103, -152, -33, 148, 124, -12, -116, -94, -18, 76, 128, 54, -107, -145, -15, 116, 119, 29, -74, -122, -39, 88, 159, 64, -91, -132, -30, 90, 139, 67, -50, -149, -96, 76, 168, 71, -79, -143, -72, 36, 120, 98, -40, -162, -117, 62, 147, 91, -48, -123, -123, -5, 144, 136, -16, -162, -119, 25, 115, 106, 21, -110, -149, 1, 151, 140, 11, -104, -99, -25, 105, 179, 53, -125, -152, -20, 107, 126, 56, -65, -140, -85, 101, 177, 60, -99, -126, -67, 58, 156, 114, -63, -179, -98, 75, 131, 73, -41, -140, -110, 31]
2473C1J18n5j39r0K3J19J32j9j33j24J4J32J12kj20j19pJ30J22J3j19j05k7R0
2497b3J34M4j05j37l1R2J10N2o8j56m4P7J34M8p1j14p1M6J42Q1o5j46n3M4J17
2522C7P9k4j27r6L4J24Q6l6q2j09jJ12J24j2j36p7K2Q5Q1J8p9j19JR9R5j1p7q2
2550g1j9N0J21K7q2j05OO3P2L6l7r8o8N8J17K0o5q9j8L0P5O4l7j10m7O6P0K8k1
2579C6n0o8OQ1P1k0r0l9M0L4M3J0m6q4jQ9N9k4m1l6j4K7P0K4n2p2J5N0L0kk0l2
2611fm1K3P6Rn5l2J8J5LJ9J6m2m6M3M6l1m3J3J0qJM8rp5J5O6k9k9J9M1o5k5O6
2644A1K7o1k7P3Np2J3P2l0m4M5L9m6n7P6M4o6k9N7ro0L7R0l5j17L1Q4j0m1L5o
2675B9q6j4J29M7r6o5J8L4j2N2N2q3j20L7J22K1p3moo1J1J56L6j46q1Q3M6k7M4
$$ y = [31, 149, 94, -45, -135, -112, 7, 139, 120, -13, -137, -123, 9, 121, 119, -1, -120, -127, 3, 125, 138, 19, -86, -113, -23, 111, 155, 50, -87, -118, -26, 84, 136, 68, -88, -132, -55, 79, 127, 56, -58, -129, -83, 59, 140, 75, -71, -124, -80, 37, 116, 92, -35, -131, -97, 27, 113, 77, -5, -114, -115, -3, 121, 109, -27, -104, -82, 3, 84, 102, 23, -96, -95, 4, 99, 88, 11, -71, -90, -40, 81, 108, 26, -79, -73, -10, 62, 98, 61, -37, -105, -47, 70, 90, 25, -64, -82, -52, 23, 87, 50, -60, -107, -41, 29, 57, 36, -14, -82, -76, 5, 76, 56, -34, -73, -33, 1, 44, 54, 8, -76, -77, 12, 71, 47, 6, -30, -44, -17, 53, 77, 25, -47, -32, 18, 48, 46, 26, -6, -47, -24, 52, 61, 6, -26, -8, 7, 10, 29, 45, 3, -43, 0, 46, 15, -28, -15, -5, -13, -12, 36, 27, -48, -33, 33, 4, -25, -6, 35, -30, -55, 11, 38, -23, -50, 23, 28, -44, -31, 41, 11, -33, 12, 51, 5, -52, 24, 68, 2, -27, 30, 21, -39, -2, 88, 53, -64, -33, 51, 41, 0, 35, 29, -57, -71, 58, 105, 9, -56, -38, -4, -16, 36, 88, 5, -115, -78, 44, 65, -8, -12, -18, -79, -68, 88, 124, -22, -103, -20, 26, -1, 43]
2704D3N2j40j05J29J56m9j29K3K6p9P4J49m6k00k7J84K5n4J5Kj31k6J94J12j78
2729B0j25O0N0MP3N3j54j68R7K11Pj00o3m4n3J09J92j0k28j22Q8J23O5J9n5j63
2755a14r8J62K22Pj98r7K2M8R2J29l2k59j07J96J85m8r4k4q4p4J86K43j28k84
2779a49J2J82j4J3J09q2k92L5L50P4k44r2R1o4j7K65Q8l46k19K51K01q1l0L9k12
2804a32j73K95L18j47l19LQ2lJ36K27j79l81j1L28J62q3o8j01j86P1L35J53k33
2827I4k76jJ18J33J39k0k17k12R2K63J43j16j93j04K7J27J60P6j94k69L7K92R4
2850A93j05p8p0j07N6L11O2l16j91J72J47m8O9M6k73j91L03L14j66k71N2L1p3
2873a33J83K84k30m30P2L61N4j09M7j09k93P6M80J35l88k10J11K9M2K85O2l90
$$ y = [43, 95, -45, -150, -21, 135, 86, -43, -20, 6, -73, 1, 150, 104, -96, -123, 61, 86, 32, 47, 49, -82, -108, 86, 198, 20, -105, -45, 5, 9, 82, 135, -19, -187, -90, 121, 128, 28, -35, -79, -132, -23, 169, 159, -69, -191, -103, 20, 85, 104, 49, -114, -212, -50, 172, 179, -19, -116, -94, -46, 46, 175, 143, -116, -223, -27, 158, 110, 16, -8, -92, -166, 20, 263, 135, -149, -137, 45, 31, 44, 153, 71, -221, -186, 164, 238, -6, -98, -7, -71, -88, 177, 265, -81, -300, -49, 152, 71, 41, 80, -132, -305, -10, 308, 161, -158, -155, -73, -76, 60, 287, 108, -273, -284, 44, 206, 123, 55, -46, -232, -161, 174, 327, 94, -182, -183, -65, 68, 207, 187, -30, -242, -150, 113, 256, 140, -53, -157, -130, -3, 157, 233, 39, -230, -193, 99, 193, 88, 10, -60, -167, -111, 200, 262, -54, -245, -73, 74, 26, 95, 141, -132, -323, -20, 294, 128, -143, -91, -60, -133, 50, 334, 104, -326, -254, 107, 161, 52, 99, -10, -303, -227, 253, 388, 0, -210, -99, -70, -28, 257, 319, -71]
2895g1k94K43L33k2r0k6k01j52K40L63p2l41r8Q9O7J07J40q8l13r4K62K05n9j41
2919a3p4m3J6J78J56j29k69k9K16J35n7p3o8r7K2K39J41j99k53M0J75O2N1J8j75
2944c0k36J21L30O2k25j13om5J28K69J2l52j87K05J83pJ1k2k33j39K46K93q4k52
2968g1n1K4K7J21J66r4l02l8K31J14o6m2n0j17%K12J32j62j90M7J18J6L0N0j05
2993@j83P7K50L2j93p3O5j9K5J51L5k38j39J64J86m0q8J6q9j06J81K12r5k35j6
3018a20J06K2K7J27q9k50LK49Q0j20m5%j06NJ97J05j79j57O1P4J5N0M4j30j21
3043a52R0J34j1n3l9l0pN6Q5k0q5n6N0P4K2k5n1j4J6J9M2J9q2n4N9P0j5m5J5j9
3073gm9O3R5n0j30L0Q4j7k3N3Lj36oJ62j0j07LO6m2o7J22N9j41n4J13L7r6L8O4
$$ y = [-71, -365, -122, 211, 189, 99, 73, -128, -280, -40, 323, 251, -90, -188, -99, -32, 75, 215, 127, -186, -280, -18, 187, 128, -13, -87, -130, -114, 64, 220, 91, -178, -207, 9, 144, 87, 14, -54, -151, -129, 110, 251, 52, -201, -161, 14, 76, 127, 145, -30, -266, -145, 185, 247, 22, -91, -97, -142, -14, 255, 267, -85, -272, -67, 116, 109, 120, 98, -135, -274, -28, 265, 181, -71, -122, -98, -71, 50, 216, 122, -180, -218, 13, 127, 61, 19, -31, -148, -148, 64, 196, 34, -156, -109, 9, 25, 55, 105, 0, -183, -106, 144, 176, -17, -90, -25, -44, -19, 132, 167, -71, -210, -46, 140, 100, 12, 28, -61, -167, 14, 226, 131, -104, -120, -14, 8, 35, 162, 73, -177, -174, 75, 155, 35, -10, -10, -116, -111, 86, 191, 12, -145, -84, -10, 5, 55, 99, -31, -152, -62, 72, 61, 8, -31, -61, -68, -12, 73, 53, -32, -88, -38, 36, 58, 33, -18, -32, -16, 3, 45, 64, -18, -72, -13, 57, 42, -3, 12, -7, -56, 7, 102, 52, -78, -48, 36, 19, -4, 49, 52, -84, -90, 72, 62, -45, -42, 24, -18, -85, 37, 96, -45, -99, 14, 51, -45, -7, 57]
3102E7o8q4J03P2r0o2J06J6r5OQ8n4o5N9P8o6m7N9J5m2J4O5n7o1N0M4k1k3J6j7
3132dk3L5M7k9n7MJ9PL4Mn6m3L9L7LJ6l7n4oQ7L6m5l6pj4LR2K3r4m6L2M5MK7K
3167D5j06k1Q1P4l9m4om1MR3N0q0p3J2N6K2K3j2p8o0Q7Q8Ln9n4k5PJ07N9o2r9
3198d8k7L0Q5N1j2j24p0M4J03N6j6q8q0lJ20P6j8q7p9QP9R6Nj09q7K8P3P1L2o7
3228D2j35k4J34Q6j2n2r1m5O1J35L8j13j08jO0N8P6k1j70q2J06J50Qn3p4p8KJ36
3256C3J18p1j51l9M1P9P8K5j34j12L9J26O8k9r2p9j4J11J22kj28r8J5Q9J02J6
3282A13r9j23KJ07P7K9p7j22l5R5J32J4p4r5n8M4J38Q3j16j32qN7O7R0nj65j03
3309a64R7J37J6l7n3j00l3J51J32n7j64j6L9N0Q0N3j16j53L0J71L9n7k6o0q1P0
$$ y = [57, -11, -95, 8, 80, -10, -72, 34, 50, -45, -39, 49, -5, -70, -11, 67, 1, -46, 13, 28, -14, 0, 65, 8, -53, -3, 41, 20, -3, 13, -4, -27, 8, 55, 26, -31, -27, -8, -1, 33, 37, -19, -62, -23, 14, 17, 33, -4, -58, -64, 23, 59, 14, -22, -29, -43, -40, 52, 75, -19, -65, -33, 12, 16, 43, 45, -61, -82, -1, 73, 34, -10, -16, -57, -53, 40, 90, 10, -63, -51, 5, 27, 50, 38, -40, -100, -13, 75, 78, 19, -35, -60, -53, 54, 113, 51, -48, -75, -45, 40, 91, 79, -45, -115, -71, 32, 88, 72, -16, -96, -99, 21, 97, 79, -8, -87, -79, 0, 96, 101, -8, -95, -67, 6, 77, 109, 42, -93, -117, 17, 103, 91, 39, -52, -97, -36, 99, 137, 24, -84, -85, -25, 33, 109, 88, -82, -164, -58, 92, 100, 47, -27, -105, -103, 33, 151, 80, -71, -110, -69, 10, 88, 113, -21, -133, -94, 32, 100, 71, -21, -100, -114, -3, 119, 117, -11, -109, -94, -5, 97, 113, 14, -109, -107, 0, 77, 106, 29, -93, -128, -33, 99, 113, 39, -56, -114, -70, 68, 151, 35, -97, -105, -48, 19, 109, 104, -61, -164, -67, 70, 86, 49, -4, -104, -137, 14, 146, 89, -75, -91, -52, -2, 78, 131, 15, -138, -108, 63, 102, 45, 19, -41, -122, -52]
3335e2J82K0j65r9N9O4K1Q5m7j66o1J39J24k1p2m9m7PJ01J11o7j36m8Q4P7J7n
3362E6o8p6lJ12Q8o1j04k6M2L8L1L0n8j10J3J30N6o4o6J0j9LJ22N7j39j24Q9J12
3390G1k3l4M6n7j15N6J93l1j61qP5l1pJ14J8j78o2J61O9j02k3N5o5p9J41J16j22
3417A7j34P3R2o4J2Q5m4j70L9J73j3r0j7O0n3l4J23O3j57p5J04P0n1l4Q6n5j02
3444i6M0J47k0j34K5Q0l5p0Q7Q6j37p6J29O9j08m3J04oj09L4J06l9j25N3J29p6
3470A5j05O8R0j22l1J49J8j57l4J57Nj12L8R8r5j18J16J46j18j04R4O3j16k3J62
3495H4Nj72RJ45pj37N6J27j02j16J13J01j23q7J49N3j64k5J63J7j54J1J64o9j60
3520a19J05J43r7j28J11P9j74l1J98K9j86l4J61j3j46R6J44j42j57J33J43j14
$$ y = [-52, 130, 150, -15, -114, -55, 9, 30, 115, 68, -98, -159, -20, 104, 83, 11, -38, -85, -78, 23, 134, 67, -69, -117, -33, 44, 61, 56, -12, -88, -91, 21, 109, 48, -56, -82, -40, -2, 29, 59, 1, -109, -96, 34, 90, 26, -40, -30, -49, -46, 76, 133, -6, -130, -41, 71, 48, 14, 60, 3, -112, -56, 137, 106, -55, -63, 12, -19, -26, 88, 106, -72, -134, 27, 96, -6, -29, 26, -39, -118, 23, 139, 17, -117, -44, 48, -16, -4, 81, 37, -133, -94, 79, 66, -24, -41, 19, -34, -68, 55, 118, -39, -114, -10, 60, 9, -25, 61, 6, -96, -56, 91, 71, -63, -38, 42, 7, -63, 24, 110, -27, -103, 26, 95, -13, -56, 48, 42, -67, -33, 73, 34, -91, -38, 91, 15, -90, -22, 68, -54, -85, 64, 82, -75, -109, 48, 53, -59, -21, 77, -18, -136, -20, 126, 8, -96, -2, 61, -55, -78, 84, 89, -83, -74, 71, 64, -73, -17, 110, 8, -108, 5, 106, -17, -104, 45, 98, -66, -91, 72, 89, -65, -54, 110, 41, -119, -14, 129, 32, -96, 15, 94, -80, -111, 87, 116, -70, -104, 57, 44, -102, -6, 138, -4, -161, -28, 115, 1]
3542Ap5J18J9j94K7K25j7k10K1J52o5q5J19J03j52j08J37Q6j09n1J26j5j40M0
3566d7J53m9j34L9J26p4q7Q3O8q7q3J37M0j32m6J23K9j24PJ12l3j23N8J41n1j43
3592i7M5R0n6n0J15M3j54p1J61O4j26mJ09o3j39Q9J79q2j61P4J05j07m5J76M0
3617A35k02n4J74L9j49M6J33j06j65J47J49j40j28J63N2j72j9J92Lj96L6J70p7
3640C1j50R3J48j49j09J61O7j59m8J89kj75L3J57o2j34R7J28j41q4J35N7j31k
3664e0J10%j31J2J23l7p9N6N7o9n7O8P8q0m0O8J8p3J2O6mp9j1N3Ql3K2L2l4o2
3694e6K4R1op7pM9l9l5P1N9r4q2P1P6n7l8R6l3j28M0J55k1j35M1Q8q5m5J49L7
3723A09j76n5J74L0j22K1J28j20j16J35J43j32j10J04N8j27L2J45p6j63P0J31
$$ y = [1, -74, 44, 63, -131, -104, 121, 104, -106, -85, 67, 2, -83, 36, 139, -13, -121, 16, 102, -7, -58, 68, 53, -87, -47, 106, 57, -77, -38, 88, 14, -73, 10, 78, -9, -92, 45, 85, -47, -93, 30, 59, -65, -58, 54, 21, -102, -44, 97, 46, -97, -52, 38, -18, -68, 47, 90, -64, -135, 26, 90, -36, -40, 69, 6, -133, -44, 135, 53, -108, -34, 71, -36, -81, 95, 135, -67, -121, 53, 92, -57, -11, 122, 16, -149, -2, 147, 7, -121, 42, 94, -78, -97, 95, 98, -98, -62, 108, 31, -119, -26, 122, -27, -136, 25, 92, -67, -115, 74, 72, -103, -70, 87, 25, -109, -12, 116, -25, -109, 26, 83, -48, -50, 60, 60, -71, -59, 64, 27, -52, 4, 61, -8, -65, 3, 81, 1, -39, 29, 47, -26, -14, 52, 48, -31, -42, 11, 19, -14, 8, 40, 6, -56, -32, 59, 53, -24, -31, 18, -21, -56, 15, 74, -20, -102, -31, 45, -12, -50, 46, 13, -115, -75, 80, 59, -76, -35, 53, -32, -77, 72, 109, -67, -122, 52, 82, -40, -19, 109, -11, -127, 8, 151, 19, -91, 13, 71, -56, -24, 121, 45, -118, -48, 83]
3745H3m6q6O5K8j26LJ79lj64rR8j3l7Q3K5j41o7J24R3o7m7K4n8k4R2Q0o5j04J7
3774f3L9L2M0Lp4o8L0P9M8j8n4o0%O8O1qn3n0l0P0R5%j00l0MM4L8O2n4j32k5J03
3806cQ4l1m6l8m7J6J42M4j09r7NO3M1N9Rj37j18R7J52qo3l4m9l2Q2J45l2j59n1
3835a15N0Q4L5L8p6j25j6J45R5m6q3l9m7N2J23N5j06j34K4Q7O9K6m3q6q2O9J35
3862H9K3q3r8lJ1R5O9m3j38m5Q4Q0L0j7p1q8J7J29P3o3j05n5N1O8O9Pj09j03K6
3891a00J29O3k4o2j00j8J11J16j8j10q4RO9R4M8j01j30j1J07Q5M0n7j15o7P8J35
3917H7J5o3q4n4K8J20Q0n7j47k7N5P4N3J3j00j18L8J30N0l6o9n9l3Q2J23%j41
3944d0o6M8N5N5K9m7j29k9J32R4m3n5m0n1K8J24O7j18j07K8P0K0M1Oj16q8Q5J24
$$ y = [83, 37, -49, 16, 44, -82, -79, 100, 97, -67, -76, 22, 9, -28, 55, 80, -61, -128, -4, 89, 22, -25, -1, -59, -83, 9, 89, 24, -80, -63, -24, 8, 48, 51, -23, -91, -61, 18, 66, 48, -6, -66, -66, 2, 63, 55, 2, -48, -78, -8, 87, 87, -13, -43, -39, 5, 43, 105, 51, -81, -106, -3, 81, 50, 4, -34, -81, -65, 77, 121, 12, -85, -80, -17, 24, 83, 92, -45, -163, -66, 86, 78, 15, -19, -68, -100, -18, 127, 95, -64, -115, -65, 19, 54, 92, 16, -109, -125, 20, 115, 69, -14, -53, -100, -48, 75, 130, 24, -110, -86, 1, 70, 96, 53, -33, -115, -46, 89, 112, 29, -69, -72, -61, 34, 103, 60, -78, -123, -39, 41, 71, 54, -17, -105, -88, 41, 114, 51, -54, -109, -58, 10, 79, 86, -23, -126, -100, 29, 92, 68, 6, -94, -112, -1, 115, 97, -13, -97, -88, -19, 75, 123, 22, -108, -119, -12, 73, 113, 56, -59, -126, -48, 87, 102, 39, -45, -99, -71, 49, 129, 72, -75, -102, -47, 27, 80, 93, -7, -125, -87, 43, 93, 57, -12, -71, -104, -22, 101, 101, -40, -106, -58, -3, 52, 81, 34, -95, -124, 8, 102, 59, 4, -36, -87, -59, 65, 132, 14, -93, -65, 5, 25, 66, 72, -44, -132, -47, 77]
3972G7j6n5j8o3LQ0J09o8j15rM2M2M1K3q3q7K6J08M2l5o9l3j0O2R1j6q6m9NL5
4002b6P6L0o6p1mM0O0J6k8q6j6O0N9pj7k6m6J0Q5M4p6o9QM7kL6K9p5p3N7Q2j5
4034C6m5J4k2m4M4R2k3j01%N8j3j6M7pq2j1R8K5o1LQk5j0N3M2o8n1M5L7k1J1J0
4066B3k4n0K5O0j6m0QPrmJ6L1k2l7OM5j8k3K3J7l3l9N6L8o0pO8k8m8%Q5k8o3K8
4100a3N5o5l3Q4M0r2n0R7Rp1K8O9n5r2Q3Q5p5l9N9Nq2L4J07m2j11J5Q4j7m4O2
4130C5Rj01pJ17K1r0l2M7lk7N5M5q4p3M0Q5%m0pj8l1L2R4J6j05o2N6N9OkPo8o6
4163i2N8J21J0j28k7N0k0J0R3qj35o1J15J03n5m0K9n4p0J07J39q5j59K9R6l3J0
4190CP9m0j74K0J89L3j11l6K7n3j4J48N5j50j19J00R1l1NL6j03j03J09J63k6j51
$$ y = [77, 61, 6, -12, -75, -72, 8, 117, 49, -66, -75, -33, 9, 50, 73, -10, -97, -71, 37, 79, 44, -25, -58, -68, -6, 85, 69, -17, -66, -61, -26, 50, 80, 14, -57, -61, -21, 39, 55, 27, -59, -75, -15, 44, 37, 20, -6, -52, -42, 43, 87, 11, -58, -50, -3, -5, 31, 60, -15, -88, -31, 51, 36, -9, 5, -17, -61, -17, 75, 52, -49, -49, 9, -4, -20, 27, 20, -62, -73, 25, 50, -11, -8, 0, -25, -35, 18, 60, -8, -59, -14, 23, 2, 13, 23, -1, -51, -26, 34, 18, -22, -14, -7, -16, -20, -4, 27, 5, -32, -26, 19, 1, -22, 1, 18, -15, -54, 2, 40, -20, -27, 41, 13, -35, -35, 50, 22, -41, -13, 42, -23, -56, 28, 68, -24, -74, 23, 32, -39, -11, 58, 3, -89, -6, 79, 4, -35, 24, 29, -53, -19, 88, 46, -65, -50, 34, 17, -27, 35, 44, -57, -64, 53, 74, -16, -48, -1, -4, -31, 24, 69, -15, -88, -48, 37, 37, -3, -10, -28, -59, -27, 67, 83, -22, -84, -28, 31, 37, 35, 42, -26, -92, -34, 87, 97, -31, -58, -8, -28, -18, 75, 67, -68, -129, -14, 89, 34, -6, 23, -31, -101, 6, 145, 60, -99, -70, 26, -7, 3, 82, 42, -132, -112, 77, 110, -1, -37, -10, -63, -77, 71, 126, -24, -143, -43, 48, 17, 22, 58, -45, -148, -39, 124, 98, -53]
4216e3j3L6kM2R9k5j74n5J53R0m9l6l1n2l2J45J25r4j67k2J07M2K7K4p1j37oJ84
4244E5R3j08r6Pj1rJ38Q0j51j74P8J65kl2mo2j11O1K08Pj82n8N6K4PJ03Nj84o6
4273a63J51J31n7n8j8n9k4J08J40p8j84KJ20L6OJ5o0j29PJ85Q7j12j05%K0L5Q2
4300G8M4j27j41N7J52L9n9m6m5o2M9J62M4j57j30P6P9J3L6J8j32j04J17J78l7
4325A02j42k5J1j9P6J29l6j88n2J48Q7n4Lj4j14m3J74J21j22j42M1N3j1O9Q2j06
4351B8j70N5J61K8p9k6k6m8L3J52K5j65q1Q3N6JK2j7r7o9J02J38k8j18k8J4KP1
4379A9P8n1j44k7J04R3l3j6m0o5oJ22P8o7r8k2N2M7L0J7o4r9J2J39M6p2n6k3J
4408d5L1P0L8r3r2M3Q8J7k0nn3m7M2J12j6r3m1K7L3RN3j0r1n0P2R6l9n7prj3N9
$$ y = [-53, -66, -30, -32, 10, 109, 84, -90, -145, 8, 98, 49, 13, -18, -70, -102, 43, 168, 74, -93, -115, -8, 34, 61, 85, 14, -123, -129, 55, 148, 40, -56, -49, -60, -69, 69, 149, -2, -176, -98, 67, 65, 33, 29, -33, -144, -83, 125, 132, -50, -108, -52, -28, -21, 82, 87, -97, -163, -12, 119, 62, 4, -14, -73, -97, 11, 151, 73, -111, -109, 11, 47, 53, 68, 8, -121, -114, 71, 158, 46, -59, -59, -39, -4, 78, 122, -5, -146, -89, 63, 102, 43, -3, -48, -110, -61, 101, 145, -12, -142, -66, 13, 26, 62, 80, -52, -156, -39, 139, 102, -40, -65, -54, -73, 3, 132, 96, -92, -144, 4, 91, 37, 40, 26, -88, -131, 43, 164, 42, -100, -59, -6, -17, 52, 134, 28, -142, -87, 74, 102, 23, -3, -29, -77, -44, 108, 133, -32, -113, -30, 26, 27, 49, 32, -65, -134, -32, 106, 78, -40, -68, -54, -52, 19, 97, 46, -98, -125, -21, 72, 39, 23, -17, -82, -88, 34, 112, 45, -53, -75, -23, 24, 54, 71, 7, -92, -80, 59, 105, 33, -23, -46, -45, -14, 56, 94, 1, -91, -48, 40, 57, 37, 32, -21, -68, -26, 86, 70, -23, -64, -37, -4, 5, 58, 48, -43, -93, -21, 75, 36, -21, -28, -37, -50, 9]
4440IP3o6j00QP9J9j8J2k3o3oJ03N4n8n8nL2OM7L1p3p9M1Q7ll7kk6n4M8Q0j7o4
4473b3l0M2J7pK9Lp3k9O2M8j7m6Rpj7O7Ql1o1J6M5J4qMl0m3K6O6kl6k6RQJ4J7
4508A8Ol6k1J7L5qJj3j9J6K1J2j1k8jOK4J9k5j1j1j0L4J7Jm0j5J6L0j0MLk5l1
4542c5K7L5l0j5oK0rJ1MMl2NL8ok7J3Mj4nL0mk5lK7jj8J2Pj8j6M3K1l7qJ6Mk2
4579a0J7J6k5k0K1K7j4k4J7J1k9J4K3%l7NJ8LpRj2k5J0K6qk2J1j1%jJ7J1j9j6
4613b4J3J1LqJ0k0JJ8j0JPrkOK4j2k5J1J2K%J1j7rJJ3J2qqpj0J1J5mnj1RnJ0J4
4653B1mj4k3K3J6j4Rrj5j2L6Kj6k7RQljJ7pl5K5K1mj9JQj1PL2j0k0rK5%pJ6j3
4691Cj5oM4Pk0jqmNJ9%j8k7RJ8pJ2mOl0OK3LpnKpKOJ0k0j9J9Mll%Qj2jJ6nknN
$$ y = [9, 82, 16, -84, -76, 3, 22, 4, 16, -7, -70, -76, 27, 81, 23, -35, -40, -8, -2, 45, 76, 3, -76, -35, 52, 49, 12, 10, -16, -70, -22, 58, 41, -23, -53, -11, 6, -1, 28, 31, -42, -71, -9, 39, 22, -24, -15, -22, -39, 28, 36, 5, -56, -40, 5, 19, 11, 15, -15, -58, -32, 34, 32, -4, -30, -21, -13, 1, 18, 24, -12, -33, -16, 19, 11, 12, -1, -20, -4, 17, 29, 18, -10, -11, -5, 19, 38, 13, 2, -9, -19, 15, 32, 33, -7, -22, -6, 24, 14, 18, 21, -4, -35, -8, 27, -3, -18, -24, -4, -13, -2, 2, 6, -26, -21, 17, 11, -16, -3, 1, -13, -18, 12, 8, -17, -20, 7, 6, -12, 0, 7, -11, -27, 16, 37, 0, -8, 8, 12, -10, 7, 23, -2, -22, -1, 26, 12, -12, 5, 16, -13, 1, 24, 24, -13, -8, 10, 13, 6, 15, 3, -22, -12, 14, 6, -16, -5, -16, -16, -17, 0, 11, -8, -24, -11, 0, 3, -5, 5, -15, -14, 4, -6, -5, 2, -7, -9, -3, 21, 9, -16, -5, 7, 9, 9, 20, 3, -6, -5, 8, 20, 12, 4, -3, -13, -2, 13, 9, 4, -7, 2, -3, 7, 21, 17, 3, -20, 3, 19, 5, 14, 5, -10, -22, 14, 16, 0, -27, -18, -10, -13, -14, 3, -4, -39, -14, 7, 3, -16, -15, -7, -18, -11, 21, 11, -9, -18, 7, 7, 0, 16, 3, -12, -18, 26, 33, 13, 12, 4, 0, 5, 24, 24, 6, -21, -12, 6, -1, 11, 7, 13, -17, -11, 12, 15, 8, 3, 5, -2, 0, 6, 16, -4, -23, -4, 0, -3, -6, -6, 2, -10, -11, 5, 0, -2, -7, -2]
4736bOj7J1jj2j3K3%rj8J2K9j0%Qkk2nM2Kl0J0J5j9KJ8Qk3j9K4Lj0QOj5j5J3J7
4774A5j2j6J4krj2K6npjJ3Jk0QL0k6j2PK0j4j0J6J2j8qQJ5k9jJ6Nl3J5K7j8pm
4811a6K8k4j1L9Mk5j7L6Pk0nK7k1k4J3M0l0nJ3Ok2j0K9rj7LK3pk7QJ6j4k3L4K1
4846B0k7j8L1Kj7lK4j1k8L0J1j0k6QK3k3PK0kl4lK8K2l6mK0%k6QL5j5k9KK4kj8
4882a7J6K4m1qL5Lj4j8M0rrmK9j8k5RJ3j3JK3nl0lM1pl7mL8j2j2J1K5l7j7L9J9
4918B6k2k2K9ol5J4K8mk5lK0%j7K4Pl5qL3J7pm0J9Rk4J4K8j0l7J4L2qk2K0J4k3
4953@l2M8K2m9OOK1l4J2K9k3k8RL6qm1K4J3l4rN2jm0J0K6k1j8J4L1l3j8J9K2k1
4987a0OJ4j1j8MM0k0l2J4J8mj0K3Kk7j1J8J4j1pPlj2J3J9kk0nK0j%QMj6k4K4J4
$$ y = [-2, 4, -13, -2, -3, -15, -28, -5, -5, -14, -32, -20, 9, -1, -1, 7, 5, -17, -22, 20, 22, -8, 2, 17, -2, 0, 18, 26, 3, -16, 8, 11, 1, 9, 15, 0, -15, -2, 15, 3, -13, 1, -1, -10, -22, 4, -1, -8, -9, 4, 5, -15, -7, 23, -3, -15, -8, 12, -2, -12, 4, 16, -2, -10, -2, 13, -16, -17, -1, 4, -29, -14, 13, -5, -12, -16, 12, -12, -23, 16, 20, -5, -22, 14, 21, 1, -4, 23, 2, -22, -9, 31, 1, -4, 9, 15, -7, -17, 12, 3, -14, -11, 12, 5, -22, -14, 2, -12, -35, -1, 20, -7, -25, 6, 8, -9, -12, 12, 1, -27, 3, 14, 4, -22, -14, 9, -14, -7, 13, 11, -23, -26, 2, 24, -12, -16, 4, 4, -22, -14, 21, 6, -23, -21, 3, 1, -17, -1, 23, -18, -26, 9, 12, -2, -20, 20, 11, 2, -2, 27, 9, -16, -7, 6, -7, -6, 17, 12, -18, -21, 20, 13, -24, -28, 10, -2, -14, -3, 22, -15, -32, 7, 26, 4, -18, 11, 5, -30, -16, 12, 8, -17, -20, 0, 0, -17, 7, 14, -21, -29, 4, 21, 14, -26, -7, 2, -22, -8, 20, 10, -27, -13, 19, 11, -11, 9, 23, 0, -32, 16, 38, -11, -5, 1, 22, -12, 0, 29, 6, -22, -13, 23, 15, -26, -2, 11, -23, -32, 20, 19, -21, -11, 15, -6, -24, -10, 21, -12, -30, -11, 11, -10, -4, 10, -1, -19, -15, 25, 5, -27, -13, 5, 1, -9, 14, 16, -11, -22, -4, 10, -1, -8, -1, -4, -16, -3, 16, 14, -6, -11, 9, 8, 8, 16, 20, 4, -20, 4, 18]
5024A8j5j5RkkJ1K9k1k4MJ5%j4J7rj4mJ6J1k7qJ2J5k0nM7k0l7J7L6mj6JMk5jL9
5061A8Qk2j5J6qKJ2Ok6j8L4K6l0j3J0noK1J5ql4JK1nnJ2Nl6LL4J8j5j7j3PnK8
5098A6J0l0j5rK4J1jJk4mPK9mj4k5R%L3kjj2k1J4K4jj5oOoJ0K8pk0j3RJ5Nlj4
5137Dj7mK1QJ1l3lqK2J8%j0k4JPK3mk0qpRJ1K9k4k8j1K3K1%kj3l9K0K5L1k8l0
5174b9J7lJ8Rmk5j4K2L1lj0qk1jK7L6j1l2lnL0OKj5l2nL5Rqj5k2NJ2L0Pl0j4j0
5212b4K2PQrJl0K1J6Mj2j9j6NL9Oj3l2kjK7L2j7k1p%J2K5rk2k3J8PJ1K1k9k5N
5249b4L2K6Ml0j7PJ2J6Lj5k1nJ0K2oj0j7LpL4Rk4l0JK0J5Lork7NL2Koj9kLJM6
5288C1k3k2j5K5RJLj2plK7J3rj4qj1J4J5Mk8lMK6JMj3k0JJ4J7Ok4plRJ8Mj6k6
$$ y = [18, 3, -12, -3, -5, -7, 4, 33, 12, -12, -8, 7, 7, -7, 10, 1, -13, -17, -1, 10, -17, -25, -13, 2, -18, -23, 24, 4, -33, -16, 20, 16, 0, 1, 5, -20, -21, 18, 26, 4, -11, 5, -3, -1, 11, 17, -9, -27, 7, 33, 3, -10, 0, -5, -11, 10, 25, 17, -17, -16, 5, 0, -5, 7, 12, -24, -21, 13, 31, 16, -1, -14, -7, -12, 16, 26, -4, -19, -28, -4, 7, 6, 7, -17, -21, -14, 15, 11, -3, -28, -19, -19, 14, 12, 11, -1, -22, -8, 16, 15, 0, -6, 0, -6, 4, 32, 25, 5, -8, 1, 16, 21, 18, 4, -13, -17, 4, 12, 23, -10, -13, -21, 1, 19, 19, 9, -15, -14, -7, 16, 12, -8, -16, -23, -14, -3, 26, 2, -26, -37, -14, 7, 7, 5, -8, -47, -27, -2, 29, 1, -29, -12, -15, 3, 12, 8, -17, -31, -9, 22, 19, 9, 1, -20, -21, 6, 42, 31, -1, -4, -9, 21, 27, 29, 14, -18, -23, 12, 21, 13, -2, -24, -19, -7, 23, 30, 0, -14, -24, -2, 5, 13, 4, 5, -25, -4, 12, 16, 4, -15, -31, -26, 13, 19, 6, -26, -28, -29, -2, 30, 13, -8, -15, -15, -3, 22, 13, -9, -32, -14, -7, 4, 25, -4, -29, -24, 8, 34, 38, 8, -9, -2, 10, 26, 29, 14, -7, -12, -2, 20, 14, 4, -13, -10, -17, 17, 26, 2, -28, -27, -7, 8, 11, 5, -4, -31, -26, 6, 8, 2, -17, -19, -16, -15, 31, 8, -14, -29, -4, 5, 6, 9, -3, -10, -13, 14, 27, 18, 4, -4, -15, -1, 14, 18, -10, -13, -9, 17, 18, 22, 9, -11, -10, 4, 21, 27, 3, -4, -7, 2, 20, 24, 8, -18]
5327a8j4L2J7Ok2j5lPK0Pj2k0Qj3J6KLj2nlJ1ROj6%qJ3K0Jk1lJ1MJNj4j5J2oK1
5367A2kok1NJ6K3j2j2Jj0PJ0Rk3J2k5J6Mjkj4mJ9LjmMj2RMpkj0KkJ5Lqj1%NJ7
5409GqkqMJ6qJ6ojj8J3LkMmrkJ5%qLmOj8J2J3j8pQQj0J4rj4lJ2KJ3j7Kj0J8op
5453a0Rj2J3j1MpOLnOj2LQj9K0k0NJJ5JLkrK6qj5J0pPoNjjm%kORJ3k2rJ4mPpj
5499@%j2%LOOlpnJ0OnQk1QJ2njj%j4kK7jk4LMKJJ9j1j6nK4jj0KQkrJ1J3j5j6K5
5544A2k5J9kkNk8K4K3j5jj2O%PJ9j4k0j2J2K1j3jj1Jj5K1J0jj4jMj0J6Rj1j3r
5581b1K8Nj9%nRlJ1Qj2j0JJ8KjOrk7J9J3Qqj8j1J4PJ5Ll2mJ3J5Krnrj1M1Mj5l2
5622a9nK4MJ5%j5k4MQK8jk2rkRJ2Rk1j7rK2J2%pj4oJ6K5lj8pjLJ5J9km9PPL5K
$$ y = [-18, -32, 0, 17, 23, 1, -14, -17, -10, 10, 17, 5, -15, -7, -20, -4, -2, 1, -11, -16, -19, -8, 1, 7, -9, -9, -17, -4, 16, 17, -4, -7, 4, 8, 9, 14, 0, -15, -3, -9, 12, 10, 4, -17, -12, 4, 27, 15, 3, 4, -6, 1, 11, 20, -3, 9, -16, 0, 4, 3, 1, -13, -17, 2, 5, 4, 0, 4, -8, 1, 5, -2, -4, -14, -12, -14, 1, 4, -4, -15, -15, -10, 7, -1, -3, -11, -7, 9, 1, 17, 11, 10, -8, 5, 8, 6, 10, 6, -3, -5, 10, 10, 2, 5, 1, 7, -11, 1, 14, -4, -11, -3, 5, -5, 9, 0, -14, -17, -5, -3, 10, -7, -5, -15, 3, -3, -10, -1, -13, 0, -11, -7, -14, -8, -5, -10, -4, -16, -13, -5, -24, -4, -24, -19, -18, -3, -2, 1, -1, -10, 16, 8, -7, 3, -4, 3, -3, 2, 1, 0, -4, -4, -6, 0, 9, 22, 0, -9, 5, 1, 8, 1, 0, 0, -12, -12, -9, -3, 3, 0, -7, -12, -2, 4, -1, 7, -14, -6, 6, 1, 0, -1, -1, -15, -17, 10, 9, -15, -12, -8, -6, -5, 14, 3, -13, -18, 6, 5, -5, -3, 5, 3, -6, 5, 18, 3, -13, 12, -13, 6, 4, 2, 7, -21, 3, 26, 11, 10, -2, 4, 4, 11, 30, 16, -4, -16, -4, 17, 4, 3, -8, -7, -22, -1, 9, 8, -6, -7, -3, -13, 3, 12, 1, -12, -21, 7, 12, -7, -7, -12, -3, -6, 5, 13, 1, -9, -8, 10, 12, 11, 17, 8, -19, 0, 13, 21, 13, -5, -16, -2, 5, 20, 23, -9, -13, 0, 15, 17, 8, 3, -6, -17, 24, 28, 13, -19, -24, 0, 4, 19, 19, 4, -20, -16, -8, 20, 19, -3, -12, -14, -5, 7, 16, -5, -22, -31, -9, 3, 3, -4, -18, -24, -8, 17, 14, -4, -11, -12, -9, 6, 25, 23, -26, -19, -12, 23, 25]
5663B5k2j7mJ0ML8k6k6j0K3J7jj0Kl3QL8Qj8k6OlK7LJ1j5l7QL8%pnj5j6J7K3J2
5700B7l2k9J1K3PKKk4j4J4L6Mk7rj6J5J7K5j0l6k4K8K4JNj6m0K1K2K0pl0j%K8
5735A7Ljj7k6NL1K0ok4k1pK5J7J0l5k3J2J6L1j6Jl6KJ3K9Kk6j6JPJ6J7ln5lK7
5771a3L0Lj6nk5KK9K5j8k7rJ6K1J0Lk9k1LL1J9k1mj8nK9RJ0k5k4J5MK9pk7pj6
5807b9K2L7Jl6j2KJ8QJ4j9k5kJ3K2J0k5j6LkL6kj3k2JRJ2J2j2j0j6NJ9J2kk7j7
5843c1J9QPJ4k1j1J3RJ3Kk0Mj1J6nQk3KKJ1jJ2j0j9rJ6J4n%j4LNmK1ok4lPJ0%
5883aj0Lk0RK2J1kk2JKOOLqj0J3oMj4J2Pj7NK4j4oNK%MoJ2j7jNJ9rj3J4qKkRJ
5927A5j3LKnMJ3k4lPJKj0j2J6pJ%lJ7mOj7J1J0j7J0j0Nk%NojMj0lJ4MjMlJl%J1
$$ y = [25, 3, -14, -18, -8, -4, 34, 8, -18, -28, -5, 12, 11, 1, 3, -30, -22, 16, 24, 6, -20, -14, -17, 10, 13, 24, 9, -28, -20, 18, 18, 11, 6, -9, -25, -8, 15, 27, -5, -34, -23, 0, 7, 9, 11, -13, -27, -13, 23, 27, 0, -9, -25, -10, 7, 32, 22, -14, -38, -10, 14, 15, 20, 4, -36, -15, 7, 27, 20, -10, -11, -11, 17, 20, 19, 2, -24, -19, 12, 32, 26, 2, -19, -26, -1, 16, 26, -9, -32, -20, -4, 27, 11, 12, -24, -22, -9, 20, 22, -4, -20, -19, -12, 4, 21, 18, -37, -40, -13, 17, 20, 4, -1, -26, -24, 5, 30, 12, -15, -24, -8, 13, 23, 26, -3, -24, -21, 10, 29, 8, 4, -14, -19, 10, 19, 29, 4, -20, -5, -1, 28, 21, -6, -13, -29, -7, 30, 31, -5, -17, -15, 3, 11, 25, 6, -19, -21, -8, 14, 24, -1, -17, -14, -16, 20, 18, 5, -17, -16, -7, 5, 17, 5, -5, -21, -16, 3, 15, 13, -14, -31, -12, -4, 3, 17, -4, -15, -2, 7, 20, 22, 2, 6, -5, 11, 6, 14, -9, -7, -5, 6, 5, 17, 7, -12, -21, -5, 9, 4, 4, -10, -7, -2, -6, 15, 9, -15, -18, -11, -1, -1, -11, -8, -28, -19, 3, 14, 12, -10, -9, -7, -1, 5, 8, 0, -10, 3, -3, 1, -13, -1, 6, -11, -6, 18, 4, -2, 3, 5, 5, 9, 3, 15, -2, -3, 2, 21, 12, -1, 13, 5, 7, 5, 14, 15, 2, 5, 7, 2, 6, 19, -5, -8, -1, 0, 2, -8, -20, -4, -11, -10, -10, -13, 4, 0, 6, -11, 0, 10, -7, 3, -7, -2, -4, -4, 1, -5, -6, -2, -12, -15, -1, 3, 2, 6, 3, 4, 1, 1, 12]
5972A2j4JmJ7qNj3mPPQOk0Mj%RJLqj7PORnj9J5j2LJ7j5j4j1K0%J4Rl3J0oJ8Oj
6015Ikj3lkK1Rpk8mK7%Qj3jj3J9NLKk2JNJ0K1k5j6j6J3J4J3oj5jqK2jJ0l6kRK3
6056A0Qmk3rj0K0J8Ll5rJ4NJ5jj4j4mJ2K7Qj6l5J4J1J6Rk4nrJ3K6Pk3qpK1J1J1
6094B9k0j4qRJ9J2Jm8NJ0J4J3jk4k0K0OJ6%l0j4J7J8NLj8k3kK3J5mMk3k2J7K6
6130A1J5l0k7PK3J6Jpl1j5J7K7Oj7j8K%K6L8j3l8pK1J0Qj1ml0PL0J1j8j7rQRK3
6167B4j2j2k1JK4ONk5k5J5J2J4Qj9j9JJ7J3Kkj4k2J5K5J1k4rrJ2J1J9jk7k1J6
6202a1K2J2j3j4qqL2J8ql0OKRJ3Pj1j6k2L5KOj4mj3LL0Ol5llKK2Jnj7k3J2L6j2
6241Fj0j6mJ0J1K0j5k4pJ8K4nj0Lj7oL0J4j2k2mLK0KJ3k5o%J5PqonQmJ1K2k9j0
$$ y = [12, -2, -1, -5, 12, 4, 9, -4, -8, -1, 6, 14, 20, 0, 4, 3, 3, 12, 13, 16, 8, -9, -2, 4, 13, 8, -11, 4, -8, -5, 12, -3, -17, -28, -8, -8, 6, 15, -18, -8, -14, 4, 10, 9, 7, -6, -9, -11, 10, 19, 12, -16, -20, 7, 7, 15, 2, 1, -12, 7, 12, 15, 17, -5, -4, 1, 11, 32, 7, -9, -25, -12, 2, 15, 9, -6, -7, -15, 7, 6, 16, -20, -22, -13, 10, 18, 14, -9, -18, -28, -8, 10, 13, -22, -31, -17, -12, 3, 2, -12, -26, -30, -18, 9, 17, 1, -34, -20, -9, 7, 16, -8, -13, -22, -9, 17, 24, 1, -7, -14, 7, 18, 29, 9, -5, -13, -4, 15, 27, 28, -20, -15, -5, 9, 22, 21, -3, -23, -3, 3, 19, 19, -11, -25, -8, 10, 15, 18, 0, -23, -25, -2, 13, 9, 13, -10, -32, -15, 11, 26, -4, -31, -24, -1, 15, 16, 9, -22, -37, -20, 7, 13, -4, -22, -20, -20, 6, 44, 31, -7, -14, 7, 17, 25, 14, 10, -20, -13, 17, 28, 10, -7, -16, -8, 1, 24, 12, 0, -21, -20, 4, 10, 15, -10, -35, -20, -8, 6, 14, -5, -24, -23, -6, 7, 9, 7, -7, -29, -14, 11, 22, -2, -11, -20, -8, 3, 22, 21, -6, -27, -11, 11, 23, 10, -4, -12, -20, 12, 30, 22, -8, -2, 0, 9, 22, 29, 18, 2, -20, 15, 17, 23, 9, 5, -8, -5, 25, 31, -4, -7, -10, -8, 14, 15, 10, -7, -30, -18, 18, 6, -4, -20, -24, -14, -3, 17, 2, -22, -29, -11, 13, 8, -2, 1, -16, -22, 8, 22, 10, -12, -16, -13, 7, 9, 22, -3, -9, -9, 6, 13, 5, -1, -6, 2, -2, 9, 31, 2, -8]
6280hnK7j2JKj0pLL1jk0j2J3jrJ7jrj9K3mLnlj1%RPPj5rJ7JKJ1k0KkOPjJj5jQ
6325bRJ2Lk8nK8oj4K2j3j9KJ8qnoKMnK5jj1rKJ9j9J4j0Kj2OJ3Lk1JPj1LjLj0K
6367a6NJ9k1qPLpJ2J4j2j1PJ0Oj3ORplNNj1JOMkj6K6j4Pnjpj1K4j2jj3J6J0k0
6408ijNQj6J2PKj6KPj3lJ6Rj5rJ4LqJQj1j4J6J0lj0PjnkJ1Opj0J7Rk8J6ojMkJ7
6452A7j7PKrJ3pJ3j2j7J2rNKKJj5K2llnoNJknoOrRK0j3pKnKJ2J1j5jj2K1KolJ
6497AnjlJ0jk8JK4Pj5OKj1RJ2pJ2qPj0nMJ3mk0PJ6j1Qj0%pJJ1Rj6mkLKoJkj3J7
6542fRj5Pj1OJJ2%kk2NK0lOqpQkkNj0OnpK4mRj5rJJ5Nmj4LLmK4Mj9lnL%Pjjnk
6591cNRooJ2j7MJMj6LJ9nj6K3k0O%%J3j1nj3K3oOKkk6%L0JJlnmKJ1Mj6r%NK3l
$$ y = [-8, -13, 14, 2, 3, 5, -5, -12, -9, 22, 21, 1, -11, 2, 1, -8, 9, 8, -1, -20, 3, -1, 2, -3, -6, -17, -17, -8, -1, 6, -9, -18, -1, 0, 2, 13, -7, -5, -7, -1, 6, 5, 6, -9, -10, -2, 7, 19, 22, -6, -11, 17, 11, -3, 19, 6, -13, -11, 7, -1, -6, -12, -10, -6, -11, 14, 13, 2, -7, -5, 14, -5, 9, -1, 1, -11, -5, 8, 11, -10, -9, -2, -13, -10, -11, -8, -18, -16, -11, 8, -13, -21, -14, -11, -18, -6, 8, -4, -15, -8, 2, 8, -5, 1, 10, 3, 0, 5, 10, -1, 0, 6, 10, 8, -8, 18, 4, 11, 6, 5, -2, -13, 11, -1, -2, -15, 1, 11, -9, -10, -5, 3, -13, -1, 6, 8, -8, -6, 1, -12, -15, 1, 10, -5, -14, 0, 3, -5, -4, 4, -7, -21, -5, 5, 2, -8, -1, -2, -7, -9, 2, 8, 1, -9, 8, 17, -11, 5, -1, -2, 2, 0, 17, 0, 7, 9, 0, 13, 6, 19, 7, -10, 2, -7, -2, 0, 2, 3, -12, 10, 7, 4, -1, -7, -2, -1, -3, -8, -14, -8, -17, -8, 12, -1, -8, -6, -11, -9, 3, 14, -1, -2, -14, 7, 9, 3, 0, 1, -4, -5, -8, 2, 1, -27, -26, -2, 5, -10, -4, -2, -13, -4, 8, 1, 13, 5, 12, 2, -3, 1, 14, 10, -10, -3, 13, 2, 10, 0, 0, -7, -6, 5, 14, -2, -6, -8, -5, -3, -9, -8, -10, -23, -6, 3, -12, -5, -16, -10, -9, 3, 3, 1, -21, -16, 4, 1, 7, -1, -8, 0, -2, -4, 1, -9, -3, -8, -15, 9, 5, 14, -1, -10, -9, 6, 11, 7, -7, -4, -1, -5, 19, 23, 4, 1, -4, -1, -1, 6, 5, 4, -1, -3, 2, 11, 5, -1, 11, -6, -2, -1, 3, -13, -10, 9, 4, -12, 11, -9, -3, -3, -3, 10, -1, -6, -19, 4, -2, 4, 6, 4, -22, -22, 8, 9, 10, 7, 2, -2, 0, 11, 15, -1, -10, -10, -5, 18, 15]
6636A5pk2PLmJ2rOnNJ2lRk6KQLJj1Kj5J4%RnLqljkJ0pLlJJ0njj8NK1j3J1nlJJ
6683bJ2Kjj5koJ1OKj1O%kMknj3OJ2LnJ0kj3jJ9pNj7MJ6j1QqLrQJnpOrJ0Nnj2N
6730foOKkMoQrmJ3j9J0kLOqJ9j1%jJ7Kj0qPoJ2lmK%nLqKPqnJ0rJ9mJj7KOMpjM
6780@JlNJqkjjJ0jj6J1klJJ9qj0j5K9qpnRpOJ2qMj2LmK0kpLrJ5qRkkJpPlJ4j2
6828Gj1KKJ1j0kLj5J7mmj0NN%j0J6jj3J1lQj9J9JqLJ2j8mLOJonKJJkLJ0Jj0Ml
6873djJ3%nnlqJ6ONj2qJ8mNj1J1mj9J6KnmnkKj0QjlLlJ0OqkJ1j5%L%oOPjlrJ0
6921cj%LRqnOLrOmJmJ1Rk0NJmLjJ0kj3kJ4%mJQj0lJ%LnLMj1mJ0kppRKjkJ2nj3
6972a6RJqj1J8jOj3LPlNNn%oQJ1pJKr%NJj1J2J%j0JNj3nJ6MnJpJ1mlLpJJ3j2L
$$ y = [15, 8, -14, -7, -4, -8, 4, -5, 1, -4, 1, 13, 10, 19, -7, -5, 3, 6, 7, -4, -2, -17, -3, -3, 6, 1, 4, -4, -7, -8, -10, 0, -7, -4, -7, -6, 4, -1, -2, -20, -15, 6, -7, 4, -1, -4, -3, -2, 10, 12, 11, -4, -6, -12, -1, 5, 7, -4, 2, 2, 0, 4, 2, -3, -16, -10, 2, 5, 0, 10, 8, -5, -6, 13, 6, 11, -6, -2, 14, 3, 11, 3, 6, -3, 5, 6, 1, -6, 0, -9, 1, 6, 1, -11, -6, -12, -6, -4, -6, -2, -8, 0, -9, -13, 0, -19, -9, -11, -8, -2, -10, 9, -2, -2, -3, 14, 16, 6, -2, 5, -1, 11, 8, 4, 6, 6, 1, 4, -4, -2, 5, -3, -8, 2, -7, 12, 8, 9, -8, -6, 0, 4, -3, -4, 0, 1, -2, 3, 4, -4, -6, -7, -8, 2, 1, -15, -4, -6, -9, -8, 11, 3, -7, -22, 7, -1, -8, -13, -4, -11, -5, 7, -1, 3, -9, -6, -10, 10, 8, 1, 4, -5, 10, 2, 11, 9, 7, 8, 1, 8, 5, 19, 7, -4, -2, 0, 11, 1, -1, 2, -13, 4, 0, -4, -14, -9, -4, -4, -14, 2, 1, -12, -1, -4, 4, -15, 4, 5, -3, 0, 12, -6, -10, -7, -1, 0, -6, -11, -9, -8, -7, -9, -6, 4, 5, -5, -1, -4, -5, 8, 8, 3, -2, -5, -13, 3, 9, 14, 2, -6, 12, 8, 13, 2, 13, 9, -10, 6, 8, 3, -1, -6, -8, -6, -16, -8, -9, -12, -9, -12, -2, 4, -4, -6, 5, -10, -10, -7, -7, -13, -7, 0, -1, -4, -13, -3, -4, -4, -1, 8, 0, -5, 1, 4, -5, 1, -3, -2, -6, 5, 14, -6, -1, 0, -4, -1, -2, 8, 6, -7, -9, 5, 5, 1, 2, 10, 0, -3, -2, -2, 1, -4, -1, 3, -8, -12, -2, -4, -11, -18, -9, -7, -8, -10, 2, -3, -16, -7, -6, -14, -25, -7, -8, -2, -15, -12, -5, -8, -3, 2, -3, -3, -9, -1, 10, 3, 4, 6, -3, -3, 2, 3, -8, 4, 5, 5, -5, -4, 1, -12, -17, -1, 3, -2, -1, -8, 3, -1, -4, -1, -8, -7, 6, -6, -3]
7020ck%nJKoPRj9PLlkOj2JMRMj1QNj6J3jNj2J5J9l4J1LPjpJ3qj2RoRj4mJ5j6M
7066ePkLj3J1jj3J3mJ0nnnJ3j4J7jpj2NJ3j2Nk%JjPNk0lKJ2j2KNjOnJ0JrOPj8
7111iJ7J0%j5mJ5Kj0mjJ2k0J7Kmj1J2Nj3%Qj4kj2J5J2kj5JOpKJ1j0mJ1Nj3J0n
7151blrJJ3NJj2NnJJ7j3jrJ2lj3J8QqkKlJ1qKPj3OLRj8RJNj1jMlpNpJ0mlOkoM
7200aJjqRJ0j8jJ2j5KPMRj7MOKKmjn%LQj5kJ0pJMOnlONjRoj1j1J2oJ6j4J0J5k0
7247ArK0Jjj3%J1rrJ1qNK%Lj7J8j2jMlLlkNoJnJ4jolL%OlPMj1PjJpJ4Pj1j0P%
7296D%o%Mj0J4qkOmJ4k5J5JMKmRj3jOlrPJoRj1J7rj0OpPrNkpnRPkRj0%NkKlPp
7347eJ2jj1J6pO%j0Nj%%PnJ0oj4J1rMmnlJQLLnLj6K1opRMj7MPOjj2mjJ5nJ0j2
$$ y = [-3, -5, -5, -10, -9, -7, -13, -6, 3, -16, -9, -6, -9, -11, -5, -17, -16, -12, -3, 1, -10, -2, 3, -13, 0, -1, 4, -8, 7, 26, -8, 3, 6, 13, 12, 5, 18, 10, -2, 7, 1, 10, -4, -8, 7, -9, -5, 2, 0, 3, -10, 1, 0, -13, 0, -4, 6, 1, -4, -9, 4, -10, 7, 6, -1, -13, -8, 5, -7, -2, -4, -4, -3, -4, 3, 8, -12, -15, -13, -1, -13, -11, -6, -7, -1, -6, 4, 5, -4, 2, 9, -9, 8, 18, 18, 3, -1, 14, 16, 6, 2, 1, 13, -7, 10, 12, 8, -3, 9, 14, 1, 1, 9, -5, -7, -19, -4, 8, 6, -9, -8, -2, -9, -7, 4, -6, -10, 1, 6, -7, 3, -2, -5, -14, -13, 0, 5, 6, -6, -1, -6, -5, 12, -1, -2, -11, 1, -2, -15, 3, 11, 3, 1, 3, 0, 11, 3, 5, 12, -1, 5, 8, 17, -1, 8, 9, 14, 3, 2, 6, 3, -4, 1, -6, 4, 0, -3, 3, 1, -5, -1, 0, -1, -9, 0, 10, -8, -9, 3, -12, -10, -3, 1, 10, -7, -3, 3, 5, 7, 3, 2, -3, -3, 0, 8, -7, -9, 1, -6, -5, -1, 5, 0, -3, 3, 8, 7, 16, 10, -1, -12, 0, -6, 10, -4, 6, 21, 1, -8, 12, 13, 12, -1, -1, 10, 1, -8, 3, -5, 0, 2, 2, 5, -12, 6, -6, -7, -3, -6, -3, -6, -8, -3, -9, -8, -13, 1, 0, -6, -9, -6, -6, 0, -3, 4, 8, -3, 4, 3, 4, -3, 11, 18, 7, -3, 4, 4, 4, -2, -2, 2, -8, 6, -2, -4, 2, -2, 12, -13, 2, 3, 7, 9, 5, 14, 1, 0, 6, 3, -6, 1, 2, -4, 5, -6, 11, 2, -8, -2, -9, -2, -11, -6, -8, -15, -20, -11, -4, -6, 3, -7, -7, -2, -4, -2, -5, 2, -5, 7, 6, -5, 11, 4, 10, 10, 0, 5, 4, 4, 4, 11, 6, 16, 10, -4, 7, -2, 2, -2, -7, -10, -9, -1, 2, 5, 0, 3, -13, 8, 2, -5, 4, 8, -9, -5, 2, 8, 7, -5, -9, -10, 5, 0, 10, -2]
7394bj9J4PpPmj4J9J%MqlQLLjrmoJ7QKk3kQOLnJnOKMkjqmLMPj6LpMJ0ommlKJ1
7446@OmqkkJ1pRj7KNLQKk2LnJ1RJj5JK%J1Lj3J%qL1j2jKj2OJ9npk1RjJ6J0j3j0
7492doNPQrj3nKJ2QOj0k2J0J1J3qj2j6PJ5R%j1j8PJ2RMj8j7MJ5QQj3jj9J7J3R
7533A7j8j4KjJ9Kmj1mJ3MKLj6j2J5J4Qpj9qJ0K0l%j9j8QJ5JMrj7JJ9PRj5j9j2
7573c3J8K7%j4j5lJ3J1Onk1qK5J6j0pj8J3JJ5Qj0j2j0JJ5J8j5j9j3J7K0J5qj0
7608Hk4J8kK2Mk0j3J3LOOj2l1NQL0Ml0lqJ2KL1k7rj5J1J4nj1Jj8MK2J9j7k3%J1
$$ y = [-2, -21, -7, 0, -7, 0, -4, -18, 1, 2, 2, 6, -2, -5, 3, 6, 9, 8, -1, -5, -11, 6, 14, 16, -7, -9, -1, 5, 8, 3, 4, -1, 5, 7, 11, 9, 8, 0, -4, -1, 3, 10, -6, -3, -10, -6, 4, -2, -6, -10, -13, -11, 0, 6, 2, -6, -8, -10, 1, -6, 3, -14, -12, -7, -4, 4, 6, -16, -13, -18, -7, 2, 3, -12, -11, -9, -9, 2, 5, -8, -7, -7, -15, 16, 4, 3, 5, -7, -1, 18, 13, 6, -15, -6, -7, 9, 19, 6, -4, -10, -5, 2, 10, 1, -12, -17, -15, -3, 5, 11, 1, -21, -11, 0, 13, 5, -7, -23, -16, -1, 8, 8, -3, -21, -14, -2, 7, 11, -7, -24, -20, -5, 3, 11, -2, -3, -22, -5, 8, 17, -1, -15, -13, -14, 5, 7, 3, -8, -12, 1, 5, 7, 10, -6, -18, -3, 11, 19, 12, -7, -15, -5, 15, 12, 12, -7, -25, -17, -2, -1, 3, -6, -23, -22, -3, 4, 13, -2, -21, -33, -15, 12, 12, -2, -17, -20, -7, 4, 10, 5, -16, -24, 1, 17, 7, 0, -18, -5, -4, 11, 19, 9, -3, -13, -12, 3, 21, 6, -13, -26, -9, 11, 26, 18, 8, -16, 2, 0, 22, 26, 6, -7, 6, 9, 15, 21, 9, -22, -17, -9, 21, 25, -5, -8, -16, -4, -2, 29, 2, -7, -22, -11, 3, -2, -13, -12, -30, -26, -4, 15, -2, -25, -25, -14]
$$ [...]
8191B1
##END NTUPLES=NMR FID
##END=
