##TITLE=1H_2PEDM2
 CDCl3, 8 sc, 
 26.7.2019
##JCAMPDX= 6.0         $$ Bruker NMR JCAMP-DX V2.0
##DATA TYPE= NMR FID
##DATA CLASS= NTUPLES
##ORIGIN= UXNMR, Bruker Analytische Messtechnik GmbH
##OWNER= root
$$ XWIN-NMR		Version 3.5
$$ Fri Jul 26 14:06:55 2019 Russian Standard Time (UT+4h)  she@DPX200
##.OBSERVE FREQUENCY= 200.13155
##.OBSERVE NUCLEUS= ^1H
##.DELAY= (6, 6)
##.ACQUISITION MODE= SIMULTANEOUS
##.ACQUISITION SCHEME= undefined
##.AVERAGES= 8
##.DIGITISER RES= 18
##SPECTROMETER/DATA SYSTEM= spect
##.PULSE SEQUENCE= zg30
##.SOLVENT NAME= CDCl3
##.SHIFT REFERENCE= (INTERNAL, CDCl3, 0, 15.7039)
##AUDIT TRAIL= $$ (NUMBER, WHEN, WHO, WHERE, WHAT)
$$ ##TITLE= Audit trail, XWIN-NMR		Version 3.5
$$ ##JCAMPDX= 5.01
$$ ##ORIGIN= Bruker BioSpin GmbH
$$ ##OWNER= she
$$ F:/spectra/data/she/nmr/H-F/1/audita.txt
$$ ##AUDIT TRAIL=  $$ (NUMBER, WHEN, WHO, WHERE, WHAT)
(   1,<2019-07-26 14:05:44.26 +0400>,<she>,<DPX200>,
      <created by zg, POWCHK disabled, PULCHK disabled
       configuration hash MD5:
       00 E9 B6 7A A2 85 ED C7 34 08 36 98 17 FE 4E 26
       data hash MD5: 16K
       E1 1B C2 1F 26 9D B0 07 DD 66 B5 A5 79 B8 9D B9>)
$$ ##END=
$$ 
$$ hash MD5
$$ C3 DC F3 E6 0D 44 3E 07 95 BB AB 23 7B 08 C6 12
##$RELAX= 
##$RELAX= 
##$RELAX= 
##$RELAX= 
##$RELAX= 
##$RELAX= 
$$ Bruker specific parameters
$$ --------------------------
##$DU= <F:/spectra>
##$EXPNO= 1
##$NAME= <H-F>
##$PROCNO= 1
##$TYPE= <nmr>
##$USER= <she>
##$AMP= (0..31)
100 100 100 100 100 100 100 100 100 100 100 100 100 100 100 100 100 100 
100 100 100 100 100 100 100 100 100 100 100 100 100 100 
##$AQSEQ= 0
##$AQ_mod= 1
##$AUNM= <au_zg>
##$AUTOPOS= <>
##$BF1= 200.13
##$BF2= 200.13
##$BF3= 200.13
##$BF4= 200.13
##$BF5= 200.13
##$BF6= 200.13
##$BF7= 200.13
##$BF8= 200.13
##$BYTORDA= 1
##$CFDGTYP= 0
##$CFRGTYP= 5
##$CHEMSTR= <none>
##$CNST= (0..31)
1 1 145 1 1 1 1 1 1 1 1 1 1 1 1 1 1 1 1 1 1 1 1 1 1 1 1 1 1 1 1 1 
##$CPDPRG= <>
##$CPDPRG1= <>
##$CPDPRG2= <>
##$CPDPRG3= <>
##$CPDPRG4= <mlev>
##$CPDPRG5= <mlev>
##$CPDPRG6= <mlev>
##$CPDPRG7= <mlev>
##$CPDPRG8= <mlev>
##$CPDPRGB= <>
##$CPDPRGT= <>
##$D= (0..31)
0 1.2 0 0 0 0 0 0 0 0 0 0.03 0 0 0 0 0 0 0 0 0 0 0 0 0 0 0 0 0 0 0 0 
##$DATE= 1564135543
##$DBL= (0..7)
120 120 120 120 120 120 120 120 
##$DBP= (0..7)
150 150 150 150 150 150 150 150 
##$DBP07= 0
##$DBPNAM0= <>
##$DBPNAM1= <>
##$DBPNAM2= <>
##$DBPNAM3= <>
##$DBPNAM4= <>
##$DBPNAM5= <>
##$DBPNAM6= <>
##$DBPNAM7= <>
##$DBPOAL= (0..7)
0.5 0.5 0.5 0.5 0.5 0.5 0.5 0.5 
##$DBPOFFS= (0..7)
0 0 0 0 0 0 0 0 
##$DE= 6
##$DECBNUC= <off>
##$DECIM= 24
##$DECNUC= <off>
##$DECSTAT= 4
##$DIGMOD= 1
##$DIGTYP= 9
##$DL= (0..7)
0 120 120 120 120 120 120 120 
##$DP= (0..7)
150 150 150 150 150 150 150 150 
##$DP07= 0
##$DPNAME0= <>
##$DPNAME1= <>
##$DPNAME2= <>
##$DPNAME3= <>
##$DPNAME4= <>
##$DPNAME5= <>
##$DPNAME6= <>
##$DPNAME7= <>
##$DPOAL= (0..7)
0.5 0.5 0.5 0.5 0.5 0.5 0.5 0.5 
##$DPOFFS= (0..7)
0 0 0 0 0 0 0 0 
##$DQDMODE= 0
##$DR= 18
##$DS= 0
##$DSLIST= <SSSSSSSSSSSSSSS>
##$DSPFIRM= 0
$$ [...]
##$SUBNAM2= <"">
##$SUBNAM3= <"">
##$SUBNAM4= <"">
##$SUBNAM5= <"">
##$SUBNAM6= <"">
##$SUBNAM7= <"">
##$SUBNAM8= <"">
##$SUBNAM9= <"">
##$SW= 24.9336996594482
##$SWIBOX= (0..15)
0 0 2 0 0 0 0 0 0 0 0 0 0 0 0 0 
##$SW_h= 4990.01996007984
##$TD= 16384
##$TD0= 1
##$TE= 0
##$TE2= 300
##$TE3= 300
##$TEG= 300
##$TL= (0..7)
0 120 120 120 120 120 120 120 
##$TP= (0..7)
150 150 150 150 150 150 150 150 
##$TP07= 0
##$TPNAME0= <>
##$TPNAME1= <>
##$TPNAME2= <>
##$TPNAME3= <>
##$TPNAME4= <>
##$TPNAME5= <>
##$TPNAME6= <>
##$TPNAME7= <>
##$TPOAL= (0..7)
0.5 0.5 0.5 0.5 0.5 0.5 0.5 0.5 
##$TPOFFS= (0..7)
0 0 0 0 0 0 0 0 
##$TUNHIN= 0
##$TUNHOUT= 0
##$TUNXOUT= 0
##$USERA1= <user>
##$USERA2= <user>
##$USERA3= <user>
##$USERA4= <user>
##$USERA5= <user>
##$V9= 5
##$VALIST= <valist>
##$VCLIST= <CCCCCCCCCCCCCCC>
##$VD= 0
##$VDLIST= <DDDDDDDDDDDDDDD>
##$VPLIST= <PPPPPPPPPPPPPPP>
##$VTLIST= <TTTTTTTTTTTTTTT>
##$WBST= 1024
##$WBSW= 4
##$XGAIN= (0..3)
0 0 0 0 
##$XL= 0
##$YL= 0
##$YMAX_a= 323854
##$YMIN_a= -200583
##$ZGOPTNS= <>
##$ZL1= 120
##$ZL2= 120
##$ZL3= 120
##$ZL4= 120
##$ABSF1= 10
##$ABSF2= 0
##$ABSG= 5
##$ABSL= 3
##$ALPHA= 0
##$AQORDER= 0
##$ASSFAC= 0
##$ASSFACI= 0
##$ASSFACX= 0
##$ASSWID= 0
##$AUNMP= <proc_1d>
##$AZFE= 0.1
##$AZFW= 0.1
##$BCFW= 1
##$BC_mod= 2
##$BYTORDP= 1
##$COROFFS= 0
##$CY= 11.3945322036743
##$DATMOD= 1
##$DC= 2
##$DFILT= <>
##$DTYPP= 0
##$F1P= 20.1537800932815
##$F2P= 0.134698688090026
##$FCOR= 0.5
##$FTSIZE= 0
##$FT_mod= 4
##$GAMMA= 1
##$GB= 0.15
##$INTBC= 1
##$INTSCL= 1
##$ISEN= 128
##$LB= 0.24
##$LEV0= 0
##$LPBIN= 0
##$MAXI= 10000
##$MC2= 0
##$MEAN= 0
##$ME_mod= 0
##$MI= 1.114404
##$NCOEF= 0
##$NC_proc= 0
##$NLEV= 6
##$NOISF1= 3.799351
##$NOISF2= 2.8
##$NSP= 1
##$NTH_PI= 0
##$NZP= 0
##$OFFSET= 15.70392
##$PC= 1
##$PHC0= -9012.359
##$PHC1= 4.600974
##$PH_mod= 1
##$PKNL= yes
##$PPARMOD= 0
##$PSCAL= 0
##$PSIGN= 0
##$REVERSE= no
##$SF= 200.130013532006
##$SI= 16384
##$SIGF1= 3
##$SIGF2= 2
##$SINO= 400
##$SIOLD= 16384
##$SREGLST= <1H.CDCl3>
##$SSB= 0
##$STSI= 0
##$STSR= 0
##$SW_p= 3612.71676300578
##$SYMM= 0
##$S_DEV= 0
##$TDeff= 0
##$TDoff= 0
##$TI= <>
##$TILT= no
##$TM1= 0
##$TM2= 0
##$TOPLEV= 0
##$USERP1= <user>
##$USERP2= <user>
##$USERP3= <user>
##$USERP4= <user>
##$USERP5= <user>
##$WDW= 1
##$XDIM= 8192
##$YMAX_p= 0
##$YMIN_p= 0
$$ End of Bruker specific parameters
$$ ---------------------------------
##NTUPLES= NMR FID
##VAR_NAME=  TIME,          FID/REAL,        FID/IMAG
##SYMBOL=    X,             R,               I
##VAR_TYPE=  INDEPENDENT,   DEPENDENT,       DEPENDENT
##VAR_FORM=  AFFN,          ASDF,            ASDF
##VAR_DIM=   8192,          8192,            8192
##UNITS=     SECONDS,       ARBITRARY UNITS, ARBITRARY UNITS
##FACTOR=    0.0002004,     1,               1
##FIRST=     0,             0,               0
##LAST=      1.6414764,     0,               0
##MIN=       0,             -200583,         0
##MAX=       1.6414764,     323854,          0
$$ Real data points
##PAGE= N=1
##DATA TABLE= (X++(R..R)), XYDATA
$$ plain form
0 0 0 0 0 0 -8 8 -8 8 -8 16 -16 24 -27 32 -40 48 -59 72 -86 97 -113 136 -158 181 -209 238 -273 311 -351
29 -351 395 -447 503 -562 630 -704 784 -871 966 -1075 1191 -1319 1458 -1616 1788 -1981
45 -1981 2197 -2441 2719 -3037 3408 -3844 4367 -5007 5815 -6868 8301 -10383 13691 -19782
59 -19782 34670 -144344 -87789 270548 73083 -62874 45938 34921 -200583 -95903 200443
70 200443 156412 -123849 -107168 27857 -22912 -41219 143742 138695 -114389 -179517 18671
81 18671 79215 -160 32707 71799 -59458 -111373 45034 111224 -30177 -84107 14042 32299
93 32299 -26317 18166 74172 -4739 -86403 -33787 39917 41709 19803 -15816 -64054 -33658
105 -33658 64757 79936 -1371 -48903 -54005 -60367 1569 112508 92164 -50479 -94863 -24477
$$ packed form
0@%%%%qJ6j6J6j6K4l2M0n1N9p2Q8j07J31j58J83k10K49k94L39l90M47n11N84o62
29c51P46q42R50j065J192j334J488j655J837k041K266k510K777l074L404l769
45a981M178m638N160n756O445p252Q211r374J0822j2683J5169j8684K4074l3473
59a9782N4452j79014N6555L58337j97465j35957J08812j1017k35504J04680K96346
70B00443m4031k80261J6681J35025n0769j8307J84961n047k53084o5128J98188
81A8671O0544p9375L2867L9092j31257n1915J56407O6190j41401n3930R8149J8257
93C2299n8616M4483N6006p8911q1664N2616P3704J792k1906l5619m8238L0396
105c3658R8415J5179q1307m7532n102o362O1936J10939k0344j42643m4384P0386
$$ plain form
117 -24477 -1205 6885 83846 77269 -82127 -142375 4965 107630 52453 11850 2105 -89875
129 -89875 -123298 40950 160694 41795 -79306 -28262 -543 -60455 -695 126879 54813
140 54813 -117339 -88901 52434 54903 2760 37134 20160 -94265 -82333 71069 97708
151 97708 -22523 -50570 14458 -1165 -37749 28142 67575 -25135 -81192 27 55639 9791
163 9791 -5845 24206 -16872 -73903 -8957 86873 44389 -59546 -56184 13811 27795 10622
175 10622 21733 10713 -46738 -59529 10436 64553 37127 -12466 -29315 -33409 -27747 17977
187 17977 66269 36412 -47108 -69919 -8238 45826 41678 16236 -10856 -44992 -46234 11857
199 11857 60076 34126 -15815 -26213 -20988 -20908 10253 54143 31784 -40329 -54922 1390 37293
$$ packed form
117b4477K3272Q090P6961o577j59396o0248J47340J02665n5177m0603r745r1980
129h9875l3423J64248J19744j18899j21101N1044K7719n9912N9760J27574p2066
140E4813j72152K8438J41335K469n2143L4374j6974j14425J1932J53402K6639
151I7708j20231k8047O5028j5623l6584O5891L9433r2710n6057Q1219N5612m5848
163I791j5636L0051m1078n7031O4946R5830m2484j03935L362O9995J3984j7173
175A0622J1111j1020n7451j2791O9965N4117k7426m9593j6849m094N662M5724
187A7977M8292k9857q3520k2811O1681N4064m148k5442k7092l4136j242N8091
199A1857M8219k5950m9941j0398N225Q0L1161M3890k2359p2113j4593N6312L5903
$$ plain form
212 37293 22608 4422 -7150 -27082 -25227 13466 35145 8750 -18485 -12193 -1251 -2823 3705
225 3705 16407 6671 -19488 -22820 4595 26709 14960 -14097 -24151 -7482 11384 15890 9817
238 9817 -5145 -22136 -15663 14792 25013 508 -13416 -1402 -3932 -17520 5068 38103 14329
251 14329 -34262 -27167 12322 15787 4574 14235 4251 -32442 -23464 28694 30823 -14317 -16095
264 -16095 13318 -1879 -26227 6299 36311 1473 -29441 -3938 11986 -8149 -1087 25277
276 25277 1707 -34987 -7527 31796 5912 -26126 534 21902 -7397 -20626 8561 14098
288 14098 -10357 -5675 13433 -2591 -18750 5887 20317 -7534 -18706 9295 15479 -11269
300 -11269 -13297 10653 11216 -5592 -4137 1527 -5857 -1685 14950 8257 -14544 -11689 8925 9406
$$ packed form
212C7293j4685j8186j1572j9932J855L8693K1679k6395k7235O292J0942j572O528
225C705J2702r736k6159l332K7415K2114j1749k9057j0054J6669J8866M506o073
238I817j4962j6991O473L0455J0221k4505j3924J2014k530j3588K2588L3035k3774
251A4329m8591P095L9489L465j1213R661r984l6693Q978N2158K129m5140j778
264a6095K9413j5197k4348L2526L0012l4838l0914K5503J5924k0135P062K6364
276B5277k3570l6694K7460L9323k5884l2038K6660K1368k9299j3229K9187N537
288A4098k4455M682J9108j6024j6159K4637J4430k7851j1172K8001O184k6748
300a1269k028K3950N63j6808J455N664p384M172J6635o693k2801K855K0614M81
$$ plain form
314 9406 -2229 -477 2705 -4564 -5097 4457 5394 468 2349 -357 -11819 -7196 14346 16832 -5520
329 -5520 -17039 -6081 4920 8401 8660 -1134 -15298 -10040 9417 11926 -854 -3127 -373 -9549
343 -9549 -12572 7130 21519 6560 -14304 -15917 -5803 6518 18472 13353 -13261 -27026 -5591
356 -5591 19839 17696 2274 -6007 -12653 -15455 -556 20178 19021 -805 -14899 -15759 -6486 12848
370 12848 26143 9404 -23054 -28002 419 24214 20930 2730 -14108 -21179 -10267 11925 21457
383 21457 8969 -8055 -15062 -12022 776 18225 19912 -4404 -28716 -21443 9464 28908 19353
396 19353 -7081 -26365 -21776 3081 23384 18655 -3422 -19109 -16417 -1132 15332 21016 7308
409 7308 -17735 -29432 -12228 19256 33720 16043 -17098 -33362 -16642 15824 30979 14424
$$ packed form
314I406j1635J752L182p269n33R554R37m926J881k706j1462M623K1542K486k2352
329e520j1519J0958J1001L481K59r794j4164N258J9457K509j2780k273K754r176
343i549l023J9702J4389j4959k0864j613J0114J2321J1954n119k6614j3765K1435
356e591K5430k143j5422q281o646k802J4899K0734j157j9826j4094q60R273J9334
370A2848J3295j6739l2458m948K8421K3795l284j8200j6838p071J0912K2192R532
383B1457j2488j7024p007L040J2798J7449J687k4316k4312P273L0907J9444r555
396A9353k6434j9284M589K4857K0303m729k2077j5687K692J5285J6464N684j3708
409G308k5043j1697J7204L1484J4464j7677l3141j6264J6720L2466J5155j6555
$$ plain form
421 14424 -14467 -26394 -12234 11939 24867 17476 -4493 -24828 -25114 -1538 26137 30753 6292
434 6292 -24138 -31145 -7386 24230 31183 4927 -26610 -29523 -2580 24491 27440 7392 -17872
447 -17872 -29416 -16500 11444 29506 20345 -7241 -28444 -24041 4056 30355 26050 -7810 -35411
460 -35411 -26385 8972 33902 26240 -4224 -29156 -27418 -2227 22508 25970 7536 -16661 -26593
473 -26593 -11353 17524 31072 13209 -19111 -33932 -15995 18922 37957 20180 -17592 -35169
485 -35169 -16310 14012 26539 16421 -5278 -24084 -21641 5019 28832 23077 -4128 -25651
497 -25651 -27281 -7269 24843 38190 10017 -30973 -35742 -2983 24540 24232 6159 -16389 -28744
510 -28744 -13191 19695 31854 10262 -16421 -25583 -18857 1715 28521 31237 -3471 -36118 -25817
$$ packed form
421A4424k8891j1927J4160K4173J2928p391k1969k0335k86K3576K7675M616k4461
434F292l0430p007K3759L1616O953k6256l1537k913K6943K7071K949k0048k5264
447a7872j1544J2916K7944J8062r161k7586k1203M403K8097K6299m305l3860k7601
460c5411R026L5357K4930p662l0464k4932J738K5191K4735L462j8434k4197r932
473b6593J5240K8877J3548j7863l2320j4821J7937L4917J9035j7777l7772j7577
485c5169J8859L0322J2527j0118k1699j8806K443K6660K3813n755k7205k1523
497b5651j630K0012L2112J3347k8173m0990m769L2759K7523l08j8073k2548j2355
510b8744J5553L2886J2159k1592k6683r162O726K0572K6806K716l4708l2647J0301
$$ plain form
523 -25817 10351 28857 18771 -4130 -24842 -25884 1246 31267 27990 -3354 -25324 -21793 -5339
536 -5339 13732 26891 17483 -13900 -33239 -14743 19814 31257 11566 -15967 -28419 -16987
548 -16987 11671 32870 21817 -12421 -31163 -16536 8422 18696 15135 4185 -14444 -25708
560 -25708 -8100 23531 27679 -540 -23937 -21048 -4182 14108 25503 12712 -19783 -30811
572 -30811 -3437 22288 15467 -1384 -6684 -11973 -15052 4399 28783 17121 -17666 -27111 -7418
585 -7418 8915 16950 20863 3117 -29732 -29570 11631 35458 13545 -12954 -15827 -13009 -7532 15516
599 15516 32328 9375 -26362 -26888 -1843 12698 17476 18963 -689 -31543 -26878 14489 34164
612 34164 10224 -14716 -15094 -9599 -4269 12311 22721 4276 -20512 -17407 1796 8942 7677
$$ packed form
523b5817L6168J8506j0086k2901k0712j042K7130L0021l277l1344k1970L531J6454
536e339J9071J3159r408l1383j9339J8496L4557J1443j9691k7533j2452J1432
548a6987K8658K1199j1053l4238j8742J4627K4958J0274l561j0950j8629j1264
560b5708J7608L1631M148k8219k3397K889J6866J8290J1395j2791l2495j1028
572c0811K7374K5725o821j6851n300n289l079J9451K4384j1662l4787r445J9693
585g418J6333Q035L913j7746l2849J62M1201K3827k1913k6499k873K818N477K3048
599A5516J6812k2953l5737n26K5045J4541M778J487j9652l0854M665M1367J9675
612C4164k3940k4940l78N495N330J6580J0410j8445k4788L105J9203P146j265
$$ plain form
625 7677 8087 -934 -17402 -13821 11218 20650 903 -16209 -9515 3556 6639 6100 4183 -5533
639 -5533 -13532 -3472 13476 12245 -3585 -10164 -4640 -1780 1072 12665 15780 -5937 -26329 -11974
653 -11974 17778 21675 3393 -7634 -10829 -14564 -3277 21832 23155 -6977 -23179 -7659 3582
666 3582 1067 11440 21381 -3869 -33570 -15626 20872 19004 -1346 -1084 -2584 -20498 -12365 23290
680 23290 23551 -12886 -18340 6677 2431 -15695 4547 26999 -433 -27991 -4059 18649 -1130
693 -1130 -10587 11389 8880 -18289 -8622 20819 6140 -22021 -2365 23713 1500 -20452 1372
706 1372 14459 -8036 -10515 16595 13159 -16550 -12869 10881 4324 -8879 8319 17395 -10826
719 -10826 -25700 1631 21299 6456 -5960 -1350 -4513 -11633 -443 14707 9596 -4139 -8053
$$ packed form
625G677M10r021j6468L581K5039R432j9747j7112O694J3071L083n39j917r716
639e533p999J0060J6948j231j5830o579N524K860K852J1593L115k1717k0392J4355
653a1974K9752L897j8282j1027l195l735J1287K5109J323l0132j6202J5520J1241
666C582k515J0373R941k5250k9701J7944L6498j868k0350K62j500j7914Q133L5655
680B3290K61l6437n454K5017m246j8126K0242K2452k7432k7558K3932K2708j9779
693a130r457K1976k509k7169R667K9441j4679k8161J9656K6078k2213k1952K1824
706A372J3087k2495k479K7110l436k9709L681K3750o557j3203J7198R076k8221
719a0826j4874K7331J9668j4843j2416M610l163p120J1190J5150n111j3735l914
$$ plain form
732 -8053 -7026 -5045 3050 10954 8381 -2050 -11742 -12764 659 15213 9077 -7311 -6228 2354
746 2354 -5179 -9302 9306 17445 -4142 -14566 1955 3610 -10882 1995 23512 2810 -25642
759 -25642 -5642 19436 -1329 -15682 13586 21261 -16689 -24103 12544 16361 -11195 -1270 21149
772 21149 -5599 -31489 2752 30992 -729 -20619 8957 13817 -21201 -16331 24415 18401 -17875
785 -17875 -10551 12596 -4663 -17624 12907 24235 -11813 -23341 8567 13906 -12765 -7650 18281
798 18281 7011 -18310 -6894 11715 39 -8159 8594 10356 -11131 -12283 7699 7387 -6820
811 -6820 -171 12179 664 -14256 -5950 7423 6402 3015 3455 -3236 -11324 -4654 8781 10382
825 10382 2217 -3736 -5637 -5815 -2145 5092 10524 7503 -5359 -15714 -8450 8956 13537 3302
$$ packed form
732h053J027J981Q095P904k573j0431r692j022J3423J4554o136j6388J083Q582
746B354p533m123J8608Q139k1587j0424J6521J655j4492J2877K1517k0702k8452
759b5642K0000K5078k0765j4353K9268P675l7950p414L6647L817k7556R925K2419
772B1149k6748k5890L4241K8240l1721j9890K9576M860l5018M870M0746o014l6276
785a7875P324K3147j7259j2961L0531J1328l6048j1528L1908N339k6671N115K5931
798A8281j1270k5321J1416J8609j1676q198J6753J762k1487j152J9982l12j4207
811f820O649J2350j1515j4920Q306J3373j021l387M40o691q088O670J3435J601
825A0382q165n953j901j78L670P237N432l021j2862j0355P264J7406M581j0235
$$ plain form
839 3302 -4035 -5521 -8315 -4807 9101 12988 -1351 -10041 -3158 -556 -4619 3904 14915 2113
853 2113 -17173 -9331 9355 6583 -3663 1590 4614 -7165 -8185 7687 8570 -7753 -6694 9443
867 9443 5595 -10587 -4396 10885 2616 -10909 494 13309 -360 -13466 -1399 9258 532
880 532 -1635 8689 1423 -17609 -9081 17133 14855 -7880 -8736 3524 -3027 -10168 7751 19524
894 19524 -1357 -19089 -5903 6541 614 3357 14092 -153 -23686 -11838 17037 14297 -5690
907 -5690 -3801 2913 -8985 -11398 10683 17623 -4127 -13542 -324 1859 -5531 5020 15696 -2030
921 -2030 -19373 -4317 13604 4984 -5290 1280 2373 -6842 -2699 9242 4074 -7350 -2510 5021
935 5021 -535 -3039 5146 4242 -6725 -5988 5225 6658 -304 -2979 -3477 -3891 2771 9323 2440 -7930
$$ packed form
839C302p337j486k794L508J3908L887j4339q690O883K602m063Q523J1011j2802
853B113j9286P842J8686k772j0246N253L024j1779j020J5872Q83j6323J059J6137
867I443l848j6182O191J5281q269j3525J1403J2815j3669j3106J2067J0657q726
880E32k167J0324p266j9032Q528K6214k278k2735q56J2260o551p141J7919J1773
894A9524k0881j7732J3186J2444n927K743J0735j4245k3533J1848K8875k740j9987
907e690J889O714j1898k413K2081O940k1750r415J3218K183p390J0551J0676j7726
921b030j7343J5056J7921q620j0274O570J093r215M143J1941n168j1424M840P531
935E021n556k504Q185r04j0967P37J1213J433o962k675m98m14O662O552o883j0370
$$ plain form
951 -7930 -5852 722 1343 3243 6432 -456 -9622 -5018 3879 3137 2099 5448 -1950 -14206 -5894
966 -5894 13171 10910 -5035 -6569 -1009 -4694 -2515 11137 9485 -8676 -10466 3658 3682 -3948
980 -3948 4678 10729 -6246 -16023 2290 14575 1623 -5939 1840 -787 -9138 2345 14887 840
994 840 -13947 -1661 9623 -1076 -5462 6778 5206 -10539 -7227 9404 7147 -5056 -2393
1007 -2393 2018 -5455 -4225 10244 8672 -9505 -10876 4161 6311 -1799 671 3941 -5250 -8867
1021 -8867 2886 8450 310 -2910 679 -3397 -6941 3366 11377 1306 -9196 -4665 2231 1975
1035 1975 2952 4449 -2015 -7416 -1217 5516 2001 -1015 1926 196 -5413 -2060 6024 4615 -2373
1050 -2373 -3106 -1006 -961 2086 5631 291 -6952 -2847 5183 3375 -2171 -958 610 -2556 -1874 3612
$$ packed form
951g930K078O574O21J900L189o888r166M604Q897p42j038L349p398j2256Q312
966e894J9065k261j5945j534N560l685K179J3652j652j8161j790J4124K4p630
980c948Q626O051j6975r777J8313J2285j2952p562P779k627q351J1483J2542j4047
994H40j4787J2286J1284j0699m386J2240j572j5745L312J6631k257j2203K663
1007b393M411p473J230J4469j572j8177j371J5037K150q110K470L270r191l617
1021h867J1753N564q140l220L589m076l544J0307Q011j0071j0502M531O896k56
1035A975R77J497o464n401O199O733l515l016K941j730n609L353Q084j409o988
1050b373p33K100M5L047L545n340p243M105Q030j808n546J213J568l166O82N486
$$ plain form
1066 3612 3335 -2142 -2765 -441 -1624 -575 5061 3990 -5355 -7358 1179 5628 1676 -1098 -1119 -3298
1082 -3298 -3045 2853 5237 -151 -3566 -918 -218 -1713 1413 5172 1288 -5106 -4008 1718 3898
1097 3898 2616 510 -2833 -4084 418 5066 2756 -2080 -2211 47 -11 -123 1928 2385 -551 -3070
1113 -3070 -2003 1087 3016 2438 -919 -3908 -2632 1817 3831 1149 -2441 -2665 -349 1134 693 187
1129 187 168 -638 -1819 -1151 991 1608 407 -881 -1698 -1750 641 3203 1093 -3315 -2671 1995 2902 -458
1147 -458 -1404 46 -80 -350 1438 1433 -1071 -999 1248 175 -1616 1313 3590 -585 -4368 -713 3732
1164 3732 2177 -806 -904 -1263 -1490 1643 3354 -284 -3053 -314 1330 -1103 -985 2495 1589 -2589
1180 -2589 -2650 388 1132 1059 1273 -1160 -3810 -828 3418 1573 -2089 -1238 440 -678 -527 1495 440
$$ packed form
1066C612k77n477o23K324j183J049N636j071r345k003Q537M449l952k774k1k179
1082c298K53N898K384n388l415K648P00j495L126L759l884o394J098N726K180
1097C898j282k106l343j251M502M648k310m836j31K258n8j12K051M57k936k519
1113c070J067L090J929n78l357k989J276M449K014k682l590k24K316J483m41n06
1129A87j9q06j181O68K142O17j201j288q17n2K391K562k110m408O44M666R07l360
1147d58r46J450j26k70J788nk504P2K247j073j791K929K277m175l783L655M445
1164C732j555k983r8l59k27L133J711l638k769K739J644k433J18L480r06m178
1180b589o1L038P44p3K14k433k650K982M246j845l662Q51J678j118J51K022j055
$$ plain form
1197 440 -1457 214 890 -1986 -1242 3679 2403 -3708 -2796 2950 2172 -1839 -48 1993 -1426 -1759
1213 -1759 3097 1992 -3626 -1146 4766 870 -5027 -200 5085 -136 -3911 1391 3159 -2323 -2056
1228 -2056 3206 525 -3933 974 4897 -2276 -6088 2016 5672 -2038 -4462 2066 2257 -3486 -1516
1243 -1516 3820 605 -3916 148 3002 -2099 -3462 2996 4092 -2723 -4313 1488 3054 -922 -1570
1258 -1570 1253 1077 -1166 -806 826 496 -198 770 1312 -683 -2385 -273 3254 2146 -2013 -1842 1826
1275 1826 1131 -2496 -471 3939 1599 -3292 -1826 1410 -224 -287 3571 1480 -5579 -3705 4635 3491
1291 3491 -3525 -1254 3812 -1317 -6302 894 6571 1 -4565 500 1189 -4055 -721 6734 1933
1306 1933 -7162 -3117 5056 1552 -3727 784 4058 -1933 -4603 1442 3537 -890 -1290 2113 338
$$ packed form
1197D40j897J671O76k876P44M921j276o111R12N746p78m011J791K041l419l33
1213a759M856j105n618K480N912l896n897M827N285n221l775N302J768n482K67
1228b056N262k681m458M907L923p173l812Q104L656p710k424O528J91n743J970
1243a516N336l215m521M064K854n101j363O458J096o815j590N801J566l976o48
1258a570K823j76k243L60J632l30o94R68N42j995j702K112L527j108m159J71L668
1275A826o95l627K025M410k340m891J466L236j634o3L858k091p059J874Q340j144
1291C491p016K271N066n129m985P196N677o570m566N065O89n244L334P455m801
1306A933r095M045Q173l504n279M511L274n991k670O045K095m427m00L403j775
$$ plain form
1321 338 -3249 -412 3807 1096 -2892 -903 3010 1535 -2567 -2266 1841 3160 14 -1876 -206
1336 -206 89 -1752 233 4173 1659 -3929 -2386 1773 -697 -2026 4704 5603 -5623 -9353 2077
1351 2077 7434 -324 -2001 3431 -1946 -9679 57 11365 2714 -7756 -778 3608 -6326 -5278
1365 -5278 10776 9686 -8858 -10033 4428 4218 -4219 2520 8742 -4290 -11631 2696 9851 -2225
1379 -2225 -5127 6096 3498 -9376 -4093 9692 4392 -7002 -1351 5956 -1492 -5711 3041 4963
1393 4963 -3958 -3194 5943 3021 -7043 -4400 4950 4206 -1727 -862 989 -2582 -4213 847 5519
1408 5519 3634 -1807 -5221 -3907 -3 3108 4545 3677 -2515 -8931 -4886 6024 7826 -21 -2629
1423 -2629 -621 -4486 -5866 4884 11379 549 -8643 -2551 1579 -3089 1703 11444 2446 -13190
$$ packed form
1321C38l587K837M219k711l988J989L913j475m102L01M107J319l146j890J670
1336b06K95j841J985L940k514n588J543M159k470j329O730Q99j1226l730J1430
1351B077N357p758j677N432n377p733R736J1308q651j0470O978M386r934J048
1365e278J6054j090j8544j175J4461k10q437O739O222j3032p341J4327P155j2076
1379b225k902J1223k598j2874N283J3785n300j1394N651P307p448m219Q752J922
1393D963q921P64R137k922j0064K643R350p44n933Q65J851l571j631N060M672
1408E519j885n441l414J314L904L111J437q68o192o416M045J0910J802p847k608
1423b629K008l865j380J0750O495j0830r192O092M130m668M792R741q998j5636
$$ plain form
1437 -13190 -6255 9502 4539 -5866 1829 7620 -5479 -10334 5300 10301 -3840 -6373 5317
1450 5317 2933 -8117 -1365 9624 426 -9445 1016 9195 -2304 -8747 1896 5678 -2993 -2099
1464 -2099 5846 349 -9285 -2372 8244 3183 -4253 -232 1782 -5345 -5027 6455 9117 -1606
1478 -1606 -7900 -3602 665 1913 4474 4880 -1723 -8053 -4770 3656 6730 2944 -1034 -2715 -4063
1493 -4063 -3633 2557 8562 4520 -5505 -7536 -446 3321 2373 3538 2781 -4930 -7976 1433 7746
1508 7746 1084 -3566 1558 1282 -6363 -3195 8152 5519 -6602 -5190 4283 1825 -4441 803 5111
1523 5111 -2687 -5757 3653 5280 -4900 -5440 4762 4276 -4171 -1646 4600 -1454 -7019 1775 8360
1538 8360 86 -5793 106 1476 -4396 -343 9492 4316 -9100 -7472 4127 5177 -211 1566
$$ packed form
1437a3190O935J5757m963j0405P695N791j3099m855J5634N001j4141k533J1690
1450E317k384j1050O752J0989r198r871J0461Q179j1499o443J0643L782q671Q94
1464b099P945n497r634O913J0616n061p436M021K014p127L18J1482K662j0723
1478a606o294M298M267J248K561M06o603o330L283Q426L074l786l978j681j348
1493d063M30O190O005m042j0025k031P090L767r48J165p57p711l046R409O313
1508G746o662m650N124k76p645L168J1347k633j2121J412R473k458o266N244M308
1523E111p798l070R410J627j0180n40J0202m86q447K525O246o054n565Q794O585
1538H360q274n879N899J370n872M053R835n176j3416J628J1599J050n388J777
$$ plain form
1552 1566 3027 -4470 -7816 1321 8343 3538 -2297 -2056 -2591 -4111 925 7857 4789 -4719 -6692
1567 -6692 -756 2677 1801 2165 1993 -2399 -5424 -1486 3912 3116 -626 -1118 -611 -2516 -2092 2980 4364
1584 4364 -1456 -4612 58 3333 -581 -2724 1091 2228 -1541 -1530 2489 1023 -3636 -1363 3966
1599 3966 1858 -2721 -454 2209 -1874 -3497 3263 6128 -1114 -5498 -745 2227 6 1323 4221
1614 4221 -606 -6439 -1932 5044 2632 -1890 655 1701 -4103 -4536 3857 6511 -1014 -4780 -713
1629 -713 495 -1631 1379 4695 -369 -5562 -1581 3378 712 -1668 1451 1593 -3141 -3121 2447 3066
1645 3066 -1212 -1621 718 -481 -1686 1354 2718 -1262 -2929 882 2630 -671 -1832 874 1451
1660 1451 -759 -684 1088 699 -810 -466 516 308 259 600 -52 -1183 -622 1093 1508 106 -1203 -1217
$$ packed form
1552A566J461p497l346R137P022m805n835K41n35j520N036O932l068r508j973
1567f692N936L433q76L64j72m392l025L938N398p96l742m92N07j905M24N072J384
1584D364n820l156M670L275l914k143L815J137l769J1M019j466m659K273N329
1599C966k108m579K267K663m083j623O760K865p242m384M753K972k221J317K898
1614D221m827n833M507O976k412m522K545J046n804m33Q393K654p525l766M067
1629g13J208k126L010L316n064n193L981M959k666k380L119J42m734K0N568O19
1645C066m278m09K339j199j205L040J364l980j667L811J748l301j161K706N77
1660A451k210P5J772l89j509L44R82k08m9L41o52j131N61J715M15j402j309j4
$$ plain form
1678 -1217 274 1257 510 -562 -344 25 -631 -611 814 1069 -473 -951 -237 -377 -392 1115 1312 -1369
1696 -1369 -2359 582 1992 -525 -1391 765 778 -1351 -732 1383 394 -1208 422 1337 -1172 -1551 1586
1713 1586 1879 -1435 -1458 1735 1381 -1711 -862 1714 777 -1037 333 900 -1200 -908 2113 1550 -1896
1730 -1896 -1535 1472 895 -1344 -172 1654 -137 -1760 -121 1127 4 -250 669 -576 -1832 111
1746 111 2108 408 -1933 -901 599 120 -199 524 51 -1119 -621 626 424 -131 377 -15 -1350
1763 -1350 -865 1272 1710 -131 -1327 -823 9 893 1398 363 -1177 -940 609 901 247 341 349 -584 -1078
1782 -1078 251 1466 896 -342 -974 -1022 17 1582 1444 -757 -1918 -479 1060 1013 179 -287 -884
1799 -884 -1110 -112 1162 1084 -20 -1095 -1468 -871 876 2096 880 -1773 -2460 -662 1499 1959 760
$$ packed form
1678a217J491R83p47j072K18L69o56K0J425K55j542m78P14j40j5J507J97k681
1696a369r90K941J410k517q66K156J3k129O19K115r89j602J630R15k509l79L137
1713A586K93l314k3L193l54l092Q49K576r37j814J370N67k100K92L021n63l446
1730a896L61L007n77k239J172J826j791j623J639J248j123k54R19j245j256J943
1746A11J997j700k341J032J500m79l19P23m73j170M98J247k02n55N08l92j335
1763a350M85K137M38j841j196N04Q32Q84N05j035j540K37J549K92o54R4Qr33m94
1782a078J329J215n70j238o32m8J039J565j38k201j161J439J539m7q34m66n97
1799h84k26R98J274p8j104j075l73N97J747J220j216k653o87J798K161M60j199
$$ plain form
1816 760 -1016 -2077 -1120 812 1879 1031 -202 -1097 -1395 -735 1314 2594 927 -1772 -2179 -202 1740
1833 1740 1899 640 -1114 -1913 -589 1593 1732 110 -810 -669 -587 -107 1444 1713 -474 -2296 -1272
1850 -1272 959 1655 1088 -212 -2060 -2213 491 2847 1447 -1397 -2079 -1034 -279 1026 2178 809
1866 809 -2090 -2601 -447 1361 1867 1520 -470 -3012 -2546 1432 3468 1285 -1366 -1891 -1103 53 1839
1883 1839 2204 113 -1797 -1440 13 1029 1751 1297 -920 -2431 -886 1845 2198 406 -1329 -1829
1899 -1829 -537 1495 1965 321 -1401 -1584 -497 794 1650 991 -955 -2099 -1196 560 1685 1871
1915 1871 -73 -2971 -2842 818 3197 1601 -873 -1771 -2040 -963 1965 3224 313 -2831 -1944 38
1931 38 451 1463 2666 138 -3896 -2681 2207 3361 752 -878 -1158 -1914 -641 2795 3086 -866
$$ packed form
1816G60j776j061R57J932J067q48j233q95k98O60K049J280j667k699m07J977J942
1833A740J59j259j754p99J324K182J39j622r20J41Q2M80J551K69k187j822J024
1850a272K231O96n67j300j848j53K704K356j400k844o82J045P55J305J152j369
1866H09k899n11K154J808N06l47j990k542M66L978K036k183k651n25P88J156J786
1883A839L65k091j910L57J453J016P22m54k217j511J545K731L53j792j735n00
1899a829J292K032M70j644j722j83J087J291Q56o59j946j144R03J756J125J86
1915A871j944k898J29L660K379j596k474q98k69J077K928J259k911l144Q87J982
1931C8M13J012J203k528m034J215M888J154k609j630k80p56J273L436K91l952
$$ plain form
1947 -866 -2919 -844 794 628 1446 1831 -1024 -3356 -1113 2635 2611 79 -1351 -1781 -1564 718 3064
1964 3064 1808 -1896 -3134 -866 1432 1465 792 242 -1233 -2701 -1149 2414 2998 -310 -2726 -1630
1980 -1630 -79 437 1771 2120 -1181 -3905 -920 3094 1665 -1259 -234 621 -1791 -1576 2826 3027
1996 3027 -1909 -2875 1004 1330 -680 947 2324 -1886 -3904 1506 4557 -136 -3119 191 1044 -1675
2012 -1675 172 3836 674 -4352 -1740 2644 1098 -682 1629 647 -4062 -2857 3596 4100 -1237
2027 -1237 -2802 -634 -808 -947 2450 3322 -1220 -4008 -1345 1301 1191 1319 1300 -1208 -3324 -1463 2122
2044 2122 3092 1148 -1702 -2716 -916 1508 1763 981 446 -1259 -2627 -246 2945 1646 -1177 -387
2060 -387 516 -1866 -1250 3397 2877 -3087 -2953 2482 1944 -2382 -216 3088 -863 -3716 1671 3874
$$ packed form
1947h66k053K075J638j66Q18L85k855k332K243L748k4k532j430m30K17K282K346
1964C064j256l704j238K268K298L3o73n50j475j468J552L563N84l308k416J096
1980a630J551N16J334L49l301k724K985M014j429k924J025Q55k412K15M402K01
1996C027m936r66L879L26k010J627J377m210k018N410L051m693k983L310Q53k719
2012a675J847L664l162n026K612M384j546j780K311r82m709J205O453N04n337
2027a237j565K168j74j39L397Q72m542k788K663K646j10J28j9k508k116J861L585
2044B122R70j944k850j014J800K424K55p82n35j705j368K381L191j299k823P90
2060c87R03k382O16M647n20n964J34N435n38m326K166L304l951k853N387K203
$$ plain form
2076 3874 -2383 -3525 2819 2639 -3584 -1531 4262 213 -5471 31 5536 -164 -4452 880 2355
2091 2355 -3379 -1820 5475 2553 -5727 -3133 3958 1345 -2882 1665 3773 -3098 -5184 2092 4558
2106 4558 -642 -1416 1639 -972 -4048 901 5288 975 -3369 -883 1076 -889 -344 2812 1802
2121 1802 -1995 -2243 114 771 649 1187 533 -1175 -1468 -338 727 1293 507 -1061 -849 594 -167
2138 -167 -1469 532 2458 -230 -2678 -78 1483 -1173 -1296 2497 1505 -3091 -1820 2402 307 -2657
2154 -2657 1337 3845 -1963 -4721 1299 3761 -1255 -1685 2960 674 -4577 -931 4848 1101 -3499
2169 -3499 718 3015 -2641 -3567 3601 4371 -2670 -3152 2364 1231 -3150 151 4273 -69 -3961 215
2185 215 2672 -1463 -2030 2839 2437 -2994 -2656 1842 1363 -1586 169 2255 -771 -3113 -223 2013
$$ packed form
2076C874o257j142O344j80o223K053N793m049n684N502N505n700m288N332J475
2091B355n734J559P295k922q280K594P091k613m227M547K108o871k086P276K466
2106D558n200p74L055k611l076M949M387m313m344K486J959j965N45L156j010
2121A802l797k48K357O57j22N38o54j708k93J130J065N66p86j568K12J443p61
2138a67j302K001J926k688k448K600J561k656j23L793r92m596J271M222k095k964
2154b657L994K508n808k758O020K462n016m30M645k286n251L646N779l747m600
2169c499M217K297n656r26P168P70p041m82N516j133m381L301M122m342l892M176
2185B15K457m135n67M869m02n431L38M498m79k949J755K086l026k342K890K236
$$ plain form
2201 2013 246 -635 894 150 -2543 -1739 1912 2565 -70 -1750 -871 -170 -305 617 1954 984 -1779
2218 -1779 -2259 166 1689 871 433 638 -1124 -2604 -73 3270 1707 -1734 -1247 672 -325 -871 1729
2235 1729 2240 -1477 -2561 792 1669 -848 -397 1833 -78 -2783 -90 3109 328 -2887 -420 2194
2251 2194 -104 -1445 856 910 -2114 -1283 2446 1834 -1947 -1759 818 168 -1102 1290 2433 -1116
2267 -1116 -3617 -584 2617 1447 -301 -33 -837 -2452 -446 3379 2764 -1454 -2646 -366 362 98
2283 98 1780 2518 -966 -3927 -1357 2889 2474 -88 -550 -808 -2139 -710 3120 2872 -1517 -2969 -180
2300 -180 870 -40 988 1829 -1106 -3478 -522 2939 1433 -1117 -759 -569 -1542 121 2955 1350
2316 1350 -2828 -2711 789 1693 325 341 246 -1817 -2119 1138 2996 852 -1703 -1623 -798 105 1911 2601
$$ packed form
2201B013j767q81J529p44k693Q04L651O53k635j680Q79P01j35R22J337r70k763
2218a779m80K425J523q18m38K05j762j480K531L343j563l441M87J919r97n46K600
2235A729N11l717j084L353Q77k517M51K230j911k705K693L199k781l215K467K614
2251B194k298j341K301N4l024Q31L729o12l781J88K577o50j270K392J143l549
2267a116k501L033L201j170j748K68q04j615K006L825o15m218j192K280P28k64
2283I8J682P38l484k961K570M246m15k562m62k58j331J429L830k48m389j452K789
2300a80J050r10J028Q41k935k372K956L461j506k550L58J90r73J663K834j605
2316A350m178J17L500R04j368J6r5k063l02L257J858k144k555Q0Q25R03J806O90
$$ plain form
2334 2601 -168 -3129 -2180 1252 2713 1566 -298 -1743 -1933 -449 1937 2800 769 -2106 -2755 -590
2350 -590 1753 2393 1258 -823 -2741 -2281 1128 3573 1713 -1834 -2558 -1087 266 1589 2479 413
2366 413 -3057 -2972 694 2420 1318 274 -778 -2718 -2162 2058 3918 441 -2937 -2015 -117 605
2382 605 1764 2253 -757 -3625 -1491 2204 2237 516 -188 -1158 -2479 -446 3340 2965 -1158 -2851 -1178
2399 -1178 400 1436 2371 988 -2568 -3066 319 2727 1756 109 -1024 -2268 -1541 1499 3231 1030
2415 1030 -1891 -2570 -1249 806 2597 2064 -1124 -3273 -1810 1148 2362 1658 -334 -2445 -2371 194
2431 194 2342 1933 -19 -1708 -2423 -1063 2014 3195 632 -2414 -2533 -464 1414 2522 1648 -1390
2447 -1390 -3110 -1112 1852 2372 1057 -348 -1945 -2294 293 3015 2321 -823 -2330 -1601 -180 1788
$$ packed form
2334B601k769k961R49L432J461j147j864j445j90J484K386Q63k031k875o49K165
2350e90K343O40j135k081j918M60L409K445j860l547p24J471J353J323Q90k066
2366D13l470Q5L666J726j102j044j052j940N56M220J860l477l378R22J898P22
2382F05J159M89l010k868K134L695L3j721p04r70j321K033L786l75m123j693J673
2399a178J578J036R35j383l556m98L385K408r71j647j133j244P27L040J732k201
2415A030k921o79J321K055J791n33l188k149J463K958J214p04j992k111P4K565
2431A94K148m09j952j689p15J360L077J181k563l046j19K069J878J108q74l038
2447a390j720J998K964N20j315j405j597l49K587K722o94l144j507P29J421J968
$$ plain form
2463 1788 2832 627 -2741 -2711 289 2161 1712 399 -1133 -2430 -1364 1590 2674 645 -1512 -1977
2479 -1977 -1253 364 2330 2048 -1035 -2997 -1442 1087 1923 1361 -245 -1983 -2151 264 2271 1654
2495 1654 -411 -1585 -1633 -572 1362 2422 806 -1744 -2140 -401 1432 2111 1026 -1087 -2258 -907
2511 -907 1397 2069 861 -723 -1672 -1260 408 1879 1520 -385 -1734 -1481 -113 1602 1893 92 -1967
2528 -1967 -1860 17 1458 1525 289 -1332 -1862 -556 1281 1585 395 -932 -1441 -995 465 1756 1174
2545 1174 -776 -1856 -964 480 1442 1188 -305 -1635 -1295 427 1526 878 -206 -862 -1066 -342 996
2562 996 1447 339 -1048 -1208 -258 828 1272 725 -679 -1425 -487 931 1289 436 -589 -1020 -639 340
2580 340 965 746 -212 -1031 -873 80 920 759 -21 -754 -978 -357 695 1138 67 -1164 -940 137 559
$$ packed form
2463A788J044k205l368L0L000J872m49j313j532j297J066K954J084k029k157m65
2479a977P24J617J966k82l083j962J555K529Q36n62j606j738j68K415K007o17
2495A654k065j174m8J061J934J060j616k550l96J739J833O79j085k113j171J351
2511i07K304O72j208j584r49M12J668J471l59j905j349K53J368J715K91j801k059
2528a967J07J877J441O7j236j621n30J306J837L04j190j327n09M46J460J291n82
2545A174j950j080Q92J444R62k54j493j330L40J722J099o48j084o56k04P24J338
2562I96M51j108j387j60R50J086M44n47j404p46R38J418L58q53j025m31L81R79
2580C40O25k19r58q19J58R53Q40j61p80p33k24O21J052M43j071j231K24J077M22
$$ plain form
2599 559 355 198 -101 -752 -675 502 883 60 -286 -200 -369 -280 581 956 -201 -985 -112 776 262 -103
2619 -103 322 51 -529 -101 797 282 -553 -87 499 -56 -379 407 657 -475 -713 438 724 -208 -477
2638 -477 205 16 -426 141 660 -176 -808 38 602 -99 -543 54 308 -302 -412 221 305 -250 -247 102 176
2659 176 -208 -95 43 -135 -104 217 427 -143 -698 -125 628 504 -117 -259 7 -127 -48 665 777 -175 -928
2680 -928 -209 460 313 374 573 -232 -1239 -466 1298 1226 -315 -918 -332 -199 -118 933 1266 -602 -1698
2699 -1698 -391 954 437 22 526 -334 -1672 -632 1682 1399 -813 -1270 -252 -153 -150 1036 1114 -1006
2717 -1006 -1793 87 1302 224 -284 363 -271 -1380 19 2045 811 -1526 -1116 561 532 199 980
2734 980 395 -1613 -1488 1310 2022 -55 -1107 -303 -369 -593 1069 2128 123 -2332 -1488 911 1290
$$ packed form
2599E59k04j57k99o51P7J177L81q23l46Q6j69Q9Q61L75j157p84Q73Q88n14l65
2619a03M25k71n80M28Q98n15q35M66N86n55l23P86K50j132k38J151K86r32k69
2638d77O82j89m42N67N19q36o32Q46N64p01m44N97K54o10j10O33Q4n55LL49P4
2659A76l84J13J38j78L1L21K10n70n55N73P53j24o21j42K66j34P9P13J12r52p53
2680i28P19O69j47O1J99q05j007P73J764p2j541o03N86J33Q1J051L33j868j096
2699a698J307J345n17m15N04q60j338J040K314k83k212m57J018R9LJ186P8k120
2717a006p87J880J215j078n08O47o34j109J399K026j234k337M10J677k9l33P81
2734I80n85k008J25K798P12k077j052Q04o6k24J662J059k005k455Q44K399L79
$$ plain form
2751 1290 771 539 -673 -2191 -1261 1743 2466 144 -1722 -1294 -511 142 1368 1745 -301 -2409 -1662
2768 -1662 797 1757 932 -8 -950 -1811 -822 1666 2335 75 -1950 -1150 299 650 940 1105 -250 -1997
2786 -1997 -1080 1517 2023 55 -952 -619 -580 -169 1622 1978 -815 -2644 -663 1757 1186 115 -36
2803 -36 -849 -1872 -207 2627 1938 -1405 -2125 -422 285 479 1745 1386 -1906 -3329 -117 2793 1556
2820 1556 -491 -861 -1429 -1863 525 3246 1584 -2137 -2533 -278 642 818 1843 911 -2374 -2992 473
2837 473 2972 1472 -572 -949 -1247 -1223 944 2943 1124 -2140 -2049 283 1084 915 1030 333 -1793 -2024
2855 -2024 844 2684 821 -1351 -1190 -403 -117 955 1811 53 -2368 -1594 1128 1837 199 -511 -726
2872 -726 -1323 -742 1503 2246 -224 -2429 -1497 457 1136 1236 902 -999 -2833 -1013 2241 2507 -11
$$ packed form
2751A290n19k32j212j518R30L004P23k322j866M28P83O53J226L77k046k108P47
2768a662K459R60q25r40r42q61R89K488O69k260k025Q00J449L51K90J65j355j747
2786a997R17K597N06j968j007L33L9M11J791L56k793j829J981K420n71j071j51
2803c6q13j023J665K834o89l343p20J703P07J94J266l59l292j423L212K910j237
2820A556k047l70n68m34K388K721j662l721l96K255R20J76J025r32l285o18L465
2837D73K499j500k044l77k98K4K167J999j819l264R1K332Q01j69J15o97k126k31
2855b024K868J840j863k172J61P87K86J072Q56j758k421P74K722P09j638p10k15
2872g26n97N81K245P43k470k205R32J954O79J00l34j901j834J820L254K66k518
$$ plain form
2889 -11 -1553 -1282 -977 49 2158 2316 -641 -2948 -1497 1074 1816 1287 486 -1214 -2607 -808 2413
2906 2413 2578 -38 -1783 -1241 -440 432 1789 1821 -687 -2560 -1074 1345 1429 334 -19 -807 -1676 -481
2924 -481 1959 1771 -996 -1965 -291 627 253 573 740 -1019 -2040 122 2090 888 -1002 -849 -292
2941 -292 -569 407 2000 888 -2030 -2062 600 1678 709 200 -183 -1581 -1504 1108 2571 595 -1495
2958 -1495 -1097 -333 -49 1029 2011 330 -2159 -1754 746 1683 822 107 -515 -1467 -1001 1201 1997 278
2976 278 -1355 -1044 -120 254 779 1037 -101 -1545 -1121 666 1395 409 -550 -759 -642 -191 776 1111 -128
2995 -128 -1364 -912 635 891 125 -68 -266 -867 -627 866 1416 -156 -1263 -579 354 286 632 810 -391
3014 -391 -1620 -409 1421 1020 -306 -412 -167 -679 -216 1280 1254 -682 -1354 -161 519 201 543 628
$$ packed form
2889a1j542K71L05J026K109J58k957k307J451K571P42n29q01j700j393J799L221
2906B413J65k616j745N42Q01Q72J357L2k508j873J486K419Q4j095l53p88q69J195
2924d81K440j88k767r69J674R18l74L20J67j759j021K162J968j202j890J53N57
2941b92k77R76J593j112k918l2K662J078r69n09l83j398P7K612J463j976k090
2958a495L98P64K84J078R82j681k489M05K500R37q61p15o22r52M66K202P96j719
2976B78j633L11R24L74N25K58j138j444M24J787P29r86r59k09J17M51R67L35j239
2995a28j236M52J547K56p66j93j98o01K40J493N50j572j107O84R33o8L46J78j201
3014c91j229J211J830m01j326j06K45n12M63J496k6j936o72J193O80l18L42Q5
$$ plain form
3032 628 -688 -1485 -77 1354 600 -508 -408 -277 -598 5 963 553 -767 -807 37 133 4 414 264
3051 264 -700 -795 191 781 192 -382 -310 -98 -2 210 316 30 -351 -239 123 403 151 -131 -145 -155 -26 100
3073 100 444 299 -391 -474 264 549 86 -179 65 -95 -297 229 587 11 -542 -78 370 -111 -139 385 259
3094 259 -580 -358 485 330 -303 -182 166 -178 -376 354 348 -457 -451 364 319 -391 -187 339 14 -475 102 389
3116 389 -128 -310 164 212 -146 49 322 -81 -332 67 527 48 -207 -28 62 -56 155 378 -51 -315 -36
3137 -36 214 85 32 93 -58 -285 -17 345 226 -24 -223 -265 -164 298 560 -128 -537 -270 83 153 251 127
3159 127 -288 -577 -149 321 262 112 -11 -413 -580 37 674 344 -265 -427 -184 35 190 519 125 -581
3179 -581 -400 235 408 175 104 -20 -428 -182 476 605 68 -373 -236 -89 192 634 378 -423 -686 -87
$$ packed form
3032F28j316p97J408J431p54j108J00J31l21O03R58m10j320m0Q44R6j29M10j50
3051B64r64r5R86N90n89n74P2K12R6K12J06k86l81J12L62K80k52k82j4j0J29J26
3073A00L44j45o90q3P38K85m63k65K44j60k02N26L58n76n53M64M48m81k8N24j26
3094B59q39K22Q43j55o33J21L48l44j98P30oq05OQ15m5p10K04N26l25m89N77K87
3116C89n17j82M74M8l58J95K73m03k51L99M60m79k55J79R0j18K11K23m29k64K79
3137c6K50j29n3O1j51k27K68L62j19k50j99m2J01M62K62o88m09K67L53P0R8j24
3159A27m15k89M28M70n9j50j23m02j67O17O37l30o09j62K43K19J55L29l94p06
3179e81J81O35J73k33p1j24m08K46O58J29n37m41J37J47K81M42k56q01k63N99
$$ plain form
3199 -87 471 350 78 -170 -528 -426 243 601 331 -264 -559 -549 -67 590 666 -110 -709 -622 56 484 526 82
3221 82 -559 -649 -178 465 546 239 -280 -664 -438 358 698 395 -286 -622 -443 160 726 609 -176 -612 -234
3242 -234 189 499 472 128 -459 -588 28 563 486 37 -304 -553 -285 432 809 269 -646 -668 -164 397 477
3263 477 334 -353 -710 -374 392 573 159 -285 -566 -494 55 620 441 -136 -707 -533 122 647 600 -64 -675
3284 -675 -589 129 637 565 109 -468 -597 -156 540 706 319 -264 -665 -440 393 862 481 -328 -633 -386 104
3305 104 620 716 -49 -799 -544 302 407 344 209 -286 -784 -416 575 717 -82 -450 -291 -249 -25 532 548
3326 548 -480 -811 -32 389 142 -5 128 -270 -599 47 766 314 -465 -337 -9 -21 195 544 61 -771
3346 -771 -595 349 643 181 20 -180 -456 -253 479 760 56 -566 -341 62 222 361 423 -141 -589 -473
$$ packed form
3199h7N58j21k72k48l58J02O69L58k70n95k95J0M82O57P6p76n99Q7O78M28M2m44
3221H2o41r0M71O43Q1l07n19l84K26P96L40l03o81l36J79O03N66j17p85m36L78
3242b34M23L10k7l44n87j29O16N35p7m49l41k49K68P17L77n40r15k2N04N61Q0
3263D77j43o87l57L36P66J81m14m44k81P2N49N65j79n77n71J74O55N25m7o64o11
3284f75Q6P18N08p2m56n77j29M41O96J66l87n83m01K25Q33M69l81q09l05K47M90
3305A04N16R6p65p50K55Q46J05o3j35m95m98L68R91J42p99l68J59M2K24N57J6
3326E48j028l31P79M21k47j47J33l98l29O46P19m52p79J28L28j2K16L49m83q32
3346g71J76R44K94m62j61k00k76K03P32K81p04o22K25M03J60J39O2n64m48J16
$$ plain form
3366 -473 300 658 219 -205 -356 -222 -16 290 463 56 -478 -503 85 296 172 45 -35 -329 -449 211 630
3387 630 45 -587 -268 107 -44 -12 324 112 -553 -305 450 360 -157 -103 205 -194 -328 503 615 -211 -523
3408 -523 77 389 -14 43 356 -37 -497 25 726 169 -396 -149 217 -152 -175 379 393 -335 -545 47 381
3429 381 80 -88 49 -164 -420 10 504 186 -444 -382 74 27 -127 163 341 -175 -596 -117 460 173 -266
3450 -266 17 246 -356 -222 485 426 -333 -363 431 191 -436 -108 614 63 -547 60 593 -210 -536 432 596
3471 596 -387 -415 502 193 -582 -154 820 156 -744 -134 613 -45 -479 360 493 -625 -619 487 460 -373 -132
3492 -132 432 -163 -805 -15 698 57 -513 -90 238 -284 -203 360 347 -452 -311 199 165 -285 35 397 103
3513 103 -360 -117 301 164 -42 40 227 32 -243 -71 301 184 -51 10 181 -194 -360 215 632 36 -458
$$ packed form
3366d73P73L58m39m24j51J34K06L06J73m07n34k5N88K11j24j27q0k94j20O60M19
3387F30n85o32L19L75j51L2L36k12o65K48P55r0n17N4L08l99j34Q31J12q26l12
3408e23O00L12m03N7L13l93m60N22P01n57n65K47L66l69k3N54J4p28k10N92L34
3429C81l01j68J37k13k56M30M94l18o30O2M56m7j54K90J78n16m21M79N77k87m39
3450b66K83K29o02J34P07n9p59l0P94k40o27L28P22n51o10O07N33q03l26R68J64
3471E96r83k8R17l09p75M28R74o64r00O10P47o58m34Q39J33j118OJ106k7q33K41
3492a32N64n95o42P90P13o41n70M23L28n22Q1N63j3p99J41N10l4m50L20L62k94
3513A03m63K43M18j37k06Q2J87j95k75J72L72j17k35O1J71l75j66N75M17n96m94
$$ plain form
3534 -458 -105 279 -264 -236 574 397 -508 -491 262 235 -293 110 551 -322 -940 160 838 -132 -557 264 300
3555 300 -724 -403 860 534 -727 -412 500 -99 -633 416 846 -425 -860 319 659 -442 -355 634
3573 634 350 -756 -190 689 98 -587 114 612 -233 -601 332 564 -292 -327 481 313 -509 -326 454 257
3593 257 -291 21 328 -294 -531 171 476 7 -410 -5 78 -296 -156 412 354 -285 -535 -93 222 5 42
3614 42 210 -110 -476 -220 350 350 -118 -170 117 -175 -377 212 556 48 -473 -146 264 -49 -109 296 342 -395
3636 -395 -443 349 344 -163 -99 441 40 -475 -59 549 116 -411 3 340 -105 -396 254 348 -292 -310 408 244
3658 244 -479 -263 482 128 -522 -127 413 -150 -535 39 483 -143 -429 146 235 -396 -251 523 282 -501
3678 -501 -308 356 98 -304 85 465 -193 -570 101 463 27 -155 242 136 -431 -181 560 423 -377 -264
$$ packed form
3534d58L53L84n43K8Q10j77r05J7P53k7n28M03M41q73o18J100O78r70m25Q21L6
3555C00j024L21J263l26j261L15R12n99n34J049M30j271m35J179L40j101Q7R89
3573F34k84j106N66Q79n91o85P01M98q45l68R33K32q56l5Q08j68q22J83P80j97
3593B57n48L12L07o22k37P02L05m69m17M05Q3l74J40N68n8o39k50M42L15k17L7
3614D2J68l20l66K56N70%m68n2K87k92k02N89L44n08n21L27M10l13o0M05M6p37
3636c95m8P92nn07O4N40m01n15M16O08m33n27M14L37m45k91O50R4o40j8P18j64
3658B44p23K16P45l54o50L95N40n63l85N74M44o26k86N75Q9o31J45P74k41p83
3678e01J93O64k58m02L89L80o58l77O71L62m36j82L97j06n67K50P41j37q00J13
$$ plain form
3698 -264 215 -9 -210 243 408 -169 -449 -16 265 83 10 161 -35 -401 -111 411 236 -178 -266 1 -73
3719 -73 -167 200 266 -95 -309 -69 121 94 56 25 -140 -244 -108 213 217 -59 -202 -115 160 133 97 135 25 -228
3743 -228 -22 290 291 -43 -82 4 -63 -2 237 300 -44 -394 7 393 200 -102 -47 -22 -273 -37 443 276 -213
3766 -213 -352 -55 55 -56 291 251 -354 -569 54 426 182 -144 -67 -201 -366 89 527 173 -384 -337 -17
3787 -17 30 95 296 59 -488 -507 152 558 129 -98 -148 -337 -161 352 507 65 -469 -228 124 157 283 239
3809 239 -103 -466 -267 312 439 116 -129 -259 -296 10 457 370 -216 -451 -229 105 255 242 39 -332 -444
3830 -444 -80 317 281 42 -308 -378 -243 230 428 91 -330 -403 -238 114 400 204 -200 -403 -230 107 345
3851 345 209 -62 -415 -309 80 485 322 -60 -248 -347 -95 409 529 6 -497 -317 64 315 398 276 -223
$$ packed form
3698b64M79k24k01M53J65n77k80M33K81j82p3J51j96l66K90N22j75m14q8K67p4
3719g3r4L67O6l61k14K40J90k7l8l1j65j04J36L21Mk76j43Q7K75k7l6L8j10k53
3743b28K06L12Jl34l9Q6o7O1K39O3l44l50M01L86j93l02N5K5k51K36M80j67m89
3766b13j39K97J10j11L47m0o05k15O23L72k44l26P7j34j65M55M38l54n57M7L20
3787a7M7O5K01k37n47j9O59M06m29k27n0j89J76N13J55m42n34K41L52L3J26m4
3809B39l42l63J99N79J27l23k45j30l7L06M47q7n86k35K22L34J50j3k03l71j12
3830d44L64L97l6k39l50p0J35M73J98l37m21p3J65L52K86j96m04k03J73L37K38
3851C45j36k71l53J06L89M05j63l82j88r9K52N04J20n23n03J80L81K51Q3j22m99
$$ plain form
3872 -223 -549 -96 319 478 134 -185 -385 -334 137 532 360 -231 -580 -252 119 325 300 -5 -415 -510 -60
3893 -60 375 353 -28 -267 -370 -256 236 518 185 -402 -446 -137 148 383 281 -121 -385 -305 255 340 228 -11
3915 -11 -290 -310 26 425 415 -73 -362 -326 56 318 491 138 -350 -405 -94 324 416 119 -259 -413 -257 191
3937 191 390 232 -181 -454 -323 128 408 248 -70 -431 -365 30 343 258 -78 -340 -333 30 283 292 26 -287
3959 -287 -330 -123 233 313 120 -210 -301 -180 226 316 199 -159 -398 -169 172 398 151 -91 -263 -185 63 325
3981 325 293 -13 -229 -227 -1 199 332 146 -315 -375 -64 220 276 29 -207 -209 -161 107 317 199 -154 -302 -187
4004 -187 143 175 121 47 -250 -299 17 286 242 -69 -212 -160 -30 140 309 97 -243 -302 56 199 101 86 8
4027 8 -136 -245 108 363 137 -120 -86 55 28 37 163 15 -211 -149 268 213 -48 -6 83 -86 -202 143 226 -59
$$ packed form
3872b23l26M53M15J59l44l19k00N1M71L95j72n91l49L28L71K06k5l05m10r5M50
3893f0M35k2l81k39j03J14M92K82l33n87m4L09K85K35j02m02k64Q0N60Q5j12k39
3915a1k79k0L36L99j0m88k89L6L82K62J73l53m88n5L11M18R2k97l78j54J56M48
3937A91J99j58m13k73J31M51K80j60l18l61O6L95L13q5l36k62PL63K53Rk66l13
3959b87m3K07L56Q0j93l30r1J21M06R0j17l58k39K29L41K26k47k42j72P8K48K62
3981C25l2l06k16KK26K00J33j86m61o0L11K84N6k47k36kM8K68K10j18l53j48J15
4004a87L30L2n4p4k97m9L16K69m4l11j43N2J30J70J69k12l40n9L58J43r8j5p8
4027Hj44j09L53K55k26k57L4J41k7RJ26j48k26O2M17n5k61M2Q9j69j16L45Q3k85
$$ plain form
4051 -59 -230 -57 120 -62 -29 131 -102 -235 -92 140 78 -93 -50 27 -116 -149 110 176 -60 -89 -83 57 7 -24
4075 -24 108 39 -140 -101 130 180 -2 -60 29 32 -94 -3 161 123 -91 -124 64 38 -61 65 203 -92 -230 5
4099 5 175 -44 -36 87 137 -294 -156 276 162 -138 -129 -6 -139 -240 203 300 -93 -360 -33 111 -111 -7 271
4122 271 90 -328 -157 302 171 -246 -44 67 -157 -208 198 341 -99 -242 69 231 -88 -40 217 -95 -254
4143 -254 -8 305 200 -143 -72 26 30 2 222 163 -268 -315 88 374 104 -184 -115 -31 -144 0 368 193 -326
4166 -326 -424 -9 246 61 196 51 -369 -475 72 538 177 -304 -212 -82 -250 1 518 222 -463 -516 202
4187 202 363 15 53 102 -374 -532 209 760 149 -382 -174 -1 -152 149 525 95 -605 -318 307 269 -56
4208 -56 16 32 -379 -251 347 539 -166 -419 -154 25 46 200 286 -200 -527 -131 422 322 -67 -245 -231 -307
$$ packed form
4051e9j71J73J77j82L3J60k33j33J43K32o2j71M3P7j43l3K59O6k36k9OJ40n0l1
4075b4J32o9j79L9K31N0j82n8Q9Lj26R1J64l8k14l3J88k6r9J26J38k95j38K35
4099EJ70k19QJ23N0m31J38M32j14l00RJ23j33j01M43R7l93k67L27J44k22J04K78
4122B71j81m18J71M59j31m17K02J11k24n1M06J43m40j43L11J62l19M8K57l12j59
4143b54K46L13j05l43P1R8Mk8K20n9m31m7M03K86k70k88O9Q4j13J44L68j75n19
4166c26r8M15K55j85J35j45m20j06N47M66l61m81R2J30j68K51N17k96o85n3P18
4187B02J61l48L8M9m76j58P41N51o11n31K08J73j51L01L76m30p00K87O25l8l25
4208e6P2J6m11J28N98J92p05k53K65J79K1J54Q6m86l27L96N53j00l89j78J4p6
$$ plain form
4230 -307 6 431 333 -248 -611 -218 277 351 151 -9 -282 -520 -55 575 521 -142 -481 -352 28 190 416
4251 416 454 -206 -695 -245 536 500 69 -92 -177 -427 -101 651 572 -273 -535 -112 253 105 218 373 -327
4272 -327 -729 -88 675 282 -298 -211 -84 -220 49 658 269 -567 -548 189 305 53 73 70 -419 -432 287 668
4294 668 92 -468 -291 -76 -37 298 520 14 -732 -429 361 538 122 -62 -135 -479 -182 519 664 42 -544
4315 -544 -356 13 199 332 452 -96 -621 -402 395 607 123 -209 -350 -259 -54 408 507 -30 -580 -312 167
4336 167 338 200 40 -148 -544 -264 418 511 -50 -419 -230 -17 58 238 251 -259 -583 -161 354 329 38
4357 38 -118 -219 -240 16 503 361 -169 -500 -139 184 296 288 64 -285 -441 75 542 376 -203 -239 -148 -64
4379 -64 135 430 273 -337 -589 -46 340 214 -29 -92 -279 -464 38 584 345 -366 -372 -68 33 77 342 138
$$ packed form
4230c07L13M25r8n81l63L93M95P4k00j60k73k38M65O30n4o63l39J29L80J62K26
4251D16L8o60m89M50P81l6m31j61q5k50L26P52p9q45k62M23L65j48J13J55p00
4272c27m02O41P63l93n80Q7J27j36K69O09l89q36J9P37J16k52K0lm89j3P19L81
4294F68n76n60J77K15L9L35K22n06p46L03P90J77m16j84p3l44K97P01J45o22n86
4315e44J88L69J86J33J20n48n25K19P97K12m84l32j41R1K05M62R9n37n50K68M79
4336A67J71j38j60j88l96K80O82R3n61l69J89K13P5J80J3n10l24M22N15k5k91
4357C8j56j01k1K56M87j42n30l31L61L23J12qk24l49j56N16M67j66n79l6R1Q4
4379f4J99K95j57o10k52N43L86j26k43o3j87j85N02N46k39p11oL04J01M4K65k04
$$ plain form
4401 138 -462 -510 138 422 117 -62 61 -263 -390 160 548 118 -451 -255 78 48 107 322 12 -355 -211
4422 -211 360 354 7 -91 19 -190 -25 299 322 -126 -376 -79 112 181 88 78 -179 -327 -42 314 249 -5 -172
4445 -172 -219 -131 79 231 106 -186 -314 -139 97 220 80 -177 -284 -167 -23 171 216 -56 -313 -195 113
4466 113 185 29 -20 -94 -178 -129 200 345 35 -209 -116 64 7 131 172 -37 -237 -20 285 175 -54 -49 -9 -130
4490 -130 -72 223 213 -220 -145 54 50 -51 114 100 -177 -220 98 224 -44 -143 25 -68 -124 57 275 -8 -273
4513 -273 -47 87 -6 -43 44 -17 -228 -75 135 119 -70 -48 -32 -61 -16 166 111 -32 -92 -16 112 -6 104 43
4537 43 -24 -53 -1 48 60 -61 -10 -3 -25 -41 98 46 -70 12 -48 48 11 11 -17 30 12 6 5 -77 15 -43 -49 -24 29 -28 -109
4568 -109 -13 -34 -42 -72 -30 -100 -66 -29 11 -27 -7 -93 -30 -24 -92 40 48 -46 -33 102 40 -8 -6 47 -75 -7 78 102 -51 -68
$$ packed form
4401A38o00m8O48K84l05j79J23l24j27N50L88m30n69J96L33l0N9K15l10l67J44
4422b11N71ol47r8J10k09J65L24K3m48k50K97J91O9r3j0k57j48K85L56o5k54j67
4445a72m7Q8K10J52j25k92j28J75K36J23j40k57j07J17J44J94M5k72k57J18L08
4466A13P2j56m9p4q4M9L29J45l10k44R3J80n7J24M1k09k00K17L05j10k29NM0j21
4490a30N8K95j0m33P5J99mj01J65j4k77m3L18J26k68r9J68r3n6J81K18k83k65
4513b73K26J34r3l7Q7o1k11J53K10j6j89K2J6k9M5J82n5j43o0P6J28j18J10o1
4537D3o7k9N2M9J2j21N1Pk2j6J39n2j16Q2o0R6l7%k8M7j8ojq2R2n8oK5N3n7q1
4568a09R6k1ql0M2p0L4L7M0l8K0q6O3Oo8J32Qr4J3J35o2m8KN3j22O8Q5K4j53j7
$$ plain form
4598 -68 30 42 -2 7 76 20 -100 88 98 65 -55 -48 43 -78 38 135 15 -111 -61 70 43 -65 -39 -92 -118 -88 42
4625 42 15 -79 -54 13 34 0 77 12 -44 -136 -46 132 28 -28 -32 -76 -12 22 127 68 -120 -144 43 78 95 99 49 -76
4653 -76 -105 29 146 88 -6 -72 -109 -22 107 127 10 -93 -37 -38 -23 25 63 -11 -79 -78 61 47 -18 -41 -84 -46 17 53
4681 53 -3 -55 -37 -68 -23 84 -43 -90 -85 -59 73 30 26 51 -88 -155 17 118 67 -53 -55 -84 -65 77 238 -12 -125
4708 -125 -40 75 89 126 104 52 -60 -103 115 135 -45 -67 43 -63 -39 104 191 -94 -188 27 68 -53 30 64 -74
4733 -74 -118 -23 143 -1 -144 -85 23 -30 36 125 77 -168 -216 59 123 8 -37 30 -116 -48 38 92 -24 -104 -69 51
4759 51 50 41 107 36 -103 -72 147 157 38 -111 -34 -16 -26 73 77 30 -155 -29 116 133 -19 72 17 -130 -57 13 181
4786 181 -17 -155 -104 11 15 23 47 21 -203 -141 98 77 -30 -50 -32 -24 -68 42 130 -90 -186 46 36 -4 -33 62 -63
$$ packed form
4598f8R8J2m4RO9n6j20J88J0l3j20PR1j21J16R7j20j26N0J31k7j08K6n3k6L0J30
4625D2k7r4K5O7K1l4P7o5n6r2R0J78j04n6mm4O4L4J05n9j88k4J87L5J7Mn0j25
4653g6k9J34J17n8r4o6l7Q7J29K0j17j03N6jJ5M8L8p4o8JJ39j4o5k3m3L8O3L6
4681E3n6n2J8l1M5J07j27m7NK6J32m3mK5j39o7J72J01n1j20kk9J9J42J61k50j13
4708a25Q5J15J4L7k2n2j12m3K18K0j80k2J10j06K4J43Q7k85r4K15M1j21Q3L4j38
4733g4m4R5J66j44j43N9J08n3O6Q9m8k45m8K75O4j15m5O7j46O8Q6N4j16q0L5J20
4759E1jrO6p1j39L1K19J0j19j49P7J8j0R9Mm7j85J26J45J7j52R1n5j47P3P0J68
4786A81j98j38N1J15MQK4k6k24O2K39k1j07k0J8Qm4J10Q8k20r6K32j0m0k9R5j25
$$ plain form
4813 -63 -136 70 127 37 -133 -72 78 75 3 83 117 -96 -160 86 169 29 -54 32 -53 -83 51 230 45 -141 -122 48
4839 48 -35 18 83 97 -133 -161 110 159 22 -168 -56 10 -103 -35 143 17 -147 -129 109 99 -74 43 78 -161
4863 -161 -164 97 217 -85 -132 36 108 -44 -26 145 -31 -153 18 221 103 -111 -100 96 46 -76 157 194 -98
4886 -98 -190 24 156 -38 -14 76 -35 -199 -17 262 112 -118 -127 85 -57 -89 159 152 -179 -219 55 100 -38 -68
4910 -68 64 -17 -195 -46 254 105 -173 -81 114 -10 -60 155 160 -114 -191 47 178 5 -59 86 38 -65 -19
4933 -19 201 45 -186 -80 127 46 -50 75 129 -94 -127 90 179 14 -107 -10 52 -45 -25 128 48 -207 -141 144
4957 144 24 -69 -1 61 -44 -137 75 212 -18 -179 -47 93 -35 -27 185 38 -186 -153 162 181 -49 -89 111
4980 111 -74 -169 42 228 46 -125 22 141 -41 -31 128 148 -214 -99 217 123 -95 -6 173 -104 -191 70
$$ packed form
4813f3p3K06N7r0j70O1J50lp2Q0L4k13o4K46Q3j40q3Q6q5l0J34J79j85j86J9J70
4839D8q3N3O5J4k30k8K71M9j37j90J12O6j13O8J78j26j64J8K38j0j73J17L5k39
4863a61lK61J20l02m7J68P2j52J8J71j76j22J71K03j18k14J1J96n0j22K33L7k92
4886i8r2K14J32j94K4R0j11j64J82K79j50k30rK12j42l2K48pl31m0K74M5j38l0
4910f8J32q1j78J49L00j49k78R2J95j24n0K15Nk74p7K38J31j73o4J45m8j03M6
4933a9K20j56k31J06K07q1r6J25N4k23l3K17Q9j65j21R7O2r7K0J53q0k55O6K85
4957A44j20r3O8O2j05r3K12J37k30j61J32J40j28QK12j47k24L3L15J9k30m0K00
4980A11j85r5K11J86j82j71J47J19j82J0J59K0l62J15L16r4k18Q9J79k77q7K61
$$ plain form
5002 70 202 -34 -189 2 45 -70 -49 139 57 -118 -136 86 31 -122 -6 157 -43 -134 73 234 -9 -172
5024 -172 47 129 -42 -15 80 63 -140 -83 183 136 -34 -107 84 -15 -58 108 173 -39 -230 -39 154 33 13 52
5048 52 25 -177 -71 206 160 -49 -167 -23 10 -62 90 147 12 -232 -53 75 52 -31 50 -88 -231 -108 207
5071 207 215 -62 -162 -28 -20 -33 72 226 -60 -250 -88 187 131 -52 -51 21 -131 -107 196 181 -91 -181 19 111
5095 111 71 70 96 -47 -263 -25 279 118 -90 -62 3 -72 48 204 129 -165 -269 -49 152 122 43 37 -184 -185 32
5120 32 300 160 -116 -211 -82 -25 45 178 103 -256 -341 53 196 190 15 -80 -245 -189 124 268 61 -99 -187 -28
5144 -28 18 175 279 40 -231 -231 24 268 149 -2 -134 -142 -16 249 249 19 -189 -192 -41 125 223 28 -109 -196
5168 -196 -142 217 243 97 -112 -240 -104 100 175 90 -75 -338 -220 52 248 144 -79 -290 -225 -62 154 322
$$ packed form
5002G0J32k36j55J91M3j15K1J88q2j75j8K22n5j53J16J63k00r1K07J61k43j63
5024a72K19Q2j71K7R5j7k03N7K66m7j70p3J91r9m3J66O5k12j91J91J93j21k0L9
5048E2k7k02J06K77m6k09j18J44L3p2J52N7j35k44J79J28k3q3Q1j38j43J23L15
5071B07Qk77j00J34Qj3J05J54k86j90J62K75n6j83JP2j52K4L03j5k72r0K00R2
5095A11m0jK6j43k16K38L04j61k08K8O5p5J20J56p5k94j04K20K01l0p9ok21jK17
5120C2K68j40k76r5J29N7P0J33p5l59q5L94J43oj75r5j65N6L13J44k07j60q8J59
5144b8M6J57J04k39k71%K55K44j19j51j32qJ26K65%k30k08lJ51J66R8j95j37q7
5168a96N4L59K6j46k09j28J36K04P5q5j65k63J18K72J96j04k23k11O5J63K16J68
$$ plain form
5190 322 -16 -336 -294 -66 237 190 99 -111 -288 -196 216 261 67 -138 -217 -129 109 306 311 -52 -345 -174 73
5213 73 204 209 11 -230 -304 21 316 285 20 -193 -306 -86 195 331 165 -205 -331 -54 244 161 137 -75
5235 -75 -306 -223 98 328 129 -120 -305 -160 41 226 277 -56 -282 -309 16 268 231 -9 -247 -328 -91 175
5257 175 308 106 -203 -294 -106 187 335 149 -190 -252 -162 153 350 186 -142 -260 -193 69 332 276 3 -276
5279 -276 -246 49 295 276 -5 -212 -293 -100 210 367 160 -351 -299 -61 161 307 121 -130 -345 -202 117
5300 117 271 174 -111 -364 -226 21 250 196 -87 -334 -184 6 222 254 8 -210 -252 -72 218 266 68 -191
5322 -191 -246 -28 235 377 133 -80 -330 -99 146 247 169 -141 -221 -143 91 281 258 6 -253 -139 93 235
5344 235 268 49 -189 -327 -35 183 217 51 -154 -213 -113 59 177 59 -145 -287 -164 120 159 57 -45
$$ packed form
5190C22l38l20M2K28L03m7r1k10j77R2M12M5j94k05p9Q8K38J97Nl63k93J71K47
5213G3J31Nj98k41p4L25K95l1k65k13j13K20K81J36j66l70j26K77K98q3k4k12
5235g5k31Q3L21K30j99k49j85J45K01J85N1l33k26k7L25K52l7k40k38q1K37K66
5257A75J33k02l09r1J88K93J48j86l39o2R0L15J97j64l28j18O7K62K63n6k73k79
5279b76L0K95K46j9k81k07q1J93L10J57k07n11N2K38K22J46j86k51k15J43L19
5300A17J54r7k85k53J38K47K29n4k83k47J50J90K16L2k46k18m2J80K90M8j98k59
5322a91n5K18K63J42k44k13k50K31K45J01p8l10q0P8K34J90k3k52k59J14K32J42
5344B35L3k19k38j38K92K18L4j66k05n9J00J72J18j18k04j42J23K84L9j02j02
$$ plain form
5365 -45 -291 -260 85 217 131 17 -144 -88 28 235 188 63 -145 -116 40 152 193 145 -78 -239 -21 122 200
5388 200 95 -70 -82 10 103 234 62 -34 -189 -102 24 107 154 -18 -152 -129 5 165 161 -53 -104 -155 -41 124
5412 124 83 11 -37 -171 -92 59 134 62 -105 -91 -97 9 88 80 6 -167 -80 132 80 -25 -9 -36 -149 -50 78 103
5438 103 -42 -111 61 32 -10 93 100 -45 -144 18 119 24 11 82 14 -111 -41 86 65 -78 -1 8 -5 -49 29 63
5464 63 -14 -28 -10 -5 -33 -60 -13 30 -80 -47 58 20 26 2 -6 -67 -84 -12 64 62 -16 -38 8 11 12 72 96 -4 -93 72 128
5495 128 31 -36 34 21 -78 54 191 135 -129 -156 -24 71 43 87 74 -73 -170 96 295 12 -66 -96 -73 -127 90
5520 90 208 70 -159 -239 -25 85 69 90 -30 -231 -190 116 210 59 -147 -91 -131 -76 74 248 58 -243 -172
5543 -172 106 117 126 31 -45 -240 -124 122 222 90 -99 -146 -25 94 141 238 -28 -226 -140 171 245 91 -93
$$ packed form
5365d5k46L1L45J32q6j14j61N6J16K07m7j25k08K9J56J12M1m8k23j61K18J43P8
5388B00j05j65j2R2R3J31j72r6j55Q7J26Q3M7j72j34K3J34J60mk14n1n1J14J65
5412A24m1p2m8j34P9J51P5p2j67J4oJ06P9qp4j73Q7K12n2j05J6k7j13R9J28K5
5438A03j45o9J72k9m2J03Pj45r9J62J01r5j3P1o8j25P0J27k1j43P7Rj3m4P8L4
5464F3p7j4J8Nk8k7M7M3j10L3J05l8Ok4qo1j7P2P6kp8k2M6LJO0K4j00q9J65N6
5495A28r7o7P0j3r9J32J37n6k64k7J32R5k8M4j3j47r7K66J99k83p8l0K3n4K17
5520I0J18j38k29q0K14J10j6K1j20k01M1L06R4j51k06N6m0N5J50J74j90l01P1
5543a72K78J1Rr5p6j95J16K46J00j32j89m7J21J19M7R7k66j98Q6L11P4j54j84
$$ plain form
5566 -93 -137 -188 -108 233 296 -34 -359 -147 135 134 72 97 -82 -344 -148 257 217 -16 -181 -177 -129 -14 222 238 -141
5591 -141 -398 -85 132 226 110 -56 -244 -324 -37 385 273 -130 -265 -180 -38 156 328 180 -270 -395 -35
5612 -35 286 277 35 -111 -251 -197 112 340 173 -176 -241 -133 124 165 218 37 -259 -285 55 406 272 -123 -250
5635 -250 -213 -55 209 365 114 -348 -434 24 308 182 68 -110 -383 -242 169 454 142 -269 -352 -143 68
5656 68 299 308 -85 -469 -373 123 356 175 -13 -181 -334 -84 305 422 43 -330 -375 17 238 291 152 -211
5678 -211 -446 -274 271 419 88 -159 -258 -178 88 320 339 -66 -514 -271 138 261 172 -31 -241 -406 -93
5699 -93 389 354 19 -268 -239 -20 184 318 176 -227 -400 -173 280 370 77 -55 -227 -273 77 454 288 -209
5721 -209 -404 -145 146 183 248 83 -288 -322 50 420 315 -23 -189 -210 -140 144 427 181 -278 -459 -107 300
$$ packed form
5566i3m4n1Q0L41O3l30l25K12K82jo2K5j79k62J96M05m0k33j65MM8J15K36J6l79
5591a41k57L13K17R4j16j66j88q0K87M22j12m03j35Q5J42J94J72j48m50j25L60
5612c5L21rk42j46j40N4L09K28j67l49o5J08K57M1N3j81k96k6L40L51j34l95j27
5635b50L7J58K64J56k51m62q6M58K84j26j14j78k73J41M11K85l12m11q3K09K11
5656F8K31Rl93l84R6M96K33j81j88j68j53K50L89J17l79l73m5L92K21N3j39l63
5678b11k35J72N45J48l31k47r9Q0K66K32J9m05m48K43M09J23q9k03k10j65L13
5699i3M82l5l35k87K9K19K04J34j42m03j73K27M53R0k93j32j72m6L50L77j66m97
5721b09j95K59K91L7O5j65l71l4L72L70j05l38j66k1P0K84K83k46m59j81L52M07
$$ plain form
5743 300 314 177 -44 -387 -349 214 426 204 -242 -281 -210 -18 251 331 10 -368 -355 78 375 230 -47 -214
5765 -214 -302 -96 270 360 117 -303 -269 -32 171 270 197 -42 -284 -140 182 382 139 -138 -148 -169 -38 241
5787 241 280 19 -341 -252 96 289 134 14 -158 -235 -121 208 213 17 -198 -201 -56 133 225 110 -196 -435 -124
5810 -124 260 263 102 -146 -186 -214 -6 322 246 -81 -264 -171 59 221 168 57 -212 -218 -19 290 195 42 -112
5833 -112 -135 -83 142 261 160 -160 -247 -48 107 202 141 -50 -139 -185 90 222 58 -67 -123 -85 -18 135 177 55
5857 55 -156 -164 -52 122 127 -13 -46 -155 -83 134 176 123 -182 -151 -30 37 79 67 -38 -146 -104 66 207 40 46
5882 46 -113 -57 -51 105 116 14 -59 -67 83 96 103 34 -60 -112 -7 54 146 83 -8 -57 -14 37 73 28 54 -57 -108 130
5910 130 24 -10 25 1 -50 -62 71 -8 16 -81 -78 -3 17 22 29 -15 -28 -51 32 -37 -80 -41 45 50 -17 -12 75 -14 -79 86 68
$$ packed form
5743C00J4j37k21l43L8N63K12k22m46l9P1J92K69Q0l21l78J3M33K97j45k77j67
5765b14q8K06L66R0k43m20L4K37K03R9p3k39k42J44L22K00k43k77j0k1J31K79
5787B41L9k61l60Q9L48J93j55j20j72p7J14L29Nj96k15lJ45J89R2j15l06k39L11
5810a24L84Lj61k48m0k8K08L28p6l27j83R3K30J62n3j11k69oJ99L09r5j53j54
5833a12k3N2K25J19j01l20q7J99J55R5o1j91q9m6K75J32j64j25n6L8O7J53M2j22
5857E5k11qJ12J74Nj40l3j09P2K17M2n3l05L1J21O7M2j2j05j08M2J70J41j67O
5882D6j59N6OJ56J1j02p3qJ50J3Po9r4n2J05O1R2o3r1m9M3N1L6m5K6j11n1K38
5910A30j06l4L5k4n1j2J33p9K4r7LP5K0NPm4j3k3Q3o9m3L9Q6No7NQ7q9o5J65j8
$$ plain form
5941 68 10 15 58 53 -63 -28 64 0 -42 78 80 44 -112 12 45 18 82 96 34 -76 -27 1 39 31 -35 -45 25 -33 102
5970 102 13 -56 -119 -51 35 62 -2 -42 -76 -80 9 39 65 -64 -66 -87 -42 123 75 37 -42 -94 -28 77 76 64 -10 -38 40 102
6000 102 114 62 0 -172 -125 43 156 131 0 -68 -130 12 125 93 -10 -109 -87 -53 80 109 4 -115 -150 -73 71
6025 71 150 37 -134 -135 -106 2 111 78 -96 -244 -31 31 154 170 -16 -203 -181 -6 135 197 -1 -90 -139 -73
6049 -73 156 166 11 -112 -147 -70 166 171 77 -79 -234 -78 95 259 196 -71 -158 -122 68 280 142 4 -204
6072 -204 -184 36 167 165 41 -103 -223 -24 172 244 44 -126 -207 -42 124 224 102 -152 -238 -139 76 221
6094 221 31 -130 -210 -170 73 250 144 -44 -152 -145 27 214 249 21 -144 -147 -34 261 258 28 -153 -181 -100 96
6118 96 208 183 -119 -218 -107 163 224 30 -21 -151 -183 0 278 242 -42 -224 -122 4 201 209 -16 -178 -247
$$ packed form
5941F8n8NM3nj16L5R2o4m2J20Kl6j56J24L3k7O4J4o2j10M9K8L8qo6j0P0n8J35
5970A02q9o9o3O8Q6K7o4m0l4mQ9L0K6j29kk1M5J65m8l8p9n2O6J05jj2p4k8P8O2
6000A02J2n2o2j72M7J68J13k5j31o8o2J42J13l2j03r9K2L4J33K9j05j19l5P7J44
6025G1P9j13j71jK9J08J09l3j74j48K13O2J23J6j86j87K2J75J41O2j98q9m9O6
6049g3K29J0j55j23l5P7K36Nr4j56j55J56J73J64o3k67q7L6J90K12j38j38k08
6072b04K0K20J31kj24j44j20J99J96P2k00j70q1J65J66J00j22k54q6R9K15J45
6094B21j90j61q0M0K43J77j06j88j08PJ72J87L5k28j65lJ13K95lk30j81k8Q1J96
6118I6J12k5l02r9J11K70O1j94n1j30l2J83K78l6k84j82J02J26J97Qk25j62o9
$$ plain form
6141 -247 -49 191 201 62 -155 -244 -126 135 238 116 -127 -194 -109 97 177 147 -16 -220 -214 73 267 157 -51
6164 -51 -211 -170 17 202 227 24 -251 -141 -4 161 183 35 -51 -247 -111 124 248 90 -195 -178 -127 56
6186 56 198 114 -138 -223 -137 54 211 118 -27 -223 -171 -2 183 184 17 -234 -174 -13 110 162 109 -159 -264 -114
6210 -114 140 194 37 -161 -179 -157 21 188 139 -89 -238 -158 63 197 165 9 -137 -132 58 204 156 12 -72
6233 -72 -65 -56 97 203 61 -145 -165 -28 150 108 43 -23 -83 -147 41 222 39 -125 -216 -74 15 116 33 7 -177
6258 -177 -175 74 147 50 -69 -108 -166 -40 64 239 51 -137 -205 28 104 127 72 20 -152 -61 116 116 145 -64 -67 1
6284 1 36 54 175 0 -140 -143 90 69 54 5 -14 -123 -57 50 175 37 -69 -59 38 8 87 106 -58 -183 -104 102
6310 102 62 -26 -13 -48 -64 -59 78 136 -80 -86 -23 40 -9 5 0 -14 -82 -8 62 120 -42 -41 -77 -2 41 78 117 -58 -84 -38
$$ packed form
6141b47J98K40J0j39k17q9J18K61J03j22k43o7Q5K06Q0l0j63k04OK87J94j10k08
6164e1j60M1J87J85K5k03k75J10J37J65K2j48q6j96J36K35J24j58k85J7N1J83
6186E6J42q4k52q5Q6J91J57r3j45j96N2J69J85Jj67k51O0J61J23N2n3k68j05J50
6210a14K54N4j57j98j8K2J78J67m9k28j49Q0K21J34l2j56j46NJ90J46m8j44q4
6233g2PRJ53J06j42k06k0J37J78m2o5o6o0o4J88J81j83j64r1J42Q9J01q3k6j84
6258a77KK49P3r7j19l9n8J26J04J75j88j88o8K33P6K3n5n2j72R1J77%K9k09lO8
6284AL5J8J21j75j40lK33k1j5m9j9j09O6J07J25j38j06J0R7l0P9J9j64j25P9K06
6310A02m0q8J3l5j6NJ37N8k16oO3O3m9J4nj4o8P4P0N8j62Jl6P5M3L7L9j75k6M6
$$ plain form
6340 -38 63 100 37 14 -16 -80 -21 133 140 -91 -63 19 44 60 11 67 -68 -159 25 93 -7 -44 -36 -7 -44 -92 102 62
6368 62 -88 -40 1 7 -133 -5 42 -21 -100 -12 62 -44 -71 77 52 -30 -31 37 33 -59 5 82 34 -42 19 11 6 -75 41 83
6398 83 1 -7 -6 36 -7 -49 68 35 -96 -11 3 15 -74 5 86 17 -88 -20 32 42 -66 9 24 -38 -100 28 59 -32 -46
6427 -46 -47 -11 -22 22 116 31 -49 -30 27 58 23 0 51 -45 -43 62 46 55 -65 7 -21 1 30 126 10 -23 -72 51 100 -34
6457 -34 52 28 -61 -104 39 147 24 -56 -35 14 -31 68 133 35 -82 -91 34 53 -33 -14 -18 -64 -58 55 96 -32 -62 -82
6485 -82 -27 28 14 89 -26 -113 -35 67 79 -21 -106 -44 -63 2 56 60 -77 -149 -13 109 111 46 -11 -18 -96 -12 95 -5
6513 -5 -16 -105 -33 -25 -5 117 81 -54 -156 -39 64 137 36 11 -52 -81 -25 120 55 -63 -108 -12 -19 36 165 -37 -65
6540 -65 -157 31 106 90 -27 -89 -31 -91 52 83 34 -27 -136 -24 97 26 -48 18 -31 -127 35 192 36 -75 -76 1
$$ packed form
6340c8J01L7o3k3l0o4N9J54Pk31K8Q2K5J6m9N6j35r1J84O8j00l7QK9l7m8J94m0
6368F2j50M8M1Oj40J28M7o3p9Q8P4j06k7J48k5q2jO8mr2O4P7m8p6O1qnq1J16M2
6398H3q2qJM2m3m2J17l3j31Q5J4J2q9P9Q1o9j05O8N2J0j08P5J5o2o2J28L1r1j4
6427d6jL6j1M4R4q5q0J9N7L1l5k3N1r6KJ05j6Rj20P2k8K2K9R6j16l3m9J23M9j34
6457c4Q6k4q9m3J43J08j23q0K1M9m5R9O5r8j17rJ25J9q6J9mm6OJ13M1j28l0k0
6485h2N5N5j4P5j15q7P8J02J2j00q5O2j9O5N4Mj37p2J36J22Ko5n7pp8Q4J07j00
6513ej1q9P2QK0J22l6j35j02J17J03P3j01k5o3k9N6J45o5j18m5R6pN5J29k02k8
6540f5r2J88P5j6j17o2N8o0J43L1m9o1j09J12J21p1p4O6m9r6J62J57j56j11jP7
$$ plain form
6566 1 -11 38 105 31 -129 -122 -6 78 -62 23 -19 -137 -46 60 200 45 -52 -106 -30 44 7 -3 -35 -130 -125 6 120
6593 120 42 -11 -92 -116 23 26 59 -63 -43 -75 4 114 88 15 -30 -84 -41 21 141 3 -42 -42 -108 25 172 54 -60
6620 -60 -40 -14 21 57 79 24 -75 -75 -14 68 81 15 -60 -100 -11 20 69 13 -16 -96 -11 109 113 26 -61 -162 4 6 39 58
6650 58 -43 -83 -130 21 29 35 -6 -24 -81 -75 76 62 10 -76 -134 -11 72 76 64 -87 -126 -50 82 96 30 -68 -47 -49 58
6679 58 107 51 25 -7 12 -3 113 73 -48 -53 -137 -16 97 59 -10 -84 -62 -56 84 57 43 -47 -3 -14 73 63 12 -46 -77
6708 -77 -33 -58 57 115 -17 -114 -88 -12 118 66 50 -61 -101 16 89 93 61 58 -32 -42 50 97 11 -14 -86 -3 48 57 37
6737 37 20 -15 -45 97 128 111 -8 0 -34 -66 58 77 32 -63 -97 8 13 77 2 -16 -104 -111 -2 38 16 24 -90 -118 -5
6766 -5 0 39 -3 -78 -56 30 46 36 -8 -48 -117 -3 2 37 -59 -36 -46 -29 23 48 56 13 -74 -28 34 25 -39 -36 50 15 -13 60 89
$$ packed form
6566Aj2M9O7p4j60PJ16Q4j40Q5m2j18R1J06J40j55r7n4P6P4l7j0l2r5NJ31J14
6593A20p8n3q1k4J39LL3j22K0l2P9J10k6p3m5n4M3O2J20j38m5%o6J33J47j18j14
6620f0K0K6L5L6K2n5r9%O1Q2J3o6p5m0Q9L1M9n6k9q0Q5J20Mq7q7j01J66KL3J9
6650E8j01m0m7J51QOm1j8n7OJ51j4n2q6n8J23Q3Mj2j51l9P6J32J4o6r8K1kJ07
6679E8M9n6k6l2J9j5J16m0j21nq4J21J13l8o9p4K2OJ40k7j4r0M4j1Q7j0n1n8l1
6708g7M4k5J15N8j32r7K6P6J30n2j6j11m0J17P3Ml2lr0j0R2M7q6k5p2Q3N1Rk0
6737C7j7l5l0J42L1j7j19Ql4l2J24J9m5r5l4J05NO4p5j8q8pJ09M0k2Qj14k8J13
6766eNL9m2p5K2Q6J6j0m4m0o9J14NL5r6K3j0J7N2K5Qm3q7M6O2ro4LQ6l5k8P3K9
$$ plain form
6799 89 19 -103 -37 -28 -74 -43 13 -34 -61 -2 54 32 21 1 -36 -114 -6 4 -25 -29 -23 -53 -37 -3 3 -56 -50 -72 5 69 21 20
6831 20 0 -28 -23 30 -45 39 -55 16 35 50 -21 44 -7 -42 18 81 48 -54 -26 1 22 -40 60 87 111 -63 29 -27 45
6860 45 18 -62 -13 27 -4 0 11 16 5 18 28 7 -42 -25 24 -4 -67 -12 41 22 -20 -23 -8 0 8 -53 -18 -3 48 21 -42 35 1
6893 1 30 -57 -31 -22 40 33 -47 55 39 -43 41 100 -5 -50 28 9 -22 6 17 46 -40 18 45 -35 5 26 35 2 -69 6 45
6924 45 8 33 2 31 -47 -46 38 52 -47 -44 35 -64 38 -32 29 -27 -12 -15 22 64 -31 -9 -3 18 9 -8 63 35 -36 -24 -20 -22 15
6957 15 75 -77 -36 -17 60 -21 -44 40 -16 -9 25 92 9 21 -15 36 115 10 -44 -4 -53 -33 46 80 12 -55 -45 45 25 -2
6987 -2 28 -31 -65 -70 -21 63 4 -30 -53 -68 -47 -13 76 5 -60 -83 -1 52 59 58 51 -19 -17 23 78 21 -79 -20 60 47 31 40 51
7020 51 -67 -41 110 -21 -23 16 35 -3 30 81 78 -81 -99 6 70 -13 20 69 82 -70 -38 102 40 -6 -62 5 16 29
$$ packed form
6799H9p0j22O6Rm6L1N6m7k7N9N6k2j1k0l7p8J08J0k9mOl0J6L4On9Ok2P7O4m8j
6831B0k0k8NN3p5Q4r4P1J9J5p1O5n1l5O0O3l3j02K8K7K1o2J00K7K4j74R2n6P2
6860D5k7q0M9M0l1MJ1Nj1J3J0k1m9J7M9k8o3N5N3j9m2lJ5QQo1L5J5N1k7o3P7l4
6893AK9q7K6RO2pq0J02j6q2Q4N9j05m5P8j9l1K8J1K9q6N8K7q0M0K1Rl3p1P5L9
6924D5l7K5l1K9p8JQ4J4r9LP9r9J02p0O1n6J5lL7M2r5K2OK1rj7P1k8p1J2MkL7
6957A5O0j52M1J9P7q1k3Q4n6PL4O7q3J2l6N1P9j05n4M0m9K0P9L4o8o7J0R0k0k7
6987bL0n9l4nM9Q4n9l4k3j5K1L4Q9p1o5k3Q2N3Pjpp0KM0N5n7j00N9Q0j3j6RJ1
7020E1j18K6J51j31kL9J9l8L3N1lj59j8J05O4q3L3M9J3j52L2J40o2m6n6O7J1J3
$$ plain form
7048 29 48 -6 -46 -64 13 14 43 -6 -24 -6 -134 -36 30 41 -18 -36 -6 -27 -53 102 -43 -42 -64 16 39 18 23 8 -28 4
7078 4 -11 59 63 -50 -36 20 -1 29 26 -7 -102 -50 14 71 16 -60 -23 1 -35 -64 52 -7 -51 -46 22 49 2 -8 37 -39 -38 41
7110 41 59 -30 -46 -13 -30 -45 -31 18 -23 -58 -94 16 -58 -12 -30 -20 -32 21 0 53 -32 -137 -8 9 -5 30 56 -72
7138 -72 -86 -39 38 29 -32 -3 15 -21 -3 8 65 -6 -59 -17 17 6 -16 -22 -2 -32 -20 15 46 16 -17 -25 -25 -25 9 52 10 19 64
7171 64 10 0 2 -4 40 -47 50 61 1 -34 -48 35 60 -5 -15 33 -17 -58 5 47 20 -4 60 8 0 28 55 -13 14 -22 59 58
7203 58 8 26 37 -54 -64 -39 12 -40 -58 -29 8 -82 34 43 -14 -63 -22 55 84 -9 -16 25 -34 -9 40 0 8 1 37 1 1 0 -12
7236 -12 21 5 52 67 -55 33 -23 -46 -25 9 38 27 21 -37 -13 -30 10 20 -8 -78 -27 -9 15 11 -36 -1 8 -36 58 42 48 -22
7268 -22 -10 -7 7 -51 62 -54 -75 -39 -71 7 50 24 -1 1 -24 -41 7 -66 -4 -7 -14 20 36 14 -39 -22 -47 -34 6 -5 23
$$ packed form
7048B9J9n4m0j8P7JK9m9j8J8j28R8O6J1n9j8L0k1k6J55j45Jk2Q0K3k1Nj5l6L2
7078Dj5P0Mj13J4N6k1L0ll3r5N2O4N7n5p6L7K4l6k9J16n9m4NO8K7m7j0M5p6JP9
7110D1J8q9j6L3j7j5J4M9m1l5l6J10p4M6j8J0j2N3k1N3q5j05J29J7j4L5K6j28
7138g2j4M7P7ro1K9J8l6J8J1N7p1n3M2L4j1k2oK0l0J2L5L1l0l3q%%L4M3m2RM5
7171F4n4j0KoM4q7R7J1o0l5j4Q3K5o5j0M8n0m1O3M2k7k4O4n2qK8K7o8K7l6Q1j
7203E8n0J8J1r1j0K5N1n2j8K9L7r0J16Rn7m9M1P7K9r3pM1n9K5M9m0QpL6l6%jj2
7236a2L3j6M7J5j22Q8n6k3K1L4K9j1on8K4j7M0J0k8p0N1J8K4mm7L5Rm4R4j6Op0
7268b2J2LJ4n8J13j16k1L6l2P8M3k6k5Kk5j7M8p3O2lpL4J6k2n3J7k5J3M0j1K8
$$ plain form
7299 23 -15 35 44 -50 -14 -16 -11 -41 46 37 7 -52 -45 15 -45 -15 -14 -43 -95 -36 -3 -8 36 0 15 15 -11 -37 -13 -19 -49 -24 15 -11 21
7334 21 -7 -22 21 -45 42 -40 -36 49 -14 -20 45 44 42 -29 -60 -5 9 -47 -15 22 15 -38 -19 20 39 66 -63 2 -35 38 14 41
7366 41 38 -32 23 -5 46 -3 16 43 -8 12 23 -65 -15 -41 -15 -7 23 -26 -60 0 -22 -11 -26 49 7 2 -67 -25 -29 60 40 -26
7398 -26 37 -34 -6 56 62 -22 -1 -65 -34 -5 -5 56 -17 25 -16 42 -21 5 -3 -25 17 37 40 58 41 27 -24 41 72 15 -22 7
7430 7 -19 -30 47 85 11 -5 -58 -49 10 51 23 -42 -26 9 42 27 -21 -3 -44 -40 22 32 45 14 -67 10 -38 8 72 -39 -41 -27
7462 -27 -2 36 -2 97 38 -65 -47 -7 35 -13 -31 7 -85 -16 25 81 -40 -5 -4 5 85 -40 64 -69 -21 0 25 20 -35
7491 -35 6 -110 -54 0 8 23 -34 -35 -9 -33 2 33 32 -56 -47 -35 80 60 -22 -32 -79 1 49 86 50 -62 -88 54 14 68
7521 68 78 -32 -23 -65 50 43 -10 -15 -73 -63 70 62 41 -78 -78 -34 -25 37 57 -22 -22 -36 -33 45 102 10 -43 -41 -1 41 50 42 -5 -86
$$ packed form
7299B3l8N0Rr4L6kNl0Q7rl0n9PO0o0L0Jk9n2N9L3nM4l6J5%k6k6K4ol0K5L9k6L2
7334B1k8j5M3o6Q7q2MQ5o3oO5jkp1l1N5J4n6L2L7pn3J9L9J9K7j29O5l7P3k4K7
7366D1lp0N5k8N1m9J9K7n1K0J1q8N0k6K6QL0m9l4O0k2J1j5P5m2no9M2mQ9k0o6
7398b6O3p1K8O2Oq4K1o4L1K9%O1p3M2m1N8o3K6qk2M2K0LJ8j7j4n1O5L1n7l7K9
7430Gk6j1P7L8p4j6n3RN9M1k8o5J6L5L3j5m8J8m1MO2J0J3l1q1P7m8M6O4j11kJ4
7462b7K5L8l8R9n9j03J8M0M2m8j8L8r2O9M1N6j21L5JRQ0j25J04j33M8K1K5nn5
7491c5M1j16N6N4QJ5n7jK6k4L5L1jq8RJ2J15k0q2j0m7Q0M8L7l6j12k6J42m0N4
7521F8J0j10Rm2J15pn3nn8J0J33qk1j19%M4RO2K0p9%j4LP8N7r2n3KM0M2Rqm7q1
$$ plain form
7555 -86 -95 14 76 31 -76 -95 -50 14 106 35 -61 -17 -36 13 24 56 29 6 -136 -1 88 51 -14 -35 -69 2 40 27 19
7584 19 -58 -128 -50 11 108 62 -14 -120 -34 56 133 76 6 -56 -42 -13 30 92 18 -103 -65 -26 113 9 83 -114 -74 -85
7612 -85 66 93 -4 -88 -74 -43 40 42 102 -30 -156 -74 22 43 -7 -47 -19 -44 -17 63 56 21 -64 1 -37 59 85 30 -56 -77
7642 -77 -4 108 98 19 -30 -90 -39 60 103 76 -54 -149 -71 20 99 83 -41 -36 -143 38 84 23 -26 -95 -98 35 105 -7
7670 -7 46 -62 -84 -15 128 67 -15 29 -41 3 -50 77 31 -44 -84 -43 10 5 63 -33 -53 -74 34 149 76 -43 -11 -15 26
7699 26 16 102 64 -104 -75 -30 120 38 -40 -17 -105 -60 55 40 56 -74 -113 -34 31 20 57 -56 -109 -58 86 101 37
7726 37 -14 -15 -62 -67 42 75 85 -95 -57 -44 -18 31 49 32 -96 -34 28 57 55 -39 18 45 -1 77 26 -45 -53 -24 67 108 -27
7757 -27 28 -53 -19 15 43 17 -46 8 -27 62 -10 50 6 -16 -93 -52 16 45 -44 0 -9 -5 -18 3 16 -52 -73 -24 19 13 33 -34
$$ packed form
7555h6rJ09O2m5j07j9M5O4R2p1r6M4j9M9J1L2k7k3j42J35Q9l7o5k1l4P1L8j3q
7584A9p7p0P8O1R7m6p6j06Q6R0P7n7p0o2J4K9M3O2p4j21L8L9J39j04P4j97M0j1
7612h5J51K7r7q4J4L1Q3KO0j32j26Q2R6K1n0m0K8k5K7Q0pl5q5O5l8R6K6n5q6k1
7642g7P3J12j0p9m9o0N1R9M3k7j30r5P8R1P9j6j24Nj07J81M6o1m9o9lJ33P0j12
7670gN3j08k2O9J43o1q2M4p0M4n3J27m6p5m0M1N3nN8r6k0k1J08J15p3j19L2mM1
7699B6j0Q6l8j68K9M5J50q2p8K3q8M5J15j5J6j30l9P9O5j1L7j13n3N1J44J5o4
7726C7n1jm7nJ09L3J0j80L8J3K6M9J8j7j28O2O2K9kr4N7K7m6P8n1p1qK9R1M1j35
7757b7N5q1L4L4K8k6o3N4l5Q9p2O0m4k2p7M1O8K9q9M4rMj3K1J3o8k1M9M3oK0o7
$$ plain form
7789 -34 -4 -42 30 -16 -46 21 -44 -44 -62 10 66 27 -10 25 -31 18 49 79 106 -68 -56 -10 82 6 10 0 91 33 -13 76 54
7820 54 43 -37 5 43 22 -10 -9 35 2 30 36 35 -50 6 23 -73 -2 34 0 51 2 -11 65 -20 25 59 11 -53 11 -29 23 21
7852 21 -7 -8 -11 -36 4 85 63 -61 -37 21 60 18 93 66 -62 -35 13 8 0 42 -40 -105 -1 18 30 -24 -27 -2 -28 -4 -8 33
7884 33 7 -101 -84 20 31 38 -23 10 -17 3 -52 68 -22 -44 -44 48 24 71 19 -37 -94 -3 33 115 33 -66 -71 -59 -45 106
7914 106 70 -22 -103 -32 -36 87 51 -1 -74 -18 -6 43 63 -10 -97 -111 13 4 71 12 -29 -68 46 112 117 0 -8 -61 -80 68
7944 68 89 60 -61 -92 -106 46 61 36 -34 -91 -136 14 138 48 -12 -40 -27 15 97 128 37 -91 -111 -63 89 136 78
7971 78 -30 -115 -47 78 104 47 -35 -97 -84 30 55 74 78 -128 -94 48 45 61 -56 -38 -76 -45 46 118 18 -111 -150
7998 -150 -53 86 89 53 -31 -111 -94 98 92 49 -72 -96 -49 -40 106 85 -62 -114 -99 -32 86 123 -74 -115 -106 9 92 126
$$ packed form
7789c4L0l8P2m6l0O7o5%j8P2N6l9l7L5n6M9L1L0K7j74J2M6R2p6Mj0R1n8m6Q9k2
7820E4j1q0M2L8k1l2JM4l3K8Ojq5N6J7r6P1L6l4N1m9j3P6q5M5L4m8o4O4m0N2k
7852B1k8jlk5M0Q1k2j24K4N8L9m2P5k7j28K7M8nqM2q2o5J04J9J2n4lK5k6K4mM1
7884C3k6j08J7J04J1Po1L3k7K0n5J20r0k2%R2k4M7n2n6n7R1L6Q2q2r9nJ2J4J51
7914A06l6r2q1P1mJ23l6n2p3N6J2M9K0p3q7j4J24rO7n9m1l9J14O6Nj17qn3j9J48
7944F8K1k9j21l1j4J52J5k5p0n7m5J50J24r0o0k8J3M2Q2L1r1j28k0M8J52M7n8
7971G8j08q5O8J25K6n7q2o2J3J14K5J9Mk06L4J42lJ6j17J8l8L1R1P2j00j29l9
7998a50R7J39Ll6q4q0J7J92om3j21k4M7RJ46k1j47n2J5O7J18L7j97m1RJ15Q3L4
$$ plain form
8026 126 65 -104 -79 -41 156 152 127 -75 -142 -69 106 275 32 -23 -106 -33 -1 79 129 -88 -83 -109 54 114 112 -5 -90
8053 -90 -147 -68 89 137 83 -103 -77 -44 96 128 72 -96 -142 -50 39 136 37 -69 -85 -69 24 187 170 -43 -103 -134 62
8080 62 130 96 31 -159 -123 49 124 86 36 -122 -97 -21 68 139 63 -47 -165 -38 -9 81 39 -61 -130 -104 21 126
8106 126 134 -74 -181 -110 -18 140 114 60 -105 -87 31 151 132 -5 -86 -94 -46 98 101 69 -84 -130 -119 97 102 106 -11
8133 -11 -78 -90 59 169 118 -20 -64 -66 -34 192 132 41 -94 -117 89 117 102 17 -113 -75 -2 121 122 -27 -33 -115 4
8160 4 31 129 50 -92 -145 4 16 109 53 -6 -100 -152 10 93 55 -25 -68 -66 4 35 91 -24 -32 -126 -49 76 101 46 -78
8189 -78 -73 -85
$$ packed form
8026A26o1j69K5L8J97mk5k02o7P3J75J69k43n5q3P3L2Q0N0k17Nk6J63O0kj17q5
8053i0n7P9J57M8n4j86K6L3J40L2n6j68m6R2Q9R7r9j06j6J6R3J63j7k13o0l1J96
8080F2O8l4o5j90L6J72P5l8n0j58K5P6Q9P1p6j10j18J27K9R0m2j00o9K6J25J05
8106A26Qk08j07P1R2J58k6n4j65J8J18J20j9j37q1qM8J44Ll2j53m6J1K16NMj17
8133a1o7j2J49J10n1j38m4kL2K26o0r1j35k3K06K8j5q5j30L8P3J23Jj49oq2J19
8160DK7R8p9j42n3J49J2R3n6n9r4n2J62Q3l8q0m3KP0L1N6j15qr4P7J25K5n5j24
8189g8Nj2
8191h5
$$ Imaginary data points
##PAGE= N=2
##DATA TABLE= (X++(I..I)), XYDATA
$$ plain form
0 0 0 0 0 0 0 0 0 0 0 0 0 -4 8 -8 8 -8 8 -8 12 -14 16 -20 21 -24 28 -31 36 -39 44 -52 56 -62 70 -78 86 -96
36 -96 105 -117 129 -143 157 -175 194 -213 239 -265 297 -334 376 -425 492 -572 676 -815 1009 -1301
56 -1301 1775 -2640 4540 -10395 62615 323854 98042 -154190 -29045 29929 -136664 -57972
68 -57972 216898 136742 -168934 -144265 69922 50631 -17670 97072 86866 -146870 -176392
79 -176392 65323 142276 6928 -14663 33311 -56134 -98546 52880 114875 -38080 -100826
90 -100826 21023 61308 -14512 -2146 48971 -19872 -89261 -16622 67437 42406 -9769 -32510
102 -32510 -45514 -6882 71782 60930 -39887 -78485 -36140 -3272 41136 101304 49432 -92184
114 -92184 -109745 5430 52764 28324 50643 31871 -94724 -117995 48901 140042 34080
$$ packed form
0@%%%%%%%%%%%mJ2j6J6j6J6j6K0k6L0l6M1m5N2n9O7p5Q3r6J08j18J32j48J64j82
36i6K01k22K46k72L00l32L69m07M52n04N62o31P10q01R17j064J248j491J824k310
56a301L076m415P180j4935P3010K61239k25812k52232J25145N8974j66593P8692
68e7972K74870q0156l05676K4669K14187j9291o8301J14742j0206k33736k9522
79a76392K41715P6953j35348k1591M7974q9445m2412J51426O1995j52955o2746
90a00826J21849M0285p5820J2366N1117o8843o9389P2639Q4059k5031n2175k2741
102c2510j3004L8632P8664j0852j00817l8598M2345L2868M4408O0168n1872j41616
114i2184j7561J15175M7334k4440K2319j8772j26595k3271J66896R1141j05962
$$ plain form
125 34080 -51878 -40312 -64705 -63412 79647 159892 7053 -128626 -49275 31589 -12664 10637
137 10637 101925 25918 -131505 -78035 88862 82093 -17871 -11260 -1562 -75700 -52402 90931
149 90931 99230 -44673 -78896 12383 21980 -24316 17821 52787 -30797 -78446 13256 73332
161 73332 9276 -31099 1767 -12134 -51308 8073 86215 27958 -77300 -54905 36632 46668
173 46668 3218 -3321 -6115 -40945 -35812 35352 70991 17429 -42489 -41724 -15790 3372 34037
186 34037 53635 8425 -63487 -58700 21183 65908 32045 -15088 -33563 -38302 -18836 34901
198 34901 61954 14916 -41896 -37980 -7517 4227 21716 42296 9778 -52988 -48273 21239
210 21239 50839 14500 -17120 -19817 -20754 -10086 23425 33962 -1537 -29285 -13814 6958 5512
$$ packed form
125C4080q5958J1566k4393J293J43059Q0245j52839j35679P9351Q0864m4253K3301
137A0637R1288p6007j57423N3470J66897o769r9964O611R698p4138K3298J43333
149I0931Q299j43903l4223R1279R597m6296M2137L4966q3584m7649R1702O0076
161G3332o4056m0375L2866j3901l9174N9381P8142n8257j05258K2395R1537J0036
173D6668m3450o539k794l4830N133P1164L5639n3562n9918P65K5934J9162L0665
186C4037J9598m5210p1912M787P9883M4725l3863m7133j8475m739J9466N3737
198C4901K7053m7038n6812L916L0463J1744J7489K0580l2518o2766M715O9512
210B1239K9600l6339l1620k697r37J0668L3511J0537l5499k7748J5471K0772j446
$$ plain form
223 5512 4463 10487 56 -20043 -15141 13812 27000 5699 -22227 -21879 3197 20294 14461
236 14461 -336 -12397 -17907 -4973 21095 23310 -6353 -21114 -3440 4144 -5923 7773 29845
249 29845 3603 -39456 -23117 24417 24943 -1292 -1283 -3114 -26204 -14174 33008 29630 -21337 -25717
263 -25717 11246 5843 -19165 5938 32539 -3259 -35327 -4750 20628 -895 -5306 16699
275 16699 -166 -31989 -5025 34311 7617 -28932 -3138 23498 -4466 -21468 8447 18024
287 18024 -9105 -9802 11751 1340 -15931 5003 20393 -6439 -19595 8566 17452 -10065 -13905
300 -13905 11924 12907 -8146 -8010 3366 -349 -499 11328 4901 -15854 -10590 12293 11533 -5003
314 -5003 -5207 1592 -2968 -4038 5140 5787 -2268 -2678 -1672 -7697 -2817 14171 12278 -11419 -18997
$$ packed form
223E512j049O024j0431k0099M902K8953J3188k1301k7926L48K5076J7097n833
236A4461j4797j2061n510J2934K6068K215k9663j4761J7674P584j0067J3696K2072
249B9845k6242m3059J6339M7534N26k6235Rj831k3090J2030M7182l378n0967m380
263b5717L6963n403k5008K5103K6601l5798l2068L0577K5378k1523m411K2005
275A6699j6865l1823K6964L9336k6694l6549K5794K6636k7964j7002K9915R577
287A8024k7129o97K1553j0411j7271K0934J5390k6832j3156K8161Q886k7517l840
300a3905K5829R83k1053J36J1376l715j50J1827o427k0755N264K2883p60j6536
314e003k04O799m560j070R178O47q055m10J006o025M880J6988j893k3697p578
$$ plain form
329 -18997 -1100 11609 8370 2136 -5936 -13785 -5017 13389 12411 -4893 -8846 -1536 -4048 -5051
343 -5051 10718 18807 -815 -20116 -12856 4883 13687 14333 3338 -17895 -21871 4836 26715
356 26715 14379 -8817 -14471 -10110 -5015 8688 21491 11456 -12039 -20118 -9215 5335 17254
369 17254 18137 -3063 -27919 -20706 13090 29593 12278 -12289 -21635 -15279 1899 19460 18760
382 18760 -1230 -17407 -15100 -2878 9558 17309 9572 -14104 -27504 -8818 22059 28890 5779
395 5779 -21112 -27276 -9048 16999 26658 9971 -14671 -21779 -7830 10657 19344 12944 -5665
408 -5665 -23178 -20486 4820 29491 27151 -2040 -29775 -28894 -2 28486 28040 110 -25525
421 -25525 -23678 987 22468 22165 3005 -18364 -25780 -11783 14711 30756 18864 -12083 -32598
$$ packed form
329a8997J7897J2709l239o234q072p849Q768J8406r78j7304l953P310k512j003
343e051J5769Q089j9622j9301P260J7739Q804O46j0995k1233l976K6707K1879
356B6715j2336k3196n654M361N095J3703J2803j0035k3495q079J0903J4550J1919
369A7254Q83k1200k4856P213L3796J6503j7315k4567r346O356J7178J7561p00
382A8760j9990j6177K307J2222J2436P751p737k3676j3400J8686L0877O831k3111
395E779k6891o164J8228K6047R659j6687k4642p108J3949J8487Q687o400j8609
408e665j7513K692K5306K4671k340k9191k7735Q81K8892K8488m46k7930k5635
421b5525J847K4665K1481l03j9160k1369p416J3997K6494J6045j1892l0947k0515
$$ plain form
434 -32598 -22251 9189 31493 21820 -11141 -33057 -19933 13494 31223 17660 -10373 -27900
446 -27900 -22744 874 24833 27682 5375 -21848 -28923 -9820 19006 31203 12123 -22180 -34828
459 -34828 -9979 26106 35562 10684 -22144 -33089 -14349 15748 30322 17911 -7962 -24975
471 -24975 -19997 3544 25967 24247 -3134 -29441 -26846 2777 31475 31612 626 -32417 -32770
484 -32770 -525 28003 25760 2353 -18763 -24144 -9383 17095 28965 9736 -20057 -29589 -13971
497 -13971 11869 31432 25795 -9401 -40154 -26979 14550 34264 16815 -9957 -24133 -20419
509 -20419 2541 28364 26097 -5377 -28684 -22264 -1451 17954 28977 16678 -18698 -38203
521 -38203 -12819 25866 31634 5976 -18681 -25523 -11899 16208 33543 15611 -19778 -31515
$$ packed form
434c2598J0347L1440K2304r673l2961k1916J3124L3427J7729j3563k8033j7527
446b7900N156K3618K3959K849k2307k7223p075J9103K8826J2197j9080l4303j2648
459c4828K4849L6085R456k4878l2828j0945J8740L0097J4574j2411k5873j7013
471b4975M978K3541K2423j720k7381k6307K595K9623K8698J37l0986l3043l53
484c2770L2245K8528k243k3407k1116n381J4761K6478J1870j9229k9793r532J5618
497a3971K5840J9563n637l5196l0753J3175M1529J9714j7449k6772j4176L714
509b0419K2960K5823k267l1474k3307O420K0813J9405J1023j2299l5376j9505
521c8203K5384L8685N768k5658k4657o842J3624K8107J7335j7932l5389j1737
$$ plain form
533 -31515 -12058 11557 22500 19880 1563 -24265 -28967 -353 30018 26225 -4739 -27718 -23875
546 -23875 -530 24029 29096 5391 -26578 -31492 -4012 22074 21619 5167 -9103 -18558 -17154
559 -17154 4413 27828 19634 -13767 -29703 -12494 11323 21518 17715 -1466 -26127 -24644 8535
572 8535 29689 12152 -11901 -13401 -7153 -3542 11145 24597 6184 -26234 -24972 5338 21544
585 21544 16091 6816 -9567 -28901 -17362 23336 36341 2236 -26755 -18464 -1482 6366 18382
598 18382 22119 -4868 -33925 -21426 12813 23643 13190 3041 -12775 -29471 -14232 25620
610 25620 34032 -1281 -27040 -16353 1041 7072 14104 15219 -5283 -24720 -13064 11675 15558
623 15558 5137 -335 -6075 -14507 -6484 16012 18922 -5042 -19647 -6073 10492 9782 2503 -1523
$$ packed form
533c1515J9457K3615J0943k620j8317k5828m702K8614L0371l793l0964k2979L843
546b3875K3345K4559N067k3705l1969m914K7480K6086m55j6452j4270r455J404
559a7154K1567K3415q194l3401j5936J7209K3817J0195l803j9181k4661J483L3179
572H535K1154j7537k4053j500O248L611J4687J3452j8413l2418J262L0310J6206
585B1544n453r275j6383j9334J1539M0698J3005l4105k8991Q291J6982P848J2016
598A8382L737k6987k9057J2499L4239J0830j0453j0149j5816j6696J5239L9852
610B5620Q412l5313k5759J0687J7394O031P032J115k0502j9437J1656K4739L883
623A5558j0421n472n740q432Q023K2496K910k3964j4605J3574J6565p10p279m026
$$ plain form
637 -1523 -7079 -9399 1920 15174 8917 -9008 -12648 -1282 5155 4978 8707 6699 -11613 -23002
651 -23002 -2631 24655 19286 -7307 -17399 -10115 -4120 5804 21052 14223 -16443 -26609 -2344
664 -2344 14369 7194 5895 9530 -10713 -30551 -6417 29517 20187 -10472 -12159 -3601 -11088 -3699
678 -3699 24548 19813 -18741 -23102 8167 10362 -9605 2920 22158 -3181 -28960 -2466 24143
691 24143 2916 -13583 6432 9289 -15292 -8805 20124 7946 -21119 -3905 23258 1803
703 1803 -22704 -436 17667 -4119 -11716 12733 11322 -17823 -14138 13779 9642 -8835 2228
716 2228 12020 -11597 -22728 6949 25233 3363 -14394 -5841 -1083 -5455 3550 15067 5375
729 5375 -10836 -10875 -2780 1877 6899 9859 2769 -8199 -11929 -5860 7396 16106 5584 -11698
$$ packed form
637a523n556k320J1319J3254o257j7925l640J1366O437j77L729k008j8312j1389
651b3002K0371K7286n369k6593j0092P284N995R924J5248o829l0666j0166K4265
664b344J6713p175j299L635k0243j9838K4134L5934r330l0659j687Q558p487P389
678c699K8247m735l8554m361L1269K195j9967J2525J9238k5339k5779K6494K6609
691B4143k1227j6499K0015K857k4581O487K8929j2178k9065J7214K7163k1455
703A803k4507K2268J8103k1786p597K4449j411k9145L685K7917m137j8477J1063
716B228R792k3617j1131K9677J8284k1870j7757Q553M758m372R005J1517r692
729E375j6211l9Q095M657N022K960p090j0968l730O069J3256Q710j0522j7282
$$ plain form
743 -11698 -9267 3642 753 -4514 8904 14356 -7112 -17481 2062 9500 -4837 723 17981
756 17981 -186 -26019 -5112 23087 3538 -16360 7839 17764 -16621 -23827 14920 21696 -10684
769 -10684 -8816 15079 -3813 -27341 4708 32851 -919 -26508 3323 15791 -15726 -14390
781 -14390 24165 18035 -22016 -16135 14052 2756 -14201 10146 21337 -13307 -25122 9634
793 9634 18950 -9831 -9919 15960 6912 -19163 -7377 15413 4444 -8936 4823 8956 -10799
806 -10799 -11805 9895 10849 -6211 -3118 9228 -569 -14085 -3217 12057 7573 -1601 -2196 -4731
820 -4731 -8410 -263 11474 8648 -3475 -8540 -5680 -1770 2582 7122 7264 398 -10100 -13395 -1761
835 -1761 13864 12774 -2573 -10385 -6456 -3063 1039 10307 9882 -5661 -13063 -2167 4718 488
$$ packed form
743a1698K431J2909k889n267J3418N452k1468j0369J9543P438j4337N560J7258
756A7981j8167k5833K0907K8199j9549j9898K4199R925l4385p206L8747O776l2380
769a0684J868K3895j8892k3528L2049K8143l3770k5589K9831J2468l1517J336
781a4390L8555o130m0051N881L0187j1296j6957K4347J1191l4644j1815L4756
793I634R316k8781q8K5879r048k6075J1786K2790j0969j3380J3759M133j9755
806a0799j006K1700R54j7060L093J2346r797j3516J0868J5274m484r174n95k535
820d731l679Q147J1737k826j2123n065K860L910M352M540J42o866j0498l295J1634
835a761J5625j090j5347p812L929L393M102R268m25j5543p402J0896O885m230
$$ plain form
849 488 3693 10304 -1712 -17458 -6371 13901 9394 -5506 -2491 3536 -4901 -6390 8016 9093
863 9093 -7383 -7547 8685 6141 -9973 -4876 11109 3767 -10655 -866 11993 -831 -13840
876 -13840 -445 12103 1764 -5282 3178 119 -13962 -4789 18637 12861 -12966 -13460 4205
889 4205 2539 -5824 6742 15210 -5822 -21158 -3343 13453 4998 -388 6201 -3698 -20638 -5978
903 -5978 21994 14945 -10956 -10286 2696 -3295 -6292 11604 15708 -7733 -16839 1053 8049 -1239
917 -1239 3030 10961 -4370 -18662 -1226 17500 5856 -8913 -2096 3208 -4347 -2224 8660
930 8660 3697 -8612 -3593 6137 1193 -3784 2850 3259 -6525 -5275 6265 6541 -3126 -5520 -2050
945 -2050 -416 3640 7001 -619 -9883 -4976 4376 4348 2021 2550 -2780 -9192 -2763 7389 5189 -444
$$ packed form
849D88L205O611j2016j5746J1087K0272m507j4900L015O027q437j489J4406J077
863I093j6476j64J6232k544j6114N097J5985p342j4422R789J2859j2824j3009
876a3840J3395J2548j0339p046Q460l059j4081R173K3426n776k5827m94J7665
889D205j666q363J2566Q468k1032j5336J7815J6796q455n386O589r899j6940J4660
903e978K7972p049k5901O70J2982n991k997J7896M104k3441r106J7892O996r288
917a239M269P931j5331j4292J7436J8726j1644j4769O817N304p555K123J0884
930H660m963j2309N019R730m944m977O634M09r784J250J1540K76r667k394L470
945b050J634M056L361p620r264M907R352k8k327N29n330o412O429J0152k200n633
$$ plain form
961 -444 558 -3164 -10518 -1457 15088 9416 -9335 -9897 1179 1205 485 9186 6383 -10617 -10991 6015
977 6015 7982 -2640 1105 7044 -6213 -13896 4807 16455 335 -10632 -773 1961 -5306 2359
991 2359 12638 -989 -15248 -1857 11846 726 -7295 3667 4724 -9298 -6356 10468 7538
1004 7538 -7569 -5596 2868 -1676 -2692 8434 6371 -10664 -10586 6940 9255 -2342 -2834 2282
1018 2282 -3697 -6535 4813 9580 -953 -6035 -447 -643 -3418 4426 9981 -1057 -11017 -3398
1032 -3398 6150 4211 1171 1355 -3011 -6513 499 7297 2294 -3031 -389 155 -4001 -947 6231
1047 6231 3516 -4545 -4460 420 1210 1863 3384 -1339 -6951 -2016 6206 3404 -3838 -2656 872 -990
1063 -990 -1133 3317 2553 -3316 -3527 618 704 383 3645 2020 -5832 -6048 3510 7173 683 -3478 -1894
$$ packed form
961d44J002l722p354R061J6545n672j8751n62J1076K6p20Q701k803j7000l74J7006
977F015J967j0622L745N939j3257p683J8703J1648j6120j0967R859K734p267P665
991B359J0279j3627j4259J3391J3703j1120q021J0962J057j4022K942J6824k930
1004G538j5107J973Q464m544j016J1126k063j7035P8J7526K315j1597m92N116
1018B282n979k838J1348M767j0533n082N588j96k775P844N555j1038r960P619
1032c398R548j939l040J84m366l502P012O798n003n325K642N44m156L054P178
1047F231k715q061Q5M880P90O53J521m723n612M935Q222k802p242J182L528j862
1063i90j43M450p64n869k11M145Q6l21L262j625p852k16R558L663o490m161J584
$$ plain form
1080 -1894 -1418 -781 3741 4799 -1404 -4706 -702 1829 190 1501 3846 -170 -5613 -2742 3840
1095 3840 4581 799 -1876 -3220 -2552 1942 4981 1422 -3760 -2920 732 1139 222 1134 1063 -1803 -3239
1112 -3239 -844 2247 2702 553 -2462 -3719 -1019 3058 3511 -431 -3581 -2341 896 2070 785
1127 785 -364 -459 -751 -1186 -68 1761 1630 -237 -1359 -1154 -322 1588 2845 320 -3318 -1869 2886
1144 2886 3100 -1020 -2053 288 755 -2 1013 1013 -1231 -1298 1219 734 -1240 612 2517 -1187 -4216
1161 -4216 -38 4324 1490 -2473 -1989 -602 -329 1615 2499 -1154 -3638 -286 2082 -406 -1094 1768
1177 1768 974 -2885 -2435 1506 2051 436 -125 -1333 -2755 212 3927 1477 -2810 -1541 1330 418
1193 418 -263 1363 664 -1427 -165 1248 -866 -757 3097 1982 -3677 -2625 3559 2749 -2210 -1066
$$ packed form
1080a894M76O37M522J058o203l302M004K531j639J311K345m016n443K871O582
1095C840P41l782k675j344O68M494L039l559n182Q40L652M07r17R12p1k866j436
1112c239K395L091M55k149l015j257K700M077M53l942l150J240L237J174j285
1127G85j149r5k92m35J118J829j31j867j122K05Q32J910J257k525l638J449M755
1144B886K14m120j033K341M67p57J015%k244o7K517m85j974J852J905l704l029
1161d216M178M362k834l963M84J387K73J944Q84l653k484L352K368k488o88K862
1177A768p94l859M50L941N45j615n61j208j422K967L715k450m287J269K871r12
1193D18o81J626o99k091J262J413k114J09L854j115n659J052O184q10m959J144
$$ plain form
1209 -1066 1827 -693 -1758 2377 1909 -3375 -1626 4184 912 -5062 -683 4987 -13 -4622 598
1224 598 3417 -2033 -2781 2576 1189 -3641 118 4223 -1894 -5709 2094 5953 -2096 -5230 1808
1239 1808 3249 -2764 -1752 3832 1095 -3968 -340 3445 -1058 -2960 2838 3928 -2938 -4271 2297
1254 2297 3998 -910 -2129 1208 1353 -1193 -805 1207 851 -290 257 733 -877 -1825 411 3065
1270 3065 1295 -2827 -2206 1754 1435 -2076 -647 3212 798 -4070 -2096 2233 946 -736 1773
1285 1773 440 -5091 -2794 5336 3837 -4059 -2683 3295 -363 -5163 1347 6708 -368 -5852 -60
1300 -60 2896 -2059 -509 5724 1290 -7299 -2682 6306 2763 -4000 -203 3894 -1492 -4279 1903
1315 1903 4433 -813 -2283 1450 723 -2701 -189 3742 855 -3372 -1063 2883 1105 -2861 -1929
$$ packed form
1209a066K893k520j065M135m68n284J749N810l272n974M379N670n000m609N220
1224E98K819n450p48N357j387m830L759M105o117l815P803L859q049l134P038
1239A808J441o013J012N584k737n063L628L785m503j902N798J090o866j333O568
1254B297J701m908j219L337J45k546L88K012l56j141N47M76j610r48K236K654
1270C065j770m122O21L960l19l511J429L859k414m868J974M329j287j682K509
1285A773j333n531K297Q130j499p896J376N978l658m800O510N361p076n484N792
1300f0K956m955J550O233m434q589M617Q988l543o763L797M097n386k787O182
1315A903K530n246j470L733p27l424K512L931k887m227K309L946j778l966R32
$$ plain form
1330 -1929 2297 2846 -1039 -2859 -549 832 -663 241 2991 425 -4593 -2528 2699 1184 -1486
1345 -1486 2739 3343 -5881 -8018 3989 9088 -709 -4901 1178 -643 -6569 1581 11387 1733 -10039
1360 -10039 -2465 5317 -2473 -3536 9442 7707 -10376 -10592 6662 7857 -3484 -336 6337 -4005
1374 -4005 -10606 3696 11475 -1889 -7414 3902 3899 -8029 -3605 10020 4588 -8482 -3194 6162
1388 6162 -278 -5925 2367 5471 -3585 -4218 4741 2705 -6995 -3875 6201 4638 -3352 -2915 681
1403 681 -1347 -2492 2268 5401 1332 -4270 -5231 -1424 3229 4427 2905 -42 -4487 -6937 -1086
1418 -1086 8584 7484 -2666 -5936 -1316 -1240 -1986 5939 9475 -2189 -10868 -2320 5157 696 1222
1433 1222 7552 -125 -13280 -4928 11818 6181 -7175 -1430 6130 -4303 -9200 5629 10794 -4471
$$ packed form
1330a929M226N49l885j820K310J381j495R04K750k566n018K065N227j515k670
1345a486M225O04r224k137J2007N099r797m192O079j821n926Q150R806r654j1772
1360a0039P574P782p790j063J2978j735j8083k16J7254J195j1341L148O673j0342
1374d005o601J4302P779j3364n525J1316lj1928M424J3625n432j3070N288R356
1388F162o440n647Q292L104r056o33Q959k036r700L120J0076j563p990M37L596
1403F81k028j145M760L133m069n602r61L807M653J198j522k947m445k450N851
1418a086R670j100j0150l270M620P6p46P925L536j1664q679Q548P477m461N26
1433A222O330p677j3155Q352J6746n637j3356N745P560j0433m897J4829N165j5265
$$ plain form
1447 -4471 -8645 4110 4209 -6897 -1990 9052 869 -9741 107 9167 -1945 -9136 2109 7423
1461 7423 -2282 -3966 4066 666 -7970 -1080 9382 3238 -6321 -2309 2476 -2623 -2702 6892 7509
1476 7509 -4447 -9278 -1345 4752 3820 2786 1537 -3921 -7240 -1501 6653 6811 134 -4314 -3823
1491 -3823 -2158 6 4321 6818 945 -8041 -6999 2391 6160 2248 244 -393 -5134 -6010 3366
1506 3366 8562 202 -5945 -469 1779 -4163 -1934 7720 4421 -7788 -5890 5147 3604 -4128
1520 -4128 -357 4804 -1960 -5562 3129 5562 -4247 -5332 5052 5122 -4387 -3072 4266 20 -5574
1535 -5574 2195 8224 -781 -7428 -375 3613 -1697 -97 7364 2040 -10057 -6326 6933 7189 -1562
1550 -1562 -1889 910 -3759 -5593 3462 8967 1437 -5870 -3742 -825 -881 2543 6600 1823 -7151 -6672
$$ packed form
1447d471m174J2755R9j1106M907J1042q183j0610R848R060j1112p191J1245N314
1461G423r705j684Q032l400q636O890J0462o144r559M012M785n099p9R594O17
1476G509j1956m831P933O097r32j034j249n458l319N739Q154J58o677m448M91
1491c823J665K164M315K497n873q986J042R390L769l912k004o37m741q76R376
1506C366N196q360o147N476K248n942K229R654l299j2209J898J1037j543p732
1520d128L771N161o764l602Q691K433r809j085J0384P0r509J315P338m246n594
1535e574P769O029r005o647P053L988n310J600P461n324j2097L731J3259K56q751
1550a562l27K799m669j834R055N505p530p307K128K917n6L424M057m777q974M79
$$ plain form
1566 -6672 1613 5077 2031 26 -383 -3030 -4223 504 5109 2737 -2276 -2509 -527 -903 -447 3184
1582 3184 3452 -2238 -4710 670 4065 -68 -2824 947 2607 -1239 -1840 2087 1304 -2985 -993 4137
1598 4137 1824 -3345 -1363 2318 -717 -2543 2995 4971 -2487 -6243 -110 4086 839 -163 2011
1613 2011 -1503 -5876 -762 6151 2661 -3522 -1430 1195 -2706 -3017 4452 5829 -2713 -6152 -287
1628 -287 2535 -172 868 3158 -1188 -5569 -818 4609 1500 -2267 313 1475 -2508 -2358 3090
1643 3090 3462 -1687 -2401 799 624 -981 1194 2379 -1326 -2864 1218 2975 -735 -2185 845 1767
1659 1767 -778 -990 1000 666 -999 -586 711 428 -192 39 -272 -977 -300 1221 974 -710 -1667 -844
1677 -844 678 1238 158 -1124 -631 66 -268 -283 711 779 -761 -1171 44 304 28 843 873 -1321 -1941
$$ packed form
1566f672Q285L464l046k005m09k647j193M727M605k372n013k33J982l76M56L631
1582C184K68n690k472N380L395m133k756L771J660l846o01L927p83m289J992N130
1598D137k313n169J982L681l035j826N538J976p458l756O133M196l247j002K174
1613B011l514m373N114O913l490o183K092K625l901l11P469J377q542l439N865
1628b87K822k707J040K290m346m381M751N427l109l767K580J162l983J50N448
1643C090L72n149p14L200j75j605K175J185l705j538M082J757l710j450L030R22
1659A767k545k12J990l34j665M13J297k83o20K31l11p05O77J521k47j684r57Q23
1677h44J522N60j080j282M93O97l34j5R94O8j540m10J215K60k76Q15L0k194o20
$$ plain form
1696 -1941 1000 2322 -325 -1610 596 1127 -916 -571 1475 672 -1145 92 1295 -704 -1332 1531
1712 1531 1907 -1521 -1704 1628 1436 -1679 -1066 1787 851 -1365 -258 923 -810 -953 1654 1188 -2173
1729 -2173 -1682 1585 1156 -1413 -609 1329 -216 -1869 -100 1401 36 -802 177 -298 -1305 368
1745 368 2038 119 -2130 -760 1270 714 -276 222 63 -912 -262 1025 697 -297 35 101 -764 -250
1763 -250 1583 1507 -748 -1545 -352 802 1105 910 -218 -1367 -719 927 1015 -49 -253 -18 -686 -827
1781 -827 514 1342 274 -1102 -1187 -485 489 1391 629 -1410 -1843 -36 1563 818 -543 -870 -756 -511
1799 -511 472 1301 629 -796 -1270 -866 175 1437 1708 -40 -2174 -1835 634 2377 1618 -321 -1681
1816 -1681 -1640 32 1780 1945 344 -1099 -1271 -636 403 1768 1862 -232 -2399 -1734 948 2328 1303
$$ packed form
1696a941K941J322k647j285K206N31k043L45K046q03j817J237J203j999o28K863
1712A531L76l428j83L332j92l115O13K853r36k216J107J181j733j43K607m66l361
1729b173M91L267m29k569Q04J938j545j653J769J501j365q38R79m75j007J673
1745C68J670j919k249J370K030n56r90M98j59r75O50J287l28r94L32O6q65N14
1763b50J833p6k255p97J193J154L03j95j128j149O48J646Q8j064k04K35o68j41
1781h27J341Q28j068j376q5P02R74R02p62k039m33J807J599p45j361l27J14K45
1799e11R83Q29o72j425m74M04J041J262K71j748k134L39K469J743p59j939j360
1816a681M1J672J748J65j601j443j72O35J039J365R4k094k167O65K682J380j025
$$ plain form
1833 1303 -545 -1804 -1565 291 1965 1324 -814 -1552 -646 -35 356 1082 854 -1167 -2254 -483 1730
1850 1730 1561 85 -1306 -1907 -1116 1433 2796 479 -2348 -2129 24 1100 1420 1373 -180 -2492 -1965
1867 -1965 968 2449 1524 176 -1429 -2666 -957 2682 3493 73 -2678 -1815 87 1316 1965 1291
1883 1291 -932 -2256 -984 972 1550 1088 94 -1540 -2050 13 2333 1649 -845 -2057 -1326 411
1899 411 1737 1321 -724 -2009 -1211 451 1321 1215 -29 -1707 -1894 -102 1576 1670 669 -1276 -2835
1916 -2835 -1526 2134 3387 486 -2267 -2054 -701 687 2514 2483 -818 -3345 -1370 1589 1657 1205
1932 1205 1226 -926 -3567 -1441 3422 3537 -613 -2380 -1296 -608 520 2798 2066 -2039 -3361 -202
1948 -202 2035 1045 453 396 -1640 -2841 -64 3234 2062 -1387 -2444 -1378 -33 1483 2532 506
$$ packed form
1833A303j848j259K39J856J674o41k138p38R06O11L91P26k28k021j087J771K213
1850A730j69j476j391o01P91K549J363k317k827K19K153J076L20m7j553k312N27
1867a965K933J481r25j348j605j237J709L639Q11l420k751Q63J902J229O49o74
1883A291k223j324J272J956N78m62r94j634n10K063K320o84k494j212P31J737
1899D11J326m16k045j285P98J662Q70j06j244j678j87J792J678R4j001j945j559
1916b835J309L660J253k901k753K13J353J388J827l1l301k527J975K959O8m52
1932A205K1k152k641K126M863J15m150j767J084O88J128K278p32m105j322L159
1948b02K237r90n92n7k036j201K777L298j172l449j057J066J345J516J049k026
$$ plain form
1964 506 -2901 -2879 382 2557 1404 -224 -936 -1437 -1650 240 2995 2299 -1459 -3204 -867 1489 1506
1981 1506 1268 833 -1761 -3231 137 3810 1656 -2027 -1141 777 -774 -914 2574 2491 -2489 -3117 1403
1998 1403 2325 -615 -138 1398 -1638 -3217 1795 4417 -863 -4066 -124 2069 -774 -318 2739 -15
2014 -15 -4415 -1387 3548 1664 -1553 -38 237 -3217 -1738 4237 3766 -2554 -3890 33 1040 223
2030 223 1966 2163 -2153 -4064 -150 2945 1739 244 -10 -1642 -2563 48 3232 2676 -387 -2691
2046 -2691 -2226 404 2454 1770 -36 -884 -1399 -1703 724 3138 1162 -2180 -1226 655 -726 -695 2836
2063 2836 2042 -3449 -3112 2633 2512 -2366 -1085 2640 -474 -3586 1212 3791 -2098 -3843 2551 3131
2079 3131 -3177 -2223 3765 718 -4951 13 5659 -63 -5136 299 3369 -1975 -1872 4658 2076
$$ packed form
1964E06l407K2L261K175j153j628p12n01k13J890K755o96l758j745K337K356J7
1981A506k38m35k594j470L368L673k154l683Q86J918j551j40L488q3m980o28M520
1998A403R22k940M77J536l036j579N012K622n280l203L942K193k843M56L057k754
2014a5m400L028M935j884l217J515K75l454J479N975m71o320j336L923J007q17
2030B23J743J97m316j911L914L095j206j495k54j632r21K611L184n56l063k304
2046b691M65K630K050o84j806q48n15l04K427K414j976l342R54J881j381L1L531
2063B836p94n491L37N745j21m878J281L725l114l112M798K579n889j745O394N80
2079C131o308R54N988l047n669M964N646n722n073N435L070n344J03O530k582
$$ plain form
2094 2076 -5912 -2882 5064 2545 -3121 261 3151 -2712 -4481 2956 5365 -1091 -3083 873 -19
2109 -19 -2802 1306 5006 122 -4579 -1310 2049 153 -433 2094 1005 -2754 -2240 984 1625 450
2125 450 260 -261 -1509 -1250 417 1215 897 -121 -1271 -951 574 335 -875 487 1965 -523 -2728
2142 -2728 -36 2159 -356 -1258 1962 1335 -2984 -1747 2866 1308 -2313 566 3257 -1785 -4366
2157 -4366 1733 4496 -984 -2649 2006 1080 -3764 -685 5009 1230 -4192 -351 3071 -1699 -3239
2172 -3239 3354 4067 -3354 -4055 2346 2165 -2713 -349 3682 -285 -4399 -21 3258 -803 -2332 2114
2188 2114 2112 -3194 -2809 2372 2171 -1596 -577 1757 -696 -2790 352 2740 478 -1239 255 141
2204 141 -1809 -799 2585 2438 -946 -2413 -534 827 568 787 1334 161 -2057 -1713 1060 2303
$$ packed form
2094B076p988L030P946k519n666L382K890n863j769P437K409o456j992L956q92
2109a9k783M108L700m884m701L269L359j896n86K527j089l759N14L224O41j175
2125D50j90n21j248K59J667P98l18j018j150L20J525k39j210J362J478k488k205
2142b728K692K195k515r02L220o27m319J237M613j558l621K879K691n042k581
2157d366O099K763n480j665M655r26m844L079N694l779n422L841L422m770j540
2172c239O593P13p421p01O401j81m878K364M031l967m114M378L279m061j529M446
2188B114kn306L85N181k01l767J019K334k453k094L142K388k262j717J494j14
2204A41j950J010L384j47l384j467J879J361k59K19N47j173k218L44K773J243
$$ plain form
2220 2303 695 -524 -310 -1000 -1631 737 3266 1060 -2710 -1780 1022 524 -611 1201 1486 -1855
2236 -1855 -2637 1018 2161 -725 -1120 1179 -4 -2444 -16 3030 211 -3088 -443 2536 151
2251 151 -1875 427 1053 -1487 -1024 2384 1595 -2314 -1833 1353 1092 -785 662 1810 -1347 -3110
2267 -3110 399 3453 1392 -1439 -955 -485 -1181 498 3266 1766 -2581 -2916 440 1741 605 950
2283 950 1054 -1694 -3536 -66 3688 2151 -1516 -1810 -793 -989 273 2906 1801 -2665 -3284 418
2299 418 1998 272 81 778 -1375 -2947 302 3402 1182 -2112 -1407 29 -331 575 2481 609
2315 609 -3107 -2232 1855 2506 -55 -663 -220 -1211 -998 1884 2883 -107 -2534 -1429 478 1207 1755
2332 1755 1371 -1275 -3251 -1051 2436 2874 321 -1768 -2058 -1067 778 2319 1871 -720 -2840 -2118
$$ packed form
2220B303j608j219K14o90o31K368K529k206l770R30K802m98j135J812K85l341
2236a855p82L655J143k886l95K299j183k440K428L046k819l299K645K979k385
2251A51k026K302O26k540M63L408p89l909M81L186k61j877J447J148l157j763
2267c110L509L054k061k831M84M70o96J679K768j500m347l35L356J301j136L45
2283I50J04k748j842L470L754j537l667k94J017j96J262K633j105m466o19L702
2299D18J580j726j91O97k153j572L249L100k220l294P05J436l60R06J906j872
2315F09l716Q75M087O51k561o08M43r91K13K882R99k990k427J105J907P29N48
2332A755l84k646j976K200L487M38k553k089k90R91J845J541m48k591k120P22
$$ plain form
2348 -2118 744 2644 1796 -368 -2039 -2485 -798 2309 3256 276 -3111 -2660 155 1715 1737 1290 -876
2365 -876 -3212 -1904 2038 3097 487 -1203 -1452 -1736 -525 2819 3410 -853 -3769 -1478 1598 1737
2381 1737 1307 915 -1564 -3254 -323 3289 2235 -777 -1417 -1137 -1292 580 3369 1873 -2522 -3245
2397 -3245 -193 1836 1618 1226 -510 -2972 -2333 1567 3300 933 -1512 -1915 -1517 -219 2134 2618
$$ packed form
2348b118K862J900q48k164j671m46J687L107R47k980l387M51K815J560K2m47k166
2365h76k336J308L942J059k610j690k49k84J211L344N91m263k916K291L076J39
2381A737m30l92k479j690K931L612j054l012o40K80j55J872K789j496m395p23
2397c245L052K029k18l92j736k462O39L900J733k367k445m03L98J298K353M84
$$ [...]
8191H6
##END NTUPLES=NMR FID
##END=
