##TITLE=1H_2PEDM1
 CDCl3, 8 sc, 
 2.8.2019
##JCAMPDX= 6.0         $$ Bruker NMR JCAMP-DX V2.0
##DATA TYPE= NMR FID
##DATA CLASS= NTUPLES
##ORIGIN= UXNMR, Bruker Analytische Messtechnik GmbH
##OWNER= root
$$ XWIN-NMR		Version 3.5
$$ Fri Aug  2 13:54:34 2019 Russian Standard Time (UT+4h)  she@DPX200
##.OBSERVE FREQUENCY= 200.13155
##.OBSERVE NUCLEUS= ^1H
##.DELAY= (6, 6)
##.ACQUISITION MODE= SIMULTANEOUS
##.ACQUISITION SCHEME= undefined
##.AVERAGES= 8
##.DIGITISER RES= 18
##SPECTROMETER/DATA SYSTEM= spect
##.PULSE SEQUENCE= zg30
##.SOLVENT NAME= D2O
##.SHIFT REFERENCE= (INTERNAL, D2O, 0, 15.7039)
##AUDIT TRAIL= $$ (NUMBER, WHEN, WHO, WHERE, WHAT)
$$ ##TITLE= Audit trail, XWIN-NMR		Version 3.5
$$ ##JCAMPDX= 5.01
$$ ##ORIGIN= Bruker BioSpin GmbH
$$ ##OWNER= she
$$ F:/spectra/data/she/nmr/H-F/1/audita.txt
$$ ##AUDIT TRAIL=  $$ (NUMBER, WHEN, WHO, WHERE, WHAT)
(   1,<2019-08-02 13:52:49.15 +0400>,<she>,<DPX200>,
      <created by zg, POWCHK disabled, PULCHK disabled
       configuration hash MD5:
       00 E9 B6 7A A2 85 ED C7 34 08 36 98 17 FE 4E 26
       data hash MD5: 16K
       0A F0 DF FB 3C E8 2E 3A 05 53 60 E2 F9 91 F2 8C>)
$$ ##END=
$$ 
$$ hash MD5
$$ 97 BF 2A 8E A2 7D 3A 21 1D 1E F8 53 38 B4 47 74
##$RELAX= 
##$RELAX= 
##$RELAX= 
##$RELAX= 
##$RELAX= 
##$RELAX= 
$$ Bruker specific parameters
$$ --------------------------
##$DU= <F:/spectra>
##$EXPNO= 1
##$NAME= <H-F>
##$PROCNO= 1
##$TYPE= <nmr>
##$USER= <she>
##$AMP= (0..31)
100 100 100 100 100 100 100 100 100 100 100 100 100 100 100 100 100 100 
100 100 100 100 100 100 100 100 100 100 100 100 100 100 
##$AQSEQ= 0
##$AQ_mod= 1
##$AUNM= <au_zg>
##$AUTOPOS= <>
##$BF1= 200.13
##$BF2= 200.13
##$BF3= 200.13
##$BF4= 200.13
##$BF5= 200.13
##$BF6= 200.13
##$BF7= 200.13
##$BF8= 200.13
##$BYTORDA= 1
##$CFDGTYP= 0
##$CFRGTYP= 5
##$CHEMSTR= <none>
##$CNST= (0..31)
1 1 145 1 1 1 1 1 1 1 1 1 1 1 1 1 1 1 1 1 1 1 1 1 1 1 1 1 1 1 1 1 
##$CPDPRG= <>
##$CPDPRG1= <>
##$CPDPRG2= <>
##$CPDPRG3= <>
##$CPDPRG4= <mlev>
##$CPDPRG5= <mlev>
##$CPDPRG6= <mlev>
##$CPDPRG7= <mlev>
##$CPDPRG8= <mlev>
##$CPDPRGB= <>
##$CPDPRGT= <>
##$D= (0..31)
0 1.2 0 0 0 0 0 0 0 0 0 0.03 0 0 0 0 0 0 0 0 0 0 0 0 0 0 0 0 0 0 0 0 
##$DATE= 1564739568
##$DBL= (0..7)
120 120 120 120 120 120 120 120 
##$DBP= (0..7)
150 150 150 150 150 150 150 150 
##$DBP07= 0
##$DBPNAM0= <>
##$DBPNAM1= <>
##$DBPNAM2= <>
##$DBPNAM3= <>
##$DBPNAM4= <>
##$DBPNAM5= <>
##$DBPNAM6= <>
##$DBPNAM7= <>
##$DBPOAL= (0..7)
0.5 0.5 0.5 0.5 0.5 0.5 0.5 0.5 
##$DBPOFFS= (0..7)
0 0 0 0 0 0 0 0 
##$DE= 6
##$DECBNUC= <off>
##$DECIM= 24
##$DECNUC= <off>
##$DECSTAT= 4
##$DIGMOD= 1
##$DIGTYP= 9
##$DL= (0..7)
0 120 120 120 120 120 120 120 
##$DP= (0..7)
150 150 150 150 150 150 150 150 
##$DP07= 0
##$DPNAME0= <>
##$DPNAME1= <>
##$DPNAME2= <>
##$DPNAME3= <>
##$DPNAME4= <>
##$DPNAME5= <>
##$DPNAME6= <>
##$DPNAME7= <>
##$DPOAL= (0..7)
0.5 0.5 0.5 0.5 0.5 0.5 0.5 0.5 
##$DPOFFS= (0..7)
0 0 0 0 0 0 0 0 
##$DQDMODE= 0
##$DR= 18
##$DS= 0
##$DSLIST= <SSSSSSSSSSSSSSS>
##$DSPFIRM= 0
$$ [...]
##$SUBNAM2= <"">
##$SUBNAM3= <"">
##$SUBNAM4= <"">
##$SUBNAM5= <"">
##$SUBNAM6= <"">
##$SUBNAM7= <"">
##$SUBNAM8= <"">
##$SUBNAM9= <"">
##$SW= 24.9336996594482
##$SWIBOX= (0..15)
0 0 2 0 0 0 0 0 0 0 0 0 0 0 0 0 
##$SW_h= 4990.01996007984
##$TD= 16384
##$TD0= 1
##$TE= 0
##$TE2= 300
##$TE3= 300
##$TEG= 300
##$TL= (0..7)
0 120 120 120 120 120 120 120 
##$TP= (0..7)
150 150 150 150 150 150 150 150 
##$TP07= 0
##$TPNAME0= <>
##$TPNAME1= <>
##$TPNAME2= <>
##$TPNAME3= <>
##$TPNAME4= <>
##$TPNAME5= <>
##$TPNAME6= <>
##$TPNAME7= <>
##$TPOAL= (0..7)
0.5 0.5 0.5 0.5 0.5 0.5 0.5 0.5 
##$TPOFFS= (0..7)
0 0 0 0 0 0 0 0 
##$TUNHIN= 0
##$TUNHOUT= 0
##$TUNXOUT= 0
##$USERA1= <user>
##$USERA2= <user>
##$USERA3= <user>
##$USERA4= <user>
##$USERA5= <user>
##$V9= 5
##$VALIST= <valist>
##$VCLIST= <CCCCCCCCCCCCCCC>
##$VD= 0
##$VDLIST= <DDDDDDDDDDDDDDD>
##$VPLIST= <PPPPPPPPPPPPPPP>
##$VTLIST= <TTTTTTTTTTTTTTT>
##$WBST= 1024
##$WBSW= 4
##$XGAIN= (0..3)
0 0 0 0 
##$XL= 0
##$YL= 0
##$YMAX_a= 197374
##$YMIN_a= -240694
##$ZGOPTNS= <>
##$ZL1= 120
##$ZL2= 120
##$ZL3= 120
##$ZL4= 120
##$ABSF1= 10
##$ABSF2= 0
##$ABSG= 5
##$ABSL= 3
##$ALPHA= 0
##$AQORDER= 0
##$ASSFAC= 0
##$ASSFACI= 0
##$ASSFACX= 0
##$ASSWID= 0
##$AUNMP= <proc_1d>
##$AZFE= 0.1
##$AZFW= 0.1
##$BCFW= 1
##$BC_mod= 2
##$BYTORDP= 1
##$COROFFS= 0
##$CY= 11.3945322036743
##$DATMOD= 1
##$DC= 2
##$DFILT= <>
##$DTYPP= 0
##$F1P= 20.1537800932815
##$F2P= 0.134698688090026
##$FCOR= 0.5
##$FTSIZE= 0
##$FT_mod= 4
##$GAMMA= 1
##$GB= 0.15
##$INTBC= 1
##$INTSCL= 1
##$ISEN= 128
##$LB= 0.24
##$LEV0= 0
##$LPBIN= 0
##$MAXI= 10000
##$MC2= 0
##$MEAN= 0
##$ME_mod= 0
##$MI= 1.114404
##$NCOEF= 0
##$NC_proc= 0
##$NLEV= 6
##$NOISF1= 3.799351
##$NOISF2= 2.8
##$NSP= 1
##$NTH_PI= 0
##$NZP= 0
##$OFFSET= 15.70392
##$PC= 1
##$PHC0= -9129.276
##$PHC1= 10.20097
##$PH_mod= 1
##$PKNL= yes
##$PPARMOD= 0
##$PSCAL= 0
##$PSIGN= 0
##$REVERSE= no
##$SF= 200.130013532006
##$SI= 16384
##$SIGF1= 3
##$SIGF2= 2
##$SINO= 400
##$SIOLD= 16384
##$SREGLST= <1H.CDCl3>
##$SSB= 0
##$STSI= 0
##$STSR= 0
##$SW_p= 3612.71676300578
##$SYMM= 0
##$S_DEV= 0
##$TDeff= 0
##$TDoff= 0
##$TI= <>
##$TILT= no
##$TM1= 0
##$TM2= 0
##$TOPLEV= 0
##$USERP1= <user>
##$USERP2= <user>
##$USERP3= <user>
##$USERP4= <user>
##$USERP5= <user>
##$WDW= 1
##$XDIM= 8192
##$YMAX_p= 0
##$YMIN_p= 0
$$ End of Bruker specific parameters
$$ ---------------------------------
##NTUPLES= NMR FID
##VAR_NAME=  TIME,          FID/REAL,        FID/IMAG
##SYMBOL=    X,             R,               I
##VAR_TYPE=  INDEPENDENT,   DEPENDENT,       DEPENDENT
##VAR_FORM=  AFFN,          ASDF,            ASDF
##VAR_DIM=   8192,          8192,            8192
##UNITS=     SECONDS,       ARBITRARY UNITS, ARBITRARY UNITS
##FACTOR=    0.0002004,     1,               1
##FIRST=     0,             0,               0
##LAST=      1.6414764,     0,               0
##MIN=       0,             -240694,         0
##MAX=       1.6414764,     197374,          0
$$ Real data points
##PAGE= N=1
##DATA TABLE= (X++(R..R)), XYDATA
$$ plain form
0 0 0 0 0 0 8 -8 8 -8 8 -8 16 -16 24 -24 32 -40 48 -56 64 -72 88 -100 114 -132 149 -172 194 -220 248
29 248 -279 314 -351 392 -436 487 -539 600 -665 736 -815 901 -997 1104 -1224 1353 -1503
46 -1503 1675 -1872 2099 -2366 2687 -3078 3567 -4197 5041 -6228 8007 -10947 16584 -30899
60 -30899 129921 197374 -240694 56540 19813 -27 74306 -185189 115467 111328 -225693
71 -225693 99181 70055 -61042 4339 -86259 127522 32089 -173743 105335 29290 -54188
82 -54188 26779 -45930 69673 -24953 -78651 131050 -43018 -75362 75591 -15403 4051
93 4051 -11743 -18691 53777 -44742 -4292 57309 -46458 -28915 38363 37169 -41156 -45128 63578
106 63578 15042 -46269 -10944 32020 35336 -80041 370 108862 -69508 -58218 58568
$$ packed form
0@%%%%Qj6J6j6J6j6K4l2M0m8N6p2Q8j04J20j36J60j88K14k46K81l21L66m14M68
29B48n27N93o65P43q28R23j026J139j265J401j551J716j898K101k328K577k856
46a503L178l547L971m465N053n765O645p764R238j1269J4235j8954K7531m7483
60c0899J60820O7453m38068K97234l6727j9840P4333k59495L00656m139l37021
71b25693L24874k9126j31097O5381r0598K13781r5433k05832K79078p6045q3478
82e4188Q0967p2709J15603r4626n3698K09701j74068l2344J50953r0994J9454
93D051j5794o948P2468r8519M0450O1601j03767J7543O7278j194p8325l972J08706
106F3578m8536o1311L5325M2964L316j15377Q0411J08492j78370J1290J16786
$$ plain form
117 58568 35535 -11411 -94104 53305 101964 -121895 -12688 84620 -20807 -22106 -43146
128 -43146 73433 40920 -142035 58751 83752 -78520 -5088 -9013 54490 17149 -121527
139 -121527 85321 54418 -112096 39211 26429 -7328 -4596 -54400 83329 4002 -98628
150 -98628 72149 14632 -43185 18036 -14177 36755 -19231 -45963 77053 -24818 -48753
161 -48753 54787 -11119 -5202 -2848 -17267 53157 -36111 -39415 77816 -22873 -47090 41341
173 41341 6242 -6823 -22271 -3367 58774 -39373 -46341 73355 -1768 -52607 16148 21850
185 21850 11106 -37483 -15401 69051 -24641 -54131 47697 14954 -22841 -19140 9354 50710
197 50710 -44365 -38088 69393 -7500 -41267 12653 15577 16021 -38673 -6799 58847 -35929 -29284
$$ packed form
117E8568k3033m6946q2693J47409M8659k23859J09207R7308j05427j299k1040
128d3146J16579l2513j82955K00786K5001j62272P3432l925O3503l7341j38676
139a21527K06848l0903j66514J51307j2782l3757K732m9804J37729p9327j02630
150i8628J70777n7517n7817O1221l2213N0932n5986k6732J23016j01871k3935
161d8753J03540o5906N917K354j4419P0424q9268l304J17231j00689k4217Q8431
173D1341l5099j3065j5448J8904O2141r8147o968J19696p5123n0839O8755N702
185B1850j0744m8589K2082Q4452r3692k9490J01828l2743l7795L701K8494M1356
197E0710r5075O277J07481p6893l3767N3920K924M44n4694L1874O5646r4776O645
$$ plain form
210 -29284 41291 -1926 -10037 -11888 6617 29690 -32808 -9837 34403 -14203 -10655 8772 5336
223 5336 -85 -17373 10595 15593 -20251 -4149 17361 1296 -15937 2269 16065 -12933 -8352
236 -8352 15328 4182 -11997 -9346 20936 3860 -28107 12442 12746 -9445 -1066 -6953 18541
249 18541 -3609 -28927 31085 3203 -25031 13222 -2287 12113 -6710 -26717 37826 -5357
261 -5357 -28172 27210 -7015 -861 1234 -15137 29625 -16594 -18081 34156 -18031 -678 9220
274 9220 -19156 25251 -12300 -15102 30427 -21057 1521 13666 -20432 19121 -8568 -11359 25272
287 25272 -19822 2736 12707 -18768 15876 -5703 -9593 18152 -14613 5231 6136 -15152 17520
300 17520 -7905 -10252 18619 -11081 -508 6621 -6764 8187 -8606 -1016 12622 -12808 1283
$$ packed form
210b9284P0575m3217q111j851J8505K3073o2498K2971M4240m8606L548J9427l436
223E336n421j7288K7968M998l5844J6102K1510j6065j7233J8206J3796k8998M581
236h352K3680j1146j6179K651L0282j7076l1967M0549L04k2191Q379n887K5494
249A8541k2150k5318O0012k7882k8234L8253j5509J4400j8823k0007O4543m3183
261e357k2815N5382l4225O154K095j6371M4762m6219j487N2237n2187J7353R898
274I220k8376M4407l7551k802M5529n1484K2578J2145l4098L9553k7689k791L6631
287B5272m5094K2558R971l1475L4644k1579l890K7745l2765J9844R05k1288L2672
300A7520k5425k347K8871k9700J0573P129j3385J4951j6793P590J3638k5430J4091
$$ plain form
313 1283 7131 -3660 2329 -7458 4701 6219 -12247 5456 5014 -5047 464 -2240 7221 -3063
327 -3063 -11127 12945 2932 -10296 1257 4596 3046 -9918 -258 14253 -10523 -6260 12578
340 12578 18 -6630 -5771 8969 8534 -17223 1001 15596 -7627 -7633 3405 9044 -3443 -15414
354 -15414 14039 11957 -19491 -3351 14323 3540 -13304 -6620 20758 -548 -21972 11603
366 11603 13336 -12847 -9219 9818 13227 -14624 -12319 21639 3352 -19497 1541 13700 124
379 124 -15397 2587 19596 -11983 -15931 17405 8553 -15926 -6835 16297 7214 -20755 -1244
392 -1244 21921 -7877 -17634 12003 14010 -12685 -13435 16354 11296 -21466 -5585 22313 -30
405 -30 -19845 3252 19245 -6348 -20341 11155 18964 -16492 -14490 20300 9913 -22052 -6185
$$ packed form
313A283N848j0791N989r787J2159J518j8466J7703m42j0061N511k704R461j0284
327c063q064K4072j0013j3228J1553L339j550j2964R660J4511k4776M263J8838
340A2578j2560o648Q59J4740m35k5757J8224J4595k3223oJ1038N639j2487j1971
354a5414K9453k082l1448J6140J7674j0783j6844O684K7378k1306k1424L3575
366A1603J733k6183L628J9037L409k7851K305L3958j8287k2849K1038J2159j3576
379A24j5521J7984J7009l1579l948L3336q852k4479R091K3132r083k7969J9511
392a244K3165k9798r757K9637K007k6695p50K9789n058l2762J5881K7898k2343
405c0j9815K3097J5993k5593j3993L1496P809l5456K002L4790j0387l1965J5867
$$ plain form
418 -6185 23006 1524 -23872 4476 23561 -9830 -20802 13496 16993 -16613 -13937 20354 10233
431 10233 -23154 -4188 23496 -1846 -22382 5136 21997 -7962 -21557 13340 18595 -18999
443 -18999 -13361 21421 8390 -22719 -3895 25410 -2101 -26496 8468 23200 -12302 -19068
455 -19068 14507 17176 -18287 -13854 22876 6590 -24826 485 24044 -3851 -23508 6632
467 6632 23196 -11586 -20651 16094 15923 -18522 -10792 21344 5522 -24707 504 25569 -5908
480 -5908 -23724 9932 21706 -13477 -18556 16743 13008 -18714 -7512 20773 3873 -24200 1202
493 1202 25980 -8270 -23051 11920 18803 -11268 -17692 13626 15937 -21030 -8262 25027 -731
506 -731 -22287 3736 21199 -4273 -24707 10018 23189 -17067 -13414 17131 6590 -14613 -7555
$$ packed form
418f185K9191k1482k5396K8348J9085l3391j0972L4298L497l3606K676L4291j0121
431A0233l3387J8966K7684k5342k0536K7518J6861k9959j3595L4897N255l7594
443a8999N638L4782j3031l1109J8824K9305k7511k4395L4964J4732l5502o766
455a9068L3575K669l5463M433L6730j6286l1416K5311K3559k7895j9657L0140
467F632J6564l4782r065L6745j71l4445P730L2136j5822l0229K5211K5065l1477
480e908j7816L3656J1774l5183n079L5299l735l1722J1202K8285j6900k8073K5402
493A202K4778l4250j4781L4971O883l0071o424L1318K311l6967J2768L3289k5758
506g31k1556K6023J7463k5472k0434L4725J3171m0256L653L0545j0541k1203P058
$$ plain form
519 -7555 19354 4974 -26750 6153 24725 -13140 -16509 9520 15142 -8301 -18376 17703 12725
532 12725 -25017 -10 20914 -4589 -16942 1109 22735 -4544 -26444 15575 17375 -18896
544 -18896 -6765 12727 7336 -12785 -9802 22496 1639 -26042 8809 18152 -8700 -12983 4508
557 4508 16518 -8989 -16254 17495 6326 -17994 1680 13441 -572 -14350 -41 18780
569 18780 -6958 -16747 13565 8554 -12537 -3306 9797 3333 -12713 -2163 17928 -3815 -18116
582 -18116 10267 13307 -11772 -9364 10035 9460 -11808 -9149 18564 3109 -21883 5245 17106
595 17106 -6926 -13037 3493 17427 -6477 -20609 16585 11755 -19102 -1340 11311 4108 -9863
608 -9863 -10196 19982 2239 -23253 10397 11732 -7795 -5067 -1404 13319 -4375 -16587 17445
$$ packed form
519g555K6909j4380l1724L2903J8572l7865l369K6029N622k3443j0075L6079m978
532A2725l7742K5007K0924k5503j2353J8051K1626k7279k1900M2019J800l6271
544a8896J2131J9492n391k0121K983L2298k0857k7681L4851R343k6852m283J7491
557D508J2010k5507p265L3749j1169k4320J9674J1761j4013j3778J4309J8821
569A8780k5738r789L0312n011k1091R231J3103o464j6046J0550K0091k1743j4301
582a8116K8383L040k5079K408J9399n75k1268K659K7713j5455k4992K7128J1861
595A7106k4032o111J6530J3934k3904j4132L7194m830l0857J7762J2651p203j3971
608i863l33L0178j7743k5492L3650J335j9527K728L663J4723j7694j2212L4032
$$ plain form
621 17445 3215 -14702 6398 2435 1422 -3999 -7025 14739 -4077 -11504 13537 -2182 -6227
634 -6227 3914 -1165 4692 -6324 -2916 13903 -8821 -6987 11647 -1987 -4562 -1058 3835 6700
648 6700 -11963 -1826 15698 -7413 -10278 9001 5271 -4713 -7013 4645 10821 -10687 -8974
661 -8974 15342 1853 -12615 1925 7407 2075 -9173 -4450 15764 -3283 -14287 10952 4347
674 4347 -5366 -2634 -2349 12379 -5390 -13281 16789 -1160 -9571 7029 -4648 5638 -658 -11166
688 -11166 15280 -3705 -9526 12235 -7573 1718 4486 -10989 11201 -2427 -7017 11908 -10579
701 -10579 1853 8829 -12988 7481 1255 -6013 9181 -10069 2637 10017 -15124 5397 7113
714 7113 -7851 3743 -4186 2851 6725 -13472 4082 9771 -8723 -449 2101 1489 1906 -8553
$$ packed form
621A7445j4230j7917K1100l963j013n421l026K1764j8816p427K5041j5719m045
634f227J0141n079N857j1016L408J6819k2724J834J8634j3634k575L504M893K865
648F700j8663J0137J7524k3111k865J9279l730r984k300J1658O176k1508J713
661h974K4316j3489j4468J4540N482n332j1248M723K0214j9047j1004K5239o605
674D347r713K732K85J4728j7769p891L0070j7949q411J6600j1677J0286o296j0508
688a1166K6446j8985n821K1761j9808R291K768j5475K2190j3628m590J8925k2487
701a0579J2432O976k1817K0469o226p268J5194j9250J2706P380k5141K0521J716
714G113j4964J1594p929P037L874k0197J7554N689j8494Q274K550o12M17j0459
$$ plain form
728 -8553 3138 9118 -8630 -3112 7573 -481 -2765 -2523 1277 7026 -6130 -5208 10273 -1823
742 -1823 -5707 3275 -1277 4030 -2042 -6800 10333 -1410 -7252 5785 -2671 2984 202 -8545
756 -8545 10781 -774 -8456 7411 -3665 2325 1857 -9903 11106 191 -9986 8240 -2908
769 -2908 917 2177 -9349 10652 460 -10537 8306 -1457 -692 1489 -7073 9657 -464 -9564
783 -9564 8435 -1224 -2056 2120 -5377 7067 74 -8178 7199 -203 -3514 2566 -3305 3703 1522
798 1522 -6497 4136 1915 -3752 1669 -1565 879 3567 -5225 349 4921 -3849 -302 641 -872
813 -872 4812 -5169 -2447 9372 -5281 -3574 4720 -2218 4144 -4162 -4309 12265 -6621 -6051 9052
828 9052 -3714 1686 -1974 -4104 12655 -8252 -6708 12685 -5602 -872 1058 -3749 10711 -8149
$$ packed form
728h553J1691N980j7748N518J0685q054k284K42L800N749j3156R22J5481j2096
742a823l884Q982m552N307o072m758J7133j1743n842J3037q456N655k782q747
756h545J9326j1555p682J5867j1076N990m68j1760K1009j0915j0177J8226j1148
769b908L825J260j1526K0001j0192j0997J8843r763P65K181q562J6730j0121r100
783i564J7999r659q32M176p497J2444o993q252J5377p402l311O080n871P008k181
798A522q019J0633k221n667N421l234K444K688q792N574M572q770L547R43j513
813h72N684r981K722J1819j4653J707Q294o938O362q306j47J6574j8886N70J5103
828I052j2766N400l660k130J6759k0907J544J9393j8287M730J930m807J4460j8860
$$ plain form
842 -8149 -5533 13544 -7661 -1955 4453 -4096 7110 -6111 -3470 11357 -7993 -1460 5462 -4294
856 -4294 4462 -3296 -2206 7276 -6301 135 4129 -4420 3238 -636 -2197 3303 -2445 502 616
871 616 -2092 2960 -341 -2320 904 1740 -601 -3259 2239 2416 -2308 -1113 425 3679 -2520 -4824
887 -4824 6606 329 -4420 1446 433 3700 -4490 -4223 10088 -3617 -5333 5571 -1173 2227
901 2227 -3989 -2963 10789 -6976 -4271 8928 -4046 747 -1591 -1994 8871 -8467 -1572 9702
915 9702 -7148 1205 883 -2675 6764 -7820 643 8453 -9219 3086 2686 -5018 5284 -4795
929 -4795 867 5619 -8173 4485 2134 -5955 5098 -2497 -369 3071 -5009 4928 -380 -5296
943 -5296 5959 -1930 -1939 2476 -2180 3263 -1895 -2810 5700 -2732 -2660 3180 9 217 -2372 777 3611
$$ packed form
842h149K616J9077k1205N706O408q549J1206j3221K641J4827j9350O533O922r756
856d294Q756p758J090R482j3577O436L994q549P658l874j561N500n748K947J14
871F16k708N052l301j979L224Q36k341k658N498J77m724J195J538L254o199k304
887d824J1430o277m749N866j013L267q190K67J4311j3705j716J0904o744L400
901B227o216J026J3752j7765K705J3199j2974M793k338m03J0865j7338O895J1274
915I702j6850Q353l22l558R439j4584Q463P810j7672J2305m00p704J0302j0079
929d795N662M752j3792J2658k351q089J1053p595K128L440q080R937n308m916
943e296J1255p889rM415m656N443n158r15Q510q432P2N840l171K08k589L149K834
$$ plain form
960 3611 -3964 -1065 3172 -84 -1252 -1374 2852 752 -4304 1592 2468 -1499 -1424 433 3004 -1808
976 -1808 -2826 3232 185 -1728 -65 868 1930 -3070 -475 3914 -2757 -1016 2035 -395 787
991 787 -2033 555 2696 -3799 674 2670 -2360 555 -56 544 828 -3425 2363 1778 -3669 1749
1007 1749 989 -923 262 -1760 2475 132 -3682 3334 904 -2603 808 -131 1290 -760 -2315
1022 -2315 3620 -319 -2874 2182 161 -522 -624 -697 2911 -1329 -2177 3000 -481 -1507 568 12
1038 12 1111 -1362 -563 2618 -1614 -1248 1665 -246 -198 -552 488 1436 -2075 -24 1825 -1432 -332
1055 -332 792 367 71 -1366 896 1047 -1988 227 1366 -351 -530 -144 1186 -379 -1562 1343
1071 1343 698 -1087 6 560 580 -1007 -717 1620 -387 -1085 1019 420 -367 -704 327 984 -1326
$$ packed form
960C611p575K899M237l256j168j22M226k100n056N896Q76l967P5J857K571m812
976a808j018O058l047j913J663R33J062n000K595M389o671J741L051k430J182
991G87k820K588K141o495M473J996n030K915o11O00K84m253N788n85n447N418
1007A749p60j912J185k022M235k343l814P016k430l507L411r39J421k050j555
1022b315N935l939k555N056k021o83j02p3L608m240q48N177l481j026K075n56
1038A2J099k473P99L181m232L66K913j911M8l54J040R48l511K051J849l257J100
1055c32J124m25k96j437K262J51l035K215J139j717j79L86J330j565j183K905
1071A343o45j785J093N54K0j587K90K337k007o98K104n99p87l37J031O57k310
$$ plain form
1088 -1326 -194 1548 -530 -509 124 449 146 -1467 778 1405 -1582 -124 1103 -207 -620 -614 1202
1105 1202 396 -1673 784 1108 -959 -607 234 1077 -531 -1239 1659 418 -1438 216 468 239 -634
1122 -634 -521 1634 -242 -1292 832 283 -438 -342 231 959 -754 -394 985 -528 -290 178 44 488
1140 488 -587 105 754 -1007 56 618 -505 151 143 183 33 -707 461 232 -754 245 419 51 -398
1159 -398 -254 736 -355 -777 810 336 -486 -99 287 292 -607 -364 787 170 -675 149 710 -431 -593
1178 -593 369 344 -162 -323 331 580 -722 -283 721 -225 -138 32 360 407 -954 196 647 -894 273
1197 273 248 -137 511 -811 325 545 -1151 593 235 -448 644 -571 268 278 -968 807 -153 -363
1215 -363 890 -783 291 247 -942 917 -399 -308 1100 -951 265 494 -940 687 -327 -139 896
$$ packed form
1088a326J132J742k078K1O33L25l03j613K245O27k987J458J227j310m13OJ816
1105A202q06k069K457L24k067L52Q41Q43j608p08K898j241j856J654K52k29q73
1122f34J13K155j876j050K124n49p21R6N73P28j713L60J379j513K38M68j34M44
1140D88j075O92O49j761J063N62j123O56qM0j50p40J168k29r86R99J74l68m49
1159c98J44R90j091m22J587m74q22L87L86Nq99K43J151o17q45Q24N61j141j62
1178e93R62k5n06j61O54K49j302M39J004r46Q7J70L28M7j361J150M51j541J167
1197B73k5l85O48j322J136K20j696J744l58o83J092j215Q39J0j246J775r60k10
1215c63J253j673J074m4j189J859j316R1J408k051J216K29j434J627j014J88J035
$$ plain form
1232 896 -889 332 430 -752 415 -284 111 442 -650 486 131 -447 220 -244 398 -7 -298 594
1250 594 -316 14 -2 -422 731 -471 -33 668 -753 560 -243 -599 1111 -881 75 715 -957 1024
1268 1024 -668 -545 1565 -1466 330 846 -1220 1281 -1029 -381 1913 -2132 614 1225 -1618 1453
1284 1453 -1037 -303 2007 -2631 950 1415 -2109 1575 -770 -355 1850 -2674 1241 1445 -2491 1745
1300 1745 -357 -692 1569 -2248 1228 1140 -2424 1813 -177 -898 1366 -1674 971 661 -1838 1787
1316 1787 -423 -833 1342 -1364 555 536 -1259 1377 -532 -573 1273 -1184 44 759 -644 374
1332 374 -307 153 641 -1079 13 804 -234 -512 104 888 -306 -910 477 615 -337 -956 730 1166
1350 1166 -1332 -359 971 39 -295 -969 1123 1114 -2173 467 1321 -1038 113 -504 761 991 -2305
$$ packed form
1232H96j785J221R8j182J167o99L95L31j092J136l55n78O67m64O42m05k91Q92
1250E94r10L30j6m20J153j202M38P01j421J313q03l56J710j992R56O40j672J981
1268A024j692J23K110l031J796N16k066K501k310O48K294m045K746O11k843L071
1284A453k490P34K310m638L581M65l524L684k345M15K205m524L915K04l936M236
1300A745k102l35K261l817L476q8l564M237j990p21K264l040K645l10k499L625
1316A787k210m10K175k706J919j9j795K636j909m1J846k457J228P15j403J018
1332C74o81M60M88j720J092P91j038k78O16P84j194o04J387J38r52o19J686M36
1350A166k498R73J330r32l34o74K092rl287K640Q54k359J151o17J265K30l296
$$ plain form
1367 -2305 967 1380 -1851 589 -32 45 954 -1869 1069 1004 -2090 1224 -22 -715 1319 -1393 611
1384 611 827 -1872 1538 -358 -1189 2052 -1257 -200 1201 -1391 1152 -613 -1137 2498 -1450 -860
1400 -860 1879 -1051 294 -440 -575 2292 -1842 -895 2555 -1178 -568 205 -74 1506 -1935 -397 2735
1417 2735 -1598 -894 1054 -26 512 -1447 233 2260 -1921 -655 1667 -485 -158 -564 382 1412
1433 1412 -1721 -187 1670 -996 -418 381 75 436 -856 141 956 -871 -168 581 -233 2 27 81
1451 81 77 -356 196 201 -485 168 509 -436 -269 405 22 -263 -271 409 666 -1019 -140 1367 -827 -680 714
1472 714 52 318 -917 -48 1810 -1557 -787 1827 -552 -376 -58 97 1425 -1708 -571 2310 -1193
1489 -1193 -682 878 -72 709 -1360 -92 2085 -1743 -411 1476 -625 244 -696 60 1576 -1854
$$ packed form
1367b305L272M13l231K440o21P7R09k823K938o5l094L314j246o93K034k712K004
1384F11K16k699L410j896q31L241l309J057J401k592K543j765n24L635l948N90
1400h60K739k930J345p34j35K867m134R47L450l733O10P73k79J580l441J538L132
1417B735m333P04J948j080N38j959J680K027m181J266K322k152L27m06R46J030
1433A412l133J534J857k666N78P99l06L61j292R97Q15j827P03P49q14K35K5N4
1451H1mm33N52No86O53L41r45J67O74l83k85qO80K57j685Q79J507k194J47J394
1472G14o62K66j235Q69J858l367P70K614k379J76L18J55J328l133J137K881l503
1489a193N11J560r50P81k069J268K177l828J332J887k101Q69r40P56J516l430
$$ plain form
1505 -1854 10 1623 -1240 305 57 -400 1042 -1299 128 1336 -1441 471 537 -918 765 -502
1521 -502 -86 759 -1010 654 333 -1147 865 3 -525 397 -386 629 -62 -971 1158 -23 -1014 597
1539 597 216 84 -305 -449 1140 -229 -1232 824 556 -610 -269 281 587 -522 -719 911 369 -912
1557 -912 -45 740 84 -703 -100 737 -45 -778 377 631 -402 -380 249 300 -169 -526 473 394 -688 76
1577 76 374 -353 71 -98 108 330 -513 271 369 -728 396 168 -432 408 -206 99 201 -647 587 95
1597 95 -761 640 38 -236 169 -451 575 -103 -798 945 -41 -554 408 -181 324 -196 -602 1033 -213
1616 -213 -664 696 -204 16 -97 -379 838 -385 -536 911 -354 -215 211 -258 498 -360 -254 777
1634 777 -489 -227 370 -256 196 -235 -41 531 -494 -24 345 -344 141 -2 -10 277 -358 135 249 -360
$$ packed form
1505a854J864J613k863J545k48m57J442k341J427J208k777J912O6j455J683j267
1521e02M16Q45j769J664l21j480K012q62n28R22p83J015o91r09K129j181r91J611
1539E97l81j32l89j44J589j369j003K056k68j166L41N50L06j109j97J630n42j281
1557i12Q67P85o56p87O03Q37p82p33J155K54j033K2O29N1m69l57R99p9j082P64
1577G6K98p27M24j69K06K22q43P84R8j097J124k28o00Q40o14L05J02q48J234m92
1597I5q56J401o02k74M05o20J026o78o95J743r86n13R62n89N05n20m06J635j246
1616b13m51J360r00K20j13k82J217j223j51J447j265J39M26m69P56q58J06J031
1634G77j266K62N97o26M52m31J94N72j025M70L69o89M85j43qK87o35M93J14o09
$$ plain form
1654 -360 87 128 -75 94 -122 120 24 -214 155 24 -106 45 113 95 -160 0 144 -94 -17 64 99 -1
1676 -1 -205 109 4 -207 110 5 74 -4 -133 240 -128 -197 226 -125 50 42 -150 240 -184 -180 257 -192 36
1699 36 134 -186 203 -160 -104 261 -237 78 135 -231 258 -122 -134 233 -186 122 117 -160 223 -59 -163 186
1721 186 -113 81 54 -105 242 -120 -114 198 -133 25 67 -15 139 -118 -31 161 -149 -8 117 40 24 -113 57
1744 57 42 -171 19 119 -3 -3 -3 100 -89 -198 98 73 -84 -55 120 20 -125 -31 109 -41 -116 51 134 -29
1768 -29 -113 89 67 -113 -14 132 28 -83 -42 91 -96 -115 101 107 -58 -49 145 108 -234 -10 217 -66 -99 108
1792 108 131 -70 -196 95 168 -208 -62 198 70 -263 -66 212 -82 -226 118 203 -91 -209 96 161 -236
1813 -236 -142 249 46 -229 -35 233 5 -290 88 197 -101 -91 100 141 -189 -181 288 42 -219 104 173 -17
$$ packed form
1654c60M47M1k03J69k16K42r6k38L69j31j30J51O8j8k55J60J44k38P7Q1L5j00
1676ak04L14j05k11L17j05O9p8j29L73l68o9M23l51J75qj92L90m24MM37m49K28
1699C6R8l20L89l63N6L65m98L15N7l66M89l80j2L67m19L08nk77L83k82j04L49
1721A86k99J94k7j59L47l62OL12l31J58M2q2J54k57Q7J92l10J41J25p7j6j37J70
1744E7j5k13J90J00j22%%J03j89j09K96k5j57K9J75j00j45R4J40j50p5J67Q3j63
1768b9q4K02k2j80R9J46j04j11M1J33j87j9K16Oj65RJ94l7l42K24K27k83l3K07
1792A08K3k01j26K91P3l76J46K60j28l33J97K78k94j44L44Q5k94j18L05O5l97
1813b36R4L91k03k75J94K68k28k95L78J09k98J0J91M1l30QM69k46k61L23O9j90
$$ plain form
1835 -17 -189 49 220 -205 -120 271 48 -141 -92 193 85 -375 100 349 -199 -174 132 202 -142 -296 312 195
1857 195 -407 18 268 -28 -273 -105 409 -66 -374 292 181 -239 -145 119 263 -277 -201 460 -6 -322 54
1878 54 189 4 -273 99 334 -248 -151 245 45 -192 -105 297 99 -309 107 275 -194 -189 123 236 -186 -178
1900 -178 339 51 -292 -22 253 71 -337 100 403 -262 -191 200 72 -115 -237 294 258 -504 72 311 -140
1921 -140 -142 -66 324 -18 -431 373 164 -396 49 130 119 -207 -226 495 -118 -471 340 104 -143 -93 54 395
1943 395 -373 -196 570 -147 -339 202 200 33 -376 65 477 -378 -268 467 130 -311 -127 334 151 -492 -57
1964 -57 515 -53 -393 161 343 -200 -289 208 323 -238 -277 434 164 -485 20 262 1 -181 -116 398 -47
1985 -47 -476 344 127 -295 64 30 211 -178 -275 465 -181 -355 358 -68 -23 -62 -120 366 -336 -219 586 -241
$$ packed form
1835a7j72K38J71m25Q5L91k23j89M9K85j08m60M75K49n48K5L06P0l44j54O08j17
1857A95o02M25K50k96k45J68N14m75l08O66j11m20R4K64J44n40P6O61m66l16L76
1878E4J35j85k77L72K35n82R7L96k00k37Q7M02j98m08M16J68m69NL12J13m22Q
1900a78N17k88l43K70K75j82m08M37L03o65P1L91j28j87j22N31l6p62N76K39m51
1921a40kP6L90l42m13Q04k09n60M45Q1j1l26j9P21o13l53Q11k36k47N0J47L41
1943C95p68J77P66p17j92N41kj67m09M41M12q55J10P35l37m41J84M61j83o43M35
1964e7N72n68l40N54J82n43q9M97J15n61l9P11k70o49N05K42k61j82O5N14m45
1985d7m29Q20k17m22L59l4J81l89r7P40o46j74P13m26M5l9n8M86p02J17Q05q27
$$ plain form
2007 -241 -152 270 -104 115 -253 8 480 -471 -91 487 -177 -125 -37 175 200 -514 148 522 -376 -188 239
2028 239 130 -165 -245 302 342 -474 -110 445 -106 -382 114 290 -16 -322 24 441 -261 -411 437 140 -293
2049 -293 25 56 283 -301 -341 616 -191 -350 378 -107 99 -123 -291 592 -320 -317 649 -377 40 200 -376
2070 -376 462 -259 -161 672 -569 92 397 -520 319 -100 -114 514 -598 264 409 -665 338 100 -161
2089 -161 302 -439 369 283 -767 419 184 -384 176 -158 310 65 -612 421 211 -468 134 88 142 -72
2109 -72 -305 354 48 -404 90 233 -38 -176 23 166 -2 -208 -14 294 -124 -193 265 -77 -35 24 -228
2130 -228 310 -91 -249 442 -238 7 263 -461 361 46 -397 526 -326 -11 372 -628 447 157 -585
2149 -585 562 -237 -91 391 -675 461 200 -667 598 -178 -165 394 -678 465 166 -723 669 -85
$$ packed form
2007b41Q9M22l74K19l68K61M72r51L80N78o64N2Q8K12K5p14O62L74q98J88M27
2028B39j09k95q0N47M0q16L64N55n51k76M96J76l06l06L46M17p02j50Q48k97m33
2049b93L18L1K27n84m0R57q07j59P28m85K06k22j68Q83r12LR66j026M17J60n76
2070c76Q38p21R8Q33j241O61L05r17Q39m19j4O28j112Q62J45j074J003k38k61
2089a61M63p41Q08q6j050J186k35n68N60l34M68k45o77J033k10o79O02m6N4k14
2109g2k33O59l06m52M94J43k71j38J99J43j68k06J94L08m18o9M58l42M2N9k52
2130b28N38m01j58O91o80K45K56p24Q22l15m43R23q52L15L83j000J075k90p42
2149e85J147p99J46M82j066J136k61q67J265p76J3N59j072J143k99q89J392p54
$$ plain form
2167 -85 -301 425 -514 305 213 -678 586 -60 -358 433 -403 186 222 -543 442 7 -308 341 -289 79 231
2188 231 -469 272 148 -250 191 -152 50 194 -366 146 290 -249 -12 71 45 14 -247 96 317 -256 -157
2209 -157 269 -11 -178 -40 64 217 -234 -185 468 -116 -288 197 -13 38 -135 -143 483 -217 -330 401 -141
2230 -141 -96 105 -159 345 -216 -273 524 -270 -167 364 -249 149 -33 -232 389 -359 -95 527 -442 58 295
2251 295 -279 253 -214 -28 511 -600 83 588 -494 23 114 -15 246 -525 212 589 -761 10 404
2270 404 -220 33 -262 316 382 -839 217 567 -592 -67 123 144 93 -606 392 498 -789 62 430 -146
2290 -146 -109 -213 394 133 -735 329 431 -456 -4 156 188 -103 -395 453 174 -589 283 345 -215 -134 17
2311 17 292 -140 -393 441 197 -464 77 350 -96 -316 41 398 -130 -437 359 314 -496 -176 439 80 -399
$$ packed form
2167h5k16P26r39Q19r2q91J264o46k98P91q36N89L6p65R85m35l15O49o30L68J52
2188B31p00P41j24l98M41l43K02J44n60N12J44n39K37Q3k6l1k61L43K21n73R9
2209a57M26k80j67J38J04J53m51M9O53n84j72M85k10N1j73qO26p00j13P31n42
2230a41M5K01k64N04n61n7P97p94J03N31o13L98j82j99O21p48K64O22r69N00K37
2251B95n74N32m67J86N39j111O83N05j082N17R1j29K61p71P37L77j350P71L94
2270D04o24K53k95N78O6j221J056L50j159N25J90K1n1o99R98J06j287Q51L68n76
2290a46L7j04O07k61q68J064J02q87M52J60L2k91k92Q48k79p63Q72O2n60Q1J51
2311A7K75m32k53Q34k44o61N41K73m46k20L57L57n28l07P96m5q10L20O15l59m79
$$ plain form
2332 -399 -59 440 27 -625 169 618 -425 -379 431 238 -302 -389 427 353 -769 28 721 -276 -374 141 413
2353 413 -46 -673 431 620 -693 -114 495 28 -297 -327 564 218 -854 390 596 -470 -221 193 344
2372 344 -205 -558 689 283 -796 167 443 -148 -277 -50 680 -180 -701 633 268 -616 -38 383 257
2391 257 -462 -217 771 -206 -655 405 378 -266 -375 270 542 -596 -385 718 30 -548 72 516 -41
2410 -41 -656 183 674 -467 -445 508 341 -481 -317 573 169 -671 59 629 -153 -539 209 563 -416 -532
2430 -532 535 358 -492 -203 560 135 -673 8 641 -202 -494 302 479 -306 -524 463 437 -658 -131 634
2450 634 -3 -518 -50 585 -79 -678 350 546 -502 -330 417 275 -486 -313 686 93 -706 178 472
2469 472 -222 -455 173 563 -365 -475 588 182 -565 -84 460 106 -525 5 684 -268 -509 384 331 -326
$$ packed form
2332c99L40M99m13o52P94M49j043M6Q10j93n40q7Q16p4j122P97O93r97r8N15K72
2353D13m59o27J104J89j313N79O09m67l25l0Q91l46j072J244K06j066K49M14J51
2372C44n49l53J247m06j079R63K76n91j29K27P30q60n21J334l65q84N78M21j26
2391B57p19K45R88r77m49J060k7o44j09O45K72j138K11J103o88n78O20M44n57
2410d1o15Q39M91j141K2R53j67q22J64Q90m04q40P30N70p82l86P48L54r79j16
2430e32J067j77q50K89P63m25q08O81O33q43k92P96J77p85k18R87k6j095N27P65
2450F34o37n15M68O35o64n99J028J96j048J72P47j42p61J73R99n93p99Q84K94
2469D72o94k33O28L90r28j10J063m06p47M81N44l54o31N30O79r52k41Q93n3o57
$$ plain form
2489 -326 -324 400 383 -589 -129 596 -117 -459 106 460 -110 -524 330 455 -514 -261 441 194 -408 -164 556
2510 556 33 -606 147 438 -213 -390 231 422 -377 -368 462 141 -480 -8 453 15 -476 97 419 -290 -379
2531 -379 305 312 -300 -310 395 188 -495 -25 431 -58 -344 67 405 -177 -388 323 222 -313 -141 313 182
2552 182 -380 -82 414 -110 -314 205 216 -118 -274 155 274 -324 -136 403 12 -272 -20 241 2 -379
2572 -379 186 333 -252 -137 202 99 -198 -182 303 102 -344 53 247 -111 -216 30 206 -100 -215 255
2592 255 140 -245 -90 164 28 -192 11 218 -4 -167 47 157 -124 -121 178 54 -91 -34 59 69 -192 -35
2614 -35 205 -102 -80 115 -22 -14 -110 5 134 -201 60 155 -144 33 -9 -26 130 -176 100 147 -205 116 -14
2637 -14 -105 152 -143 58 56 -213 186 -67 -134 186 -164 35 122 -166 154 -58 -127 175 -177 -2 170 -168
$$ packed form
2489c26KP24j7r72M60P25p13l42N65L54n70m14Q54J25r69K53P02k47o02K44P20
2510E56n23o39P53K91o51j77O21J91p99RQ30l21o21M72M61m38m91N73L22p09q9
2531c79O84Po12j0P05k07o83M70M56m89k86M11L38n82k11P11j01n35J72M54j31
2552A82n62K98M96n24k04N19J1l34j56M29J19n98J88N39l91k84K52K61k39l81
2572c79N65J47n85J15L39j03k97J6M85k01m46L97J94l58j05K46J76l06j15M70
2592B55j15l85J55K54j36k20K03K07k22j63K14J10k81LK99j24j45N7R3J0k61J57
2614c5K40l07K2J95j37Qr6J15J29l35K61R5k99J77m2j7J56l06K76M7l52L21j30
2637a4r1K57k95K01kk69L99k53o7L20l50J99Q7k88L20k12o9L02l52J75J72l38
$$ plain form
2659 -168 94 33 -65 72 -126 75 150 -159 58 102 -58 -46 -37 164 23 -162 144 132 -104 -135 140 79 -177
2682 -177 -15 141 69 -180 -117 296 -66 -271 227 116 -139 -99 -13 266 -196 -242 414 -74 -216 162 6 118
2704 118 -259 -122 467 -301 -203 424 -189 -32 -84 -38 371 -458 -19 504 -431 -40 222 -52 129 -270 185
2725 185 383 -568 72 375 -290 -16 -8 243 114 -531 347 352 -559 19 309 38 -131 -246 433 91 -687
2746 -687 259 414 -302 -165 172 292 -213 -419 409 265 -564 6 462 -58 -342 24 361 -15 -521 279
2766 279 467 -457 -170 370 49 -211 -181 355 262 -594 134 533 -379 -186 200 151 -53 -355 345 379 -670
2787 -670 145 456 -278 -87 17 303 1 -593 450 310 -658 178 334 -57 -204 -216 516 -29 -707 516
2807 516 376 -526 -29 259 235 -331 -425 693 114 -765 280 449 -260 -342 56 533 -229 -630 641 367
$$ packed form
2659a68K62o1r8J37j98K01P5l09K17M4j60J2RK01j41j85L06j2k36l1K75o1k56
2682a77J62J56p2k49O3M13l62k05M98j11k55M0Q6K79m62m6O56m88j42L78j56J12
2704A18l77J37N89p68R8O27o13J57n2M6M09q29M39N23r35L91K62k74J81l99M55
2725A85J98r51O40L03o65K74QK51j29o45Q78Nr11N78K90k71j69j15O79l42p78
2746f87R46J55p16J37L37J20n05k06Q28j44q29N70M56n20k84L66L37l76n06Q00
2766B79J88r24K87N40l21k60L0N36r3q56P28L99r12J93L86m9k04l02P00L4j049
2787f70Q15L11p34J91J04K86l02n94J043j40r68Q36J56l91j47j2P32n45o78J223
2807E16j40r02M97K88k4n66r4J118n79q79J045J69p09q2L98M77p62m01J271k74
$$ plain form
2827 367 -712 -41 446 59 -400 -192 668 21 -784 388 467 -446 -194 196 349 -182 -522 632 185
2846 185 -754 270 340 -155 -124 -116 489 -96 -623 608 144 -531 230 130 69 -212 -223 664 -219 -559 645
2867 645 68 -368 12 88 321 -482 -259 810 -259 -554 432 156 -144 -345 164 574 -537 -347 702
2886 702 13 -503 41 394 94 -543 28 667 -323 -532 417 277 -346 -235 297 306 -445 -277 609 21 -542
2907 -542 207 326 -153 -234 69 402 -213 -399 548 144 -485 157 175 -16 -191 -151 567 -218 -493 598 2
2928 2 -366 85 11 280 -324 -270 749 -312 -443 488 -19 -89 -157 38 577 -528 -250 705 -269 -269 185 112
2950 112 257 -507 39 640 -572 -195 457 -82 -65 -200 176 346 -609 12 553 -262 -154 164 164 -34 -360
2971 -360 214 289 -387 -39 299 0 -201 -77 289 -5 -363 155 258 -215 -144 213 77 -178 -69 166 88
$$ packed form
2827C67j079O71M87l87m59K08Q60o47q05J172P9r13K52L90J53n31l40J154m47
2846A85r39J024P0m95L1QO05n85n27J231m64o75P61j00o1k81j1Q87q83l40J204
2867F45n77m36L80P6K33q03K23J069j069k95R86k76l00k01N09M10j111J90J049
2886G02o89n16N44L53l00o37N71O39r90k09R49j40o23J11N32Rp51J68Q86n88n63
2907e42P49J19m79q1L03L33o15j86R47m04o29O42J8j91j75M0P18p85k75J091n96
2928Bl68M51p4K69o04N4J019j061j31R31n07p0o8J95N39j105K78R55r74%M54p3
2950A12J45p64N46O01j212L77O52n39J7j35L76J70r55O21N41q15J08L18%j98l26
2971c60N74P5o76L48L38k99k01J24L66k94l58N18J03m73P1L57j36k55J09K35p8
$$ plain form
2992 88 -243 -18 314 -157 -263 232 41 -150 -21 63 182 -239 -112 370 -146 -224 198 43 -20 -159 35
3013 35 335 -335 -76 386 -124 -66 10 65 136 -333 90 383 -280 -63 217 -22 27 -222 161 246 -356 85
3035 85 294 -196 -11 -18 100 102 -302 170 199 -255 28 118 -45 14 -115 152 56 -240 96 77 -122 23 -6 45
3059 45 -19 -131 116 29 -148 77 45 -76 24 -30 69 -6 -119 107 37 -91 98 57 -21 -47 -5 50 -13 -96 76
3084 76 10 -64 17 40 4 -31 -11 63 -3 -72 61 -2 -64 -7 21 3 -20 -27 55 -7 -62 22 21 -5 26 -19 -7 1 -34 2 14
3115 14 -29 32 0 -33 51 -15 -35 60 -13 43 3 -41 53 -59 -85 84 9 -23 10 -1 93 -50 -72 104 -53 -66 86
3142 86 22 38 -40 -21 127 -64 -30 116 -4 -16 -7 16 77 -125 -12 143 -64 -19 31 7 -7 -114 35 65 -112
3167 -112 -2 74 -52 -38 -13 65 -1 -104 56 27 -137 -19 41 10 -66 -36 128 -19 -127 56 41 -53 -85 83
$$ packed form
2992H8l31K25L32m71j06M95j91j91J29Q4J19m21J27M82n16p8M22j55o3j39J94
3013C5L00o70K59M62n10N8P6N5P1m69M23K93o63K17K80k39M9k49L83Q5o02M41
3035H5K09m90J85pJ18Km04M72K9m54K83R0j63N9j29K67r6k96L36j9j99J45k9N1
3059D5o4j12K47q7j77K25l2j21J00n4R9p5j13K26p0j28J89m1p8k6M2N5o3q3J72
3084G6o6p4Q1K3l6l5K0P4o6o9J33o3o2N7K8j8k3pQ2o2n5Q4jk6L1m5J2Ql5L6J2
3115A4m3O1l2l3Q4o6k0R5p3N6m0m4R4j12k6J69p5l2L3j1R4j43k2J76j57j3J52
3142H6o4J6p8J9J48j91L4J46j20j2RK3O1k02J13J55k07M5N0k4j4j07J49L0j77
3167a12J10P6j26J4K5P8o6j03J60k9j64J18O0l1p6L0J64j47j08J83j5r4l2J68
$$ plain form
3191 83 109 -125 -66 156 10 -135 -9 105 -2 -136 42 139 -97 -71 66 40 -55 -62 168 45 -163 51 100
3214 100 -20 -45 57 132 -43 -110 125 24 -115 -1 38 32 -117 -15 160 -99 -120 82 23 -69 -67 81 83 -185
3238 -185 -4 144 -50 -70 12 126 -38 -182 100 122 -144 -39 106 60 -107 -47 136 -6 -151 100 134 -52
3260 -52 -85 46 94 -109 -101 161 36 -125 -2 104 7 -167 18 146 -69 -99 102 36 -92 -63 87 61 -114
3283 -114 -7 146 -12 -140 56 103 -30 -58 97 57 -123 -71 108 -8 -143 19 97 -28 -80 1 108 -99
3305 -99 -108 122 49 -88 3 77 5 -96 -18 143 -21 -97 110 93 -77 -48 47 69 -117 -35 161 2 -107 44 53
3330 53 -16 -82 11 123 -90 -81 138 12 -89 19 74 36 -86 -14 133 -56 -81 77 17 -32 -20 35 53 -96 -63
3355 -63 83 -52 -74 65 12 8 -47 -8 68 -99 -38 138 -27 -44 37 31 23 -71 -40 97 -32 -55 108 24 -56 -13 23
$$ packed form
3191H3K6k34N9K22j46j45J26J14j07j34J78R7k36K6J37k6r5pK30j23k08K14M9
3214A00j20k5J02P5j75o7K35j01j39J14L9oj49J02J75k59k1K02n9r2KJ48Kk68
3238a85J81J48j94k0Q2J14j64j44K82K2k66J05J45m6j67O0J83j42j45K51L4j86
3260e2l3J31M8k03QK62j25j61J23J06r7j74J85J28k15l0K01o6j28K9J50k6j75
3283a14J07J53j58j28J96M7j33k8J55m0j80N2J79j16j35J62P8j25n2Q1J07k07
3305i9rK30p3j37R1P4p2j01P8J61j64p6K07j7j70K9R5K2j86Q2J96j59j09J51R
3330E3o9o6R3J12k13RK19j26j01J08N5l8j22P2J47j89k5J58o0m9J2N5J8j49L3
3355f3J46j35k2J39n3mn5L9P6j67O1J76j65j7Q1oqr4L1J37j29k3J63q4q0M3L6
$$ plain form
3382 23 117 -41 -48 129 -74 -68 51 -18 60 -39 -52 117 -70 -71 128 -77 13 50 -43 83 -31 -30 106 -86 -21 103
3408 103 -77 15 -10 -34 105 -99 -37 113 -103 43 59 -86 93 -59 -7 81 -123 36 104 -109 43 -22 -6
3431 -6 97 -125 24 92 -120 90 15 -28 99 -75 35 118 -84 45 69 -72 80 -19 -40 96 -65 29 83 -86
3455 -86 66 -4 -39 80 -35 -54 64 -63 -18 -21 -65 80 -41 -67 63 -46 -66 51 -78 30 39 -81 89 -14
3479 -14 -97 74 -43 -41 69 -97 65 33 -123 108 -8 -82 138 -95 35 62 -158 111 -11 -135 183 -96
3501 -96 -13 137 -141 77 -2 -113 148 -99 -55 164 -126 37 81 -119 143 -123 -59 159 -154 15 92 -115
3523 -115 101 -45 -87 162 -157 -31 162 -114 42 49 -93 99 -100 -38 112 -125 -18 100 -77 31 -8 -1
3545 -1 124 -107 -31 152 -88 6 69 -72 98 -69 -67 147 -91 -4 130 -74 18 26 -79 75 -55 -50 114 -112
$$ packed form
3382B3R4j58pJ77k03OJ19o9P8r9j3J69j87jJ99k05R0L7r3J26j14JJ36j92O5J24
3408A03j80R2k5k4J39k04O2J50k16J46J6j45J79j52N2Q8k04J59O8k13J52o5J6
3431fJ03k22J49O8k12K10p5m3J27j74J10Q3k02J29K4j41J52r9k1J36j61R4N4j69
3455h6J52p0l5J19j15j9J18j27M5lm4J45j21k6J30j09k0J17j29J08Rj20J70j03
3479a4q3J71j17KJ10j66J62l2j56K31j16p4K20k33J30K7k20K69j22j24L18k79
3501i6Q3J50k78K18p9j11K61k47M4K19k90J63M4k00K62k66O4K18l13J69P7k07
3523a15K16j46m2K49l19J26J93k76J56Pj42J92j99O2J50k37J07J18j77J08l9P
3545aJ25k31P6J83k40R4O3j41J70j67KK14k38Q7J34k04R2Qj05J54j30NJ64k26
$$ plain form
3569 -112 18 92 -116 74 -3 -62 116 -107 27 142 -143 63 44 -86 127 -67 -18 108 -146 27 89 -134
3591 -134 37 -9 -25 112 -127 39 127 -147 47 47 -72 78 -67 8 93 -142 48 106 -82 63 -31 -64 129
3614 129 -92 6 114 -130 47 81 -77 80 -25 -7 104 -74 -8 82 -114 66 17 -86 98 -56 -36 129
3636 129 -128 22 49 -103 100 -38 -47 132 -128 -5 88 -102 99 -31 -48 131 -75 -17 95 -98 53 9
3658 9 -92 153 -78 -17 98 -98 5 30 -64 85 -30 -22 105 -76 40 75 -94 50 7 -39 76 -67 15 49
3682 49 -62 4 63 -62 -2 25 -4 93 -63 1 112 -82 -25 66 -23 -37 -12 -5 43 -100 22 108 -104 -31 43 9 22
3709 22 -55 27 101 -157 13 118 -88 -39 1 4 100 -109 18 100 -119 9 64 -19 36 -65 35 98 -143 38 74
3734 74 -110 11 -3 24 2 -126 109 94 -121 76 74 -35 1 -20 88 -5 -110 93 65 -97 -5 53 30 -57 -20
$$ packed form
3569a12J30P4k08J90p7n9J78k23J34J15k85K06j9j30K13j94M9J26k54J73O2k23
3591a34J71m6j6J37k39J66Q8k74J94%j19J50j45P5Q5k35J90N8j88J45r4l3J93
3614A29k21R8J08k44J77L4j58J57j05J8J11j78O6R0j96J80m9j03J84j54K0J65
3636A29k57J50K7j52K03j38rJ79k60J23R3j90K01j30j7J79k06N8J12j93J51m4
3658Ij01K45k31O1J15j96J03K5r4J49j15QJ27j81J16L5j69J44m3m6J15j43Q2L4
3682D9j11O6N9j25O0K7k9R7j56O4J11j94N7R1q9j4K5PM8j43J22Q6k12P3P4l4J3
3709B2p7Q2P4k58J70J05k06M9M0LR6k09J27Q2k19J28N5q3N5j01J00O3k41J81L6
3734G4j84J21j4K7k2j28K35j5k15J97kj09L6k1J08r3j05K03k8j62R2N8k3q7L7
$$ plain form
3759 -20 91 31 -118 51 96 -83 -64 42 59 -57 -92 108 62 -147 -12 97 -26 -71 17 65 -8 -116 64 75
3783 75 -104 -46 81 8 -53 -38 139 34 -177 70 131 -82 -8 56 80 -49 -112 150 73 -137 53 71 -24 -62 24
3808 24 117 -109 -80 126 37 -119 -15 82 33 -115 -28 171 -91 -137 83 83 -77 -95 109 63 -123 -44 134 -2
3832 -2 -160 8 147 -45 -125 87 91 -106 -82 108 65 -141 -69 152 3 -135 30 123 -16 -123 65 128 -135
3855 -135 -69 121 52 -78 -69 164 30 -169 28 128 -64 -84 48 124 -63 -77 120 39 -150 -4 97 -9 -129
3878 -129 -8 150 -54 -119 92 49 -103 -34 106 44 -160 -22 135 -28 -132 67 79 -41 -133 67 95 -126
3900 -126 -13 147 2 -135 -18 148 -29 -137 101 124 -104 -66 111 76 -113 -45 166 18 -171 -17 133
3921 133 -33 -121 69 103 -98 -139 106 71 -97 -49 109 26 -148 15 129 -15 -121 48 128 -76 -78 100 41
$$ packed form
3759b0J11o0j49J69M5j79J9J06J7j16l5K00m6k09J35J09j23m5Q8M8p3j08J80J1
3783G5j79N8J27p3o1J5J77j05k11K47O1k13P4O4K4j29o3K62p7k10J90J8r5l8Q6
3808B4R3k26K9K06q9j56J04R7m9j48Q7J99k62m6K20%j60j8K04m6j86P9J78j36
3832bj58J68J39j92q0K12Mj97K4J90m3k06P2K21j49j38J65R3j39j07J88O3k63
3855a35O6J90o9j30RK33j34j99J97J00j92k0J32P6j87j4J97q1j89J46J01j06j20
3878a29J21J58k04o5K11m3j52O9J40o2k04J38J57j63j04J99J2j20r2K00K8k21
3900a26J13J60j45j37J17J66j77j08K38K3k28L8J77l5j89O8K11j48j89J54J50
3921A33j66q8J90L4k01m1K45l5j68M8J58q3j74J63J14j44j06J69Q0k04kJ78n9
$$ plain form
3944 41 -124 -61 66 17 -106 -15 118 -48 -107 74 63 -85 -92 70 56 -140 -12 123 -17 -97 13 87 -40 -67
3968 -67 42 70 -88 2 80 44 -69 -34 79 7 -87 58 74 -58 -32 71 83 -71 -37 54 54 -71 -25 73 -18 -84
3994 -84 37 58 -52 -64 36 61 -89 -41 69 -1 -68 -16 64 2 -60 23 56 -82 -51 25 10 -6 -63 30 20 -100 -1
4021 -1 66 -43 -18 8 9 -8 -60 57 36 -102 -5 43 -5 -12 -5 33 9 -54 58 30 -50 -10 -5 33 -22 -75 47 8 -43 19
4051 19 3 -5 -49 -11 24 -27 -35 55 -2 -25 9 -1 12 -25 -20 60 4 -36 8 -9 -64 -26 -19 0 -3 -21 37 22 -35 24 -1 -29 38
4084 38 -15 14 14 -38 42 19 -26 24 -46 -26 48 -48 25 29 -61 57 -10 -2 62 -63 4 37 -36 15 -11 -4 63 -63 19 44 -84
4115 -84 -5 8 2 6 -28 30 27 -88 32 39 -82 5 -3 -4 -4 -70 22 49 -33 9 20 -41 -16 -1 40 35 -80 48 53 -91 10
4146 10 20 -1 13 -60 41 60 -101 43 34 -53 -18 24 4 15 -89 55 81 -127 50 76 -40 19 -6 33 20 -125
$$ packed form
3944D1j65O3J27m9j23R1J33j66n9J81j1j48pJ62j4j96J28J35j40q0J10P4j27k7
3968f7J09K8j58R0P8l6j13L5J13p2r4J45J6j32K6J03J2j54L4R1%j25M6R8r1o6
3994h4J21K1j10j2J00K5j50M8J10p0o7N2Q0o2o2Q3L3j38L1P6j5j6n7R3j0j20R9
4021aO7j09K5K6Jj7n2J17k1j38R7M8m8pPL8k4o3J12k8q0M0NL8n5n3J22l9n1O2
4051A9j6qm4L8L5n1qR0n7k3L4j0J3l7NQ0n6m0M4j7n5L8PJ9lj8N8j5n7N9k5k8O7
4084C8n3K9%n2Q0k3m5N0p0K0P4r6P3Mr0J18o7QO4j25O7L3p3N1k6PO7j26Q2K5j28
4115h4P9J3oMl4N8lj15J20Pj21Q7qj%o6R2K7q2M2J1o1K5J5M1nj15J28Nj44J01
4146A0J0k1J4p3J01J9j61J44rq7L5M2k0J1j04J44K6k08J77K6j16N9k5L9j3j45
$$ plain form
4172 -125 74 61 -115 41 22 -32 -6 -75 69 34 -136 74 64 -91 17 -18 36 -25 -80 116 27 -122 77 13
4196 13 -4 -28 -60 102 -18 -132 120 36 -92 3 40 38 -55 -42 118 16 -111 74 42 -56 -27 54 51 -65 -111 103
4222 103 26 -116 64 61 -53 -22 19 78 -24 -125 116 52 -123 11 65 32 -51 -74 126 -6 -149 83 47 -93
4246 -93 -17 7 62 -59 -102 142 -8 -135 85 37 -41 -11 -26 115 -76 -119 155 -2 -112 53 37 22 -68 -34 121
4271 121 -73 -130 140 21 -59 -14 32 81 -88 -54 207 -43 -96 94 29 -1 -65 35 113 -92 -75 152 -32 -75
4295 -75 13 19 -11 -99 -1 128 -87 -92 82 -6 -33 -40 27 78 -94 -27 136 -71 -85 43 56 -1 -60 37 84 -82 -40 115
4323 115 -15 -84 33 37 -18 -93 -7 107 -90 -87 105 12 -61 -7 43 39 -84 -17 122 -22 -70 84 36 -66 -39 -5
4349 -5 60 -97 -77 132 -5 -88 24 13 -32 -62 -22 103 -88 -65 67 -58 -32 -10 13 80 -109 -2 131 -71 -47
$$ packed form
4172a25J99j3j76J56j9n4K6o9J44l5j70K10j0j55J08l5N4o1n5J96q9j49J99o4
4196A3j7k4l2J62j20j14K52q4j28R5L7kr3J3J60j02j27J85l2r8K9Q1lj16m6K14
4222A03p7j42J80lj14L1M1N9j02j01K41o4j75J34N4l3q3k3K00j32j43K32l6j40
4246i3P6K4N5j21m3K44j50j27K20m8p8L0j5J41j91m3K74j57j10J65j6j5r0L4J55
4271A21j94n7K70j19q0M5M6M9j69L4K61k50n3J90o5l0o4J00P8k05J7K27j84m3
4295g5Q8Ol0q8R8J29k15nJ74q8k7pO7N1j72O7J63k07j4J28J3n7n9R7M7j66M2J55
4323A15j30o9J17Mn5p5Q6J14j97LJ92r3p3N4N0mj23O7J39j44m8J54m8j02K7L4
4349eO5j57K0K09j37q3J12j1m5l0M0J25j91K3J32j25K6K2K3O7j89J07J33k02K4
$$ plain form
4374 -47 47 -12 12 -45 35 95 -91 -13 107 -42 -11 26 27 29 -79 25 85 -96 -15 69 -27 -38 -59 34 21 -95 44
4401 44 71 -66 -30 13 32 7 -37 33 28 -102 22 67 -29 -10 -12 43 14 -81 8 42 -83 -14 58 11 -29 -10 37 -36 -54
4430 -54 31 46 -39 -17 7 29 17 -37 30 30 -89 13 62 -2 -31 13 35 -11 -41 20 30 -56 -8 59 -5 -33 2 -16 -4 -21
4460 -21 10 4 -46 -11 32 -4 -30 -19 44 8 -55 32 48 -29 -8 15 20 6 -13 22 28 -14 1 32 -12 8 -19 10 -8 -66 48
4491 48 24 -31 -9 -2 13 -15 -27 36 4 -39 30 -11 -23 12 -19 50 2 -16 56 15 25 61 25 -11 4 4 14 -10 -11 40 6 -8
4523 -8 -11 -23 -4 -36 6 12 -8 -24 10 -3 -4 -15 -3 -12 -6 37 25 -33 13 2 -10 -21 -11 18 -28 -25 6 -34 2 -13 17 2 -11 4
4557 4 -5 -16 44 -16 9 5 -9 31 36 -5 -1 -3 14 -22 -18 7 32 1 23 6 15 -4 -18 14 -10 -28 27 7 -22 -15 4 -8 -22 16 60
4592 60 10 -22 7 16 -6 -20 -12 5 -15 -28 -17 -4 6 -5 -8 -20 -18 -25 1 -43 4 -10 -1 4 19 36 24 5 -9 38 4 9 11 26 8
$$ packed form
4374d7R4n9K4n7Q0O0j86P8J20j49L1L7JKj08J04O0j81Q1Q4r6j1k1R3j3j16J39
4401D4K7j37L6M3J9k5m4P0nj30J24M5r6J9kN5k9r5Q9L4j25O9P2m7m0J9M7p3j8
4430e4Q5J5q5K2K4K2j2n4O7%j19J02M9o4k9M4K2m6l0O1J0q6M8O7o4k8L5j8J2j7
4460b1L1on0L5M3l6k6J1O3l6o3Q7J6p7K1K3Nj4j9L5Om2J5L1m4K0k7K9j8n8J14
4491D8k4n5K2PJ5k8j2O3l2m3O9m1j2L5l1O9m8j8P2m1J0L6l6l6J5%J0k4jN1l4j4
4523hlj2J9l2M2Ok0j6L4j3jj1J2rOM3j2n8M6j1j2j1J0K9m6LL1m0L6j5L0j5j3J5
4557Drj1O0o0K5mj4M0Nm1MkJ7l6MK5K5l1K2j7Rj9j4L2k4j8N5k0k9PJ9j2j4L8M4
4592F0n0l2K9Rk2j4QJ7k0j3J1J3J0j1lj2KpK6m4M7j4RNJ5J7j2j9j4M7l4NKJ5j8
$$ plain form
4627 8 -12 22 0 -2 9 8 6 0 13 -19 23 1 22 29 9 -28 12 10 -17 29 3 33 -8 -35 15 -12 -21 4 9 -12 -27 2 9 6 -6 0
4663 0 15 -36 15 0 -21 -1 -28 19 -40 -6 -9 3 -20 -21 22 16 -15 0 10 -9 6 30 21 1 -40 7 -2 -2 16 -19 16 -35 -14 2
4697 2 16 -22 4 19 -20 -1 -8 10 -5 -4 8 15 11 -24 22 7 -26 -9 -17 32 -31 -2 -21 -24 -11 7 -20 -11 -20 -23 -5 -26 -1 -14 -2
4732 -2 -25 -1 -11 12 -2 -13 11 -32 47 14 32 0 -4 4 -5 -2 20 23 -12 -1 -1 21 8 -42 37 26 -35 6 -1 17 -21 2 -4 -15 -1
4767 -1 24 36 -32 15 -4 35 -55 -22 40 17 -53 1 3 -20 17 -18 34 -8 -31 16 0 -35 -27 18 -10 -11 -3 14 -9 -48 -15 29 3
4800 3 -1 20 26 32 -29 41 21 -24 22 45 25 19 -2 10 15 -50 27 16 -45 30 2 15 -7 -50 1 7 -55 50 17 -35 7 -10 44
4833 44 -35 -65 35 30 -29 -1 -6 -13 -24 -9 58 -6 -40 52 -3 -32 -10 13 3 3 0 39 28 -41 43 37 -12 -24 10 22 27 -16 1
4866 1 24 -25 9 33 -10 -9 -8 19 27 -40 37 20 -11 28 -12 -18 -5 -38 7 -18 -28 37 -7 -22 24 -37 43 14 -41 49 -17 -44 34
$$ packed form
4627Hk0L4k2kJ1jkoJ3l2M2k2K1Pk0l7M0kk7M6k6L0m1k7N0k7rK5Nk1j5K9Plj2O
4663@J5n1N1j5k1K0k7M7n9L4lJ2k3jM3ol1J5J0j9J5K4rk0m1M7r%J8l5L5n1K1J6
4697BJ4l8K6J5l9J9pJ8j5JJ2Pml5M6j5l3J7qM9o3K9j9lJ3J8k7RrlJ8k1K5j3J2
4732bk3K4j0K3j4j1K4m3P9l3J8l2mQrLK2Ll5J1%K2j3n0P9j1o1M1pJ8l8K3oj1J4
4767aK5J2o8M7j9L9r0L3O2k3p0N4Kk3L7l5N2m2k3M7j6l5QM5k8jQJ7k3l9L3M4k6
4800CmK1OOo1P0k0m5M6K3k0ok1J2No5P7j1o1P5k8J3k2m3N1Oo2J05l3n2M2j7N4
4833D4p9l0J00nn9K8npj1J5O7o4l4R2n5k9K2K3j0%lL9j1o9Q4om9j2L4J2Nm3J7
4866AK3m9L4K4m3JJK7Qo7P7j7l1L9m0oJ3l3M5k5j0O5m4j5M6o1Q0k9n5R0o6k7P8
$$ plain form
4899 34 -1 -5 10 -21 0 -26 -37 31 -5 -26 -5 10 -23 -21 -18 14 -39 -26 35 4 -5 2 -3 36 -3 -1 46 21 -8 -6 29 6 -30 -7
4933 -7 32 -9 -21 33 -17 -21 35 -2 31 -8 -14 15 2 -22 29 -17 -12 -3 -45 39 -4 -11 20 -7 -17 -2 -40 13 -2 -31 31 -16 -18 16
4967 16 -31 19 -2 -45 22 4 -22 50 -15 -25 40 -37 18 12 -33 14 22 -25 21 -7 5 20 -38 38 -11 10 26 -5 6 -16 -17 29
4999 29 1 -1 28 -3 -43 21 -2 -14 -27 -23 48 13 -24 1 -14 -15 10 -15 21 -1 -35 22 -33 -24 -9 0 17 8 -16 29 -14 -47 16
5032 16 2 -30 21 -46 13 -3 -27 16 -23 -43 47 22 -28 4 -11 50 -23 -50 23 -5 -20 33 13 -32 -23 -25 41 -9 -9 21 2 -34
5064 -34 4 -4 -3 -52 -25 47 -5 -37 45 2 -16 -7 15 35 12 -50 33 19 -47 8 2 10 -37 -11 47 -20 -60 1 44 -17 -30 36 25
5097 25 15 -23 89 15 -21 -5 19 0 -27 4 51 -2 -44 86 29 -40 -49 33 -3 -43 -10 61 -25 -57 71 -8 -41 -32 31 41
5127 41 -40 -17 39 -14 -48 7 23 12 -60 -2 39 -49 -51 35 38 -8 1 41 21 -70 5 52 -44 -47 24 22 -25 -56 44 61 -69 -22
$$ packed form
4899C4l5mJ5l1K1k6j1O8l6k1K1J5l3KLL2n3J3O1l1rPnL9l9KM7k5k9KL5k3l6K3
4933gL9m1j2N4n0mN6l7L3l9oK9j3k4N1m6NRm2Q4m3pL1k7j0J5l8N3j5k9O2m7kL4
4967A6m7N0k1m3O7j8k6P2o5j0O5p7N5om5M7Qm7M6k8J2J5n8P6m9K1J6l1J1k2jM6
4999B9k8kK9l1m0O4k3j2j3MP1l5l7K5j5jK5k5L6k2l4N7n5RJ5RJ7rk4M5m3l3O3
5032A6j4l2N1o7N9j6k4M3l9k0R0k5n0L2j5O1p3k7P3k8j5N3k0m5RkO6n0%L0j9l6
5064c4L8qJm9K7P2n2l2Q2m3j8RK2K0k3o2Q3j4o6N5oQm7K6N8o7m0O1M3o1j3O6j1
5097B5j0l8J12p4l6J6K4j9k7L1M7n3m2J30n7o9rQ2l6m0L3P1q6l2J28p9l3RO3J0
5127D1q1K3N6n3l4N5J6j1p2N8M1q8kQ6Lm6RM0k0r1P5M7r6lP1km7l1J00J7j30M7
$$ plain form
5159 -22 49 -3 -42 23 61 -44 -68 33 75 0 -37 47 35 -44 -8 44 40 -62 15 84 -28 -23 30 57 -52 -1 51 54 -66
5188 -66 -21 94 -5 -67 -5 36 -18 -65 25 57 -50 -13 72 26 -55 -13 40 -5 -64 21 91 -17 -57 19 31 -7 -34 24 34
5217 34 -45 -7 112 39 -54 26 50 -21 -66 49 60 -71 -22 58 31 -66 -24 65 32 -49 18 37 -23 -60 42 46 -57 -50 48
5246 48 35 -93 -15 48 4 -66 0 55 -29 -65 22 40 -67 -50 39 35 -87 -56 31 23 -52 23 59 -35 -27 38 53 -70 -28 72
5276 72 5 -46 -7 100 49 -71 59 60 -20 -60 27 46 -46 -38 106 37 -80 -27 56 -4 -68 5 63 -7 -49 20 34 1 -62
5305 -62 53 9 -55 -12 69 -23 -78 10 43 -48 -95 0 26 -20 -21 67 25 -69 4 60 4 -46 -5 91 -17 -63 22 -5 -53 1
5335 1 31 62 -57 -42 88 4 -36 17 67 -5 -24 24 40 -72 -28 52 37 -45 -40 64 -8 -59 13 35 -35 -29 6 41 -58 -64
5365 -64 67 6 -59 -4 72 -49 -43 9 25 -31 -35 38 15 -34 -15 56 38 -62 13 57 1 -60 14 35 -29 -55 0 8 -12 -37
$$ packed form
5159b2P1n2l9O5L8j05k4J01M2p5l7Q4j2p9L6N2mj02P7O9j12NN3K7j09N1N2Lj20
5188f6M5J15r9o2O2M1n4m7R0L2j07L7Q5m6q1M2N3m5n9Q5P0j08m0P6J2l8k7N8J0
5217C4p9L8J19p3r3Q0K4p1m5J15J1j31M9Q0k7r7M2Q9l3q1O7J9o0l7J02Mj03PR8
5246D8j3j28P8O3m4p0O6N5q4l6Q7J8j07J7Q9mj22L1Q7qp5P5L6r4QO5J5j23M2J00
5276G2o7n1L9J07n1j20J30Jq0m0Q7J9r2QJ44o9j17N3Q3o0o4P3N8p0m2O9J4l3o3
5305f2J15m4o4M3Q1r2n5Q8L3r1m7R5K6m6jQ8m2r4P3N6n6n0M1R6j08m6Q5k7m8N4
5335AL0L1j19J5J30q4m0N3N0p2j9M8J6j12M4Q0j5q2NJ04p2n1P2K2p0OL5L5r9o
5365f4J31o1o5N5P6j21ON2J6n6mP3k3m9J9P1j8j00P5M4n6o1P4K1o4k6N5Qk0k5
$$ plain form
5395 -37 28 -7 -30 32 73 16 -32 6 42 -11 -34 52 24 -30 24 28 -18 -31 -17 45 -23 -30 28 13 -19 -7 27 12 -22 -16 18 -10
5427 -10 -56 -3 -5 -4 -29 -2 12 -15 -11 9 24 -26 -7 0 10 -13 6 16 17 -32 23 20 -18 7 34 30 -1 -18 40 -9 -5 33 11 36
5461 36 -19 -17 44 -13 -19 -13 -10 6 34 8 5 3 -29 1 5 -19 1 -10 -4 12 -8 17 6 -21 -5 -27 11 -35 -42 29 36 7 -4 -10 -6 11
5497 11 1 7 -4 -18 0 42 9 -2 -4 -8 -24 -6 50 12 -52 37 33 -17 -3 -11 36 -19 -36 44 16 -34 5 29 18 -17 -35 22 -15
5530 -15 -96 35 -10 -41 -5 22 48 -54 -43 28 -16 -30 -6 42 -3 -26 -26 6 -20 -57 16 22 -43 -8 36 15 -38 -12 57 3
5560 3 -93 33 39 -63 -36 6 40 -65 -29 74 -13 -60 9 54 -12 -50 12 60 -32 -38 64 29 -84 -5 71 43 -26 -39 47
5589 47 -20 -75 57 37 -42 -45 -1 4 -53 -49 90 2 -97 34 6 -29 -55 -3 60 -69 -68 89 24 -98 -18 49 -15 -91 -7
5618 -7 92 -46 -72 43 52 -31 -55 43 45 -100 -23 85 -3 -84 23 53 -16 -45 27 80 -64 -54 107 23 -65 -11 57 38
$$ packed form
5395c7O5l5k3O2M1n7m8L8L6n3k3Q6k8n4N4Mm6j3J4O2o8pN8j5l2J2L4j5l4OL4k8
5427a0m6N3kJk5K7J4k7MK0J5n0J9PJ0k3J9J0Jm9N5ll8K5K7ml1j7N8m9ML8k2K5
5461C6n5KO1n7oOLJ6K8k6lkl2L0Mk4K0j1OJ6k0K5j1k7J6k2L8m6pP1Pk9j1oMJ7
5497A1j0Oj1j4J8M2l3j1kmj6J8N6l8o4Q9mn0J4qM7n5j7Q0k8n0L9K4j1l5j8N7l7
5530a5q1J31m5l1L6K7K6j02J1P1m4j4K4M8m5k3%L2k6l7P3Oo5L5M4k1n3K6O9n4
5560Cr6J26Oj02K7M2L4j05L6J03q7m7O9M5o6l8O2M8r2oJ02l5j13P9P6k8o9j3Q6
5589D7o7n5J32k0p9lM4Nn7MJ39q8r9J31k8l5k6N2O3j29JJ57o5j22Q0O7o4p6Q4
5618gR9j38k6J15Rq3k4R8Kj45P7J08q8q1J07L0o9k9P2N3j44J0J61q4q8N4O8j9
$$ plain form
5646 38 -73 -12 80 -46 -66 66 60 -63 -83 63 53 -91 -24 103 -19 -83 -4 32 -34 -71 52 56 -99 -67 75 9
5672 9 -79 -36 63 4 -123 19 110 -50 -52 46 10 -34 -49 72 63 -111 3 125 -50 -80 44 83 -30 -70 48 69
5698 69 -100 -55 57 3 -87 -29 64 4 -99 11 92 -41 -93 55 30 -92 -52 78 49 -139 -13 65 -38 -83 9
5723 9 43 -50 -82 43 64 -98 -35 60 23 -81 -18 91 0 -87 22 52 -89 -36 40 0 -55 -58 71 30 -81 -5 92
5750 92 -57 -59 47 44 -37 -78 75 56 -71 -5 52 -9 -82 -24 39 -43 -116 63 65 -78 -24 80 36 -76 -32 55 15 -80
5778 -80 4 61 -43 -84 4 32 -58 -89 83 86 -85 -6 70 -29 -31 14 55 -16 -97 46 56 -67 -32 61 14 -69 -35 76
5806 76 17 -86 35 62 -44 -9 10 31 -52 -68 83 49 -48 35 55 17 -42 -13 42 -45 -70 44 11 -72 -4 39 15 -38
5834 -38 -7 28 12 -59 1 13 -48 -44 25 23 -45 -13 30 -2 -47 6 39 -48 -29 -22 55 -23 -55 27 -11 -38 2 10 32 -73 -44 24
$$ packed form
5646C8j11O1R2j26k0J32oj23k0J46j0j44O7J27j22o4P9L6o6l7J23Mj55L2J42o6
5672Iq8M3R9n9j27J42R1j60kR8l6m4j5J21rj74J14J22j75l0J24L9j13m0J18K1
5698F9j69M5J12n4r0N8R3o0j03J10Q1j33n2J48k5j22M0J30k9j88J26P8j03m5R2
5723IL4r3l2J25K1j62O3R5l7j04O3J09r1q7J09L0j41N3P6m0n5lJ29m1j11P6R7
5750I2j49kJ06lq1m1J53j9j27O6N7o1p3N8O3q2p3J79Kj43N4J04m4j12M4Q7m0r5
5778h0Q4N7j04m1Q8K8r0l1J72Lj71P9P6r9kM5M1p1q1J43J0j23L5R3m7q3L4J11
5806G6n9j03J21K7j06L5J9K1q3j6J51l4r7Q3K0l8n9K9N5q7k5J14l3q3O8M3k4n3
5834c8L1L5j6p1O0J2o1MO9ko8L2M3l2m5N3L3q7J9PP7p8l2Q2l8k7M0QK2j05K9O8
$$ plain form
5866 24 -45 -28 28 46 1 -15 16 25 -11 -33 31 16 -44 36 13 11 -7 -5 17 9 -23 19 -6 -11 -1 4 15 -35 -33 16 -47 -14 16 -27
5900 -27 -30 -22 3 24 -9 6 5 -19 -37 -21 12 11 -22 -29 9 -37 16 5 13 2 -4 -2 7 -8 -14 9 -26 10 2 1 -12 -7 12 16 7 -24 20 6
5938 6 -11 6 -8 50 -7 10 6 -14 -22 -12 -35 -2 6 -24 -19 -18 -13 -6 -16 -6 0 -9 -13 -6 -43 -6 -7 -10 16 0 -14 -6 -24 31 10 -7 -11 22
5976 22 -1 -23 -16 18 26 -2 3 14 2 -3 -1 19 0 -13 29 -24 -16 -12 9 -8 2 -19 26 -6 -50 13 12 -12 -35 23 0 -24 20 30
6010 30 1 0 2 20 -31 -14 -12 0 -52 -28 7 24 -38 -2 24 -33 -41 19 12 -23 -9 5 2 -26 -30 3 12 -57 -10 44 -31 -22 28 42 11
6045 11 -19 27 22 -34 -43 33 17 -39 -15 26 33 -39 10 70 -4 -57 39 5 -31 -16 15 -9 -59 -10 25 -19 -43 9 23 -33 -58 22
6077 22 16 -46 -6 22 -9 -54 0 21 0 -28 -11 8 -40 -32 30 17 -54 -22 41 18 -46 1 43 -18 -34 34 29 -26 3 39 49 -34
6109 -34 16 61 4 -13 37 21 -11 -36 5 48 -31 -8 38 11 -29 -30 44 30 -45 -17 37 -21 -60 2 37 -24 -39 46 12 -38 -21
$$ packed form
5866B4o9J7N6J8m5j6L1Rl6k2O4j5o0Q0k3kj8KK2ql2M2k5nJ0NJ1n0KM9o3L3L0m3
5900b7lQK5K1l3J5jk4j8J6L3jl3pL8m6N3j1Qj1oKRj5oK3l5L6qjj3NJ9Mrl1M4j4
5938Fj7J7j4N8n7J7mk0qJ0k3L3Ql0NJNPj0J0OrmPl7L7jlK6j6j4Qj8N5k1j7mL3
5976B2k3k2PL4Qk8NJ1j2nKK0j9j3M2n3QMK1j7J0k1M5l2m4O3jk4k3N8k3k4M4J0
6010C0k9jKJ8n1J7KJ2n2K4L5J7o2L6K6n7qO0pl5J4J4lk8mL3Ro9M7N4p5RN0J4l1
6045A1l0M6nn6rP6j6n6K4M1Pp2M9O0p4n3R6l4l6J5L1k4n0M9L5m4k4N2J4n6k5Q0
6077B2oo2M0K8l1m5N4K1k1k8J7J9m8QO2j3p1L2O3k3o4M7M2o1j6O8nn5K9L6J0q3
6109c4N0M5n7j7N0j6l2k5M1M3p9K3M6k7m0jP4j4p5K8N4n8l9O2L5o1j5Q5l4n0J7
$$ plain form
6140 -21 -6 14 -32 -14 39 5 -34 30 9 -23 -6 42 21 -4 -11 29 -3 -69 12 22 -13 -34 32 0 -9 -26 49 8 -48 -14 54
6171 54 -4 -38 25 29 22 -20 54 10 -32 -2 30 -27 -32 13 17 -4 -41 -17 37 -57 -16 1 -1 1 -51 22 -5 -26 30 23 -16 -31 4 10
6205 10 -25 -51 -18 5 -33 -8 19 -7 -37 -18 39 -21 -31 11 27 -9 -33 48 9 -21 -23 -6 14 -28 3 18 -7 -6 29 12 -50
6236 -50 -4 21 20 -42 -8 24 7 8 -18 19 -8 -22 4 32 -39 -27 -5 10 -12 -21 12 -3 -31 -1 -11 -14 -27 -17 -12 -24 -24 11 -13
6269 -13 -4 2 -11 12 -11 -7 45 2 -30 27 15 -39 10 24 -16 12 11 -1 13 -17 -5 -24 11 -3 2 14 -9 -31 18 23 -19 4 20
6302 20 -18 -1 -25 26 1 -16 -16 -1 1 3 -12 22 -20 -15 17 -48 -39 -3 3 6 -1 -2 4 -57 -2 -4 -19 -3 17 -22 15 15 5 -26 -31 5 22
6339 22 3 18 10 11 29 -15 1 -5 -12 -24 -26 4 36 8 -12 21 -9 0 0 29 -2 -9 2 13 -12 -35 -6 -6 -4 -17 -34 9 13 -3 36 -2
6375 -2 -24 -12 -11 -9 -12 -24 2 9 -8 -18 -12 -20 -4 -5 5 -4 -23 -8 1 -31 5 -50 3 6 -32 19 -31 -8 0 5 -6 18 14 3 6 -5 26 -9
$$ packed form
6140b1J5K0m6J8N3l4l9O4k1l2J7M8k1k5pM0l2o6Q1J0l5k1O6l2rj7P5m1n6L4O8
6171E4n8l4O3Mpm2P4m4m2L0L2n7nM5Mk1l7K4N4r4M1J7kKn2P3k7k1N6pl9j5L5O
6205A0l5k6L3K3l8K5K7k6l0J9N7o0j0M2J6l6k4Q1l9l0kJ7K0m2L1J5k5JL5j7o2
6236e0M6K5jo2L4L2j7Jk6L7k7j4K6K8p1J2K2J5k2rL3j5k8L0j0lj3J0Nj2%L5k4
6269a3ROj3K3k3MN2m3l2N7j2n4M9J4m0K8jj2J4l0J2j9L5j4NJ2k3k2M9Nm2K3J6
6302B0l8J7k4N1k5j7%J5KKj5L4m2NL2o5RL6OLpjOo1N5kj5J6K0l9L7%j0l1nL6J7
6339B2j9J5qJJ8m4J6opj2kL0L2k8k0L3l0R%K9l1pJ1J1k5k3K9%Kj3j7M3Mj6L9l8
6375bk2J2JKlj2K6Pj7j0OqJ6jJ0rj9J5Rl2L6n5N3Ll8N1n0K3QNj1K4mj1Lj1L1l5
$$ plain form
6413 -9 24 12 -7 -17 -11 5 5 -25 -25 -4 -13 -21 -26 -8 -4 -12 -18 -15 -6 -22 17 -34 -5 -25 -4 -2 -16 -19 -6 -19 6 9 -34 -10 4 -14 7 -5
6451 -5 1 10 -10 0 18 -2 8 -24 -32 -1 -4 18 15 5 14 3 17 4 26 4 31 -3 -23 10 33 4 3 -19 6 4 -9 -14 -11 -26 -11 10
6487 10 -31 15 18 27 10 -3 -7 7 -9 1 -11 -12 7 9 19 -11 22 22 4 6 -15 -20 -11 -27 14 11 8 10 -15 17 14 2 -32 -13 -19 4 17
6524 17 22 22 20 16 10 -17 35 32 6 32 -23 32 -4 10 -10 15 -3 5 -9 -9 0 13 -8 25 -7 3 -4 -7 13 -7 -8 0 2 23 -13 -27 -27 -9
6562 -9 -15 -26 -28 -15 -1 -5 -11 -2 21 -7 -13 -21 -9 3 -21 10 21 21 11 22 13 -18 -23 -19 40 12 -18 -16 -12 -16 -2 -2 2 12 7 5 3 -8 0 23 -17
6603 -17 6 -7 -13 14 5 5 -30 -4 -2 7 -5 -1 11 8 6 2 3 -4 -12 -3 -9 -1 -40 14 -25 -20 6 -23 -5 3 24 -7 31 -11 6 -3 25 15 13 -6
6643 -6 4 8 -2 -15 38 -7 3 1 -3 22 26 -1 -7 -4 -11 38 -11 -12 -7 -15 -31 4 -13 6 2 10 -31 -1 -31 -13 11 -17 -5 -5 -5 -1 -15 29
6681 29 -31 -19 -33 -14 17 -1 10 5 0 27 -10 4 -2 26 -3 14 15 8 -5 15 45 15 15 -1 24 46 -28 -3 19 -10 4 -5 -8 17
$$ packed form
6413iL3j2j9j0OJ6%l0%K1rqnJ8MqoLRj6L9n1K9k0K1Kj4lJ3j3K5Lm3K4J4j8K1j2
6451eORk0J0J8k0J0l2qL1lK2lj0Rj1J4j3K2k2K7l4k0L3K3k9jk2K5kj3nLj5J5K1
6487A0m1M6LRj7j3mJ4j6J0j2jJ9KJ0l0L3%j8Kk1nRj6M1llKk5L2lj2l4J9oK3J3
6524A7N%kmok7N2lk6K6n5N5l6J4k0K5j8Qj4%RJ3k1L3l2J0plK0k0jQKK1l6j4%J8
6562ioj1kJ3J4moRK3k8oqJ2J2k4L1J1%j0J1rl1nMN9k8l0KMmJ4%MJ0nkkj1QK3m0
6603a7K3j3oK7r%l5K6KRj2MJ2lkmJpqRoQl9N4l9NK6k9J8QK1l1L8m2J7rK8j0kj9
6643fJ0Mj0j3N3m5J0kmK5Mk7oLpM9m9jNqj6L5j7J9mQm1L0l0J8K4k8J2%%Mj4M4
6681B9o0J2j4J9L1j8J1nnK7l7J4oK8k9J7Jpj3K0L0l0%j6K5K2p4K5K2k9J4rlK5
$$ plain form
6715 17 7 22 4 -10 -18 -2 1 -7 -24 -29 2 9 -13 -6 5 -15 -27 -27 -10 13 20 -9 9 1 -18 19 8 -10 9 -30 -21 -4 -3 15 13 1
6751 1 -2 -13 -7 -3 22 -3 -6 -31 -8 -8 27 -8 3 -16 17 -12 -6 5 -13 23 33 23 -1 39 5 15 11 -1 13 -5 15 -22 -17 -2 -16
6786 -16 -14 18 -26 9 -13 -14 -14 0 12 -1 -13 -2 -1 -5 14 -9 -25 13 -12 4 10 1 -5 22 0 4 13 -1 5 10 -16 26 11 11 -1 9 5
6823 5 -1 -17 10 -4 8 16 -16 -35 10 -2 -6 0 -4 14 33 -19 16 -2 -26 -27 -18 -14 0 -1 -19 48 27 6 -13 -19 19 6 -13 -15 -1 10
6859 10 4 -5 -31 3 -9 -8 -10 7 12 12 -21 6 -8 3 15 13 -8 -18 17 -13 7 1 12 7 21 20 -2 12 -21 34 4 14 12 3 3 -5 -24
6896 -24 -22 -22 -47 -6 15 -19 -12 4 -12 -4 1 0 8 12 -5 1 10 -14 -2 -2 -15 6 -11 -72 -11 -2 -1 1 -3 -16 -3 -11 -2 -14 5 -14 31 -18 -38
6935 -38 13 -4 10 15 -7 -26 5 -10 13 -24 -15 -11 -7 -8 10 15 22 -9 3 11 -22 4 -17 9 -5 -20 -27 -15 18 -20 12 -5 10 -20 -11
6970 -11 -10 -2 3 -6 -25 1 6 -13 3 1 -15 18 -1 -27 22 -24 2 -2 -25 0 -20 28 10 -9 7 25 1 1 35 -5 10 6 22 13 -12
$$ packed form
6715A7j0J5j8j4qJ6Lqj7nL1Pk2PJ1k0j2%J7K3Pk9J8qj9L7j1j8J9l9RJ7JJ8kj2
6751Alj1OMK5k5lk5K3%L5l5J1j9L3k9OJ1j8L6J0j0k4M0l4J0mj2J4j8K0l7NJ5j4
6786a6KL2m4L5k2j%J4J2j3j2J1JmJ9k3j6L8k5J6OroK7k2MRj4ONk6M2j5%j2J0m
6823Eoj6K7j4J2Ql2j9M5j2mOmJ8J9n2L5j8k4jRMJ4jj8O7k1k1j9oL8j3j9kJ4J1
6859A0ork6L4j2JkJ7N%l3K7j4J1J2kk1j0L5l0K0oJ1nJ4jk2J4l3N5l0J0kr%qj9
6896b4K%k5M1K1l4PJ6j6QNjQMj7ORk4J2%j3K1j7o1O1RJKmj3J3qRj2J9j9M5m9k0
6935c8N1j7J4Nk2j9L1j5K3l7RMMjJ8NPl1J2Ql3K6k1K6j4j5pJ2L3l8L2j7J5l0R
6970a1JQNrj9K6Nj9J6kj6L3j9k6M9m6K6mk3K5k0M8j8j9J6J8k4%L4m0J5mJ6rk5
$$ plain form
7005 -12 26 -1 -11 15 -10 11 -8 0 12 29 2 -25 15 18 2 -4 -6 -3 -9 15 -12 7 -23 -2 -5 -26 -19 -11 -11 -24 4 14 12 23 -12 26
7041 26 2 -24 -4 13 -11 4 8 28 13 -6 -1 -15 -3 13 6 -10 42 -7 27 -19 2 -9 10 -51 19 17 -7 -33 -3 42 -15 -9 8
7074 8 14 2 -3 21 -9 -29 -44 -15 13 -40 -5 22 -21 1 16 34 -25 -12 3 -9 -28 -12 25 11 14 -10 7 0 -32 26 13 -19 6
7107 6 12 -1 -24 -3 14 4 -30 12 38 15 -4 0 -2 1 -6 13 16 15 18 18 -24 -4 34 17 28 -11 5 -16 11 3 2 -1 -22 -10 30 -25 2
7144 2 1 -24 -4 0 -5 4 0 8 0 -12 -10 10 10 6 2 -22 38 -24 -10 -1 -18 -2 -10 -3 -16 -14 16 15 -4 -8 29 0 -10 -5 -1 31 2 1 5 28 -5
7185 -5 -4 -10 36 -21 16 14 -10 -31 41 11 6 -8 13 8 -3 6 4 0 -25 -18 -16 -17 -25 6 -6 -5 -29 -15 -25 -27 3 -32 -9 6 -35 0 -7 -9 15
7224 15 31 -11 -6 5 -31 5 -6 1 -3 1 6 17 -10 -17 30 20 6 15 2 25 -1 9 -11 18 -13 13 27 42 14 14 18 -10 -38 18 12
7259 12 -21 12 -2 -31 -13 0 5 6 -39 26 5 -19 -1 9 3 -30 -14 22 0 15 19 -5 -8 -6 -22 10 -13 -23 -15 1 2 -11 23 -10
$$ packed form
7005a2L8k7j0K6k5K1j9QJ2J7k7k7M0Lj6okLoK4k7J9l0K1lk1PQ%j3K8J0kJ1l5L8
7041B6k4k6K0J7k4J5MK0j5j9Nj4J2J6pj6N2m9L4m6K1j1J9o1P0kk4k6L0M5n7OJ7
7074HOj2nK4l0k0j5K9K8n3L5K7m3K2J5J8n9J3J5j2j9J6L7j4Lk4J7pl2N8j3l2K5
7107FOj3k3K1J7j0l4M2K6k3j9MkLpJ9LjL%m2K0L8j7J1l9J6k1K7qjlk1J2M0n5K7
7144Bjk5K0MnRmQqj2KK0%mmk4O0o2J4Rj7J6qPj3KL0jj9mL7k9j0NML2k9jMK3l3
7185eJoM6n7L7kk4k1P2l0nj4K1nj1Rkmk5PKjqL1j2Jk4J4j0kL0l5K3J5m1L5pkK4
7224A5J6m2NJ1l6L6j1PmMNJ1k7pM7j0j4Rj3K3k6J0k0K9l1K6J4J5k8%Mk8k8N6o
7259A2l3L3j4k9J8J3NJm5O5k1k4J8J0ol3J6L6k2J5Mk4lKj6L2k3j0QJ6Jj3L4l3
$$ plain form
7293 -10 -4 5 -7 10 -3 6 23 11 1 22 1 13 -6 25 16 2 5 15 30 -4 -5 0 4 22 24 0 -9 -4 -13 -36 0 0 -18 -5 1 -5 -17 29
7331 29 -47 -3 10 -22 -8 -15 -3 -6 -7 -8 -12 -24 -20 11 9 -21 -23 -2 8 -27 6 1 15 10 6 20 14 -9 -9 31 30 -14 -32 10 -21 11 25
7368 25 8 -8 0 22 24 -10 -2 -13 4 -4 -30 3 2 43 1 -20 -29 -8 8 -23 -13 -10 31 17 -26 -1 -6 26 -4 25 10 -4 -4 2 16
7403 16 -7 9 16 43 26 6 42 5 -1 26 33 -2 -2 30 9 13 11 33 0 -21 8 25 -18 -1 -5 6 -19 -7 52 36 -34 20 23 -10
7437 -10 -20 35 33 -14 -28 16 18 -30 -19 35 4 -10 -8 36 -16 -11 -2 -12 -4 -21 23 24 -29 -10 16 -4 -59 12 28 -18 6 11 16 21 -6
7472 -6 31 43 15 -11 45 29 -14 -35 9 -30 -22 41 5 -22 -35 21 10 3 -8 -8 22 -15 0 47 -25 -33 14 21 -25 -22 21 38 -28 6
7506 6 22 -31 -37 6 25 -21 -20 44 40 -31 -17 13 25 -22 3 52 23 -48 44 19 -1 -10 21 62 8 -3 45 19 -31 -11 9 14 -5
7539 -5 -1 29 25 -23 23 22 -2 19 10 44 -10 -17 63 19 -25 17 29 -28 -44 27 42 -32 -11 17 -2 -13 -3 10 -26 -34 7 45 -24 -24
$$ packed form
7293a0ORj2J7j3RJ7j2j0K1k1J2j9L1rj4LJ0J5l4jNMJ8Kk4rNrk3L6%j8J3Ooj2M6
7331B9p6M4J3l2J4pJ2ljjmj2ML1kl0kK1J0l5L3nJ4nmJ4ok3%M0jm4j8M2l1L2J4
7368B5j7j6QK2Kl4Qj1J7qk6L3jM1m2k1rK1J6l1J0LM1j4m3K5nL2l0K9j5j4%OJ4
7403A6k3J6PK7j7k0L6l7oK7Pl5%L2k1MkK2l3k1K9J7m3J7mJ1k5J2N9j6p0N4Ll3
7437a0j0N5km7j4M4Km8J1N4l1j4KM4n2NRj0Qj7M4Jn3J9K6k0n5P1J6m6K4NNNk7
7472fL7J2k8k6N6j6m3k1M4l9QO3l6k7j3N6j1pj1%L0l7J5M7p2qM7Pm6LM3J7o6L4
7506FJ6n3oM3J9m6JO4mp1J4L0J2m7K5M9k9p1R2k5k0rL1M1n4j1M8k6n0K0K0Nj9
7539eML0mm8M6jk4K1rL4n4pQ0m4m4M2J2n7j6P1J5p4K1K8j9j1J0J3l6qM1L8o9%
$$ plain form
7573 -24 28 31 -16 -31 44 15 -19 12 30 23 -26 17 31 -33 -23 44 20 -30 -15 52 35 -29 6 40 5 -44 9 47 -16 -6 32
7604 32 2 1 -13 39 0 -29 18 41 -36 -53 18 49 -44 -31 -12 13 -43 -47 60 4 -53 -6 13 -33 -42 5 22 -25 -14 19 24 -47
7636 -47 -27 42 9 -51 -10 56 10 -29 35 54 -18 4 16 20 -58 -22 44 4 -25 27 17 -10 -34 30 35 -38 -28 24 22 -43 2 37
7668 37 48 -33 11 45 5 -32 3 28 -45 -10 40 24 -31 -7 52 -23 -29 6 15 -18 -33 8 15 -39 -11 33 -10 -39 10 30 -5 -26
7700 -26 6 61 22 -20 27 -1 -8 -12 20 -14 -22 -21 53 22 -18 16 10 23 -4 -17 17 2 -19 1 2 2 5 -5 21 13 -11 23 -6 -40 28
7735 28 14 -37 3 16 7 -26 -24 11 14 -38 -9 -15 7 -40 -11 21 -15 -27 12 15 -55 -5 2 23 -23 17 18 -16 26 -5 4 26 -32 6
7769 6 23 8 -2 15 5 -20 2 32 13 -1 34 17 -12 -7 37 0 25 -1 22 16 -14 3 3 18 -20 10 -2 -5 -42 -19 -11 -21 -18 -36
7803 -36 6 9 6 -15 -5 -34 6 6 4 12 -12 -1 0 22 -21 9 -12 -1 -9 10 21 6 14 25 -12 -7 -1 19 12 18 23 17 17 -15 3 0 24 19 36
$$ packed form
7573b4N2Lm7j5P5k9l4L1J8pm9M3J4o4J0O7k4n0J5O7j7o4L5L4l5m9N3L8o3J0L8
7604C2l0jj4N2l9k9M7K3p7j7P1L1r3J3J9K5n6mJ07n6n7M7J9m6rM7J7m7J1L3Np1
7636d7K0O9l3o0M1O6m6l9O4J9p2K2J2Mp8L6O6m0k9N2j0k7k4O4Np3J0N2ko5M5L5
7668C7J1q1M4L4m0l7L5K5p3L5N0j6n5K4N9p5oL5Rl3j5M1Pn4K8M4m3k9M9K0l5k1
7700b6L2N5l9m2M7k8pmL2l4qJP4l1m0L4oJ3k7j3L4j5k1K0J%Lj0K6qk4L4k9l4O8
7735B8j4n1M0J3rl3KL5Ln2K9oK2m7K9L2l6j2L9Lp0N0PK1m6M0Jl4M2l1RK2n8L8
7769FJ7j5j0J7j0k5K2L0j9j4L5j7k9NM4l7K5k6K3ol0J7%J5l8L0j2ll7K3Qj0Lj8
7803c6M2Llk1J0k9M0%kQk4J1JK2m3L0k1J1qJ9J1j5QJ1l7NOK0pONo%l2J8lK4nJ7
$$ plain form
7842 36 41 25 6 1 -8 -10 12 -3 23 9 -3 13 -34 -30 20 -14 -37 -7 9 -17 -13 -27 24 22 -33 -23 -24 10 -12 -11 4 -23 8 31 -4
7877 -4 -13 -33 1 -20 -29 4 10 -2 36 11 -2 -18 -12 25 8 2 39 36 -8 -29 27 3 -14 28 39 -10 -20 2 12 -47 -19 -5 8 5
7911 5 -43 31 -8 -52 -2 21 -36 -34 0 3 -1 -33 -8 5 -15 -14 24 16 -22 9 25 -16 -41 -5 19 19 -4 32 17 -15 -15 30 2 -37
7945 -37 -2 23 12 -59 -3 17 16 -46 42 47 -34 -29 19 56 -32 -16 61 8 -54 -19 33 20 -17 20 37 -46 -26 18 26 -50 -13 38
7977 38 -11 -52 -2 10 -12 -23 31 20 -44 -43 30 17 -23 -10 27 -1 -39 9 44 -31 -24 13 33 -14 3 25 15 -42 1 51 -11
8008 -11 -46 16 58 -4 -34 8 64 -18 -23 25 41 -39 25 43 -30 -57 -10 28 -31 -56 22 47 -32 -22 37 -4 -55 -23 63 -41
8038 -41 -63 -19 44 -24 -42 43 22 -55 12 41 -8 -44 0 47 0 -39 -10 30 -29 -38 54 59 -1 -13 73 -6 -64 26 49 17 1
8069 1 22 29 -37 -31 45 30 -35 -21 54 -5 -31 9 36 -28 -60 30 7 -30 -12 12 23 -57 -17 36 2 -44 4 41 -15 -49 13 27
$$ packed form
7842C6Nj6j9nrkK2j5K6j4j2J6m7MN0l4k3L0J6k6Mj4N1kn5J0jL4k2JJ5k7L1K3l5
7877drk0L4k1rL3Oj2L8k5j3j6OL7j7oL7lm4k1N6k4j7M2J1m9j0K2J0n9K8J4J3l
7911Em8P4l9m4N0K3n7KL4Lml2K5J3k0JL8ql8L1J6m1k5L6K4%k3L6j5l2%M5k8l9
7945c7L5K5j1p1N6K0jo2Q8Nq1NM8L7q8J6P7n3o2L5N2j3l7L7J7q3K0M4Qp6L7N1
7977C8m9m1N0J2k2j1N4j1o4JP3j3m0J3L7k8l8M8L5p5PL7K0m7J7K2j0n7M3N0o2
8008a1l5O2M2o2l0M2N6q2nM8J6q0O4J8p3k7M7L8n9k5P8K5p9J0N9m1n1L2Q6j04
8038d1k2M4O3o8j8Q5k1p7O7K9m9l6M4M7m7l9K9M0n9rR2No0j2Q6p9n8R0K3l2j6
8069AK1Po6OP6j5o5J4P5n9k6M0K7o4l2R0k3l7J8K4J1q0M0N3l4m6M8L7n6l4O2J4
$$ plain form
8101 27 -26 -11 23 23 -45 -24 19 22 -36 30 46 -60 -16 -6 11 -18 -26 47 22 -33 -18 30 2 -64 15 43 -10 -49 13 21 -19 -33
8133 -33 26 3 -46 -7 58 1 -29 7 54 -22 -38 -3 21 -45 -44 31 24 -26 16 39 13 -39 3 33 -26 -28 11 18 -37 -40 -10 1 -47
8166 -47 -4 21 8 -40 20 14 -28 -23 32 26 -12 31 28 17 -15 18 54 -11 -20 16 -1 -16 -7 17 17
$$ packed form
8101B7n3J5L4%o8K1M3Ln8O6J6j06M4J0J7k9qP3k5n5J5M8k8o6P9K8n3l9O2Qm0j4
8133c3N9k3m9L9O5n7l0L6M7p6j6L5K4o6JP5pn0M2K3k6n2M2L0n9kL9Pn5lL0J1m8
8166d7M3K5j3m8O0om2NN5ol8M3lj1l2L3L6o5rL6j7j5RK4%
8191A7
$$ Imaginary data points
##PAGE= N=2
##DATA TABLE= (X++(I..I)), XYDATA
$$ plain form
0 0 0 0 0 0 0 -8 8 -8 8 -16 16 -24 32 -40 48 -56 64 -80 96 -112 131 -154 179 -208 239 -275 314 -355 403
29 403 -459 518 -584 653 -730 817 -913 1016 -1129 1252 -1388 1538 -1702 1884 -2086 2310
45 2310 -2558 2838 -3158 3520 -3935 4421 -4996 5692 -6548 7637 -9071 11056 -14000 18887
59 18887 -28960 88425 -192575 -78671 166247 -85568 79498 -115507 8108 182941
69 182941 -202102 2526 169165 -120211 1916 -27330 52429 86681 -178130 47373 112580
80 112580 -106299 26318 -11018 16791 30810 -96723 91096 21912 -123106 80905 18854
91 18854 -38275 14760 -26541 42003 -11769 -38240 61554 -28920 -41544 46463 28106 -34534
103 -34534 -46113 54407 32104 -60447 -5914 32437 25299 -50346 -27830 104564 -38998 -89496
$$ packed form
0@%%%%%qJ6j6J6k4L2m0N6p2Q8j04J20j44J76k08K43k85L33l87M47n14N89o69P58
29D03q62R77j102J237j383J547j730J929k145K381k640K926l240L586l970M396
45B310m868N396n996O678p455Q356r417J0688j2240J4185j6708K0127k5056L2887
59A8887m7847J17385k81000J13904K44918k51815J65066j95005J23615J74833
69A82941l85043K04628J66639k89376J22127k9246P9759L4252k64811K25503O5207
80A12580k18879J32617l7336K7809J4019j27533J87819o9184j45018K04011o2051
91A8854n7129N3035m1301O8544n3772k6471R9794r0474j2624Q8007j8357o2640
103c4534j1579J00520k2303r2551N4533L8351p138p5645K2516J32394j43562n0498
$$ plain form
115 -89496 76541 35007 -29653 -60528 19526 113270 -95356 -61960 117302 -20265 -44266
126 -44266 -7493 33518 59421 -118752 6476 128213 -87867 -33246 37717 14475 32590
137 32590 -99779 30587 104125 -117913 2842 73638 -38844 1771 -32592 40321 43286
148 43286 -107638 42615 60846 -70974 16177 7502 5540 9147 -54375 54640 14298 -74431
160 -74431 51885 14182 -34819 14928 -16326 30947 -3475 -56941 65184 8261 -69839 41306
172 41306 21820 -26424 -6945 -5603 43279 -13961 -60331 62313 22283 -68923 16157 33573
184 33573 -4242 -23511 -19849 56151 -1867 -68558 42572 32613 -38948 -9831 10044 36510
196 36510 -22865 -52102 63097 14461 -60320 17623 23033 2199 -22364 -18794 54095 -14935
$$ packed form
115h9496J66037m1534o4660l0875Q0054R3744k08626L3396J79262j37567k4001
126d4266L6773M1011K5903j78173J25228J21737k16080N4621P0963k3242J8115
137C2590j32369J30366P3538k22038J20755P0796j12482M0615l4363P2913K965
148D3286j50924J50253J8231j31820Q7151q675j962L607o3522J09015m0342q8729
160g4431J26316l7703m9001M9747l1254M7273l4422n3466J22125n6923p8100J11145
172D1306j9486m8244J9479J342M8882n7240m6370J22644m0030r1206Q5080J7416
184C3573l7815j9269L662P6000n8018o6691J11130r959p1561K9117J9875K6466
196C6510n9375k9237J15199m8636p4781P7943N410k0834k4563L570P2889o9030
$$ plain form
208 -14935 -49151 45958 9089 -26144 -198 2325 24504 -19502 -23786 38784 -5113 -22783
220 -22783 14613 4144 -2333 -11445 3557 19057 -17163 -9472 19668 1640 -15786 -711 16698
233 16698 -7501 -12942 15852 4728 -13000 -6564 14835 9067 -26786 4768 22728 -14531 -3633
246 -3633 263 7135 6349 -28032 18723 19117 -33743 10186 9957 -4000 3933 -25198 23969 14552
260 14552 -39830 22330 9008 -17959 11003 -13258 15943 2941 -30927 32072 -2010 -21315
272 -21315 20962 -15971 9994 7312 -27451 27985 -4848 -18185 24413 -17376 4469 9502
284 9502 -21837 22921 -5938 -14462 22415 -16341 3212 9320 -18238 17088 -4216 -8689 15345
297 15345 -15120 7460 5602 -18467 17625 -1863 -11185 12609 -6788 2264 61 -7620 13809
$$ packed form
208a4935l4216R5109l6869l5233K5946K523K2179m4006m284O2570m3897j7670
220b2783L7396j0469o477r112J5002J5500l6220P691K9140j8028j7426J5075J7409
233A6698k4199n441K8794j1124j7728O436K1399n768l5853L1554J7960l7259J0898
246c633L896O872p86l4381M6755L94n2860M3929k29j3957P933k9131M9167r417
260A4552n4382O2160j3322k6967K8962k4261K9201j3002l3868O2999l4082j9305
272b1315M2277l6933K5965k682l4763N5436l2833j3337M2598m1789K1845N033
284I502l1339M4758k8859q524L6877l8756J9553O108k7558L5326k1304m473K4034
297A5345l0465K2580j858k4069L6092j9488r322K3794j9397R052k203p681K1429
$$ plain form
310 13809 -7450 -6175 12341 -5243 -855 -1946 -621 9321 -10083 -71 9964 -7361 -599
323 -599 731 2361 1449 -10886 8926 7794 -13241 634 6428 680 -6097 -3288 13493 -5182
337 -5182 -11415 13292 1640 -9505 -1927 6236 8756 -13479 -4679 18077 -5812 -11240 6215
350 6215 6798 -1890 -12741 8170 15202 -18379 -7173 17480 2119 -12390 -5795 16750 4501
363 4501 -22975 6698 18121 -13649 -9962 10857 10892 -11103 -14107 18808 8184 -21833 247
376 247 16120 -925 -13496 95 18045 -7051 -18859 15779 11913 -17070 -6868 15417 7444
389 7444 -18395 -5196 22148 -3515 -20136 10757 15383 -12271 -13591 13997 12875 -19120 -8686
402 -8686 22544 2547 -21146 1850 19144 -4661 -19877 8567 20168 -13886 -16899 18639
$$ packed form
310A3809k1259J275J8516j7584M388j091J325R942j9404J0012J0035j7325O762
323e99J330J630r12j2335J9812j132k1035J3875N794n748o777K809J6781j8675
337e182o233K4707j1652j1145P578Q163K520k2235Q800K2756k3889n428J7455
350F215N83q688j0851K0911P032l3581J1206K4653j5361j4509O595K2545j2249
363D501k7476K9673J1423l1770L687K0819L5k1995l004L2915j0624l0017K2080
376B47J5873j7045j2571J3591J7950k5096j1808L4638l866k8983J0202K2285p973
389G444k5839J3199K7344k5663j6621L0893M626k7654j320K7588j122l1995J0434
402h686L1230j9997k3693K2996J7294k3805j5216K8444J1601l4054l013L5538
$$ plain form
414 18639 12084 -21381 -8047 22584 4060 -23448 1453 23976 -7395 -22461 11835 18873
426 18873 -15027 -15424 18470 12344 -22023 -7470 23653 927 -23003 3838 22064 -6356 -21937
439 -21937 10340 20481 -16485 -16139 20596 10747 -21943 -6195 23972 1100 -26484 5486 25280
452 25280 -10786 -20917 13366 17989 -16088 -15994 20679 10550 -24275 -2662 24551 -2522 -23658
465 -23658 4997 23508 -8931 -22295 14128 18424 -17434 -13353 19774 8246 -23126 -2552
477 -2552 25573 -3379 -24802 8068 22697 -11693 -20442 15224 16009 -17857 -10040 19583 5604
490 5604 -22417 -1753 25613 -4781 -25058 10859 20668 -11795 -17850 11627 17360 -17076 -12829
503 -12829 24052 3354 -24126 3070 20984 -3649 -22863 6393 25209 -14054 -18768 18062
$$ packed form
414A8639o555l3465J3334L0631j8524k7508K4901K2523l1371j5066L4296P038
426A8873l3900l97L3894o126l4367J4553L1123k2726k3930K6841J8226k8420j5581
439b1937L2277J0141l6966L46L6735r849l2690J5748L0167k2872k7584L1970J9794
452B5280l6066j0131L4283M623l4077R4L6673j0129l4825K1613K7213k7073k1136
465b3658K8655J8511l2439j3364L6423M296l5858M081L3127j1528l1372K0574
477b552K8125k8952k1423L2870J4629l4390q749L5666P85l3866P817K9623j3979
490E604k8021K0664K7366l0394k0277L5917R809l2463o055K9477N733l4436M247
503a2829L6881k0698k7480K7196J7914k4633j9214K9256J8816l9263m714L6830
$$ plain form
515 18062 8876 -15414 -6567 15912 7491 -23611 68 27219 -11040 -20510 12130 14594 -7618
528 -7618 -17091 12110 17123 -22684 -6289 24039 -3932 -17834 2949 18944 -1314 -25975 10018
541 10018 23245 -18950 -11044 16099 5714 -11160 -9443 17254 7003 -25968 4405 22860
553 22860 -10194 -14304 6088 14173 -5474 -17708 13657 12027 -18953 -1227 15584 -1897 -12979
566 -12979 -637 16805 -2726 -18866 11032 12881 -13872 -5115 10716 2972 -10497 -3296 15588
579 15588 -359 -18874 7418 16028 -11729 -10842 10903 9074 -10144 -9822 14965 6896 -21250
592 -21250 1412 20249 -7220 -14191 5121 14379 -3634 -20208 11482 17567 -19498 -5429 15642
605 15642 1043 -8772 -8168 14351 8148 -23738 5075 18524 -11333 -6403 2441 8117 791 -17163
$$ packed form
515A8062r186k4290Q847K2479q421l1102K3679K7151l8259r470L2640K464k2212
528g618r473K9201N013l9807J6395L0328k7971j3902K0783J5995k0258k4661L5993
541A0018J3227m2195P906K7143j0385j6874J717K6697j0251l2971L0373J8455
553B2860l3054m110K0392Q085j9647j2234L1365j630l0980J7726J6811j7481j1082
566a2979J2342J7442j9531j6140K9898J849k6753Q757J5831p744j3469P201J8884
579A5588j5947j8515K6292Q610k7757Q87K1745j829j9218L22K4787q069k8146
592b1250K2662J8837k7469o971J9312R258j8013j6574L1690O085l7065J4069K1071
605A5642j4599r815O04K2519o203l1886K8813J3449k9857M930Q844N676p326j7954
$$ plain form
619 -17163 11714 11243 -18615 3692 8086 -3998 -875 -6153 9848 3001 -15583 10706 4481
632 4481 -11556 5281 948 478 -1021 -5832 11578 -2908 -12028 12110 1397 -8325 1940 2695
646 2695 4714 -7549 -5648 15118 -3200 -13693 9467 7071 -6929 -5381 3732 9234 -7303
659 -7303 -10846 13777 5626 -14900 1007 9646 -575 -7139 -4326 12634 1665 -16657 8291
672 8291 9453 -9765 -1501 307 7088 521 -15215 12439 6876 -15800 6747 1295 -1928 4944
686 4944 -11190 9037 5228 -15650 10865 115 -7090 9373 -9149 4090 6224 -12487 9937
699 9937 -2384 -7119 13136 -9978 -303 9261 -10029 6352 -2229 -5519 13153 -10897 -2385
712 -2385 13361 -9366 -127 2187 -2502 7756 -9298 -1881 13523 -8161 -4508 6119 -561
$$ packed form
619a7163K8877m71k9858K2307M394j2084L123n278J6001o847j8584K6289o225
632D481j6037J6837m333m70j499m811J7410j4486r120K4138j0713r722J0265P55
646B695K019j2263J901K0766j8318j0493K3160k396j4000J548R113N502j6537
659g303l543K4623q151k0526J5907Q639j0221o564K813J6960j0969j8322K4948
672H291J162j9218Q264J808O781o567j5736K7654n563k2676K2547n452l223O872
686D944j6134K0227l809k0878K6515j0750p205J6463j8522J3239K134j8711K2424
699I937j2321m735K0255k3114R675R564j9290J6381q581l290J8672k4050Q512
712b385J5746k2727R239K314m689J0258j7054P417J5404k1684L653J0627o680
$$ plain form
725 -561 1084 -5199 -176 10067 -6506 -6426 8933 527 -5183 -325 1215 5104 -3110 -7169 8975
740 8975 1766 -9121 3867 1539 -127 1177 -6922 6749 3503 -10651 5266 1805 -2467 3582
754 3582 -7555 5720 5177 -12003 5976 2074 -3974 5322 -8088 4919 6711 -13199 5938
767 5938 3337 -5378 5185 -6986 4362 6628 -13154 5643 4459 -6176 3876 -4786 4153
780 4153 4884 -11861 5909 4218 -6770 3697 -2899 2380 4161 -9415 4525 4232 -6693 2863
794 2863 -527 169 3598 -6196 1570 4726 -4948 564 1216 -1052 3450 -3315 -2115 5838 -2680 -2747
810 -2747 3168 -1234 2538 -1521 -4942 8322 -1573 -7524 6646 -458 -356 528 -6143 9409 -830
825 -830 -10993 10007 48 -4243 2986 -5229 8430 -1299 -11998 12934 -481 -7716 5815 -3900
$$ packed form
725e61J645o283N023J0243j6573Q0J5359q406n710M858J540L889q214m059J6144
740H975p209j0887J2988k328j666J304q099J3671l246j4154J5917l461m272O049
754C582j1137J3275n43j7180J7979l902o048R296j3410J3007J792j9910J9137
767E938k601q715J0563j2171J1348K266j9782J8797j184j0635J0052q662Q939
780D153P31j6745J7770j691j0988J0467o596N279J781j3576J3940k93j0925R556
794B863l390O96L429r794P766L156r674N512O52k268M502o765J200P953q518o7
810b747N915m402L772m059l421J3264r895n951J4170p104J02Q84o671J5552j0239
825h30j0163K1000r959m291P229q215J3659r729j0699K4932j3415p235J3531r715
$$ plain form
839 -3900 5809 -1183 -10693 13310 -1948 -8878 8578 -3316 2099 122 -7707 10819 -2944 -7492
853 -7492 8926 -3314 72 1436 -5223 6903 -2642 -4336 6809 -3650 45 2484 -3968 2986
867 2986 -549 -1746 2398 -1977 1557 952 -3099 1018 1692 -549 -2536 1324 3271 -2768 -1436 1223
883 1223 2010 -780 -4946 4919 2982 -6436 1590 1835 780 -1350 -5291 8128 645 -8986 6213
898 6213 1055 -2026 27 -4408 8543 -1661 -9102 9972 -1126 -4423 2913 -3445 6578 -2957
912 -2957 -6899 11309 -4181 -4529 5717 -4169 4390 -2333 -4721 10428 -6363 -2925 7681 -6249
926 -6249 2631 374 -3801 7236 -5812 -749 6629 -7191 2695 1875 -4032 4515 -3440 867 3440
941 3440 -6655 4212 1683 -4931 3612 -1003 436 908 -4241 4566 3 -4796 3927 666 -1347
$$ packed form
839c900R709o992r510K4003j5258o930J7456j1894N415j977p829J8526j3763m548
853g492J6418j2240L386J364o659J2126r545j694J1145j0459L695K439o452O954
867B986l535j197M144m375L534o05m051M117O74k241j987L860J947o039J332K659
883A223P87k790m166R865j937r418Q026K45j055k130l941J3419p483r631J5199
898F213n158l081K053m435J2951j0204p441J9074j1098l297P336o358J0023r535
912b957l942J8208j5490l48J0246r886Q559o723k388J5149j6791L438J0606j3930
926f249Q880k257m175J1037j3048N063P378j3820R886q20n907Q547p955M307K573
941C440j0095J0867k529o614Q543m615J439M72n149Q807m563m799Q723l261k013
$$ plain form
956 -1347 -805 -456 3572 -2610 -2539 4089 -13 -1899 -599 1699 1491 -3996 520 3647 -1918 -1531 767
973 767 2096 -805 -3388 2828 1515 -2733 368 893 1104 -1765 -1772 4026 -1349 -2701 3086 -232 -443
990 -443 -562 -756 2987 -2436 -1231 3893 -2111 -809 1434 -645 1017 -2247 526 3240 -3591 277
1006 277 2542 -1963 229 -688 891 1602 -3663 1838 2583 -3595 486 1038 -38 256 -2285 2402
1022 2402 1290 -3810 1656 1382 -1662 149 -465 1890 -30 -3057 2536 744 -2589 981 471 335
1038 335 -424 -1213 2283 -601 -2222 2010 285 -877 87 24 1203 -1370 -955 2233 -919 -1054 1374
1055 1374 63 -187 -907 277 1413 -1651 -380 1848 -478 -797 11 724 42 -1546 943 1254 -1347
1072 -1347 -171 748 187 -663 -829 1428 238 -1498 903 644 -761 -447 152 974 -823 -720 1623
$$ packed form
956a347N42L49M028o182P1O628m102j886J300K298k08n487M516L127n565L87K298
973G67J329k901k583O216j313m248L101N25K11k869pN798n375j352N787l318k11
990d43j19j94L743n423J205N124o004J302K243k079J662l264K773K714o831L868
1006B77K265m505K192r17J579P11n265N501P45o178M081N52j076K94k541M687
1022B402j112n100N466k74l044J811o14K355j920l027N593j792l333L570n10j36
1038C35p59p89L496k884j621M232j725j162R64o3J179k573M15L188l152j35K428
1055A374j311k50p20J184J136l064J271K228k326l19Q08P13o82j588K489L11k601
1072a347J176R19n61q50j66K257j190j736K401k59j405L14N99Q22j797J03K343
$$ plain form
1089 1623 -298 -1060 423 302 138 -951 195 1607 -1301 -770 1457 -285 -757 -136 834 729 -1573
1106 -1573 202 1516 -1083 -723 543 778 -178 -1274 1160 947 -1757 44 932 -51 -336 -517 1155
1123 1155 181 -1678 677 737 -711 -122 216 730 -430 -846 1000 -173 -704 546 20 241 -242 -348
1141 -348 811 -687 -403 971 -413 -166 362 -96 52 -577 201 573 -723 99 611 -165 -367 -272 583
1160 583 -8 -831 672 571 -697 -172 312 174 -410 -327 744 286 -734 11 692 -294 -656 434 479
1179 479 -232 -253 139 495 -519 -509 844 8 -398 237 118 279 -673 -220 943 -683 -176 721 -404
1198 -404 272 -373 -281 886 -909 52 885 -748 331 -160 -352 661 -837 323 590 -857 773
1215 773 -286 -444 755 -888 466 414 -904 1064 -405 -576 958 -869 179 408 -649 888
$$ packed form
1089A623j921p62J483j21j64j089J146J412k908N31K227j742m72O21R70j05k302
1106a573J775J314k599L60J266K35r56j096K434k13k704J801Q88r83k85j81J672
1123A155r74j859K355O0j448N89L38N14j160m16J846j173n31J250n26K21m83j06
1141c48J159j498K84J374j384K47N28m58J48o29P78L72j296Q22N12p76k02R5Q55
1160E83n91q23J503j01j268N25M84j38n84Q3J071m58j020P45O81r86l62J090M5
1179D79p11k1L92L56j014J0J353q36m06O35j19J61r52M53J163j626N07Q97j125
1198d04O76o45R2J167j795R61Q33j633J079m91j92J013j498J160K67j447J630
1215G73j059j58J199j643J354n2j318J968j469j71J534j827J048K29j057J537
$$ plain form
1231 888 -471 -388 838 -771 102 334 -289 582 -503 4 495 -665 208 68 80 277 -490 412 -74
1250 -74 -421 319 -440 484 60 -559 814 -530 -83 439 -889 943 -124 -719 1173 -836 156 316
1268 316 -1177 1467 -523 -820 1601 -1187 370 288 -1352 1967 -1026 -862 2222 -1664 326 538
1284 538 -1457 2073 -1369 -754 2654 -2135 311 920 -1617 1915 -1430 -533 2723 -2480 401 1319
1300 1319 -1841 1544 -1001 -413 2322 -2332 579 1338 -1917 1281 -616 -362 1676 -1882 782 913
1316 913 -1808 1329 -482 -573 1375 -1302 594 514 -1357 1192 -482 -762 1253 -562 -50 220 -316
1333 -316 667 -753 -373 1040 -251 -572 141 682 -166 -1011 475 729 -366 -711 410 1130 -1087 -827
1351 -827 1314 32 -548 -439 510 1273 -1811 -406 1987 -1121 -476 411 64 1096 -1704 -189 2225
$$ packed form
1231H88j359Q3J226j609Q73K32o23Q71j085N07M91j160Q73j40J2J97p67R02m86
1250g4l47P40p59R24m24o19J373j344M47N22j328J832j067n95J892k009R92J60
1268C16j493K644j990k97K421k788J557q2j640L319k993J64L084l886J990K12
1284E38j995L530l442O15L408m789K446O09k537L532l345Q97L256n203K881R18
1300A319l160L385k545N88K735m654K911P59l255L198j897K54K038l558K664J31
1316I13k721L137j811r1J948k677J896q0j871K549j674k80K015j815N12K70n36
1333c16R83j420L80J413j291l21P13N41q48q45J486K54j095l45J121P20k217K60
1351h27K141j282n80J09R49P63l084J405K393l108O45Q87l47J032k800J515K414
$$ plain form
1368 2225 -1816 -255 1125 -647 914 -1109 -164 1840 -2024 242 1283 -1421 1100 -443 -624
1383 -624 1579 -1689 448 1060 -1890 1621 -68 -1484 1715 -974 15 742 -1626 1934 -147 -2034
1399 -2034 2144 -390 -840 663 -901 1682 -577 -1971 2666 -385 -1674 1084 -168 862 -782
1414 -782 -1303 2722 -784 -1980 1682 89 -127 -526 -478 2162 -1215 -1636 2141 -210 -833 145 -28
1431 -28 1226 -1111 -991 1940 -609 -1032 843 45 182 -486 -297 1042 -606 -623 888 -82 -254 130
1449 130 -40 75 -294 9 341 -336 -6 546 -347 -418 439 63 -352 -42 243 499 -655 -534 1308 -374
1469 -374 -1153 954 243 -150 -295 -432 1525 -731 -1531 2003 11 -1179 525 -86 914 -799 -1309
1486 -1309 2328 -420 -1618 1382 1 -3 -497 -756 2023 -917 -1435 1971 -372 -519 124 -464 1450
$$ packed form
1368B225m041J561J380j772J561k023R45K004l864K266J041k704K521j543j81
1383f24K203l268K137O12k950L511j689j416L199k689R89P27k368L560k081j887
1399b034M178k534m50J503j564K583k259j394M637l051j289K758j252J030j644
1414g82n21M025l506j196L662j593k16l99M8K640l377m21L777k351o23R78j73
1431b8J254k337J20K931k549m23J875p98J37o68J89J339j648j7J511r70j72L84
1449A30j70J15l69L03L32o77L30N52q93p1Q57l76m15L10K85K56j154J21J842j682
1469c74p79K107p11l93j45j37J957k256q00L534j992j190J704o11J000j713n10
1486a309L637k748j198L000j381mm94k59K779k940n18L406k343j47O43n88J914
$$ plain form
1503 1450 -980 -982 2098 -884 -644 900 -679 725 -437 -691 1675 -1021 -457 1251 -987 276
1519 276 245 -676 940 -578 -106 918 -1141 341 641 -890 402 1 46 310 -975 702 557 -1264
1537 -1264 462 568 -310 -85 -403 705 218 -1320 646 891 -818 -290 409 431 -375 -740 756 607
1555 607 -928 -210 807 9 -728 -83 721 89 -788 173 712 -415 -500 333 306 -155 -411 304 510 -646
1575 -646 -190 588 -310 -82 169 -72 344 -358 -93 540 -562 15 558 -535 200 132 -292 319 -485 180
1595 180 523 -796 358 439 -595 222 -171 169 318 -852 602 422 -892 353 76 -108 204 -611
1613 -611 667 276 -984 613 150 -427 271 -323 525 82 -852 789 51 -653 405 -155 189 59
1631 59 -561 699 -153 -575 540 -113 -50 93 -254 507 -263 -336 519 -244 -99 210 -153 255 -215 -177 387
$$ packed form
1503A450k430kL080k982K40J544j579J404j162k54K366k696N64J708k238J263
1519B76l1r21J616j518M72J024k059J482L00j531J292m01M5K64j285J677j45j821
1537a264J726J06q78K25l18J108m87j538J966K45j709N28O99K2q06l65J496j49
1555F07j535P18J017p98p37O45Q04o32q77R61N39j127q5Q33k7m61k56P15K06j156
1575f46M56P78q98K28K51k41M16p02K65O33j102N77N43j093P35o8m24O11q04O65
1595A80L43j319J154Q1j034Q17l93L40J49j170J454j80j314J245k77j84L12q15
1613f11J278l91j260J597m63n77O98n94Q48m43r34J641p38p04J058n60L44j30
1631E9o20J260q52m22J115o53O3J43l47P61p70p3Q55p63J45L09l63M08m70L8N64
$$ plain form
1652 387 -327 -60 278 -115 86 -34 21 130 -206 59 139 -93 26 29 45 -137 -82 174 -47 -46 93 -11 27
1675 27 -176 48 104 -199 72 107 -45 41 -163 102 58 -265 233 44 -144 148 -163 86 15 -261 270 -35
1697 -35 -170 260 -163 84 23 -231 278 -79 -82 291 -194 68 81 -250 248 -43 -69 251 -196 74 75 -283 230
1720 230 -19 -89 182 -132 109 14 -221 189 -43 -119 138 -73 71 -8 -170 180 -80 -65 134 -14 -38 -73
1742 -73 4 106 -104 -13 171 -46 -76 10 73 -25 -152 80 116 -83 -53 74 32 -121 -58 151 9 -76 58 103
1766 103 -33 -184 81 148 -105 -23 144 19 -82 -66 101 -10 -124 146 122 -59 -63 107 91 -158 -53 220
1788 220 -29 -168 93 106 -57 -187 82 170 -147 -73 200 23 -212 -57 206 -13 -227 85 212 -109 -182
1809 -182 97 170 -159 -140 241 105 -210 -80 186 42 -267 44 256 -105 -168 91 121 -144 -173 215 138 -240
$$ packed form
1652C87p14K67L38l93K01j20N5J09l36K65Q0k32J19LJ6j82N5K56k21JJ39j04L8
1675B7k03K24N6l03K71L5j52Q6k04K65m4l23M98j89j88K92l11K49p1k76N31l05
1697c5j35M30m23K47o1k54N09l57lL73m85K62J3l31M98k91k6L20m47K70Jl58N13
1720B30k49p0K71l14K41r5k35M10k32p6K57k11J44p9j62L50k60J5J99j48k4l5
1742g3P7J02k10R1J84k17l0Q6O3r8j27K32L6j99L0J27m2j53O3K09j42q5J34M5
1766A03j36j51K65O7k53Q2J67j25j01J6J67j11j14K70k4j81mJ70j6k49J05K73
1788B20k49j39K61J3j63j30K69Q8l17P4K73j77k35J55K63k19k14L12J27l21p3
1809a82K79P3l29J9L81j36l15J30K66j44l09L11K12l61o3K59L0k65k9L88p7l78
$$ plain form
1831 -240 98 190 -58 -153 12 232 -90 -202 273 62 -207 -33 161 103 -277 12 412 -164 -248 174 156 -117
1853 -117 -253 210 300 -385 -102 378 -78 -265 -58 319 34 -430 186 305 -286 -161 138 199 -137 -252 399
1874 399 87 -396 104 203 -33 -208 22 357 -201 -291 289 99 -175 -28 220 150 -327 6 324 -173 -222
1895 -222 169 208 -126 -218 297 118 -363 -1 262 69 -298 -9 418 -224 -321 251 119 -134 -174 201 341
1916 341 -406 -85 447 -167 -213 38 232 66 -447 180 316 -435 -16 277 -1 -84 -245 323 59 -553 287
1937 287 256 -264 -17 58 245 -186 -369 516 36 -467 232 245 -75 -239 -30 496 -229 -420 453 184 -382
1958 -382 -102 255 162 -391 -150 527 -8 -456 126 371 -213 -332 221 326 -217 -309 330 228 -484 -82 397
1979 397 -45 -216 -50 297 53 -484 256 317 -395 5 125 43 -50 -349 384 77 -480 367 162 -254 91
$$ packed form
1831b40L38R2k48r5J65K20l22j12M75k11k69J74J94n8l80K89M00n76q4M22j8k73
1853a17j36M63R0o85K83M80m56j87K07L77k85m64O16J19n91J25K99O1l36j15O51
1874C99l12m83N00R9k36j75K30L35n58r0N80j90k74J47K48p0m77L33L18m97m9
1895b22L91L9l34r2N15j79m81L62K63j93l67K89M27o42r7N72j32k53m0L75J40
1916C41p47L21N32o14m6K51J94j66n13O27J36p51M19K93k78q3j61N68k64o12Q40
1937B87l1n20K47P5J87m31j83Q85m80n03O99J3l20j64K09N26p25j91Q73k69n66
1958c82K80L57r3n53K41O77n35m48N82K45n84j19N53J05n43r2O39j02p12M02M79
1979C97m42j71J66L47k44n37P40O1p12M00J20q2r3k99P33l07n57Q47k05m16L45
$$ plain form
2000 91 -136 238 -78 -374 558 -31 -381 372 -55 -34 -12 -159 465 -240 -316 578 -139 -318 141 78 174 -327
2022 -327 -53 568 -336 -327 375 89 -191 -197 212 317 -403 -227 478 -28 -449 115 317 -102 -281 -25 388
2043 388 -107 -492 367 275 -414 5 128 114 -136 -403 491 125 -580 385 96 -179 104 -322 385 33 -583
2064 -583 590 -76 -363 428 -344 160 117 -445 618 -223 -376 639 -472 -12 290 -364 429 -281 -187
2083 -187 691 -619 -44 509 -420 214 -157 -83 521 -674 67 534 -527 73 112 -3 237 -543 195 439
2103 439 -522 -1 270 -24 -28 -275 232 230 -422 47 322 -63 -203 19 157 -20 -178 10 259 -17 -279
2124 -279 266 86 -198 108 -143 157 154 -381 319 5 -326 375 -293 69 341 -477 342 52 -422 477 -383
2145 -383 5 537 -661 280 200 -474 495 -396 -14 614 -768 311 302 -569 472 -323 -84 564 -786
$$ packed form
2000I1k27L74l16k96R32n89l50P53m27K1K2j47O24p05p6Q94p17j79M59o3R6n01
2022c27K74O21r04RP02k86k80oM09J05p20J76P05n06m21N64K02m19j79K56M13
2043C88m95l85Q59r2o89M19J23j4k50k67Q94l66p05R65k89k75K83m26P07l52o16
2064e83J173o66k87P91p72N04m3n62J063q41j53J015j111M60L02o54P93p10R4
2083a87Q78j310N75N53r29O34l71P4O04j195P41M67j061O00L9j15K40p80P38K44
2103D39r61N21K71k94mk47N07ko52M69K75l85j40K22J38j77j58J88K49k76k62
2124b79N45j80k84L06k51L00ln35P00l14l31P01o68L62K72q18Q19k90m74Q99q60
2145c83L88N32j198R41q0o74R69q91L82O28j382J079rq71J041p95K39O48j350
$$ plain form
2164 -786 327 366 -653 427 -202 -136 510 -622 235 370 -583 378 -60 -194 469 -484 155 369 -515
2183 -515 238 -17 -176 368 -359 59 383 -358 74 46 -112 246 -269 -13 407 -236 -148 157 -27 -11 -117
2204 -117 19 307 -161 -257 312 35 -280 12 89 166 -138 -259 372 26 -445 242 162 -82 -6 -186 311 -16
2226 -16 -481 402 96 -300 188 -75 136 19 -408 426 -25 -410 429 -113 -132 197 -300 287 -33 -350 567
2247 567 -227 -249 489 -279 -6 95 -188 485 -313 -271 669 -374 -294 360 -133 158 -245 -101 666 -540
2267 -540 -330 665 -238 -103 9 91 443 -594 -119 835 -516 -315 385 -13 83 -414 60 626 -694 -198
2287 -198 719 -202 -184 -24 171 272 -586 91 620 -502 -159 323 13 -62 -338 281 385 -582 69 492
2307 492 -268 -182 95 205 -59 -372 300 312 -497 -36 393 -87 -315 51 372 -83 -434 258 366 -424 -252
$$ packed form
2164g86J113L9j019J080o29O6O46j132Q57J35r53R61m38j34O63r53O39K14q84
2183e15P53k55j59N44p27M18L24p41M32k8j58L58n15K56M20o43Q8L05j84J6j06
2204a17J36K88m68r6N69k77l15K92P7P7l04j21O31l46m71O87q0k44P6j80M97l27
2226a6m65Q83l06l96M88k63K11j17m27Q34m51l85Q39n42j9L29m97N87l20l17R17
2247E67p94k2P38p68K73J01k83O73p98M2R40j043Q0O54m93K91m03J44P67j206
2267e40K10R95r03J35J12Q2L52j037M75R54j351K01P00l98R6m97M74N66j320M96
2287a98R17r21J8J60J95J01q58O77N29j122L43M82l10p5k76O19J04r67O51M23
2307D92p60Q6K77J10k64l13O72J2q09M61M29m80k28L66L21m55l51O92J08p90J72
$$ plain form
2328 -252 497 110 -408 -75 385 79 -569 49 615 -309 -486 503 243 -385 -311 302 415 -621 -209 825
2348 825 -189 -555 218 292 -32 -591 193 747 -619 -367 664 -8 -375 -155 377 336 -781 57 795
2367 795 -500 -349 384 208 -82 -502 418 516 -832 -37 628 -207 -320 16 463 15 -747 428 503 -658
2387 -658 -69 437 117 -329 -308 658 52 -764 346 503 -341 -345 239 467 -417 -464 704 138 -684 52 478
2408 478 -47 -584 93 687 -362 -533 521 365 -476 -303 525 258 -661 -42 659 -120 -591 173 550
2427 550 -284 -582 492 442 -546 -289 538 198 -589 -109 696 -84 -618 301 485 -314 -494 363 531 -567
2447 -567 -277 642 32 -572 -45 489 24 -627 218 611 -460 -416 405 261 -390 -348 545 233 -710 106
2467 106 578 -246 -424 170 529 -230 -566 512 362 -630 -111 498 121 -447 -59 662 -147 -611 373 409
$$ packed form
2328b52P49l87n18L33M60l06o48O18N66r24j77R89k60o28P4O13J13j036M12J034
2348H25j014l66P73P4l24n59P84N54j366K52J031o72l67K20N32m1j117Q38P38
2367G95j295J51P33j76k90m20R20R8j348P95O65q35j13L36M47m48p62J175P5j161
2387f58N89N06l20m46K1R66o06q16J110J57q44mN84K28q84m7J168n66q22P36M26
2408D78n25n37O77N94j049j71J054j56q41J73Q28k67r19O19P01p79m71P64L77
2427E50q34k98J074n0r88K57Q27l40p87M80Q05p80n34R19J84p99j80Q57J68j098
2447e67K90R19o10o04N27N34m65o51Q45L93j071M4Q21j44o51M2Q93l12r43Q16
2467A06M72q24j78N94L59p59l36J078j50r92N19O09l77n68L88P21q09m64R84L6
$$ plain form
2487 409 -325 -311 349 387 -544 -275 641 21 -533 132 456 -92 -500 194 516 -411 -353 481 207 -432 -191
2508 -191 434 86 -590 75 519 -186 -397 214 360 -324 -413 436 267 -489 -64 431 14 -472 -3 499
2528 499 -165 -425 320 342 -294 -324 332 255 -433 -55 465 -29 -394 56 370 -134 -408 268 316 -311 -160
2549 -160 292 158 -325 -137 434 -7 -399 174 257 -162 -242 131 301 -291 -219 397 57 -336 -18 204 43
2570 43 -323 61 379 -199 -238 237 107 -211 -147 236 151 -329 -14 307 -94 -217 74 215 -54 -214 179
2591 179 191 -241 -118 221 77 -183 4 208 12 -192 60 146 -88 -142 165 101 -137 -7 43 43 -109 -57 187
2614 187 -42 -153 135 -14 -64 -2 -31 159 -117 -85 216 -155 -51 71 -76 96 -109 -16 185 -213 -7 125
2636 125 -173 144 -6 -51 161 -220 56 113 -222 175 -11 -105 195 -192 10 68 -225 155 -32 -117 235 -125
$$ packed form
2487D09p34J4O60L8r31K69R16o20n54O65L24n48m08O94L22r27N8Q34k74o39K41
2508a91O25l48o76O65M44p05k11O11J46o84q9Q49j69p56M25M95m17m86M69N02
2528D99o64k60P45K2o36l0O56p7o88L78N20m94l65M50L14n04k74O76M8o27J51
2549a60M52j34m83J88N71m41l92N73Q3m19q0L73J70n92P2O16l40l93L18K22j61
2570D3l66L84L18n78l9M75j30l18O4L83q5m80L15L21m01j23K91J41k69j60L93
2591A79J2m32J23L39j44k60J87K04j96k04K52Q6k34n4L07o4k38J30N0%j52N2K44
2614A87k29j11K88j49n0O2k9J90k76L2L01l71J04J22j47J72k05R3K01l98K06J32
2636A25k98L17j50m5K12l81K76N7l35L97j86r4L00l87K02N8k93L80j87q5L52l60
$$ plain form
2658 -125 -61 93 -125 70 -63 -30 204 -119 -41 164 -103 -72 13 106 52 -147 62 163 -114 -86 111 106 -144
2681 -144 -50 169 5 -139 -82 236 2 -312 165 204 -207 -42 -17 146 -66 -309 369 109 -376 161 63 -27
2703 -27 -56 -184 409 -103 -382 424 -55 -197 98 -84 257 -169 -260 567 -242 -319 378 -77 26 -102 -48 456
2725 456 -402 -182 562 -295 -171 172 80 117 -435 105 522 -539 -117 478 -70 -141 -167 278 207 -622 103
2746 103 563 -345 -278 250 199 -163 -404 295 387 -529 -145 519 -102 -392 24 308 11 -439 141 578 -378
2767 -378 -342 459 54 -281 -100 244 268 -446 -105 642 -326 -343 373 85 -59 -262 116 425 -541 -120 616
2788 616 -296 -252 141 153 55 -531 212 512 -646 -71 522 -139 -166 -112 353 207 -714 305 592 -588 -155
2809 -155 371 132 -201 -386 528 342 -826 133 621 -352 -386 112 383 -105 -630 457 536 -735 -161 570
$$ packed form
2658a25O4J54k18J95j33L3K34l23P8K05k67L1Q5R3n4j99K09J01k77K8J97nk50
2681a44R4K19j64j44N7L18k34l14M77L9m11J65K5J63k12k43O78k60m85N37r8r0
2703b7k9j28N93n12k79Q06m79j42K95j82L41m26r1Q27q09p7O97m55J03j28N4N04
2725D56q58K20P44q57J24L43r2L7n52N40M17j061M22N95n48p1k6M45p1q29P25
2746A03M60r08O7N28n1l62k41O99R2r16L84O64o21k90M16K84k97m50N80M37r56
2767c78L6Q01m05l35J81L44K4p14L41P47r68j7P16k88j44k03L78L09r66M21P36
2788F16r12M4L93J2r8n86P43L00j158N75N93o61k7N4M65j46r21J019K87j180M33
2809a55N26k39l33j85R14j86j168R59M88r73l4M98K71m88n25J087P9j271N74P31
$$ plain form
2829 570 -6 -337 -187 505 168 -769 173 652 -458 -254 315 219 -112 -485 384 449 -727 23 604 -297
2849 -297 -168 -12 283 77 -611 406 415 -665 93 298 -133 -107 -232 452 53 -705 485 291 -568 87
2869 87 148 189 -207 -379 708 16 -752 417 326 -314 -210 137 516 -340 -576 659 143 -671 84 381
2889 381 64 -426 -76 642 -167 -636 434 410 -394 -240 330 284 -353 -305 520 143 -599 151 472 -229 -252
2910 -252 64 294 -83 -456 418 315 -592 61 325 -137 -115 -129 404 7 -613 459 220 -596 141 133 109
2931 109 -89 -352 580 -23 -705 498 185 -341 5 -26 423 -277 -510 709 -18 -509 277 81 85 -286
2951 -286 -198 649 -351 -440 573 -12 -225 -50 53 372 -453 -211 630 -220 -304 268 105 -26 -283 117
2971 117 392 -352 -142 382 -2 -263 -50 228 62 -322 90 335 -222 -195 216 76 -216 -90 192 97 -200
$$ packed form
2829E70n76l31J50O92l37r37R42M79j110K04N69r6l31l73Q69O5j176P50N81r01
2849b97J29J56K95k06o88J017Rj080P58K05m31K6j25O84l99p58J190j94q59O55
2869H7O1M1l96j72J087o92p68J169r1o40J04L47L79q56k36J235n16q14P55K97
2889C81l17m90L50P18q09m69J070k4q04J54N70m6o37M8Q25l77p42P50L21p01k3
2910b52L16K30l77l73Q74j03r07O53K64m62K2j4N33l97o20J072k39q16P37qk4
2931A09j98k63R32o03o82J203l13n26L46l1M49p00k33J219p27m91P86j96Ml71
2951b86Q8Q47j000q9J013n85k13J75J03L19q25K42Q41q50q4N72j63j31k57M00
2971A17K75p44K10N24l84k61K13K78j66l84M12K45n57K7M11j40k92J26K82r5k97
$$ plain form
2992 -200 -63 277 -71 -293 224 165 -208 -14 46 110 -151 -205 348 13 -315 222 59 -80 -80 -19 283 -163
3014 -163 -238 378 -43 -244 132 24 124 -206 -84 415 -242 -237 295 -64 -79 -63 12 273 -273 -102 360 -165
3036 -165 -124 89 2 91 -185 13 299 -260 -70 194 -80 -24 -40 57 120 -239 0 149 -170 6 89 -44 2
3059 2 -128 48 70 -164 31 134 -104 9 19 23 -4 -102 78 65 -71 65 66 -49 -17 22 56 11 -62 78 88 -111
3085 -111 -29 38 -15 -30 -32 66 12 -47 21 27 -79 1 39 -15 35 -33 17 0 -69 -16 47 -37 3 26 -17 2 -29 13 27 -28
3115 -28 15 48 -32 25 25 -40 29 3 1 8 -43 14 31 -100 46 47 -29 29 14 65 -30 -75 91 8 -97 77 22 1 -31 -45
3145 -45 92 -31 -113 165 7 -41 40 -23 39 -73 -54 142 -69 -84 54 -6 -7 -41 26 118 -119 -39 88 -89 -34
3170 -34 10 37 35 -99 83 101 -148 4 106 20 -39 -27 102 12 -171 68 76 -83 -46 79 130 -92 -94 109 24 -161
$$ packed form
2992b00J37L40l48k22N17n9l73J94O0O4k61n4N53l35l28N37j63j39%O1L02m46
3014a63p5O16m21k01L76j08J00l30J22M99o57NN32l59j5J6P5K61n46J71M62n25
3036a65M1K13q7Q9k76J98K86n59J90K64k74N6j6R7O3l59K39J49l19J76Q3j33M6
3059Bj30J76K2k34J95J03k38J13J0Mk7r8J80j3j36J36Jj15L2L9L4m5p3J40J0j99
3085a11Q2O7n3j5kR8n4n9O8Oj06Q0L8n4N0o8N0j7o9N3O3q4M0K3m3J9l1M2J4n5
3115b8M3L3q0N7%o5O9k6kPn1N7J7j31J46Jp6N8j5N1r5m5J66q3j05J74n5k1l2j4
3145d5J37j23q2K78j58m8Q1o3O2j12J9J96k11j5J38o0jl4O7R2k37Q0J27j77N5
3170c4M4K7kj34J82J8k49J52J02q6n9J2J29r0j83K39Qj59L7J25N1k22kK03q5j85
$$ plain form
3196 -161 24 76 21 -94 -9 139 -75 -104 79 37 -58 -47 124 70 -149 29 149 -28 -73 19 89 -27 -166 96
3220 96 62 -148 -15 56 6 -125 -40 140 -70 -140 67 56 -92 -43 68 85 -130 -46 169 -20 -123 18 80 -34
3244 -34 -154 34 141 -142 -96 99 50 -100 -58 120 50 -165 39 161 -70 -92 51 73 -88 -128 112 67 -137
3267 -137 -4 110 -23 -120 12 141 -18 -136 140 91 -137 -41 71 47 -118 -39 126 -25 -144 38 67 -47
3289 -47 -86 67 93 -78 -84 84 22 -134 20 132 -13 -87 -4 108 -64 -106 118 102 -79 -6 67 -25 -99 -30 124
3314 124 -7 -82 102 88 -94 -56 49 77 -90 -48 138 0 -149 43 69 -47 -65 11 114 -38 -113 110 26
3337 26 -138 -12 74 -2 -45 -59 112 -26 -117 83 69 -77 -48 29 58 -65 -77 92 -22 -75 77 39 -23 -41 12
3362 12 91 -46 -70 88 10 -115 75 66 -2 -26 -38 98 -14 -83 72 24 -95 -10 -5 46 -16 -48 101 -13 -113 70
$$ packed form
3196a61J85N2n5j15Q5J48k14k9J83m2r5J1J71n4k19J78J20j77m5R2P0j16j39K62
3220I6l4k10J33P1n0j31Q5J80k10p0K07j1j48M9J11J7k15Q4K15j89j03J41O2j14
3244c4j20J88J07k83M6J95m9j50M2J78p0k15K04J22k31k2J43K2j61m0K40m5k04
3267a37J33J14j33r7J32J29j59j18K76m9k28R6J12k4j65P9J65j51j19J82K9j14
3289d7l9J53K6j71oJ68o2j56J54J12j45p4Q3J12j72m2K24j6j81P3P3r2p4O9J54
3314A24j31p5J84j4j82L8J05K8j67M2J86j38j49J92K6j16j8P6J03j52p5K23q4
3337B6j64J26Q6p6m3j4J71j38r1K00j4j46K9P7K9j23j2J69j14n3J52l8o2j8N3
3362A2P9j37k4J58p8j25J90ro8k4j2J36j12o9J55m8j19Q5NN1o2l2J49j14j00J83
$$ plain form
3388 70 23 -20 29 -27 80 -34 -117 103 -19 -60 92 -39 27 13 -76 91 -27 -99 135 -69 -9 52 -90 80
3412 80 -45 -59 129 -56 -35 153 -95 27 30 -48 122 -88 -39 133 -82 -17 70 -94 99 -30 -13 145 -126
3435 -126 15 100 -76 37 -1 -67 113 -84 -27 72 -82 35 2 -108 52 -44 -41 90 -44 -22 45 -77 45 8
3459 8 -86 58 -29 -59 64 -57 28 24 -102 27 19 -95 40 -15 -24 74 -73 15 47 -113 58 55 -82 83 -48 -35
3485 -35 108 -127 35 53 -140 93 -5 -59 123 -129 28 95 -155 125 16 -94 166 -91 -12 73 -133 123
3507 123 21 -117 172 -30 -59 130 -103 74 21 -100 187 -51 -128 149 -93 -22 84 -113 114 -56 -127 176
3529 176 -67 -23 101 -78 42 0 -71 138 -65 -115 116 -61 -47 57 -60 109 -37 -85 138 -40 -54 123
3551 123 -57 28 57 -97 115 -44 -82 175 -48 -59 89 -94 38 8 -113 130 -46 -98 121 -47 -15 64 -106
$$ packed form
3388G0m7m3M9n6J07j14q3K20j22m1J52j31O6j4q9J67j18p2K34k04O0O1j42J70
3412H0j25j4J88j85K1J88k48J22Lp8J70k10M9J72k15O5Q7j64J93j29J7J58k71
3435a26J41Q5j76J13l8o6J80j97N7R9j54J17l3j10J60r6LJ31j34K2O7j22J22l7
3459Hr4J44q7l0J23j21Q5mj26J29qj14J35n5rR8j47Q8L2j60J71lj37J65j31J3
3485c5J43k35J62J8j93K33r8n4J82k52J57O7k50K80j09j10K60k57P9Q5k06K56
3507A23j02j38K89k02k9J89k33J77n3j21K87k38p7K77k42P1J06j97K27j70p1L03
3529A76k43M4J24j79J20m2p1K09k03n0K31j77J4J04j17J69j46m8K23j78j4J77
3551A23j80Q5K9j54K12j59l8K57k23j1J48j83J32l0j21K43j76n2K19j68L2P9j70
$$ plain form
3574 -106 107 -26 -92 108 -83 -30 119 -123 60 8 -110 100 -90 -78 148 -147 11 76 -54 64 -34 -77
3596 -77 138 -124 -57 107 -107 27 17 -85 113 -65 -58 135 -82 33 67 -64 65 -20 -76 133 -75 -69 119
3619 119 -63 -16 52 -96 94 -49 -62 133 -81 -21 93 -72 55 -20 -88 147 -65 -76 106 -82 43 44 -159
3642 -159 138 -48 -80 132 -108 2 84 -114 61 -7 -107 137 -70 -41 93 -94 92 -10 -85 115 -75 -29
3664 -29 126 -85 31 23 -103 75 -16 -55 99 -51 -28 91 -60 46 -20 -32 79 -63 1 120 -73 -12 67 -38
3688 -38 16 -33 4 77 -83 -66 91 -11 -61 35 17 23 -61 -69 119 -62 -90 72 -25 -26 -27 -20 83 -90 -87 145 -28 -64
3716 -64 59 -55 27 -44 -54 141 -96 -70 124 -14 15 -3 11 108 -105 16 176 -106 -33 56 -11 35 -77 45
3740 45 87 -107 -33 99 -68 -27 23 45 5 -133 38 102 -112 -6 70 -9 -56 -48 104 15 -126 2 85 -71 -103
$$ packed form
3574a06K13j33o6K00j91N3J49k42J83n2j18K10j90J2K26k95J58O5j30J18r8m3
3596g7K15k62O7J64k14J34j0j02J98j78PJ93k17J15L4j31J29q5n6K09k08OJ88
3619A19j82M7O8j48J90j43j3J95k14O0J14j65J27p5o8K35k12j1J82j88J25Jk03
3642a59K97j86l2K12k40J10Q2j98J75o8j00K44k07K9J34j87J86j02p5K00j90M6
3664b9J55k11J16qj26J78r1l9J54j50K3J19j51J06o6j2J11j42O4J19j93O1P9j05
3688c8N4m9L7P3j60J7J57j02n0R6j8Oq4qJ88j81k8J62r7jjPJ03j73LK32j73l6
3716f4J23j14Q2p1j0J95k37K6J94j38K9j8J4R7k13J21J60k82P3Q9o7M6j12J22
3740D5M2j94P4J32j67M1N0K2m0j38J71O4k14J06P6p9m7QJ52q9j41J28Q3j56l2
$$ plain form
3765 -103 55 49 -52 -84 46 73 -122 -47 107 -56 -96 41 73 -40 -129 32 142 -98 -66 145 0 -72 -18 65
3789 65 80 -142 19 136 -81 -27 98 34 -2 -88 67 106 -173 -13 126 -18 -57 6 90 -15 -145 101 99 -135
3813 -135 -15 95 9 -129 -60 113 -33 -149 83 85 -119 -71 28 77 -102 -58 115 35 -132 47 109 -52 -135 65
3837 65 104 -88 -113 119 94 -140 -56 132 47 -117 3 134 -27 -121 61 142 -74 -104 121 91 -100 -55 138 65
3861 65 -156 -11 161 -90 -77 52 104 -66 -105 111 67 -161 1 116 -18 -109 -22 120 -65 -180 99 61 -100
3884 -100 -41 65 40 -104 -41 121 -22 -148 82 88 -50 -97 51 131 -108 -44 128 15 -135 -5 140 12 -139
3907 -139 33 127 -110 -81 79 95 -92 -71 146 42 -151 -9 148 -23 -125 70 109 -90 -104 92 74 -118
3929 -118 -71 116 57 -133 0 116 -42 -147 32 100 -70 -106 44 63 -107 -34 68 10 -132 -47 125 -39 -127
$$ packed form
3765a03J58oj01l2J30K7j95P5J54j63m0J37L2j13q9J61J10k40L2K11j45p2N4Q3
3789F5J5k22J61J17k17N4J25o4l6q6J55L9k79J60J39j44l9O3Q4j05j30K46kk34
3813a35J20J10q6j38O9J73j46j16K32Kk04M8R9M9j79M4J73q0j67J79O2j61q3K00
3837F5L9j92k5K32k5k34Q4J88q5j64J20J31j61r4J82Q1k16l0K25l0j91M5J93p3
3861F5k21J45J72k51J3J29N2j70l9K16m4k28J62J15j34r1Q7J42j85j15K79l8j61
3884a00N9J06k5j44O3J62j43j26K30Oj38m7J48Q0k39O4J72j13j50J30J45j28j51
3907a39J72R4k37K9J60J6j87K1K17j04j93J42J57j71j02J95L9j99j4J96j8j92
3929a18M7J87n9j90J33J16j58j05J79O8j70l6J50J9j70P3J02n8j42Q5J72j64q8
$$ plain form
3952 -127 58 80 -99 -68 72 57 -108 -25 87 -38 -103 -11 72 -35 -84 0 93 -95 -51 86 37 -74 -2 107
3976 107 28 -123 20 110 -38 -66 34 51 -80 -64 58 56 -93 -24 106 3 -110 41 94 -29 -71 37 73 -60
4000 -60 -54 69 19 -76 11 52 -1 -74 -31 53 -74 -77 70 -9 -14 -41 17 46 -32 -9 76 -52 -47 36 23 24 -73 -5 57 -76
$$ packed form
3952a27J85K2j79L1J40j5j65Q3J12j25o5R2Q3j07m9Q4R3j88M4J37m9j11P2J09
3976A07p9j51J43R0j48k8J00J7j31J6J22kj49O9J30j03j13J51N3j23m2J08L6j33
4000f0OJ23n0r5Q7M1n3p3M3Q4j27lJ47p9nk7N8K9p8K3Q5j28NQ3j3Jr7O8O2j33
$$ [...]
8191c0
##END NTUPLES=NMR FID
##END=
