##TITLE=1H_2PDM3005
 CDCl3, 8 sc, 
 31.5.2019
##JCAMPDX= 6.0         $$ Bruker NMR JCAMP-DX V2.0
##DATA TYPE= NMR FID
##DATA CLASS= NTUPLES
##ORIGIN= UXNMR, Bruker Analytische Messtechnik GmbH
##OWNER= root
$$ XWIN-NMR		Version 3.5
$$ Fri May 31 12:32:19 2019 Russian Standard Time (UT+4h)  she@DPX200
##.OBSERVE FREQUENCY= 200.13155
##.OBSERVE NUCLEUS= ^1H
##.DELAY= (6, 6)
##.ACQUISITION MODE= SIMULTANEOUS
##.ACQUISITION SCHEME= undefined
##.AVERAGES= 8
##.DIGITISER RES= 18
##SPECTROMETER/DATA SYSTEM= spect
##.PULSE SEQUENCE= zg30
##.SOLVENT NAME= CDCl3
##.SHIFT REFERENCE= (INTERNAL, CDCl3, 0, 15.7039)
##AUDIT TRAIL= $$ (NUMBER, WHEN, WHO, WHERE, WHAT)
$$ ##TITLE= Audit trail, XWIN-NMR		Version 3.5
$$ ##JCAMPDX= 5.01
$$ ##ORIGIN= Bruker BioSpin GmbH
$$ ##OWNER= she
$$ F:/spectra/data/she/nmr/H-F/1/audita.txt
$$ ##AUDIT TRAIL=  $$ (NUMBER, WHEN, WHO, WHERE, WHAT)
(   1,<2019-05-31 12:30:35.07 +0400>,<she>,<DPX200>,
      <created by zg, POWCHK disabled, PULCHK disabled
       configuration hash MD5:
       00 E9 B6 7A A2 85 ED C7 34 08 36 98 17 FE 4E 26
       data hash MD5: 16K
       DD 3C 2D 89 5D 18 F3 ED C1 D3 9E 50 F5 74 59 AF>)
$$ ##END=
$$ 
$$ hash MD5
$$ 77 C0 03 89 A0 2F 1B 16 CC 35 51 25 EE D1 7D C3
##$RELAX= 
##$RELAX= 
##$RELAX= 
##$RELAX= 
##$RELAX= 
##$RELAX= 
$$ Bruker specific parameters
$$ --------------------------
##$DU= <F:/spectra>
##$EXPNO= 1
##$NAME= <H-F>
##$PROCNO= 1
##$TYPE= <nmr>
##$USER= <she>
##$AMP= (0..31)
100 100 100 100 100 100 100 100 100 100 100 100 100 100 100 100 100 100 
100 100 100 100 100 100 100 100 100 100 100 100 100 100 
##$AQSEQ= 0
##$AQ_mod= 1
##$AUNM= <au_zg>
##$AUTOPOS= <>
##$BF1= 200.13
##$BF2= 200.13
##$BF3= 200.13
##$BF4= 200.13
##$BF5= 200.13
##$BF6= 200.13
##$BF7= 200.13
##$BF8= 200.13
##$BYTORDA= 1
##$CFDGTYP= 0
##$CFRGTYP= 5
##$CHEMSTR= <none>
##$CNST= (0..31)
1 1 145 1 1 1 1 1 1 1 1 1 1 1 1 1 1 1 1 1 1 1 1 1 1 1 1 1 1 1 1 1 
##$CPDPRG= <>
##$CPDPRG1= <>
##$CPDPRG2= <>
##$CPDPRG3= <>
##$CPDPRG4= <mlev>
##$CPDPRG5= <mlev>
##$CPDPRG6= <mlev>
##$CPDPRG7= <mlev>
##$CPDPRG8= <mlev>
##$CPDPRGB= <>
##$CPDPRGT= <>
##$D= (0..31)
0 1.2 0 0 0 0 0 0 0 0 0 0.03 0 0 0 0 0 0 0 0 0 0 0 0 0 0 0 0 0 0 0 0 
##$DATE= 1559291434
##$DBL= (0..7)
120 120 120 120 120 120 120 120 
##$DBP= (0..7)
150 150 150 150 150 150 150 150 
##$DBP07= 0
##$DBPNAM0= <>
##$DBPNAM1= <>
##$DBPNAM2= <>
##$DBPNAM3= <>
##$DBPNAM4= <>
##$DBPNAM5= <>
##$DBPNAM6= <>
##$DBPNAM7= <>
##$DBPOAL= (0..7)
0.5 0.5 0.5 0.5 0.5 0.5 0.5 0.5 
##$DBPOFFS= (0..7)
0 0 0 0 0 0 0 0 
##$DE= 6
##$DECBNUC= <off>
##$DECIM= 24
##$DECNUC= <off>
##$DECSTAT= 4
##$DIGMOD= 1
##$DIGTYP= 9
##$DL= (0..7)
0 120 120 120 120 120 120 120 
##$DP= (0..7)
150 150 150 150 150 150 150 150 
##$DP07= 0
##$DPNAME0= <>
##$DPNAME1= <>
##$DPNAME2= <>
##$DPNAME3= <>
##$DPNAME4= <>
##$DPNAME5= <>
##$DPNAME6= <>
##$DPNAME7= <>
##$DPOAL= (0..7)
0.5 0.5 0.5 0.5 0.5 0.5 0.5 0.5 
##$DPOFFS= (0..7)
0 0 0 0 0 0 0 0 
##$DQDMODE= 0
##$DR= 18
##$DS= 0
##$DSLIST= <SSSSSSSSSSSSSSS>
##$DSPFIRM= 0
$$ [...]
##$SUBNAM2= <"">
##$SUBNAM3= <"">
##$SUBNAM4= <"">
##$SUBNAM5= <"">
##$SUBNAM6= <"">
##$SUBNAM7= <"">
##$SUBNAM8= <"">
##$SUBNAM9= <"">
##$SW= 24.9336996594482
##$SWIBOX= (0..15)
0 0 2 0 0 0 0 0 0 0 0 0 0 0 0 0 
##$SW_h= 4990.01996007984
##$TD= 16384
##$TD0= 1
##$TE= 0
##$TE2= 300
##$TE3= 300
##$TEG= 300
##$TL= (0..7)
0 120 120 120 120 120 120 120 
##$TP= (0..7)
150 150 150 150 150 150 150 150 
##$TP07= 0
##$TPNAME0= <>
##$TPNAME1= <>
##$TPNAME2= <>
##$TPNAME3= <>
##$TPNAME4= <>
##$TPNAME5= <>
##$TPNAME6= <>
##$TPNAME7= <>
##$TPOAL= (0..7)
0.5 0.5 0.5 0.5 0.5 0.5 0.5 0.5 
##$TPOFFS= (0..7)
0 0 0 0 0 0 0 0 
##$TUNHIN= 0
##$TUNHOUT= 0
##$TUNXOUT= 0
##$USERA1= <user>
##$USERA2= <user>
##$USERA3= <user>
##$USERA4= <user>
##$USERA5= <user>
##$V9= 5
##$VALIST= <valist>
##$VCLIST= <CCCCCCCCCCCCCCC>
##$VD= 0
##$VDLIST= <DDDDDDDDDDDDDDD>
##$VPLIST= <PPPPPPPPPPPPPPP>
##$VTLIST= <TTTTTTTTTTTTTTT>
##$WBST= 1024
##$WBSW= 4
##$XGAIN= (0..3)
0 0 0 0 
##$XL= 0
##$YL= 0
##$YMAX_a= 568823
##$YMIN_a= -377951
##$ZGOPTNS= <>
##$ZL1= 120
##$ZL2= 120
##$ZL3= 120
##$ZL4= 120
##$ABSF1= 10
##$ABSF2= 0
##$ABSG= 5
##$ABSL= 3
##$ALPHA= 0
##$AQORDER= 0
##$ASSFAC= 0
##$ASSFACI= 0
##$ASSFACX= 0
##$ASSWID= 0
##$AUNMP= <proc_1d>
##$AZFE= 0.1
##$AZFW= 0.1
##$BCFW= 1
##$BC_mod= 2
##$BYTORDP= 1
##$COROFFS= 0
##$CY= 11.3945322036743
##$DATMOD= 1
##$DC= 2
##$DFILT= <>
##$DTYPP= 0
##$F1P= 18.9103706918063
##$F2P= -1.10871071338519
##$FCOR= 0.5
##$FTSIZE= 0
##$FT_mod= 4
##$GAMMA= 1
##$GB= 0.15
##$INTBC= 1
##$INTSCL= 1
##$ISEN= 128
##$LB= 0.24
##$LEV0= 0
##$LPBIN= 0
##$MAXI= 10000
##$MC2= 0
##$MEAN= 0
##$ME_mod= 0
##$MI= 1.114404
##$NCOEF= 0
##$NC_proc= 0
##$NLEV= 6
##$NOISF1= 3.799351
##$NOISF2= 2.8
##$NSP= 1
##$NTH_PI= 0
##$NZP= 0
##$OFFSET= 15.70392
##$PC= 1
##$PHC0= -8654.946
##$PHC1= 7.800231
##$PH_mod= 1
##$PKNL= yes
##$PPARMOD= 0
##$PSCAL= 0
##$PSIGN= 0
##$REVERSE= no
##$SF= 200.130013532006
##$SI= 16384
##$SIGF1= 3
##$SIGF2= 2
##$SINO= 400
##$SIOLD= 16384
##$SREGLST= <1H.CDCl3>
##$SSB= 0
##$STSI= 0
##$STSR= 0
##$SW_p= 3612.71676300578
##$SYMM= 0
##$S_DEV= 0
##$TDeff= 0
##$TDoff= 0
##$TI= <>
##$TILT= no
##$TM1= 0
##$TM2= 0
##$TOPLEV= 0
##$USERP1= <user>
##$USERP2= <user>
##$USERP3= <user>
##$USERP4= <user>
##$USERP5= <user>
##$WDW= 1
##$XDIM= 8192
##$YMAX_p= 0
##$YMIN_p= 0
$$ End of Bruker specific parameters
$$ ---------------------------------
##NTUPLES= NMR FID
##VAR_NAME=  TIME,          FID/REAL,        FID/IMAG
##SYMBOL=    X,             R,               I
##VAR_TYPE=  INDEPENDENT,   DEPENDENT,       DEPENDENT
##VAR_FORM=  AFFN,          ASDF,            ASDF
##VAR_DIM=   8192,          8192,            8192
##UNITS=     SECONDS,       ARBITRARY UNITS, ARBITRARY UNITS
##FACTOR=    0.0002004,     1,               1
##FIRST=     0,             0,               0
##LAST=      1.6414764,     0,               0
##MIN=       0,             -377951,         0
##MAX=       1.6414764,     568823,          0
$$ Real data points
##PAGE= N=1
##DATA TABLE= (X++(R..R)), XYDATA
0@%%%Qj6J6j6K4l2M0n6P2q8J12j36J60j92K32k80L28l80M45n22O02o90P92r05
27d82J031j170J322j493J681j884K109k358K629k927L253l610M007m442M915n439
43b858O023o671P395q211R133j0187J1407j2832J4531j6594J9156k2443K6838
56A4687l3052M2577n9168R6133l14216J06304O21013l73187k15515K12474o2364
67C5686m13637K69837N21883j87466n18652J03167K52541r7723K0795L07549j28714
78A65266m39023K8402L58625j0219j41857J14035J1887k53219L8653L22043j6847
89A77746l07696j4286J80572j8794n3250J19281O971j77526k0014J67912M3179
100A04095r7945o4356l1848J0256J31556J06464q5598j31957k9043n061M5226
$$ plain form
0 0 0 0 0 8 -8 8 -8 16 -16 24 -32 40 -48 64 -72 88 -104 128 -152 176 -204 241 -281 321 -369 423 -482
27 -482 549 -621 701 -792 889 -995 1114 -1244 1385 -1542 1711 -1899 2108 -2334 2581 -2858
43 -2858 3165 -3506 3889 -4322 4811 -5376 6031 -6801 7730 -8864 10292 -12151 14687
56 14687 -18365 24212 -34956 61177 -253039 -146735 474278 101091 -114424 98050 35686
67 35686 -377951 -108114 413769 226303 -292349 -189182 63359 -34364 -13569 293980 165266
78 165266 -273757 -245355 113270 103051 -38806 75229 87116 -166103 -127450 194593 177746
89 177746 -129950 -144236 36336 17542 -35708 83573 90544 -86982 -106996 60916 104095
100 104095 6150 -58206 -90054 -79798 51758 158222 72624 -59333 -88376 -93437 -48211
111d8211J72833O1480k25976j76049J35844J68146P48Q113j5028k11157j31815
122b61072K34676K45416r2794j52137K035o5780p7926K07734K27381j83667k84587
133b00721O9287J65866k9611L7233J46551j34796k96723P3454L08765R849j78934
144b9780J2212L7438j23424J8539K28024J3510k39126n5796J51293K1736n2933
155a8307Q2795K5789j73097n9021J89348Q9615j40661p2592P1741m657m4138R9467
167D6282Q5471j38479j49545R4415J58254k2044q7633J096p813n9845M5006J43677
179A08842P123j59959q0802Q3557P7967O682J7057j1623j13465p0742J16177J41829
191A22643l2548j10809l1922O22k080Q0374R9065o3763j53367q533J09602L8365
$$ plain form
111 -48211 124622 186102 -39874 -215923 -80079 88067 88815 96928 81900 -129257 -261072
122 -261072 -26396 219020 126226 -25911 -23876 -89656 -167582 40152 267533 83866 -200721
133 -200721 -131434 34432 4821 42054 188605 53809 -242914 -169460 139305 149154 -29780
144 -29780 -17568 19870 -103554 -85015 143009 156519 -82607 -138403 12890 34626 -18307
155 -18307 64488 90277 -82820 -141841 47507 137122 -3539 -76131 -4390 -9047 -53185 46282
167 46282 131753 -6726 -156271 -61856 96398 74354 -13279 -12183 -19996 -79841 -34835 108842
179 108842 115965 -43994 -124796 -41239 36728 43410 60467 48844 -64621 -135363 -19186 122643
191 122643 90095 -20714 -52636 -52014 -54094 26280 125345 61582 -91785 -100318 9284 47649
203D7649j6708J8722k9474j05409n672J30821N8436p9590n4793J5749o139M54
215b5954O7317K9947q1480o4691M4930N9456r0j4135j1209k9921r491L9282L0090
228C4051j9664l1317j0305J0550K9463K1983j9660l5253o633R958J3886L1848
240B8907J1353n2447m3026M1737N0990j5615j9385P978l2226l7157N9550P5935
252G6594m4100p5618K2924L3501l3652R887O8436k5123r3579J7010Q3931j3842
264B6369m5744L7830J1565p8557n979R8369J1173q4455P16N8083l1719m0987O1970
277A8634L3649p7041k5940P4914Q464o5432J7409N9007l8871n2900M8768L8658
289C9319n2525j7299N6405k415n7227J6437N0602k7653l7270L8713K3820m6920
$$ plain form
203 47649 30941 49663 20189 -85220 -90892 39929 98365 18775 -36018 -20269 -26408 -25954
215 -25954 41363 71310 -10170 -74861 -29931 29525 29435 15300 4091 -25830 -35321 3961 34051
228 34051 14387 -16930 -27235 -16685 12778 34761 15101 -20152 -26785 -16827 -2941 28907
240 28907 40260 -12187 -55213 -13476 37514 21899 2514 10492 -21734 -58891 659 76594
252 76594 32494 -43124 -20200 13301 -20351 -10464 57972 32849 -60730 -43720 40211 26369
264 26369 -19375 18455 30020 -48537 -54516 43853 55026 -29429 -28713 29370 -2349 -43336 18634
277 18634 52283 -24758 -50698 24216 32680 -32752 -15343 43664 4793 -48107 661 39319
289 39319 -13206 -30505 25900 23485 -33742 -17305 33297 5644 -31626 7087 30907 -16013
301a6013j3702M7180N198l7690O512K3811k2545j3942L7330J3326l9729j4116
313b4380K7015N021j1696J3385O228k7578q943K9019J1189j7841m883K697j2984
326a3751J463K9493Q081k7404j5117Q997M411O474J6913p940l5067m687L5272
339G138J8190j3643j2064j0537j6755J0569M0302J0368l5244k3648J0055J2208
351c061J1003J9099o776m3743k0560L4865L8126J135j6226k0776k6055K299M5907
364A5237L1606k7922m3640p410J9209K3787K3842j423m2828l7151J8029M4932
376A6268J7768j2232k2761k5956o598L4270M0290q482m6053k6621J2961L1368
388D222K8699M022l5072m3106J879M5162L3036j0580l4650k7647q1L3345M0020
$$ plain form
301 -16013 -29715 17465 22663 -15027 -8515 15296 -7249 -21191 16139 29465 -10264 -24380
313 -24380 2635 7656 -4040 9345 15573 -12005 -20948 8071 19260 1419 -3464 -767 -13751
326 -13751 -12288 17205 25286 -2118 -17235 -8238 -3827 2647 19560 11620 -23447 -28134 7138
339 7138 25328 11685 -379 -10916 -27671 -17102 23200 33568 -1676 -25324 -15269 -3061
351 -3061 7942 27041 20265 -23478 -44038 -9173 28953 30088 13862 -6914 -32969 -30670 15237
364 15237 46843 18921 -24719 -32129 -12920 10867 34709 33286 -9542 -46693 -28664 16268
376 16268 34036 21804 -957 -26913 -33511 759 41049 32567 -13486 -40107 -27146 4222
388 4222 32921 36943 1871 -41235 -39356 5806 38842 28262 -6388 -34035 -34116 -771 39249
401C9249J659m2781m0692K589L8118L6872N519l2316m3580j0599L7706M7609P029
414D6382l9304m5374q689L5524M7836J4661l5077n1190j4869L5760M8241J4257
426D8158l0291m5665k0240K6551N0648K3860k9493n1799k1499K6513M7476K6525
438E0744k0356n2778l3331K4258N6610K8387k5001m9503k9478J6138N0500L7231
450E3421j8367n6476l3508K0987M9552L3164j0004m7517m3803P036N3515M3080
462E1080j0587m8744l8943N274M6388M5459l091n1877m7189N171M9554M5368J17
475D7980m4550m6462k345M3315M4551K492m1459m6388n292M4169N0016N455m2107
488I375m7839j2633L3742N2378J9323l8885n5229r876M0915M5156J1281l0059
$$ plain form
401 39249 40908 -1873 -42565 -39976 -1858 35014 40533 8217 -35363 -45962 -8256 39353 46382
414 46382 7078 -38296 -46985 -11461 36375 51036 15959 -35231 -50100 -14340 33901 48158
426 48158 17867 -27798 -48038 -21487 29161 53021 23528 -28271 -49770 -23257 24219 50744
438 50744 30388 -22390 -55721 -31463 25147 53534 28533 -20970 -50448 -34310 16190 53421
450 53421 35054 -21422 -54930 -33943 15609 48773 38769 -8748 -52551 -45515 8000 51080
462 51080 40493 -8251 -47194 -41920 4468 49927 46836 -5041 -52230 -47059 2495 47863 47980
475 47980 3430 -43032 -45377 -2062 42489 44981 3522 -42866 -48158 -3989 46027 51482 9375
488 9375 -38464 -51097 -17355 35023 54346 15461 -39768 -49644 -8729 36427 47708 17649
500A7649n1561k6297L4857O2751J9513l8211m6613j6263J8185M2698L3707k0621
512B9794o1006k6762L7568N0749J6273j8239m0966m0390Q370O2121M1350l0270
524B8592n4181j5465K0106L1913L2167j246n4993m9724K3954O3964K4904k1543
536B8448l1207k9500j1297L8376N6501m258o2845l6153K3531L8256K4774Q297
548D2923k9023n7046j4639N4425N0755j1533l9480k2039m425J6012M0852K1403
560D8185l8851n3575Q83M2813K8455J495j3909l0656k5915K0227M9950J2097m0257
573I42l5075N484K5706K4177J4059j5339m4747k3686L3610M9291L945l4814k7060
586b3507m087J3213L1707K8681j9246n7876k3240L9717M5404O121j6335k4692
$$ plain form
500 17649 -33912 -60209 -25352 37399 56912 18701 -27912 -44175 -25990 16708 50415 29794
512 29794 -31212 -57974 -20406 30343 46616 28377 -12589 -52979 -44609 17512 58862 28592
524 28592 -25589 -41054 -20948 10965 43132 41886 -13107 -62831 -38877 25087 49991 28448
536 28448 -2759 -32259 -43556 -5180 51321 47063 -15782 -51935 -28404 9852 34626 42923
548 42923 13900 -43146 -57785 -3360 47395 35862 -3618 -25657 -30082 -14070 26782 48185
560 48185 9334 -44241 -43358 -545 27910 29405 15496 -15160 -41075 -20848 29102 41199 942
573 942 -34133 -28649 -2943 21234 35293 19954 -24793 -48479 -14869 34422 38367 3553 -23507
586 -23507 -27594 -14381 17326 46007 26761 -31115 -54355 -14638 30766 36887 20552 -4140
598d140l3465m141N2667M6704k7961n7519j0428K3191J6811K3055K0347l3498
610A1623o0916L209N9493K2553k3100j0558o517k6871M693N4299J7732n0970l1460
623c6790K5002J6666o043J5867J1133l7710k7927L7401L5686k4258k6737J2192
635e518N086j1241J8157K5001k6206m0233J4770L8801J423j6879k257q483j6971
648b4550J5542L9665L120l9983k6091J2634K3112J4492O409j0296l0497k0372
660c6815K1502M2077R398l0707k6339K32P703J2310K6782Q181m0584l7091K3355
673a9996L9357l285j2114Q809j5480l6236J9085N6519o318n0301K802K9015j9969
686h112j5061M3617J5080n4952j5875N2103O248m5328J1617M2168k7709l9044
$$ plain form
598 -4140 -37605 -41746 10921 57625 29664 -27855 -38283 -15092 1719 24774 45121 11623
610 11623 -49293 -46084 13409 35962 12862 2304 -4213 -31084 -26391 27908 45640 -5330 -36790
623 -36790 -11788 4878 -1165 14702 25835 -11875 -39802 -2401 33285 9027 -17710 -5518
635 -5518 -432 -11673 6484 31485 5279 -34954 -20184 18617 20040 3161 904 -7579 -24550
648 -24550 -9008 30657 33777 -6206 -32297 -19663 3449 17941 24350 14054 -16443 -36815
660 -36815 -15313 26764 36162 5455 -20884 -20652 -12949 -639 26143 34324 -6260 -43351 -19996
673 -19996 19361 16076 3962 12771 -2709 -38945 -19860 36659 30341 -19960 -17158 11857 -8112
686 -8112 -23173 20444 35524 -19428 -35303 16800 23048 -22280 -10663 31505 3796 -35248
698c5248L8665L1279m7215k1115N3516J2300n1819q09M3183j8076l7407L7948
710E202L9299m5526m0038L8455K6823l0144j647L4588j7867m7732J6912M9553
722B7878n295l0443M918O254k1917j89L6787J2036l0761k0810R722J0644K595
735A419Q290N691j3542k0834j92K1545J4594q152j1281P11l245j0492J0158K5737
749B0407l456k7900j924J7347o991r581K4392J3780l2534j9293K7581J1372k2507
762i307P352K8711k0073l8329J9051L4845j5820j6993K4140N50m0238K079M6426
775B2394J120l5634N290J9980k3782j5061L8638J9084l7730j7456K7030K237k2738
788a6628J5763K8500k1960l2312J7525K3898j5473r965K1971K813k8613l562K6466
$$ plain form
698 -35248 3417 34696 -12519 -33634 19882 32182 -19637 -20446 22737 4661 -32746 5202
710 5202 44501 -1025 -41063 -2608 24215 -5929 -7576 27012 9145 -38587 -21675 27878
722 27878 22583 -7860 -2942 3312 -18605 -18794 17993 30029 -732 -21542 -11820 -1176 1419
735 1419 9709 15400 1858 -18976 -19168 2377 16971 8819 -2462 -1751 -4996 -15488 -5330 20407
749 20407 16951 -10949 -12873 4474 -2517 -12098 12294 26074 -6460 -25753 1828 13200 -9307
762 -9307 -1955 26756 6683 -31646 -12595 22250 6430 -10563 13577 14127 -26111 -24032 22394
775 22394 23514 -12120 -6830 13150 -10632 -25693 12945 32029 -5701 -23157 3873 6110 -16628
788 -16628 -865 27635 5675 -26637 -9112 14786 -687 -10652 11319 14132 -14481 -18043 8423
801H423L160j8698M718J6226j3259k1265J3074K3841o873j5762Q053O108j9743
814a1997p286K9329J6547k5465j8204J5879M791j6114J2438L0249j6831m2743
826b9407P622L6361l611j6171J8583L684m1276r114M8903J7005l7095q825K2437
839I096j4936k2285L5224L2580l6943l5183K6251J8745k2231M686L1500j6800
851I704m0614J5425L6341j2643k1441J7512P632k5708j473K9347k37k4722L883
864f994J7430q842j1990J0763O837r557K01J0126l597j1021l84N845N575N682
878A0074m084j3720k693R349L999L184P705j0355k4398L988K8594M452j5339J888
892B644l05k2969J465L9500Q217l6575j0511K0169o226r943L1531J5422m4574
$$ plain form
801 8423 11583 -7115 -2397 13829 570 -20695 -7621 16220 9347 -6415 1638 7746 -11997
814 -11997 -19283 10046 26593 1128 -17076 -1197 3594 -12520 -82 30167 13336 -29407
826 -29407 -21785 14576 10965 -5206 13377 17061 -24215 -33329 15574 32579 -4516 -13341 9096
839 9096 -5840 -28125 7099 39679 2736 -32447 -6196 12549 -9682 -4996 26504 9704
851 9704 -30910 -15485 20856 8213 -13228 4284 11916 -13792 -15265 14082 13845 -10877 -6994
864 -6994 10436 1594 -10396 367 7204 -2353 -2152 7974 4377 -6644 -7028 -1183 4392 10074
878 10074 5990 -7730 -10423 -1074 2925 6109 13814 3459 -20939 -16951 11643 16095 756 2644
892 2644 2339 -20630 -19165 20335 28552 -8023 -18534 1635 -4591 -14534 16997 32419 -12155
905a2155k4526L7671J8625k5072M405K3572k7708l2566L6263L7183l1703k5801
917b1812K7623L986l2599J4398M1575k1328m2535K1762L1926k4059j5312L0969
929A4594R38l7996P973L9818j2602l4510J6352K3330k1035j0233K7356o45l3170
942a9830N560L3181o271k4457Q840J0345j7212o50K6638l77k8335k855J8188K75
956C040l679J0991k888k2433j365K2028O453r502j788l102j0905N188K0114J434
970A3586j6105n261K924j478P034J4149o000j9581k80J2950R73q61P441o209j8050
985a4768M996K1843p14j5596J663N121r713P71J9181l92k2606j893J8205K20r940
1000c622P035L907j7076l948K2298O935j9049n828J0895k488o030J3469P577j9716
$$ plain form
905 -12155 -36681 990 19615 -5457 -1052 22520 -5188 -37754 -1491 35692 3989 -21812
917 -21812 5811 9797 -22802 -8404 33171 11843 -30692 -8930 22996 -1063 -16375 14594
929 14594 15532 -22464 -14491 25327 12725 -21785 -5433 17897 -3138 -13371 13985 13340 -19830
942 -19830 -14270 18911 12640 -11817 -2977 7368 -9844 -10494 16144 15767 -12568 -15423 2765 3040
956 3040 -639 10352 7464 -14969 -16334 5694 12147 2645 857 -2245 -13150 -7962 12152 13586
970 13586 -2519 -7780 -4856 -6334 700 14849 8849 -10732 -11012 1938 2911 2050 9491 3282 -14768
985 -14768 -9772 12071 11357 -4239 -2576 2545 -7168 -6397 12784 12392 -10214 -12107 6098 6318 -3622
1000 -3622 3413 7320 -9756 -13704 8594 15529 -3520 -9348 1547 -941 -6971 6498 14075 -5641
1014e641j2012J6762J1578r095k415N834r698j0285J4744J6062j0844j4283N032
1027d261M923m926N464J1151q651j6672M499J4686j99n575K566k313r402L792
1041d918J4050m68j2374j909N965n83J51O623j187j1559j796J0611L930n544j752
1056g60N69l820K99Q653K562q770n615L787L791J181K476j566p809k458P719N390
1072E629k919l557j513k393J109P622L114p039n980K306L506J259K578K6o889
1087c141m071O283O702j979m117j181j694l65O205M946n325p491J176M974J455
1102B377R24O69n064n801M021Q125K52m856k029j357j585M286O954k118q592j804
1118e598M492K072Q28K429k615p366j49P770K779m130j532L32k757J76O225J818
$$ plain form
1014 -5641 -17653 -891 10687 1592 -823 5011 -4687 -14972 -228 15834 4990 -9293 -4261
1027 -4261 662 -4264 1200 12351 3700 -12972 -8473 6213 6014 439 3005 692 -8710 -4918
1041 -4918 9132 8664 -3710 -5619 346 -237 -86 6537 5350 -6209 -8005 2606 6536 992 -760
1056 -760 -191 -4011 -3712 4941 7503 -1267 -6882 -3095 696 1877 4353 2787 -5022 -7480 239 5629
1072 5629 2710 -847 -2360 -4753 -3644 3978 7092 53 -5927 -3621 -115 1144 3722 3748 -3141
1087 -3141 -7212 -929 5773 3794 -323 -1504 -3198 -3563 2642 7588 2263 -5228 -4052 922 2377
1102 2377 3301 3970 -1094 -6895 -2874 5251 5503 647 -1382 -2739 -4324 -38 6916 4798 -3794 -5598
1118 -5598 -1106 966 1794 4223 1608 -5758 -5907 1863 4642 512 -1020 -688 -3445 -3269 2956 4774
1134D774o274k946L986J391j906K068J706m601k541N384L273m425k442K788J78
1149D13j609K995K002m891l304M574L501k449j374J060k195j964M426M103l535
1164A753m662Q22J981P6J732J926l326m549J247M592J382j599j766j599p77J756
1180a011L029Q66k561l382k50L133K225r88j264k90j501q59L662L152l343m069
1196c451K064K625j910K92L491k042n168K482N503k502l948L471J882n146m0O476
1212D079j214o603K542N805m300m441N815K794p012q02P523j153p715K593O717
1227D628l840m824N331K294o882p22P363l0o361R89L949k721k016M415J032m427
1243a822n55K724p40n94K593p13l151J386K041k471K89L957j859m785L247L769
$$ plain form
1134 4774 -1500 -4446 -460 931 -975 1093 2799 -1802 -4343 1041 4314 -111 -2553 235 413
1149 413 -1196 1799 3801 -1090 -4394 180 3681 1232 -142 918 -1277 -3241 1185 5288 1753
1164 1753 -2909 -2087 -106 -30 1702 3628 302 -4247 -3000 1592 2974 1375 -391 -1990 -2767 -1011
1180 -1011 2018 2884 323 -3059 -3309 -176 2049 1061 -203 -493 -1994 -2853 809 3961 618 -3451
1196 -3451 -1387 1238 -672 -380 3111 1069 -4099 -1617 3886 1384 -2564 907 2789 -2357 -2397 4079
1212 4079 2865 -3738 -1196 4609 309 -4132 1683 4477 -2535 -3337 4186 3033 -4682 -2089 4628
1227 4628 788 -4036 1295 3589 -3293 -4015 3348 3318 -3043 -2054 1895 -826 -2842 1573 2605 -1822
1243 -1822 -2377 347 -393 -987 1606 893 -2258 -872 1169 -1302 -1013 2944 1085 -3700 -453 3316
1259C316m712j482O785l97q038K142P277m708n063Q664K980j1899j578J2752j099
1274D940j1105O154R193j2250q472J6078P072j6341k865J5136m594j5317J1714
1287f57J6315j5392j5082J5860R057j6816n75J9790o248k2264R303K0541j1016
1300B816j4290J4525O908j9662j494K2519j253k0845M756J5888j0129j0868J5581
1313D452P513j8251m267J7730J44j5196M463J2537q276r405J0716O019j1943l037
1327f801J1731J086r146Q01M865m003j901P033K091o566l254J515J315L563L661
1342E990m188o553M76K455J349N748K826j0546r145Q042Q840l484l46M987q918
1357b467j2450J0990J7387p089j2985N772K905j1826L731K0577l310k2432J449
$$ plain form
1259 3316 -1396 -2878 3907 3510 -4528 -2386 4891 183 -4880 3784 6764 -5135 -6713 6039 4940
1274 4940 -6165 -11 9182 -3068 -11540 4538 11610 -4731 -7596 7540 2946 -12371 -657
1287 -657 15658 266 -14816 1044 10101 -6715 -7290 12500 6252 -16012 -6709 13832 2816
1300 2816 -11474 3051 9959 -9703 -11197 11322 10069 -10776 -6020 9868 -261 -11129 4452
1313 4452 11965 -6286 -10553 7177 7321 -7875 -3412 9125 849 -8556 2160 8179 -3764 -6801
1327 -6801 4930 6016 -3130 -2329 2536 -1467 -3368 3665 5756 -810 -4064 -2549 -1234 2329 5990
1342 5990 1802 -4751 -4275 -1820 -471 5277 8103 -2443 -11588 -3546 5294 1810 1464 6451 -2467
1357 -2467 -14917 -3927 13460 6371 -6614 -842 2063 -9763 -6032 14545 11235 -11197 -9748
1370i748J6243n105q638J3914N909k0699o173K1384M220j8440K099J5976r236
1383A706j5007J4353J3231j7448r933J9770O122k0334k464J8013l265j5343J0951
1396C52J5358j6126j7305J4999J4894j0922n648J1086m662j7761P502K3063k612
1409A2218j8753m85O837n938P45J7607K489k1881r558J4356Q475m306K850L646
1423H302j3553j1852J3614J7536n039j2489K78J519n143M238J3575o18j5577m988
1437a0197R521M795k889J284J698o452m926O822O982m199n975K565K990k686o05
1452a272L639j160n447K093Q007j339r685j332P985J907l864K393K660r463p356
1467a2234J2182J3441p907j3372K882N307n141L241J4679l183k2164l655J9241
$$ plain form
1370 -9748 6495 1390 -7248 6666 12575 -8124 -14297 7087 11307 -7133 -5034 10942 1706
1383 1706 -13301 1052 14283 -3165 -13098 6672 12794 -7540 -10004 8009 4744 -10599 352
1396 352 15710 -416 -17721 -2722 12172 1250 -4398 6688 2026 -15735 -8233 14830 12218
1409 12218 -6535 -7020 -183 -6121 -5376 12231 14720 -7161 -16719 -2363 6112 1806 4656 8302
1423 8302 -5251 -17103 -3489 14047 9008 -3481 -3203 -1684 -6827 -2589 10986 10368 -5209 -10197
1437 -10197 -676 4119 1230 2514 4212 -2240 -7166 -344 6638 2439 -3536 -971 2019 -667 -1272
1452 -1272 2367 1207 -4240 -2147 5860 4521 -5164 -6496 1489 3396 -468 1925 4585 -4878 -12234
1467 -12234 -52 13389 5482 -7890 -5008 299 -4842 -1601 13078 9895 -12269 -15924 3317
1480C317O691q877J326L314j4306p908K0231J5455j5121j4044P357K274p729J0094
1494B074J6465j2679k2936P337J8458m577p207J0637n02k0208J34K3885L019j9433
1508e533j518J2272n961r051J3379R916j5955j0384J4242P209j2135k073J1096
1521E504k983j0686P026J0703r529j0763R419R388p396m771O457j354r226M959
1535c252J3747k520j4245k073Q052J804n86N232L5j1546o443R938J1132j656p282
1550C37l311k089q72O688R518j871j1957n843N274N933K252K150k060r545m922
1565a0318R020R515l237o649L33o99l985M342J0250k529j2244o84R267J35n637
1580c120L787M367p465m929R089N533r027m676P981K785o770L78O207l992o806
$$ plain form
1480 3317 10008 1131 2457 5771 -8535 -16443 3788 19243 4122 -9922 -2565 -291 -8020 2074
1494 2074 18539 5860 -17076 -9739 8719 4142 -3065 7572 7070 -13138 -13004 10881 13900 -5533
1508 -5533 -7051 5221 -740 -9791 3588 13504 -2451 -12835 1407 8616 -3519 -5592 5504
1521 5504 2521 -8165 -1139 9564 35 -10728 -1309 8079 683 -4088 2369 1015 -8211 -3252
1535 -3252 10495 7975 -6270 -8343 -291 1513 927 6159 6194 -5352 -11795 -1857 9275 7619 337
1550 337 -2974 -5063 -5935 753 10271 8400 -3557 -9400 -4126 1807 4059 6209 4149 -5396 -10318
1565 -10318 -1298 8217 4980 -1669 -1336 -2035 -6020 -1678 8572 6043 -6201 -6885 2382 2517 -3120
1580 -3120 667 5034 -2431 -7360 1729 7262 -1765 -6441 1540 4325 -2445 -2067 4140 148 -6658
1595f658O514Q317o151q004M199M045m041J285P791l708j1613J829J1212L65o297
1610i15J752J492p564j558J1854M871j0457o023N584J690l284M617N576p413q991
1625h769N304Q383k382l660K694j287o192K447Q986p73p893l46M240j495j446
1640b189M800J252o559k395N970K668l961j077K621j165k662K664L505k494l680
1655b702J437K977m74j421M83J67j340J70K180P35k196j867J178J946j23q87J50
1672D13l49j644O11L007K29l384r65K421K35j407J546J394l235k356L570K665
1688B751k974j626K634m00l173J847M104k281m058K278K902k689j386L728L21
1703A978m399M38M205j016l561K171K829k959k094L452J087l507K15L550j046
$$ plain form
1595 -6658 -144 8173 2022 -5982 -1783 2262 -1779 -494 7297 3589 -8024 -6195 5017 5382 -915
1610 -915 837 2329 -5235 -6793 5061 9932 -525 -6548 -964 726 -2558 2059 7635 222 -8769
1625 -8769 -3465 4918 2536 -1124 1570 283 -5909 -3462 5524 4751 -3142 -3488 752 -743 -2189
1640 -2189 2611 3863 -2696 -5091 879 3547 -414 -1491 1130 -35 -2697 -33 3472 978 -2702
1655 -2702 -1265 1712 1238 -183 300 467 -873 -703 1477 2212 16 -1851 -673 1273 1150 263 413
1672 413 64 -1580 -969 2038 2267 -1117 -2082 339 574 -833 713 2107 -1128 -3484 86 2751
1688 2751 -223 -1849 785 385 -2788 -941 3163 882 -3176 -898 2004 -685 -2071 1657 1978
1703 1978 -2421 -1983 2222 1206 -2355 -184 2645 -314 -2408 1044 2131 -1376 -1161 2389 1343
1718A343l439J343K867j670j561K173L83k918%L248O5k478k1J031r35j54K010
1735A287K65k359p54J258O19J01L42p91j576K35J737O27n09o27j090n05J491J725
1753A476p58j450k41q7K11J814J142k146k067J002J632Q7L08L35j820j760K059
1770b63K635r09j951J37j40n15J871K075k105k987Q21K279M6k20N25j772k135
1787b608J868L380n75k722p72J57J6K048K220j872l731j83K463J572M71k70k629
1804a167k574J790L884R12j982j964j535j70L104L059j109l598j323R69J655K258
1820B209Q73l056l304Q96L252J359k19j111k540j193K812L118p98k719j072p5
1836a568J013K815J244l450l161J251K780Q28L35q67l499j702L873L978j384l284
$$ plain form
1718 1343 -2096 -753 2114 444 -1117 1056 1439 -1479 -1479 1769 1834 -644 -665 366 -569 -723 1287
1735 1287 1552 -807 -1561 -303 316 417 759 -32 -1608 -1373 364 991 482 -145 -1235 -1740 -249 1476
1753 1476 718 -732 -973 -1060 -849 965 2107 -39 -2106 -1104 528 615 923 1258 -562 -2322 -263
1770 -263 2372 1463 -488 -351 -491 -1006 865 2940 835 -2152 -1331 948 994 774 1299 -473 -2608
1787 -2608 -740 2640 2065 -657 -1429 -1272 -1256 792 3012 1140 -2591 -2774 -311 1261 1732 1462 -1167
1804 -1167 -3741 -1951 1933 2845 863 -1101 -2636 -2806 298 3357 2248 -1350 -2673 -1704 -49 2209
1820 2209 3082 26 -3278 -2382 870 2229 2010 899 -1641 -2834 -22 3096 2298 -421 -1493 -1568
1836 -1568 -555 2260 3504 54 -3107 -1856 924 1752 2087 1220 -2279 -3981 -108 3870 2486 -798
1852g98j213p20N92M387K668l948n052M83L117J763J521Q8m593l934L097N563
1868C021N24k459j774k310j051M287M810j978n104j109J720J258K406J738l365
1883F14m734J214M498J383j215j205k153j515K869L927q61l639j536N68J482K866
1899B563J073l857l410J451K881J221O25j179m353j656M873L991k281k802o43
1914a503j470%N414L131n403n162K381L061n5J875J378n433m751N046O277k115
1930B671l475O44j637k575N030O224m339p382J672M320o90P60L399l733p402K813
1946c700Q511j30n026m11K6l210K299P532l43q255k642M331K017M42K273j500
1962B214o420j557O213M076j766k854k050j798J478M953K034l392m069r02K124
$$ plain form
1852 -798 -2011 -2731 -2139 2248 4916 968 -4084 -3601 -484 1279 2800 2888 -1705 -5639 -2542 3021
1868 3021 3545 1086 -688 -2998 -4049 238 5048 3070 -2034 -3143 -1423 -165 2241 3979 614
1883 614 -4120 -2906 1592 2975 1760 555 -1598 -3113 -244 3683 2822 -817 -2353 -1785 -303 2563
1899 2563 3636 -221 -3631 -2180 701 1922 2547 1368 -2985 -4641 232 4223 1942 -860 -1503
1914 -1503 -2973 -2973 2441 5572 169 -4993 -2612 449 394 2269 3647 -1786 -6537 -1491 4786 2671
1930 2671 -804 -160 -1797 -4372 658 6882 2543 -4839 -3167 1153 463 1223 4622 889 -6513 -3700
1946 -3700 4811 4681 -345 -756 -730 -3940 -1641 5891 5548 -2707 -5349 -1018 999 1441 3714 2214
1962 2214 -4206 -5763 450 4526 2760 -94 -2144 -3942 -2464 2489 4523 1131 -2938 -3840 -1716
1977a716L540J611k055l312r95R80K449K875n71m655k235L515K769j198j87K96
1993A111l257j599N408L562m842m058L157J749k188K070L252m709n571M849O323
2008E257l121m102K115q8l942L272P117l076q397Q15N600l75j133L369j428p364
2024e481N8Q485K384n279k091J008k015n3O189K775o385n217K829M063R1L67Q25
2041B553l533m343K605O474P72m612k277J109M4K57L585J759m869m482L452N001
2057C495j672k599J904k27m242J176O550o21o928K34N471j396l648L694K363n987
2073b433k153P318J953p098j152N666j096m417M253M134o673m666O717M614n334
2088c67j986M207k067n059M687O788m189o579K569L362k470N54M756j908o845
$$ plain form
1977 -1716 1824 3435 1380 -1932 -2927 -1947 502 3377 2806 -1849 -4084 -569 2200 1002 815 1111
1993 1111 -2146 -3745 1663 5225 383 -3675 -518 1231 -957 1113 4365 -344 -5915 -1066 5257
2008 5257 2136 -1966 149 61 -3881 -609 6508 3432 -4965 -4150 1450 1075 -58 3311 1883 -5481
2024 -5481 -5423 3062 5446 167 -1924 -916 -2931 -2984 3205 5980 -405 -5622 -2793 1270 1361 1728 2553
2041 2553 -980 -5323 -2718 3756 4528 -84 -2361 -1252 -1208 -951 2634 4393 -476 -4958 -1506 3495
2057 3495 1823 -776 1128 901 -3341 -2165 4385 3764 -3164 -2930 2541 1145 -2503 1191 3554 -2433
2073 -2433 -4586 2732 4685 -2413 -3565 2101 1005 -3412 841 4975 -1698 -6364 353 4967 -367
2088 -367 -2353 1854 -213 -5272 -585 6203 2014 -4565 -1996 1366 -1104 -550 4206 2298 -4547
2103d547N77N985R09k559L46n8l258k07M448K262k658k799L4R86P90Q58O54n00
2121A263k290j577K067L098j121k746J117J540k806r93M419R61n211k78N187j286
2137A344n385L071N330m260m562N412K767p031q18Q199l27q281J775O935m152
2152A7n326P130M470q841l686Q870J615p906J867P667n003p874O416P220o647
2167a1m441P005J127q075J122Q767k173p669L019N419m914l276O573K110o786
2182b203j216N712p34m702K902M229l684l899L139K372k762j81L094r92l631L56
2198b200K986M72q92o4o69j310K61J695J292M6j938k185R77K485J96o71M36r55
2216c8k904J196M589M6m020k54K289j777r85M347J329n680j863N225J034m030
$$ plain form
2103 -4547 -3970 2015 2924 365 711 653 -2605 -2812 1636 3898 1240 -1559 -1525 -539 251 1109 1763 1263
2121 1263 -1027 -2604 -537 2561 1440 -1306 -189 1351 -1455 -2448 1971 2932 -2279 -2557 2630 1344
2137 1344 -4041 -970 4360 100 -4462 950 3717 -3314 -4132 4067 3740 -4541 -2766 4169 17
2152 17 -5309 1821 6291 -2550 -6236 2634 4249 -3657 -1790 5877 874 -7000 -584 6636 -11
2167 -11 -4452 2553 3680 -4395 -3273 5494 3321 -4348 -1329 4090 -824 -4100 2473 4583 -2203
2182 -2203 -3419 2293 1559 -3143 -241 3988 304 -3595 -456 1916 -846 -1027 2067 1075 -2556 -2200
2198 -2200 786 1258 366 302 -367 -1677 -1416 279 1571 1617 -321 -2506 -1529 956 1152 481 917 -38
2216 -38 -2942 -1746 2843 2889 -1131 -1385 904 -873 -1858 2489 3818 -1862 -3725 1500 2534 -1496
2232a496J134L629l611m020N076M140n342l377N048J408n072R63N317l014n786
2247e003L953N809l952m565L886J762m622Q83O277j866p296J263O151r30l161
2262a411K750O23n800o12P451K178n868k178K766o55j234M390K727n553m861L576
2278a711M460r06j013Q27k515l421K968N620o64m642j279J295K56J216K688q03
2294B376m685j592L715K914q42j725q89j272j5K871K431j929l815n26K594J960
2310A571j5q18j604j807N50L536J986k499l427j12K181J604Q62j90k597k987J411
2327b355M733J591l069k797k90N97J767L250K47m827l445K685M365N62j373j337
2343C04k633j682L902N081j359n407j626J915J315J818K328k271n817n69N584
$$ plain form
2232 -1496 -362 3267 -344 -4364 712 4852 -490 -3867 1181 2589 -2483 -1520 3797 783 -5003
2247 -5003 -1050 4759 807 -3758 128 1890 -2732 -1849 4428 2562 -4734 -3471 2680 1750 -1411
2262 -1411 1339 1962 -3838 -4450 3001 5179 -689 -2867 -101 -756 -1990 2400 5127 -426 -5287 -1711
2278 -1711 2749 1843 830 1657 -858 -4279 -1311 4309 3645 -997 -2276 -981 -725 491 3179 2376
2294 2376 -2309 -3901 -186 2728 1886 161 -728 -2000 -2015 856 3287 1358 -2457 -2983 -389 1571
2310 1571 1556 738 -866 -2673 -2123 1413 3399 900 -2527 -2639 -458 1146 2008 1818 -779 -3766 -2355
2327 -2355 2378 3969 900 -1897 -2187 -1590 177 3427 3674 -1153 -4598 -1913 2452 3014 1641 304
2343 304 -2329 -4011 -109 4972 3613 -1794 -3420 -1505 -190 1628 3956 1685 -4132 -4701 883
2358H83L018k128j921j046k190P49N230K419m801m376J421K744R83J474J18m364
2374a787l429L635N196l46l372j457o57k38L363L636k124n386r91L435K400O25
2390B503k23k737l516J229N076K044k759l235j039N57K722L238o72m456k724J841
2406b151L516J870n66l047l144K96L922L001r64l359k664J02L128L352j72l598
2422d78k954L98K745K955N67k985l669l3L288K875J24k190l073j257K640M148
2438C101N38l346k875k30J859K874J882k006m318j221L111L217M10j592k614k167
2454c377J349M302J885k767l430p63J365K440K321p26l985k478K076L616J043
2469B871j297k380k169J85L601K770j523l621j544J113K271K246N5l077l047Q67
$$ plain form
2358 883 3901 1773 -148 -1194 -3384 -2635 2595 5014 213 -4163 -2742 2 985 2459 2577 -1787
2374 -1787 -5216 -1581 3615 3269 -103 -1560 -2217 -2455 908 4544 2420 -2966 -3957 -522 1878 2503
2390 2503 2280 -457 -3973 -2744 2332 4376 1617 -1618 -2657 -2100 622 3860 3188 -1268 -3992 -2151
2406 -2151 1365 3235 2669 -378 -3522 -3226 696 3697 2733 -626 -3290 -3188 -60 3292 3120 -478
2422 -478 -3432 -3034 -289 2666 3233 248 -3421 -3454 -166 2709 2833 643 -2430 -3687 -1047 3101
2438 3101 3639 293 -2582 -2812 -953 1921 3803 1797 -2521 -3742 -631 2586 2996 1404 -1210 -3377
2454 -3377 -2028 2274 4159 1392 -2038 -2801 -1436 1004 3325 2599 -1386 -3864 -1788 1828 2871
2469 2871 1574 -806 -2975 -2790 811 3581 2058 -1563 -3107 -1994 277 2523 2578 -499 -3546 -2679
2485b679L497J851p31k190k253l09K693L066l14l042k277M84K105K325O03k323
2501E06l085j05K775K340M3j925k235r17J954K969N78k290k472l98J623K383J043
2518B787j731k879q42J993K275O82j238k311j382J241K810J049j643k215q85Q81
2534a408K155J600j121k532j218J351J971J009n16j930j648O07K517J294j102
2549A029j716r45L37J497J785k94k347j309R91J561Q55p1j179j768PK074J524
2566B031p78j576p12k0Q73J590M60j786j678L81J474Q03M8p10j409o59J290J688
2584A310j55j312q44l2N02J068O87p89j505k96J019J017O7m55r04l94M25J096
2602E05M09n56r38l25N65P59K62l46m88m44J61Q07N61n63p80J38M23Q0K19K39
$$ plain form
2485 -2679 818 2669 1938 -252 -2505 -2814 -121 2945 2631 -411 -2688 -2204 -99 2226 2829 506
2501 506 -2579 -2684 91 2431 2474 549 -1686 -2603 -649 2320 2898 608 -1864 -2262 -639 1744 2787
2518 2787 1056 -1823 -2665 -672 1603 2285 1047 -1264 -2646 -1405 1405 2454 811 -1404 -2289 -1408
2534 -1408 747 2347 1226 -1306 -2524 -1173 798 1807 1291 -639 -2287 -1680 837 2131 1029
2549 1029 -687 -1632 -1295 202 1987 1693 -654 -1963 -972 589 1444 1373 194 -1574 -1567 507 2031
2566 2031 1253 -323 -1035 -1055 -182 1408 1868 82 -1596 -1215 259 1062 1110 400 -1009 -1668 -378 1310
2584 1310 1155 -157 -1001 -1033 -531 537 1224 435 -1070 -1366 -347 670 737 282 -622 -1016 -591 505
2602 505 914 358 -580 -905 -340 419 681 335 -153 -597 -436 371 932 369 -411 -273 150 230 449 688
2622F88o38q43N76J037k11q39L06J77o50N8J156k34j394K53J082l07p86P27M71
2641F29j127m17J286K72j343J8J232l79j060N88R19q22o32J089L36j190k17J199
2659C81J00q12J04N53m90m18R83N38q73p42M33M60J7K71J17p14o57M90R22K91
2679I54o03p23k19M49N03L99L0q37j062K90J492M86r80n34m4m64J66J803M12k141
2699f23j209J484J005p48L69O27j658j462K005K298j541j806Q66M55j109J024
2715b3K178j516l038J081K662m20j277R60l04k213P72L510j82l354l79J808l39
2732g4m4K046j30l511r28L312J583j584o82J30j586l64L012J889k520k677O93
2749a435J316M12Q64M69k155k169J217K717O99j364j385p01J05J373J697j03j950
$$ plain form
2622 688 50 -793 -217 820 609 -230 76 253 -397 -339 817 583 -811 -558 524 217 -569 158 629
2641 629 -498 -915 371 643 -700 -682 550 171 -889 -301 618 -204 -836 253 589 -601 -818 381
2659 381 481 -331 -227 326 -164 -582 401 939 66 -676 -243 217 234 505 622 -92 -749 -259 663 954
2679 954 351 -372 -591 -142 361 760 790 -47 -1109 -819 673 1159 179 -355 -399 -863 -697 1106 1518 -623
2699 -623 -1832 -348 657 -91 278 905 -753 -2215 -210 2088 547 -1259 -393 62 -1047 -23
2715 -23 2155 639 -2399 -1318 1344 924 -353 607 303 -1910 -1138 2372 2190 -1164 -1543 265 -74
2732 -74 -118 1928 1798 -1713 -2641 671 2254 670 -12 118 -1468 -1832 1180 3069 549 -2128 -1435
2749 -1435 -119 293 1157 1626 -529 -2698 -1481 1236 1935 571 -814 -1515 -1410 -37 1660 1557 -393
2766c93j804N99K247J095q24j317p57k20Q95K195L91k480j968J388K041M3l39
2783G92q3j675j467K382L011j237k979L3R85j14J075K031j736l962N38L877P76
2800B247j916j72l18k289O18M327R55m205k232K039J094n4J643M08l817k353L402
2817f23L463j142k191j61q23q52K755L125j974m047j33K440J021L32O67j571l027
2834b741K49L853J665k104j990j01J29P00K104Q46k611k597J073K766O39j099
2850G81n95j002r96J318K669J14l062j387J406J440J18L27m51k312q41K643K496
2867B666j436k495k23N85L22J544J439j976l278M62L203J229j109q68r92j364
2883b291R03L466J004l054k446P59J509R58J108j35k754k059J894L166K86j870
$$ plain form
2766 -393 -2197 -1598 649 1744 920 -397 -1154 -1374 -479 1716 2107 -373 -2341 -953 1088 1131 792
2783 792 709 -966 -2433 -51 2960 1723 -1256 -1223 -238 -352 723 2754 1018 -2944 -2406 1471 2247
2800 2247 331 159 -159 -2448 -1830 2497 3452 -753 -2985 -946 148 94 1737 2145 -1672 -4025 -623
2817 -623 2840 1698 -493 -654 -1477 -2329 426 3551 1577 -2470 -2603 -163 858 1190 1857 286 -2741
2834 -2741 -2492 1361 3026 922 -1068 -1169 -1040 -340 1764 2610 -1 -2598 -1525 1241 1880 781
2850 781 186 -816 -1812 -494 2175 2289 -773 -2160 -754 686 804 1131 680 -1632 -2473 170 2666
2867 2666 1230 -1265 -1488 -903 -581 963 2402 426 -2852 -2390 813 2042 933 65 -927 -2291
2883 -2291 -1388 2078 3082 28 -2418 -1659 -150 808 1916 1781 -973 -3032 -1138 2028 2314 444
2899D44j088n96k06J567K380m44l187j355J933J779j50k12l89j721r63K400K402
2916B594j447k532L8J211O9M59J216j169k811M66L169O79k081o42K94p71L42K739
2934A823L80l251j667K212J557n78K89K66k323j471K900K727j621k420L81M01
2950c95n65J558K025j689l150M41K622M87p30J93q63j801O80K743N12k044j101
2967a077M66J49N08J308j47k024r41J323J345l9n34o27p48P5J235Q42m98j381
2985g65o01P88J124L18o46p19l31N8P67J074j23j712o21J192R19l54M0j07j159
3004h58l74J746J220j306j305M90M07l94J000J035j562j784J121J697m92o83N60
3021E18n47j436R86K109n18j970O9J041m25j28J417j77k105k90J943L60j073J16
$$ plain form
2899 444 -644 -1240 -1446 121 2501 2057 -1130 -2485 -552 1227 1077 865 476 -1245 -2208 192 2594
2916 2594 1147 -1385 -1347 -136 -67 392 1608 439 -2372 -1906 1263 1942 -139 -781 -487 -1258 -916 1823
2934 1823 2203 -1048 -2715 -503 1054 476 765 1031 -1292 -2763 137 2864 1243 -1177 -796 -395
2950 -395 -960 598 2623 934 -2216 -1775 847 1334 604 797 -66 -1867 -1187 1556 2068 24 -1077
2967 -1077 -611 -462 46 1354 1207 -817 -1758 -435 910 871 337 -290 -1038 -963 272 1114 616 -765
2985 -765 -1366 -578 546 864 218 -501 -832 -774 -7 1067 944 -768 -1389 -197 722 368 408 301 -858
3004 -858 -1232 514 1734 428 -877 -387 20 -374 626 1661 99 -1685 -564 1133 641 -42 518
3021 518 -29 -1465 -479 1630 1112 -858 -789 252 -173 -301 1116 939 -1166 -1456 487 847 -226 -110
3039a10M28j099l25J534P64j465o64Q28K30n35O05O19j066q32R61Q61n71m35L95
3058A23j37m55N17P08m54p40K68M22J9q0R5k21l52K25M48P1l26j88j14J13K97
3079B39O8k04k60l9N8K73K15k92k95n5K55M1oO4j31l28J04M52j6l95L7K19j77
3102a73p0L35R5m91l0M16J18m50J14L14k16j51L18J80m42j17M78Pk42p8K99r3
3124A21k47L28K00l79k61K50L10j80j07J93j55l01J96M02j51l97l9J90m1J30K53
3145C15k43m39j3L90K58k32j14o1j98M2L84K23l91l51J31K74m4J41L9l20k70L29
3167a50M93j26k81q3J2L4L23K18k23m51K8L03J75P1q6l03k30K47M41J05m61l10
3189b54M1Q5L75K89k51o03j02K96L32J56m7m90l88K00O17J12k43m11j78J3L95
$$ plain form
3039 -110 318 -781 -1106 428 1192 -273 -937 -109 121 -414 191 810 -256 -1088 -127 734 163 -272 123
3058 123 -14 -469 48 756 302 -438 -170 252 271 191 286 65 -287 -62 386 457 131 -57 -171 -58 239
3079 239 307 103 -157 -196 -138 135 350 58 -237 -292 -37 4 -2 62 -69 -397 -293 159 143 -252 -215 4 -173
3102 -173 -243 92 187 -304 -334 82 200 -250 -136 178 -38 -189 129 309 -133 -250 228 235 -7 -85 214 121
3124 121 -126 202 402 23 -238 12 322 142 35 228 73 -228 -32 370 219 -178 -217 -27 -68 62 315
3145 315 72 -367 -380 10 268 36 -78 -139 -337 -295 89 312 -79 -430 -299 -25 -69 72 111 -209 -479 -150
3167 -150 343 217 -64 -147 -135 -101 222 440 217 -234 -206 97 272 343 257 -46 -276 -29 412 517 56 -254
3189 -254 -213 -128 247 536 285 -318 -420 -124 208 364 317 -173 -561 -361 256 368 125 -286 -464 -451 -56
3210e6M77k14n55j65K14K93L03jl67m98J20N60K99l01j66k62r8M51N02q0o32k43
3232d19L09J99L26P4l49m98J4O45K62j48l40k16k20K64O68P4o32m19O3K87K50
3253A94K25j68n97j70N10L96p2k75k98j76R4N56K56m62m16p7K58L01J91p7m75
3274b82l44L15N78O6l05k12k07R8M79K96k10m68j62J89M06J38m4l71k35N5M80
3295B60K67j85m05k49K21K52K75j37k38l48k0M90K09r1l70k06M2J87L39K1l89
3316g5m29J39M66J51j55j80j98j63K63M94j6n04j99R7K48J14J87n8n97r3M63M17
3338C72j11k35j79r8J2L98L20k27m97j9L83P1J09m7j76l18J14M30J40l44j74M3
3360c3M4N0J37J14l12l64K62L05rk77L7o4n9J37K94j36m40p4L81J02j62K1K2k55
$$ plain form
3210 -56 421 207 -348 -513 -299 -6 297 296 -71 -569 -449 111 410 109 -57 -319 -417 34 536 456 -176 -419
3232 -419 -110 89 415 489 140 -358 -344 301 563 415 75 -141 -361 -97 571 645 13 -406 -343 -56 194
3253 194 419 251 -346 -516 -6 390 318 43 -255 -431 -337 219 475 13 -403 -480 -222 79 270 193 -282
3274 -282 -626 -311 267 333 28 -184 -391 -293 186 482 272 -196 -358 -169 237 375 331 -40 -275 -220 260
3295 260 527 342 -63 -312 -91 161 436 299 61 -287 -307 183 392 301 -69 -275 -233 -46 293 314 -75
3316 -75 -504 -365 101 252 97 -83 -281 -444 -181 313 297 -207 -406 -309 -61 53 240 182 -415 -508 -45 372
3338 372 261 26 -153 -251 -239 159 479 252 -245 -264 119 190 299 252 76 -242 -128 302 442 98 -76 -33
3360 -33 11 61 198 312 0 -364 -102 203 194 -83 -46 -110 -169 -32 262 126 -314 -388 -7 95 -67 -46 -24 -279
3384b79j35M63K68m01k52K59P5j55K20K54l03l76J49N55j73k94K61O9l28lM29
3405C03M8n04l5M90j28k48J91K75l96k12K89K79l72n9K16j0k96J15L45l10k80
3426b99J31L75k24k56K92Q1l72l7M37L6l99m9L39r4j85J41J75j46k81K77K13k08
3448e3j50K38J27l04k7L28O1l15P4K86r6l55J87L17k27k25L06J87l55j96M09J16
3470C33l70j58M45j10k95P4M49k77l99K82K91k99k35L49J19m81n4N43J8n40NN21
3492B11k03l42K24L84m23k18L94J90l68k39N13K4l69J42M64l23m39L63L91l77
3512aj66L05J03m42O6N44k5o13Q7M84j80k89K48K09l85k50M72K53m59r9K60ll39
3535b20K20L23k38m16J66L51j23k82K11R5l44j21L58L03n16j17L51M3l13J47L52
$$ plain form
3384 -279 -414 49 317 -84 -336 -77 -2 -157 63 317 14 -362 -213 342 169 -125 136 205 -123 -126 303
3405 303 351 -153 -188 302 174 -74 117 392 -4 -216 73 352 -20 -79 137 127 -169 -54 291 -19 -299
3426 -299 -168 207 -17 -273 19 100 -272 -309 128 164 -235 -284 55 -39 -224 -83 92 -54 -335 -58 155 -53
3448 -53 -203 35 162 -142 -169 159 220 -95 -21 265 169 -186 1 318 91 -134 172 359 4 -192 217 333
3470 333 -37 -195 250 140 -155 -81 368 91 -308 -26 265 -34 -269 80 199 -282 -336 207 225 -315 -310 211
3492 211 8 -334 -110 274 -149 -367 27 217 -151 -390 123 147 -222 -80 384 61 -378 -15 376 -1
3512 -1 -167 138 241 -201 -135 409 384 -229 -142 342 162 -127 121 330 -55 -305 167 420 -39 -138 122 119 -220
3535 -220 0 323 85 -331 -165 186 63 -219 -8 87 -257 -378 -20 283 -233 -350 1 44 -269 -122 230
3556B30k15m53K80M43k11l90L08K14l80n3M15Q8n08n5N89l2n05K12L93l21l33
3577b84M26L78n20k76M10J75m91J36M56k05n75K21N66l69l17L23J26l81j78O32
3597B53j2n57L7M49j39l28K94K28l60l32M54K49l54j76L88L6m20J42L68j80k98
3618b58J83K21n8j47J26J30k17j23K57J24k15n8J55K9j99R7J92r1l07J74K45j68
3640I2k29K02J87k65j67K07K47l29k01L85Ml19O6L32n8n07K48L20k99j69K81J10
3662A38l70l9M67q7l70R8L43j54l28L29K91m13j93L97J55l45q9L34q8l02K03L40
3684C17k10l25K30J80j46j28K98N3l68j07M16K5k76mK17k38j61L39K11l28j64
3705a69J02P5p2M9J68j63k42M8L43k9k21k2K2p3M2K56J0k23k57K40J51m4jP9j57
$$ plain form
3556 230 15 -438 -158 285 74 -316 -8 206 -174 -227 188 276 -232 -287 302 270 -235 -23 370 49 -284
3577 -284 142 520 0 -276 134 309 -182 -46 410 205 -370 -149 417 48 -269 54 180 -201 -379 253
3597 253 241 -316 -279 170 31 -297 -3 225 -135 -467 -13 236 -118 -294 94 130 -290 -148 220 40 -258
3618 -258 -75 146 88 -59 67 197 -20 -143 114 238 23 -35 120 149 -50 47 239 148 -159 15 260 92
3640 92 -137 65 252 -13 -180 27 274 -55 -256 129 133 -186 -120 212 154 -353 -105 215 -84 -253 28 138
3662 138 -232 -271 196 109 -261 -163 180 26 -302 27 318 -95 -288 109 264 -81 -170 164 76 -226 -23 317
3684 317 107 -218 12 192 46 -82 216 269 -99 -206 210 235 -41 -45 172 -66 -227 112 323 -5 -169
3705 -169 -67 8 -64 -15 153 -10 -252 -204 139 110 -111 -133 -111 -184 -142 114 124 -99 -356 -116 35 -9 -10 69 -88
3730h8j60J79L27o7k99pJ07KP5J43n7k55l7K58J24p6r2k0j45j1K40J90k14k72
3754a55KK16Q0jr3j23j27J10K76K6k57j50OJ14O5J39j3k37k90K57L52l3k23q5
3778a44j7j16K65K93q0l94j25K23J88m5J24j06l38m5N01K25l20k21M8K1M5L12
3800B94P1l82k49K79J94nOq6k29j68K99M34k65l38l6M4O5J92K07l12l67K5M03
3823G6J10k2j06k77j91K10M07R6m01k01n2K41J93J94k11l54jK35K22Q9j62k65
3845a70k01K25L95O7j50k37j89R6L71K65k51l28j08J84J56K19k2l43k81J46M20
3866B64Q3k24j21j76j07L37L26j85m46m6J83R9J31J16k17m33P7M41J11j46j69
3887a02j40j28L33L66n5m43j80J27J48K96O5k40l77j5M04K59m6k00k09j28J68
$$ plain form
3730 -88 -248 -69 258 191 -108 -115 -8 -6 69 212 155 -100 -137 121 245 169 77 57 -88 -99 141 331 117 -155
3754 -155 -153 63 143 142 49 -74 -201 -91 185 211 -46 -196 -190 -76 -11 128 115 -122 -412 -155 197 164 -59 -144
3778 -144 -161 -277 -12 281 201 -193 -318 -95 93 48 172 66 -272 -317 184 409 89 -132 -84 -63 -18 294
3800 294 365 -17 -266 13 207 202 208 122 -107 -275 24 458 193 -145 -181 -137 -72 120 327 15 -352 -327 76
3823 76 186 164 58 -219 -410 -200 207 303 -98 -299 -351 -110 83 277 66 -288 -289 -54 168 257 95 -170
3845 -170 -371 -146 249 316 166 -71 -260 -164 207 472 221 -107 -215 -31 125 344 322 -21 -302 -156 264
3866 264 347 123 2 -174 -281 56 382 197 -249 -295 -112 -13 118 234 17 -416 -339 102 213 67 -102
3887 -102 -242 -370 -37 329 274 -169 -349 -222 -74 222 287 47 -330 -345 59 318 272 72 -137 -265 -97
3908i7M34M4l22k69O4J35K39J37j52m07m0J62L88J7k05k17j30J18L10J11k61k33
3930a74j38J59K42J69j65k72j93J63K87J26j44k60j68J57L12J35j11k93j22J04
3950a86K57K33j25l56n2P7K13J51k1k44k99K55K39P5J0k23j41l2K43K99o4l51
3972d2r3N4J38K08m5j53l05P2K52K02p6k06j84k1J31K58n6j04k88o1K50J24J43
3995A98k25j68q4J47K47Q5j58k87J9J67J27L1o6k16n4M8L37o6n4j52jK2J60J05
4019A62nj73r1J51J61q6p2R0k69N4K65N0j64j50N1K4j2J50N7k25j90J75K20j19
4043E4r1l6J5j11J23J89j28j51L0J91j65%J21kk89Q6J32J08j29O3k5p3n4J76Q4
4068A18j09j58J44J34p9k4J2K6p7pJ19K5j01J3jK8r7R3Q1m7j22L7J00o1j40J27
$$ plain form
3908 -97 337 381 59 -210 -146 -11 228 365 213 -194 -234 -72 316 333 128 -89 -219 -101 209 320 59 -174
3930 -174 -312 -153 89 258 93 -179 -372 -209 78 204 60 -200 -368 -211 101 236 125 -168 -290 -186
3950 -186 71 304 179 -177 -229 -152 61 212 191 -53 -352 -97 142 217 227 4 -137 -169 74 373 309 -42
3972 -42 -135 -81 57 265 220 67 -238 -166 86 288 212 6 -178 -199 -68 190 134 30 -258 -319 -69 55 198
3995 198 -27 -195 -279 -132 115 200 42 -245 -226 -59 68 99 33 -183 -237 -189 148 82 28 -124 -125 -103 57 162
4019 162 157 -16 -107 44 205 119 47 137 -132 -78 187 237 73 -77 -26 -2 -14 136 193 -32 -222 -47 173 54
4043 54 -37 -73 -58 -169 -46 143 15 -136 -106 85 -80 -80 41 39 -250 -164 -32 76 -53 10 -15 -88 -142 34 118
4068 118 9 -149 -5 129 50 26 38 64 -13 -20 99 124 23 36 35 63 -34 59 140 93 -29 8 108 47 -93 34
4094C4J24j31r8J46Nj74L2K00o4l01J41J31n8j81J63Q9j69m8K19J28l73p9K70
4117Fj6j04J00J49k66j04K51J94k51o9J40J9j32J13J83r6l51J73K43j7j52J16
4139A29n7j62M9K67J17l56j06J89j7kL4K9j85k46K66K93p1k96N4k1n9J64K63j24
4163A52m71k6M46M4k02l5J33l05m2M14J62l01l83K96J66j74J70K42k49m62L79
4184d6M28k09k82J15L2l10K14M47q3m66r7L39J17j53K12j01l79l7M86J90k59l52
4206a94J26Om7L06K04l79m18J72L04J45j48o1j24k70K21M35K6m47k78J99K80K9
4228H7L6ol21k84L52M60m1l28j75J01j5J76L45j05n93j24N09L21k37p5l8j96j36
4251b87M46M41m42m92J64K90p3J06K73l46o16K88O99Mn55l1R8k59J51N35M2p51
$$ plain form
4094 34 158 27 -71 75 80 -94 -62 138 74 -227 -86 45 -13 -194 -31 58 -111 -159 60 188 -185 -264 6
4117 6 -10 -114 -14 135 -131 -235 16 210 -41 -110 30 49 -83 30 213 117 -234 -61 182 165 13 129
4139 129 72 -90 -41 226 343 -13 -119 70 53 51 85 114 -71 -317 -51 242 171 -125 -71 -92 -151 13 276 152
4163 152 -319 -345 101 145 -57 -92 41 -264 -306 108 270 -31 -414 -118 48 -126 44 286 37 -425 -46
4184 -46 382 173 -109 6 38 -272 -58 389 306 -160 -257 82 199 46 258 157 -222 -259 227 417 158 -194
4206 -194 -68 -62 -109 197 401 22 -396 -224 80 225 77 16 -108 -378 -157 278 304 -143 -421 -222 58 87
4228 87 123 117 -204 -488 -136 324 283 -45 -220 -119 -134 42 387 282 -311 -435 74 395 158 83 45 -151 -287
4251 -287 159 600 158 -334 -170 120 47 153 426 80 -536 -248 451 455 -100 -131 -33 -292 -141 394 436 -315
4273c15k22N55J94j68KJ01m75k75O25N15l33n68M3J91n5K90L00l65n87J91O11
4294B55O4k38m9o8k66J44N17J05n61k83L37J85j3J74j6m14k18M16M42k10l20j32
4316a49K8l3K95K94k32n18j2L70K90j09j96j54j89K5M08L46m31l85pK90R9Q5Q1
4339A96k61m13J12N76J61m19j90Q1K8j4L99J12n13l43K98L99J1o8r9j70k18L35
4361@N46k49n10m9K72Q7O8J18p6n58L8M96K22l26j92O5j11jL83J75m50l87K25
4384b14L85m4l3Pk49l74L81M96j07m85j4J88o0P7K86o5m88j01M22L32k27j03j6
4407fk17l6L55L01l16l79P9L11M2o2J90k76k74J76M49j1l39l0OM7J8K01K5m63
4431b09j34L48J42j2j51l4l0o7J39L17j82l07K7R7P1M9J34k41k08K5K41J59j49
$$ plain form
4273 -315 -537 18 212 44 46 147 -328 -603 22 537 204 -364 -321 -130 -185 105 405 40 -547 -356 255
4294 255 319 81 32 -36 -302 -158 359 464 -97 -380 -43 142 129 303 287 -127 -345 71 513 303 -17 -149
4316 -149 -121 -154 141 435 203 -315 -327 43 333 224 28 -126 -315 -290 118 464 33 -352 -359 -69 30 115 196
4339 196 -65 -478 -366 210 371 -48 -238 -157 -129 -143 256 368 -145 -488 -190 209 220 152 53 -117 -335 0
4361 0 546 297 -213 -262 10 97 165 283 207 -351 -313 183 405 79 -113 -48 -159 -160 223 398 -52 -439 -214
4384 -214 171 127 94 101 -148 -522 -141 355 248 -237 -251 -63 -123 -46 240 175 -313 -414 8 340 113 10 -6
4407 -6 -223 -259 96 397 81 -298 -219 92 134 72 262 -14 -288 -112 337 326 -13 -43 -37 10 28 229 254 -209
4431 -209 -343 5 147 135 -16 -50 -80 -147 -8 309 127 -180 -153 -56 15 64 198 -43 -251 -226 15 174 25
4454B5j94M1J1R8J09J16j86l37J23L24j9n5n1q5r6J75K15J2l01n6J30J10j08J67
4478A68q5j59j27K02K35n8k35k0J25j05J30J51j31k54MK55%q1n3M0j07j3K34J9
4502A35k23p9O0J12p7M9J39k72o7J90K01j34r1k4k3J8Q2K44j42k44K7R0J21J6
4526A08J1n8j91J00K11pk15J9O6qj1Q6qj75k6P7J16k5K2k2k03L8J95l5k6p7o7
4553a05L7O5J7J5q2n5O6O9n6o5K2j10J77K0M7l8o4nLN3N7Jj05J7K7J2P0l2l0o5
4583c7K6R5K1r1k0L8k7L7J20p7j46K3Q9K1l8J4L7r0J9L6J0j10MK9jk1J13l8j18
4612h2PPJ15n2OK9o8q6J16P7m9j33M3K6m1J01L4j02r4J29O0K5k6q5R4m4k9J24
4640A02K8j03K8%n4N5m2K0m1O9J3j0K3q0l5O5J7q7O9P4j18j31J54lq6R5p5M4l1
$$ plain form
4454 25 -169 -128 -117 -19 90 206 20 -317 -194 130 111 56 5 -80 -176 -1 214 226 -75 -131 -1 109 1 168
4478 168 83 -76 -203 -1 234 176 -59 -79 46 -59 71 222 91 -163 -159 96 96 15 -38 2 -105 -118 116 135
4502 135 -88 -167 -107 5 -72 -23 116 -156 -223 -33 168 34 -57 -81 -104 -86 -4 240 98 -146 -119 -29 92 108
4526 108 119 61 -130 -30 181 174 -41 -22 44 36 25 111 103 -72 -98 -21 95 70 92 70 -133 -95 100 65 39 -38 -105
4553 -105 -68 -3 14 29 -53 -108 -42 27 -29 -94 -72 -182 -5 15 62 24 -40 -45 -42 11 68 69 -36 -19 8 20 90 58 28 -37
4583 -37 -11 84 105 14 -6 32 5 42 162 85 -61 -38 51 72 34 48 85 -5 14 50 60 -50 -46 -17 -18 -39 74 36 -82
4612 -82 -75 -68 47 -5 1 30 -38 -124 -8 69 20 -113 -70 -44 -85 16 50 -52 -146 -17 43 68 42 -43 51 7 -22 102
4640 102 130 27 55 55 1 56 14 34 -7 62 75 65 88 8 -27 38 55 -32 37 111 -7 -138 16 13 -73 22 -53 -9 -40
4669d0k0P1r5J5P5M1j44lN4ql5J38J3j6j07rK6O7r2J17k1n5k4J36k6k2Kn2M8l0
4699DO3OJ4r0%pM7MM3l5m5j7n0P2NP8r2j2m0nJ70q0j21QO6L6n2K5P7j47p0J57
4731A2L2j37J9M9k2q3P4J45q2j11O1J14q8j6J36n2j76J18J17j8j33P7J18j65l7
4756d8J62J9j22j06K22nk13J24J12j55j20J86O5j02q3Q9o7k3N4P2m7j85N7J20
4780FRo9R5l4j77N1J54P1j58m2N7K5QL8R2j19j55L6K45qj49nM1n4KJ68P1k70l4
4809a05J63P6q1LQ2j70j12J29L45j62k80J62J62k71J3K08k0k89m9L32k5j51J5
4832b5M9j60K5K55P1l16j54K63L5j04K4J76k66j50K52K88k00j49L3N1q5J6L28
4855B57j39k81n3K73O9r5J5Q6j94j58L03J95j54k09O9K8M8J8K02j41k95j2L23
$$ plain form
4669 -40 -60 11 -84 -69 6 47 -97 -100 -46 -54 -89 49 62 46 -61 -70 -44 23 -69 48 27 -28 -52 84 58 36 38 -14 34 4
4699 4 67 73 87 -3 -3 -10 37 41 84 49 4 -13 -63 9 14 92 0 -12 -52 -57 113 33 -88 -80 -14 22 -30 -5 72 -75 -145 12
4731 12 44 -93 -74 -25 -47 -130 -56 89 7 -104 -43 71 -17 -33 103 51 -125 -7 110 92 -41 36 154 -11 -48
4756 -48 114 133 11 -95 127 122 -91 33 145 -10 -130 56 121 19 -64 25 -42 -65 -11 61 14 -171 -114 6
4780 6 15 -54 41 7 -170 -119 35 106 -52 -94 -37 -12 -4 34 126 7 -148 -112 133 125 -24 -29 12 -42 -40 128 199 -71 -105
4809 -105 58 134 53 56 138 -32 -144 -15 330 168 -112 50 212 -59 -46 162 142 -147 -196 136 111 -40 -25
4832 -25 24 -136 -111 144 215 -101 -255 8 43 -61 -37 139 -127 -277 -25 263 63 -86 -53 -2 -87 -71 257
4855 257 118 -163 -216 57 126 31 46 132 -62 -220 83 278 124 -85 -16 12 60 78 280 139 -156 -168 155
4878A55nj47p8J40p6q5J47K42l48k05K88J18j85LJ50j28k73K33K87j71l50J64
4900a24J99j65j4K73r0l72R9K98J33l52O4J77k96KL27J98m04j86K77P3j91Q1K65
4923B72k56k42J79L24r6k05O9L7k53Q7K71%k53j07K58N4j84M8J02j25k01J62J89
4946A30q8j76L2J15q0m2K04L2k59j5K17K3j38m2J86j25j30K61P4j15k34J66J18
4969A14j42n5K81n7l14J24K24O3l62Q0K33k45n3K38J10l41r1L08J10l06J08J73
4991B00k09k20J98K31j52j90J78K9k01KL20rl29m3J88J4q0J18P9k00k38K53K53
5014A92k29m7J11j11r3J22K20ol26P4J95p0j55J48J62l29j18M05L9j37j22J19
5036D4N3k07J63K75k37k52O6K46m9j88K39p9k44O8K88O0k86j30K09k7jO7J23l31
$$ plain form
4878 155 150 3 -75 65 -11 -96 51 293 -55 -260 28 146 -39 -36 114 -14 -287 -54 233 62 -288 -124
4900 -124 75 -90 -104 169 79 -293 -194 104 237 -115 -51 126 -170 -168 159 357 -47 -233 44 117 -74 7 272
4923 272 16 -226 -47 277 181 -24 45 82 -171 -84 187 187 -66 -173 85 139 -45 3 105 -20 -221 -59 130
4946 130 42 -134 -102 13 -67 -109 95 127 -132 -147 70 93 -45 -87 99 -26 -156 105 179 64 -170 -4 114
4969 114 -28 -83 198 141 -173 -49 175 238 -124 -44 189 -56 -109 129 239 -102 -193 115 225 -81 27 200
4991 200 -9 -229 -31 200 48 -142 36 65 -136 -134 186 177 -152 -195 -7 7 -73 45 124 -76 -314 -61 192
5014 192 -37 -84 27 -84 -177 -55 165 159 -167 -93 102 32 -123 25 187 -142 -260 145 184 47 -75 44
5036 44 97 -110 53 328 91 -161 -95 151 102 -86 153 74 -170 -102 186 246 -40 -170 39 12 11 78 201 -130
5060a30j59K23K36q5j36K8q5j99K64K77q9l87J9J87R0O1L4r6l67K6L22J92j30
5083I6k02n0P7K1K23J39j69k82n9L23J24o9j74q3j56J13L65J04l32k42Q3J08J30
5106H8J10O0l71k76L25L18l6k09j05m1q0K39L46j91m63r5L24J90k5K0j76k79q
5129c35M53K78l17k69j9O4J29K94J20n12l02K03M01J28j49j34k76r3L23M08r4
5150C01l54k20R4J55L32K6k31l90o2L52L57m8l35k23m4J28L53K28k92m26n1K44
5172a06L63Q6k07l72k00K52M25J93l22l85q0J86L52J59j76l70j71J72M34K20l44
5193A09l00j26O2L27L81j50n14l27L47L99J88j84l01k93K7M77M31k08m34l17J62
5214b44L36L46j1m42m11j5M76L43q4l67k38n9K97M48J37n03m46O8L51L04J02l40
$$ plain form
5060 -130 -289 -66 170 85 -51 -23 -108 -307 -43 234 145 -242 -223 -36 54 115 149 53 -314 -288 34 226 96
5083 96 -106 -156 -79 -58 165 304 135 -147 -206 117 241 172 -2 -85 -241 -128 237 341 9 -233 -150 -42 88
5106 88 198 258 -113 -389 -64 254 218 9 -96 -137 -217 22 368 177 -286 -381 -57 133 108 128 -48 -327 -335
5129 -335 118 396 79 -190 -209 -145 -16 278 398 -114 -416 -213 188 316 167 33 -243 -336 -13 395 301
5150 301 -53 -273 -179 -24 308 334 103 -287 -349 3 360 312 -23 -246 -290 -162 191 419 127 -299 -350 -106
5172 -106 257 343 136 -236 -436 -184 241 434 112 -273 -353 -167 185 344 168 -202 -373 -201 233 453 109
5193 109 -191 -317 -255 72 453 303 -211 -538 -191 208 396 212 -89 -382 -355 122 553 345 -89 -406 -244
5214 -244 92 438 427 -15 -426 -441 35 378 294 -73 -311 -370 -73 375 512 9 -437 -369 -18 286 388 48
5236D8m20j76M43M91L8m09l28q8K03M21K82l42m83j32L41M02O9j24m14k92K22
5257b48N16K48k92n02q4J49M20K55j56m33l48J88N02K91k44l84k91J03M04L15
5277D09p0m27l96J52M08K47nl25l75oM45K96K4m36l61j1M27M03p2l92k93q6M10
5300c4M15K1l32m39o4L09M35R3k69m62m2L24L68J15l21l33k24L31L79J99l00m90
5322c21l2K54L32J79j53n02k13K87M17J68k43k91k60J23L76L20j98m37k44J92
5342b46K95L08j34l34l05O0M27K87j44l09j86m4L31K69M7m07k59P2K96K55n3k22
5364Dk81JK81L42m9l23k43K7K28K39J24k55l10p6K97K38Jj16l11k4J44K77O4k21
5388E8k23r9K23J65Q6j01k36j75J19K79J35k51j84j29J17K67J35n1k81q6O6K39
$$ plain form
5236 48 -372 -548 -105 386 424 15 -313 -401 -198 223 505 163 -320 -452 -111 291 360 236 -178 -470 -248
5257 -248 268 516 224 -278 -362 -213 207 462 306 -127 -475 -287 215 506 262 -122 -413 -310 94 409
5277 409 339 -88 -484 -332 76 323 318 -7 -382 -388 57 353 377 -59 -420 -431 -4 399 327 -65 -358 -444 -34
5300 -34 381 402 70 -369 -433 -124 311 404 135 -327 -369 -45 323 438 117 -216 -440 -109 270 469 169 -321
5322 -321 -353 -99 233 412 259 -243 -456 -169 248 416 173 -118 -378 -255 121 441 243 -194 -438 -246
5342 -246 49 357 223 -111 -416 -356 71 358 214 -95 -281 -325 6 275 322 -85 -344 -272 24 279 226 4
5364 4 -277 -276 5 347 298 -25 -268 -241 -13 226 350 95 -215 -291 6 244 245 129 -182 -206 -62 215 279 58
5388 58 -165 -264 -41 124 210 109 -127 -302 -183 96 231 -20 -204 -333 -216 51 186 135 -146 -232 -166 73
5410G3J69j68j28j43L8K05J23k5j68j24mK09Q7l4p8j60k6J91J47o6j14r9jJ12
5434A6O6J26j59j70J11J1R8p4rj7j29R1J20K7j04p7J9K0o3Q9J43k52r7J48Q9l8
5460a5K2J3l5r1N7J51m8j29J5J20j22kJ67%j31j0N6k5l6J08M3j39l3P8N8j3l9
5487B0K4m1r7N4K02J8k00j07J36k9M4R1q7j29p9J41J52m4m3k3j14j9J02K38p6
5512A34k38j8O0J02OP2j08k08J5K02J69r7j58j0k5N6J71J00k31k71J41K96m4L8
5536A54p8j51j55J90L35j6l34j85J53L6J92J28m0l88j71L64K70q7j91p9j38K0
5558a71L10K67l47l30l6K16K34R3r9k85k53J50M26J80k60k63n3l7K79K12R2m36
5580a11l18J90L83J44j23j87j71j27L07M12m9m51j72J32J39L26J6j84l99j19L92
$$ plain form
5410 73 242 74 -54 -197 -159 46 169 144 -24 -148 -152 57 144 110 32 -128 -154 37 184 118 4 -95 -96 16
5434 16 82 208 49 -121 -10 1 99 25 16 -1 -130 -39 81 108 4 -73 -54 -34 -97 -8 135 -117 -214 -66 23 -15
5460 -15 7 20 -15 -106 -49 102 54 -75 -60 60 -62 -64 103 103 -28 -38 18 -7 -43 65 108 -31 -64 14 72 59 20
5487 20 44 3 -94 -40 162 180 -20 -127 9 -20 24 115 28 -101 -180 -39 113 69 26 3 -111 -130 -28 210 134
5512 134 -104 -122 -62 40 46 118 10 -198 -183 19 188 91 -67 -77 -102 -46 125 225 -6 -277 -136 160 116 154
5536 154 76 -75 -230 -40 295 279 -55 -240 -87 -51 141 269 229 -159 -330 34 304 217 26 -53 -191 -171
5558 -171 139 406 59 -271 -307 -91 143 236 137 -148 -401 -251 175 355 95 -168 -221 -258 21 233 325 -111
5580 -111 -429 -239 144 288 165 -22 -193 -320 -13 399 350 -101 -273 -141 -2 324 340 156 -243 -362 30
5601C0L87j35l00k44O1J36L88J57l50o01J68M24J34Nj72k93l06L16N87Q7m48m34
5623d03R3J90K57K71j64n77k73M44N34j00j90k60k35N0N62L58l09n81j63L38L48
5644A90K00o3l83m15R4O05K90k99l81j43O9K60M03K0n12m48K60M84K16k47j90
5665A0l07j20L86N70j97m31l79J78M01J31J27k49n91q6N87M82j31m88k93O6J60
5686a74M80K39m44o18j0N11L98Lj97m11k98K52O70J39m36m46p1L09L30L14j21
5707D19o89k99L63N00K01l04l69k33J02M56M02j51o13l22M18L55J40r5l60l32
5727d11k2N97L75k58m51j68Q7K59L18Q6m73m92J18N90J93j37k78k78r7L69N12
5748D39l2n48l33J75L45K20R9k17n53j14M90N18j35l45k37p1J47M39K68l93n12
$$ plain form
5601 30 417 282 -18 -262 -201 -65 323 480 130 -471 -303 121 255 260 88 -205 -511 -195 392 479 31 -403
5623 -403 -310 -120 137 408 244 -333 -606 -162 372 272 82 -178 -413 -363 199 557 248 -333 -496 -158 190
5644 190 390 327 -56 -471 -377 228 518 219 -162 -305 -236 24 427 447 -65 -513 -253 231 447 200 10
5665 10 -297 -417 -31 539 342 -89 -468 -290 111 242 369 120 -471 -557 30 512 381 -107 -400 -334 -174
5686 -174 306 545 101 -517 -527 -16 382 385 188 -223 -521 -269 401 540 104 -342 -413 -104 226 540 419
5707 419 -270 -569 -206 294 495 191 -178 -411 -309 147 549 398 -215 -537 -119 236 376 281 -79 -411
5727 -411 -433 164 539 281 -170 -338 -251 8 326 412 -61 -553 -435 155 348 211 -67 -345 -442 -73 439
5748 439 407 -141 -474 -299 46 266 365 148 -405 -519 -29 489 354 9 -228 -299 -152 287 555 162 -350
5769c50m0L83L04M4j15l77l30K36N39J36l19l41j35K50J82L06r1m62k24K16L48
5790A60J81k30k41k15P2L68L02j22m63k83K23L19K91j67k68k49JL72K62k6m55
5811a68j02L1K82J91J09l11l77Q1L10L05j44k36j28j03K08L03J15l79k71O5K41
5832B2K17k8r6l10j35K77L50j8l29r5j7Q1J75K39k63l06q7K04K39on9j87q1mL38
5857A21J24k54j52m3J36N2J30N7k65j95J36L04M6j27j11k0n3J68J57n4k28j31
5879b02J85J25Lk3r3j56L7J77J48q7j24j58J13O1J24oj24p7m0J26N4j4rj11m4
5904a15J16J08Oj21j35M3J04LQl1p0M4j5P8J7q4J9n0Q1O2n0j1k5K0J4N9n6k9o4
5933g4P1l8M3Q3m0o0J9J7k0k4j7R0k1p0O8k1j39J21L1l1r5L8P7J3o1O0l3k3p4
$$ plain form
5769 -350 -390 -7 297 341 226 -151 -481 -245 294 430 111 -230 -365 -115 67 373 282 -180 -404 -188 160
5790 160 341 111 -130 -345 -273 95 397 275 -188 -471 -248 71 362 195 -73 -322 -321 51 313 287 -168
5811 -168 -270 -239 43 234 343 32 -345 -264 46 351 207 -29 -157 -260 -52 251 366 -13 -284 -219 22
5832 22 239 211 115 -195 -330 -53 297 279 -50 -145 -162 -81 94 333 70 -236 -323 -119 120 114 55 -132 -213 -217 121
5857 121 245 -9 -161 -204 -68 -16 114 171 -94 -289 -153 151 197 70 -41 -61 -114 54 211 157 -71 -202
5879 -202 -17 108 111 88 -5 -161 -124 53 201 114 -10 -168 -55 6 130 124 0 -77 -117 9 63 49 40 -71 -115
5904 -115 1 109 115 -6 -141 -98 6 9 17 -14 -84 -40 -55 23 40 -44 -25 -75 6 68 18 7 -18 2 16 75 19 -10 -74
5933 -74 -3 -41 2 85 45 -15 4 21 1 -23 -40 50 29 -41 27 6 -133 -12 19 -12 -107 -69 8 21 -40 20 -13 -36 -110
5962a10J22J0l4j8K1q1LR2N5n7j75J78l7P0oqp4j38J52J53n5r6p0N5J6Q0J25j46
5990B7j46rJ72R2o2k2n4p1nJ86O7p6j77j3J05L9P1o1j65p3J11J57N0o3j25j54
6016a99P7J84J11p6j95n4NK07J06n3j39r1l3J69K12n4k26k05J18J53J67L1k55
6039d0j37J7J94K15j01j55j13k5J32J70P8k08k12J1J78K26n3j94j40m0J29K38
6061A70J19j88k96l7J85K10Q4j62k74o1J61K77j5r3k24j25J15K33J46o4l77l9
6083b55J40K01J19m5k97j61J63L14L0p4k32j57J03K67J87j37k51j88N0K94J54
6104B25%k71j58K7K23K17J6k82k25M1J44K50L3k36k94O4K64K47r1j75k61J4K61
6127C3J48J64l39k07o0L05J45j1j35k02j16J19L36J26k33l06j8K08J80O6q8l32
$$ plain form
5962 -110 12 22 -12 -30 -9 -90 -87 5 60 3 -172 6 -31 39 33 25 -49 -187 -35 118 63 -33 -103 -48 -32 48 173 27
5990 27 -119 -128 44 136 74 52 -2 -73 -78 108 175 99 -78 -91 14 53 124 63 -102 -175 -64 93 143 80 -45 -199
6016 -199 -122 62 173 97 -98 -152 -147 60 166 113 -26 -117 -150 19 231 177 -49 -254 -136 17 184 215 -40
6039 -40 -177 -160 34 249 148 -7 -120 -145 -13 157 235 27 -185 -174 4 230 177 -17 -157 -197 -68 170
6061 170 289 101 -195 -232 -47 163 247 85 -189 -250 -89 188 173 80 -144 -269 -154 79 225 161 -216 -255
6083 -255 -115 86 205 160 -137 -298 -135 179 209 135 -97 -254 -151 116 303 166 -85 -273 -223 71 225
6104 225 225 -46 -204 -177 46 263 279 -3 -228 -187 -43 207 240 4 -290 -226 38 285 194 19 -242 -228 33
6127 33 181 345 6 -201 -261 44 189 178 43 -159 -275 -156 180 306 73 -233 -251 -43 137 203 115 -217
6149b17n8J13L56J11k16k57o5P3K39K37j79l13j07J96K24J36j04j63l05O5L17
6170H3J46q4k90q8J33J36J87L4l00k36M5K88J81l1k34k21k7K13L09m9k02k19P6
6193a50K10O0M2j01k90m8J78L33l1k60m0l7Q7J11K19k20k83L0K25J28K5r8j22
6216c2k16K08K67M5k52k01MJ44J48J14m3k79j85K24K78p1n5j23j62n6K81K14j54
6239I8k10j03R9J25M7O8j35j86qK19J97j02k17j3P4l6K36J0j13k65J02J62M6m7
6263D8l2l9j41J08K32Qk19j49J22N5J06M3k2j91j47K60J21o2j49K4j4j7N0J69
6287A64l3l09QJ68P9m3M3J3l02O9K81J2k29r1O7O7n0J74M9j75j14P9J82l2n6m3
6313b2O5j90R4J58N5k03l3O6P9q0P8J2j99m2K44K1n4o9M4j7p3K3J34L3k39N3J45
$$ plain form
6149 -217 -275 -162 194 305 89 -168 -233 -160 79 316 137 -176 -283 -87 137 273 169 6 -299 -234 83
6170 83 229 145 -145 -233 -100 36 223 257 -43 -279 -234 54 235 204 -30 -251 -278 -65 244 195 -7 -226 -150
6193 -150 60 120 162 61 -229 -277 -99 234 203 -57 -97 -134 -47 64 283 63 -220 -190 35 163 188 90 -32
6216 -32 -248 -40 227 272 20 -181 -177 -33 115 229 186 -93 -278 -54 224 153 98 -25 -187 -243 38 252 98
6239 98 -112 -215 -116 9 56 124 -11 -197 -205 14 211 109 -108 -121 -47 -83 153 163 50 -215 -113 49 95 48
6263 48 16 -23 -164 -56 176 184 -35 -184 -62 -7 99 142 120 -71 -218 42 163 101 -48 -24 -38 -55 -5 164
6287 164 131 -178 -170 -2 77 34 77 90 -212 -143 138 150 -79 -170 -103 -36 -86 88 137 -38 -152 -73 109 77 21 -22
6313 -22 43 -147 -53 105 160 -43 -76 -10 69 -11 67 79 -120 -162 82 103 49 -20 24 7 -66 -43 91 124 -115 -62 83
6340H3j1j38R2j5n9l3J37Q2j77j01J37k9n2P2P4p8j30J57N3n6r4Q5oj05Q7L0M3
6367D8j94N9J43J6j77J53M7j55k4J30Q4j37m4R6J9j49M5J84n8j62J6J01n3q3J09
6392A4O4j05o3N0R5o2l8N6L8j57J3J98p7j45N4J43j13p2J42K2j17l3J51j3q9O
6418c8P0r4K2RJ31p5j02J09O4j82k6K12r4p0j8J84n4p4qP8j6o5Q9K1l9r1R3k8
6446HpJ7J01n4j92J22J48p6j94J09L2r7M5M4O3r6p5J19N4q3RL6r9m8R2J83j66
6473ep3M6J4k1k6K15r5j91L9J93J9j01K5M3j54l1J14J90j87k6j7M1m9j2J41j32
6499d0oJ0J79n1p4K1n5L0q0R1k6n6n2J64J6n5r8M7L4q2P9J48j38o7L5J5j5J6M
6528fPj26KK16m1j11M1rl2K1M8P3j35p2O0J00pj8M0q9r4R6J02oj22N7nJ8O5N4
$$ plain form
6340 83 72 -66 26 11 -48 -81 56 138 -39 -140 -3 -32 -84 -12 62 -16 -146 11 64 8 -86 -1 -7 -112 -25 5 48
6367 48 -146 -87 56 72 -105 48 95 -60 -84 46 130 -7 -51 45 64 -85 -40 144 86 -76 -60 41 -12 -95 14
6392 14 78 -27 -90 -40 55 -7 -45 11 49 -108 -95 103 26 -119 -65 78 -35 -107 35 57 -60 -93 58 45 -44 -38
6418 -38 32 -62 -40 -31 100 25 -77 32 96 -86 -112 100 6 -64 -82 102 48 -26 -34 44 28 -37 52 73 34 -57 36 8
6446 8 1 18 119 65 -127 -5 143 67 -127 -18 14 -83 -38 6 69 -27 -102 17 71 -12 -3 33 -66 -114 -22 161 -5
6473 -5 -78 -32 -18 -39 -65 150 55 -136 -97 96 115 14 39 82 -72 -103 11 201 14 -12 -29 12 -37 -49 92 -40
6499 -40 -46 -36 143 92 18 39 -16 14 -66 25 -1 -57 -109 55 71 16 -82 -35 -1 -83 -4 144 6 -61 -26 -11 -26 -10 -6
6528 -6 1 -125 -123 93 52 -59 -18 -27 -59 -38 10 83 -52 -124 -64 36 29 11 51 -38 -132 -36 66 60 -62 -5 -10 8 73 127
6558A27r4j01l0R0P2j4lPp8p4J76M6j12n1L1L6j5L3Mm9m6QJ09j3j05L8%p2j3J78
6588H5j1q0p4MJ18k6lj6o9rO0Q5kj01k3J09k6J5M0Op6q1J02O9m6l8J6q0k1J48
6618G5N3j50p3J03R4r3MJ3m0r3O7J47m0r5k4L2l6N4Q7o8q2K9j1J09n3J0L8j01
6646d4n0Q3O4j02K7p2L6RN4K6k3l3k8J32o0Qmn2j7P9j8l6K9M1j03O4RkR6j69n
6677f1j1R8M8oj39M3L5l7N4K0J2j07%L8J3K6m3o8P7kM7jj01j5J16k9L6j9j8m1
6707c5k2P9M7p7KKl1k0K8O5K3j55O9O2n4O5O2j50J2L8L8o3K6k8oNjJ14q3Kk0j0
6739a6J2P9o9l7n7O0LO1J7r2Kr1J24RP6m3l2o7L1R5m3o4K6l6K0nJ19k9j01QN3
6770A3kJ1L1j36L4J01J9n5j3M7j36M8N4k3Q1o9n1L4kL6rk6n8K6L1M1Nm8p2k9J56
$$ plain form
6558 127 33 -68 -98 -8 64 50 47 54 -24 -98 78 124 12 -39 -8 28 13 46 50 1 -45 -37 72 59 -46 -8 -8 -80 -93 85
6588 85 74 -6 -80 -76 42 16 13 -3 -72 -81 -21 64 62 -39 -62 47 21 36 76 82 6 -75 27 96 50 12 28 -52 -73 75
6618 75 128 -22 -95 8 102 9 13 26 -14 -107 -40 107 67 -28 -52 -20 -56 -2 85 17 -65 -36 -47 62 9 19 57 -44
6646 -44 -94 -11 53 -49 -22 -94 -58 -49 5 31 8 -25 -53 79 19 27 23 -29 -46 33 15 -21 8 49 -54 10 19 17 113 -56 -61
6677 -61 -72 26 74 68 -71 -28 7 -30 24 44 56 -51 -51 -13 0 26 -17 -85 -8 -10 37 36 -65 -80 36 7 43 24 6 -35
6707 -35 -57 22 69 -8 -6 -4 -35 -55 -27 38 61 -94 -25 37 -17 48 110 -40 -28 10 48 -15 11 -17 -23 -18 -19 95 12 14 -6 -16
6739 -16 -4 75 6 -31 -88 -28 -25 36 53 -39 -37 -128 -4 5 81 38 6 -61 -30 65 22 -42 -16 -52 -32 -37 82 53 -48 -40 13
6770 13 11 22 53 -83 -49 52 71 16 3 50 -86 -38 16 -7 74 5 -46 -12 -14 22 13 -13 -71 -45 -14 27 32 -16 -88 -117 39
6801C9k5l9N7j25L2O3M1q4J5l9K9m0L4R7n7o6kL3L5L9m3O2o1p4J35Kj11RO3p4
6831e5N3J9P0l3j0o1L0L7l4J5l0q9J38O4n4or6P0n4jL4L6m7q3J02k2j7Qj5n0P3
6862hL4O9j76NR7oN4o4M1j19NM7K9L1n4J8m9P6pK5M7j32j5O2N4Pm8n5M8m4M3L4
6894D9j5j34J27j5j9O1m6K2Qm3K4O0j41Q0Mol6NO0n4p7K3R0o6l0O6M3r1LR5p0
6925b3p0JJ66j20O3N1m8j11J9J50J5j02n3Q8M0o9Q3ko2j03J27O5j08l8M9K4j18
6952h6P2Q0l8r1P0N3o5LRl2kRN8M2o8p6J6KJ7M3M1n5j08L6Q2MKk4M9j48PJ29N6
6985H7j00q4J43m6n4P2P2j14k8J06N8%j12LK7j5jP5j06j13J00J01l0n7j3O0j27
7012i6Q1J05n8r0N6L0l1m4N4ln3j1QJ83j06m2n2O9jj9Q3j2p8l0J46q1k5M9m0m9
$$ plain form
6801 39 14 -25 32 -93 -61 2 43 -41 -26 -65 -36 -76 -42 55 -2 -68 -70 -37 -2 37 -6 56 -5 -79 56 58 -53 -44 19 -55
6831 -55 -2 17 87 54 44 -17 13 50 16 31 1 -88 50 114 60 54 -42 28 -26 -27 7 43 -4 -87 15 -7 -24 -16 -31 -81 -8
6862 -8 26 95 -81 -76 21 15 69 5 46 -73 -68 -21 8 39 -15 3 -46 30 23 48 95 -37 -52 10 64 71 23 -32 16 -28 15 49
6894 49 34 -100 27 12 -7 54 8 30 38 -5 19 79 -62 18 22 16 -20 -15 45 -9 -86 -63 27 -39 -69 -3 40 -51 -48 47 -23
6925 -23 -93 -92 74 -46 17 68 20 -91 -72 78 93 -9 -62 26 66 -3 80 78 16 -87 40 105 -3 -41 8 32 -86
6952 -86 -14 66 28 -63 7 60 -5 -2 7 -25 -27 -18 40 82 14 -62 -46 -44 -27 16 57 2 -106 -70 12 16 18 -6 43 -105 -98 31 87
6985 87 -13 -97 46 0 -54 18 90 -24 -52 54 112 112 0 3 30 15 14 89 -17 -130 -30 71 41 -16 -29 31 -96
7012 -96 -15 90 32 -58 -2 28 -3 -47 7 4 -49 -60 -52 131 25 -17 -69 0 -1 -20 63 51 -27 -57 89 8 -17 32 -8 -57
7042e7oJ48Q4j82q3O9N5o1L4J04k8j75jJ98M8q7k6o6n7L5K04o8q1r4J06mn0P1
7070C0K5q1q6J29Q4kk02J41o2k7n2K29m1k17RJ27O5o8L2rq0m6J26P1r4p1Q3J3
7098B6m0KJ07j21r4P3J32j4r1k7P4o5K4J20K2j98l0J08J00q8N7o4m1J7M0Q0r5
7125A4j27P7K4j5J24j7m6k02P2J34N7m1k4o3j20J34M7M2j11j10J14j0K0J4K9j
7151A5j47J21J49q6p4j3m2J02PM9n2o8oQ2R8q1j05R8j31N3N7J21j12j00K9K7O
7178cJ5Q2j07j25M9J59K3q9m7O2j21P5J51J5j75j01J64L3p2N0l6n1p9J17J20q7
7204B2j33R7n1J4M8J22o7j33l9J32M3o7K0L3j07K5M4j5O1j80N2P0K1jJ1j2n7M6
7232aN7J2m7Kl4K1J0P8q1q9rL1J24lm9k2Pk3mK6Q4j49jP5J5l0nJ1o6qQ7O7n1p0
$$ plain form
7042 -57 -63 85 169 -13 -96 -27 28 -33 1 105 77 -98 -99 99 147 60 34 -32 -89 -54 150 82 1 -93 13 9 -41 30
7070 30 55 -26 -112 17 101 99 -103 38 -24 -51 -103 126 85 -132 -123 4 69 1 33 24 -56 -102 24 95 1 -70 13 26
7098 26 -14 -12 95 -26 -120 -47 85 71 -20 -47 27 -38 -14 106 128 -70 -100 8 108 20 77 13 -28 -11 29 109 14
7125 14 -113 -36 -12 -27 97 80 34 -168 -96 38 95 54 30 -33 -153 -19 28 70 -41 -151 -37 -47 -27 -13 16 15
7151 15 -132 -11 138 52 -22 -35 -77 25 32 81 29 -39 -45 37 135 54 -51 47 -84 -31 26 147 35 -65 -36 -9 -3
7178 -3 12 94 -13 -138 -89 70 93 4 -43 19 -102 -27 124 139 -36 -137 27 60 -12 38 2 -49 -128 -11 109 22
7204 22 -111 -14 -65 -51 -3 119 52 -81 -120 12 55 -12 8 41 -66 -41 3 -12 49 -131 -79 -9 12 11 22 10 -47 -1
7232 -1 56 68 21 23 -11 10 20 98 17 -72 -81 -50 74 71 22 0 7 -16 -20 6 90 -59 -60 15 30 0 -5 6 -60 -68 19 86 35 -35
7266c5KL6l6J2Q8m4o2l0J05m3M9J4j4o3j0Q5j4j19O3QJ4j7N9K5j3p3N5N0j35M7
7296Dj2Ok6L0J2l9L2n2M2l9m1J40j10n1P6P1l4n9J09k5o5NL0J6o3L5k4MN9Lj8
7327A6Q1j22k8j0N2N3ol6L4o0N9Qo5j8R7l0M0q9Q7n8K0l4k0Q4l1L6m3Ro9Q9m0
7358FL1l2n5J9j9N3O8q7o3lJ25Mpq3mN7m5J09m2k8J3p4L3JJ11p3n2o9P1R0O3j31
7390a3j2nJ9N3L4j8q9o6Q8Q0k3J02j92j5l3Q0Q0pr3o%O1O9Ol7j79P2P3R9r6j6
7421A6j33J3M5J81j4r1r2l9J64P4m2q7j01PR2J04k2k0j92P1qJ54L2n6j03m7M0
7448e4J10M4j5j09j27J10J00N3q9j08M2k1R5N3pp9j52N9J84J09j25j38n6P8J15
7473G2Q2q0r3j40N7R2J76p1j02j60N9Q5J31K5j38j10k8R3J83L7j73k02P3J22J16
$$ plain form
7266 -35 -33 3 -33 -21 67 23 -39 -69 36 -7 42 56 42 -21 -31 54 40 -79 -16 -8 6 -11 48 73 60 -13 42 92 -43 4
7296 4 -8 -2 -28 2 14 -25 7 -45 -3 -42 -83 57 -53 -104 -28 43 9 -50 59 34 -31 -26 4 20 -43 -8 -32 -28 31 34 16
7327 16 97 -25 -53 -63 -11 42 36 0 34 -26 33 41 -24 -42 55 25 65 -24 63 5 25 -9 -29 55 24 60 17 26 -43 46 6
7358 6 37 5 -50 -31 -50 3 71 -16 -79 -82 43 47 40 -43 -47 10 -35 74 32 4 17 -57 -24 -23 88 15 -37 -106 -35 55 118 -13
7390 -13 -25 -30 -11 42 76 58 -31 -97 -9 71 48 150 -42 -57 -90 -10 70 63 -30 -36 -36 25 94 100 63 -116 -44 29 128 32 16
7421 16 -117 -104 -59 122 108 17 -75 -114 50 124 82 -5 -106 -99 -7 97 75 55 -137 -66 -74 80 112 56 -47 -94 -54
7448 -54 56 100 85 -24 -151 -41 59 112 23 -85 -43 -64 31 84 77 -2 -154 -95 89 198 73 -65 -121 -43 72
7473 72 154 74 -19 -159 -102 -10 166 95 -7 -167 -108 -23 108 133 -5 -115 -143 -50 133 170 -3 -205 -132 -10 106
7498A06J05j17k01q9J54K08Mj68j06m6J62P3J01r2j84j09J46J92J0o3j50j52Q3
7521a33K43J32j02k64k6lK28J04k8j76j88P3K19J69j07j96j17P7Q2K08n7j34k20
7544b16K3J58L12j15k19j00j8J48K09P1k54k02MK13J65N4k28j61r2K37K31m7j18
7567E5j75m9J07K64P5k22k86j7J86K17Q9k27j40j30J33L19N1j31k34p4J01K09
7589A21J09kl06j43R0K63O4l8k02j70R3K53J37j27k39j65R0K03J95n0k51j98L1
7612b42K93K08o8k74j24K5J76J95j0j49l29J14K48K00j23j27j97o4K10K11J00
7633B73k98k18N4R4K36O4j17k72l1J19L26j8j62j70j43J37K79R4j85k25m8J37
7655g4K28M0j00j98j47J15K63J33j63k05j97J60K08J08L3k55k58J87K20J54j11
$$ plain form
7498 106 211 94 -107 -196 -42 166 170 2 -104 -150 12 85 186 94 -90 -199 -53 139 149 86 -64 -216 -133
7521 -133 110 242 140 -124 -150 -153 75 179 151 -25 -213 -140 79 248 141 -55 -172 -95 -13 195 138 4 -216
7544 -216 -193 -35 277 162 -57 -157 -175 -27 182 253 -1 -203 -199 14 179 233 5 -156 -248 -11 220 173 55
7567 55 -120 -169 -62 202 277 55 -231 -248 -62 155 244 17 -123 -253 -120 199 250 119 -115 -189 -88 121
7589 121 230 228 -78 -221 -131 132 196 158 -44 -214 -121 132 269 142 -97 -262 -172 31 226 176 -75 -273 -242
7612 -242 51 259 191 -83 -207 -182 -6 189 179 30 -299 -185 63 263 140 13 -184 -248 -38 173 273
7633 273 -25 -243 -189 -95 141 205 88 -184 -215 -96 230 212 50 -120 -263 -126 153 247 62 -163 -211 -74
7655 -74 154 194 94 -104 -251 -136 127 260 97 -108 -305 -145 63 171 204 -51 -309 -122 98 252 141
7676A41j48j12K7J17K09k2k39j89R5J44Q3R6j50k09q9L18J63q9j88j32OP6J45
7699E3J36j55k93M8K50Q2N5j59r6l9O7J55R0k04j31j8J82P6M4q8j01j34J60K38
7723B18oj87m2j7o1J56Q5n3k46KJ74L8Q4o6j05p8k6J80P2k0j73l5R1K6J15J4k05
7750f5j30M5K35km4o7k1q9O7J86kj14k7n6R4OM0Oj18q8J45M9j9l1j00P3L9M5P4
7779A31m1j64M7J01k1o4N0k3o4J8P1J15j61k4j8K7J05n9%o7p2P6Q1J6j8l5mr3
7807i0K5J23j03L0k6PL5m3J0O3l8m8M8O0r9K9L5K5m0r2J66o0J8q4J14m4n6k6J51
7836I0j14r1J59m7k5R7K3p4r7j0K18l3j38Plj8P5K2P9j02j32Q1J1QL4Pj21l7P8
7865e3J94o3m3j51O0M3M1J00j14j39j0J20J38o8q0m7k8M8N8J45o3j47n6J7J94
$$ plain form
7676 141 -7 -119 -92 25 234 212 -27 -216 -121 23 106 202 52 -157 -246 72 235 146 -42 -174 -168 -92 53
7699 53 189 34 -259 -211 39 121 176 17 -79 -118 -51 104 194 -10 -141 -159 23 99 143 55 -46 -180 -20 218
7723 218 212 25 -17 -34 -95 61 146 93 -153 -151 23 61 145 79 -26 -104 -130 50 122 102 -71 -106 -15 11 126 140 -65
7750 -65 -195 -150 85 83 39 -28 -49 -138 -71 115 113 -1 -28 -84 10 16 56 62 -56 -144 1 50 31 0 -100 -27 12 57 131
7779 131 90 -74 -27 74 53 -11 39 16 -48 -30 41 156 -5 -29 -47 -20 85 26 26 -41 -113 -37 44 60 42 7 3 -90
7807 -90 -65 58 -45 -15 -41 -34 1 -42 -32 31 -7 -55 -7 53 -46 -17 18 43 3 -89 77 17 35 -49 65 21 -35 -61 90
7836 90 -24 -115 44 -3 -28 69 92 18 -79 -89 129 96 -42 -35 -38 -56 19 41 120 18 -114 -33 -22 -14 20 27 -94 -131 -53
7865 -53 141 78 35 -116 -56 -13 28 128 14 -125 -135 -15 123 55 -25 -72 -100 -52 6 151 88 -59 -115 -98 96
7890I6Kn8j44r1J37R9J59j85o2q6O8P1J46J0k08j39O6J75J25m7j37j24p3J88J39
7915A27J5j68j33M8J25J35Pj48k13L9J55K36m2k34j23J2J13J81P6j96j36j01J53
7938g2K12oj80j02m6J16K47J08k10j69o0J04J81J31j10k31j36J49J98J33j32j81
7960e6j81M3K72K01j05l14j17J34K26J39j06k03k08M9L22K13j58k53j59L7K18
7981fK62q0k80j78Q4K16K13J6k51k23M0J91K34kk10l41Q0K54K43k2j49k81p5K15
8005e0K93M0k37k32o8J20M15J3k08k95kJ67K11N0j56k70m6J76K43J11q5l97p8
8028b85J53L00J61j55k73j60Q0L22J53j60k72k13J55K90K13j22l43j88J49L10
8048A15K32j51k82j81O7K36K88j01k92k11%L15K55ll11k18k1L04K56Ok75k27n8
$$ plain form
7890 96 98 40 -104 -195 -58 41 200 15 -47 -133 -65 6 152 162 -46 -185 -119 56 181 134 -3 -127 -200 -12 127
7915 127 142 -26 -159 -111 14 149 156 8 -205 -166 -11 225 183 -51 -174 -162 -49 132 208 12 -124 -225 -72
7938 -72 140 134 -46 -148 -194 -78 169 277 67 -102 -162 -58 123 254 144 -87 -223 -74 124 257 125 -56
7960 -56 -237 -194 78 279 174 -140 -257 -123 103 242 136 -67 -275 -226 96 309 151 -102 -261 -224 -6
7981 -6 256 176 -104 -282 -198 18 231 247 -4 -227 -187 4 238 236 26 -315 -235 19 262 240 91 -190 -265 -50
8005 -50 243 283 46 -186 -254 -134 281 294 86 -209 -211 -44 167 217 61 -209 -255 -79 164 275 190 -207 -285
8028 -285 -132 168 329 174 -99 -259 -179 143 296 136 -136 -349 -194 96 309 187 -156 -344 -195 115
8048 115 347 196 -86 -267 -200 36 324 223 -69 -280 -280 35 290 287 -24 -242 -263 41 297 303 28 -199 -257
8071b57K22K82Pk52k62J1K30K85N0k41l39k0K82K60N7k50k95p7K10L46M6k19k83
8094b07j29K35L44pj55k71j53K00K95J19r9l15j64J39L45R8p7k80k37J75K90J38
8116B84r9k95j90R6K28K05%k71k19L2K95J93p5j90k19j1L02J65Kk75k30Q3K52
8139F3J35O6l56j43m7K13L47o3j92k34KK02K27M2k21k77j2K12K12L2q9k90q2K50
8163cK11O6k37k40m3J14K49J63k05k13j27J79K30J36j37k35j55J85K10J33j91
8184I0j43j43R7K15R1m7k17
$$ plain form
8071 -257 -35 247 254 2 -260 -249 -19 266 316 75 -264 -284 -2 258 315 65 -230 -307 -97 249 295 76 -207
8094 -207 -336 -101 243 236 81 -190 -343 -143 152 271 172 -143 -307 -168 177 275 198 -82 -319 -144 146 284
8116 284 185 -110 -300 -204 24 229 229 -42 -261 -229 66 259 184 -6 -225 -236 66 231 233 -42 -272 -189 63
8139 63 198 264 -92 -235 -282 -69 278 215 23 -211 -209 -7 220 262 41 -236 -248 -36 176 208 119 -171 -253 -3
8163 -3 208 274 37 -203 -246 -132 117 280 75 -138 -265 -86 144 280 143 -92 -247 -62 148 281 90
8184 90 -53 -196 -99 116 207 160 -57
8191e7
$$ Imaginary data points
##PAGE= N=2
##DATA TABLE= (X++(I..I)), XYDATA
0@%%%%%%%%Oj2OqJ6j6J6k4L2l3L9m6N3o4P2q0R2j03J16j32J46j64J87k09K30k56
34a36K85l14L48l84M24m71N20n72O36p07P82q72R73j087J228j393J593j845K165
53A173k589L177m036N388p759J2660k6418J29465M57762m15176m26911K47692
65b5572P3038l02936K01019M78583k44851n50884J43035M05048p3550j05780J90483
76A87633j08744l96871Q5453M27936o13k49649M9928O3534j89081K2731K96165
87A88422l4108l29625k064K53265J0004j09489O7571J8765j57732j0725J80211
98G4495L0130j40992n7882L8232N0196R5387M8374j27127j40403K5227P8860N5827
110C0324R6360j613k18460j26558J95816J93830o2734r6909l1545j21302m6310
$$ plain form
0 0 0 0 0 0 0 0 0 0 6 -6 0 -8 8 -8 8 -16 16 -17 22 -24 29 -35 37 -43 49 -54 62 -70 76 -88 99 -110 120 -136
34 -136 149 -165 183 -201 223 -248 272 -300 336 -371 411 -461 512 -575 653 -740 853 -992 1173
53 1173 -1416 1761 -2275 3113 -4646 8014 -18404 111061 568823 153647 -273264 -25572
65 -25572 47466 -255470 -54451 424132 179281 -371603 -228568 176480 102930 -2850 187633
76 187633 78889 -317982 -232529 195407 194794 -54855 -4927 58607 -130474 -107743 188422
87 188422 154314 -175311 -177375 75890 85894 -23595 43976 62741 -94991 -105716 74495
98 74495 104625 -36367 -94249 -56017 -5821 89566 137940 10813 -129590 -104363 -25503 30324
110 30324 126684 125071 -93389 -219947 -24131 169699 106965 10056 -21489 -142791 -189101
121a89101K51793K08578j72227k25451K8434M5668k1098J56044J54209k15221
131B1628k76152J27970K45955l0525o2674P1946j08060k30527J18234L25184k3589
142A79390k54491j4266J01472o1881L393J82943j0166k48269m0030K03492N0711
153I2298r6669K6287K8852j35232l8690J91101P8151j70842q8801J04914M0295
164C1664m9425N4642N7509j29593j19906J25173J64284n6176j30787J444L7824
175a3347k1987L7852J04746k7904j64485m8017J30359R2947l2786l8168k2964
186c754p2602k3311J29127J15272p9754j40889r344N9522K7754N0105M9055q4133
198A7048j37410K8249J42908L3787o3145j9299j7018o4812J9685J29238L5582
$$ plain form
121 -189101 62692 271270 99043 -126408 -97974 -52306 -73404 82640 236849 21628
131 21628 -254524 -126554 119401 88876 26202 98148 -9912 -240439 -122205 202979 179390
142 179390 -75101 -89367 12105 -49776 -46383 136560 126394 -121875 -161905 41587 92298
153 92298 -4371 21916 50768 -84464 -123154 67947 146098 -24744 -113545 -8631 31664
164 31664 -17761 36881 94390 -35203 -155109 -29936 134348 78172 -52615 -51171 -13347
175 -13347 -35334 2518 107264 79360 -85125 -133142 -2783 90164 57378 19210 -3754
186 -3754 -76356 -99667 29460 144732 64978 -75911 -85255 -25733 2021 52126 101181 17048
198 17048 -120362 -92113 50795 84582 21437 2138 -14880 -79692 -60007 69231 104813
209A04813j11797o5826M4237K8446l89M0575J0946q1751n0034O7805O8381k0207
221C5199l9651j0842j0914K955L9476K1612l1758l3510M872K3612K2898N985k8364
234A570l2964O427K7130J4584J1658m304m6134k8419N0486N1491k8690l9840P338
247i667o563j8544N1415N8636n6029q2414L0934N7476k3811r400M9877k1580q4384
260f4054K2428R3440j2993o6780K1934K5896n8382n418R2885R367r4720q287P1022
273B6338j4799m7899M8152L6782p1775l0466P7727J8753p0236M210O1610k9379
285I018n6441M5158M7074n0888k8289N4601O807n7588J0014N5085k2205m4380
297c2034L3277L0182m3509j8331M8370R612m3448k7L0848j4006j7934L0693J2801
$$ plain form
209 104813 -6984 -72810 -28573 -127 -516 40059 51005 -30746 -80780 -12975 55406 35199
221 35199 -4452 -15294 -26208 -23253 16223 37835 6077 -27433 -22561 1051 23949 29934 1570
234 1570 -31394 -24967 2163 16747 28405 24101 -22033 -50452 34 51525 22835 -17005 -9667
247 -9667 -16230 -34774 16641 75277 19248 -63166 -32232 25244 1433 -7967 41910 20330 -64054
260 -64054 -41626 51814 38821 -27959 -6025 19871 -38511 -43929 48956 58323 -36397 -44684 26338
273 26338 11539 -36360 11792 48574 -23201 -53667 24060 42813 -27423 -23213 38397 9018
285 9018 -47423 -2265 44809 -6079 -34368 20233 27040 -30548 -20534 34551 12346 -32034
297 -32034 1243 31425 -12084 -30415 17955 27567 -15881 -15908 14940 934 -17000 13693 26494
310B6494m0800j4415L4726J1194j8646L756P350k1847p053K9992J0581k4741r605
323a3014R762l094J421K2591K394l1389j3293J9101J1944J01N836r174k7309K953
337b1170L8185J2712k6544j8509o6o19J4314L1385j008m1390j9573K3917K1239
350A2873K636K222j2662l4300n469M4253L3283j7866l2208j5492n268J5688M0599
363B8289J5218m0970m2091J0205L5528J9974K458j7320l8839j9003L4813M6846
375C5108J704l2134k5492q879J0925L4834K5203k4794m8284j0331L3369L4613
387B5842J0009j7255l7893k6264K1715M9882J8133l0707l9031j0687K0646L6124
399B0514K2417j9574m7641k4170K6190M6047K0851j8959m0978k8516J3444M7038
$$ plain form
310 26494 -14306 -28721 6005 17199 -1447 2309 9659 -12188 -19241 10751 21332 -3409 -13014
323 -13014 -3252 -6346 -4925 17666 20060 -11329 -24622 -5521 6423 6524 12360 3186 -24123 -21170
337 -21170 17015 29727 3183 -15326 -15392 -16011 -1697 29688 28680 -12710 -32283 -8366 12873
350 12873 15509 17731 5069 -29231 -34700 9553 42836 24970 -7238 -22730 -27998 -12310 28289
363 28289 43507 2537 -39554 -29349 6179 26153 28611 11291 -27548 -46551 -11738 35108
375 35108 36812 4678 -20814 -29693 -18768 16066 41269 16475 -31809 -42140 -8771 25842
387 25842 35851 18596 -19297 -45561 -23846 26036 44169 13462 -25569 -36256 -15610 20514
399 20514 42931 23357 -24284 -48454 -22264 23783 44634 25675 -15303 -43819 -30375 16663
411A6663L2898j7864n0114l0311J7808M7382L3077j2540m8556l8239J1658N0151
423A2013L6982j2073m5895l5431O010M2400M0925k147m6540m3742M314M5461M0605
436D2882k07m0239m6046o774M4754N1609K666m6848m5628l118L8577M6778J1727
449E0133l9993n3612q710M4588M8853P792l5472m7788j9182L2392N6357K1099
461E6457l6633n3078j6940L1327M9740K2857k9364n6312k5136L3217N6256K4011
473E6402k8592n2677k7708K3986N1795K7327k3403m9769k8152K1572N2570L1681
485E5032k2888n4104l1828J7112M8386L8138q632n2353m2531J5910N4723L2285
497D9250j7158m4809l6569L881N0988N1112q351n7650l9881J0761L8331L5483
$$ plain form
411 16663 49561 31697 -18417 -48728 -30920 16462 49539 36999 -11557 -49796 -38138 12013
423 12013 48995 36922 -8973 -44404 -38394 4006 44931 42784 -3756 -47498 -43184 2277 42882
436 42882 42675 2436 -43610 -50384 -5630 45979 48645 1797 -43831 -46949 -8372 38406 50133
449 50133 10140 -43472 -52182 -7594 41259 49051 13579 -34209 -53391 -20999 35358 56457
461 56457 19824 -33254 -50194 -18867 30873 53730 24366 -31946 -57082 -23865 32391 56402
473 56402 27810 -24867 -52575 -28589 23206 50533 27130 -22639 -50791 -29219 23351 55032
485 55032 32144 -21960 -53788 -36676 11710 49848 41216 -11137 -53668 -37758 16965 49250
497 49250 32092 -12717 -49286 -45405 5583 56695 48344 -9306 -49187 -38426 -95 35388
509C5388Q111l7183n2714k612N5676M4867j1005m1244l5624j1980L0682N8555
521D0917J8480n1097n4237O149M1802K9354O564k2017n0102k5156M5467O4353
533E0477K596m8084l5527p146J3602M0418L6821k4981o5913j8224M7431M3998
545C5468L206j9348l4622l6668J0421O3134L7383l5055n1084r323J9380K4244
557G136K5968N32m5511m1007K2276N4531J8159k1981k6629k0689n524K9948M1831
570C9040m766m9260k6471K4564L5376J2587p841k5399l3438k833M4580M0806j5466
583C1479m6857j9583J6328K5014K1562O229l1194m7889j028N5044M0151j6975
595C2281l6649k1614r648J4956M8941K6786m4646n8045P367M5012J9549J743k112
$$ plain form
509 35388 43499 6316 -46398 -49010 6666 51533 40528 -716 -36340 -48320 -17638 40917
521 40917 59397 8300 -45937 -39788 2014 31368 37932 15915 -34187 -59343 -13876 50477
533 50477 53073 4989 -30538 -37684 -24082 16336 53157 28176 -37737 -55961 -8530 35468
545 35468 38674 19326 -15296 -51964 -41543 21591 58974 23919 -27165 -36488 -17108 7136
557 7136 33104 33636 -11875 -52882 -30606 23925 42084 20103 -6526 -27215 -32739 -2791 39040
570 39040 34274 -14986 -41457 -16893 18483 31070 23229 -2170 -35608 -38441 6139 46945 31479
583 31479 -15378 -34961 -18633 6381 27943 34172 2978 -44911 -45939 9105 49256 32281
595 32281 -4368 -25982 -35630 -20674 28267 55053 10407 -47638 -40271 4741 24290 26033 23921
608B3921l4668m3869K1322O6436J3332m3226k1471N101p104R586M3732N627n6658
621a7939k7452L9213K7781j2850p61N867k9440j9516M0118L3787l1515l3142J7433
634h416J6910r743P465J6785k4902l3621K2360M2232n817k9677m576L053n420
647a3367J5332K9591q795m3867j6276K8556K8836L455j0304j7013k1611l672L0482
660A347L4452o679m0583k1839J5484K1264J0116J0123n474l7930k4159L4812M2683
673C3617j1307k7918K170l751k1303K0640M9140j3143n6616K115L9966r129k0091
686a5610L2364J3941n1329j6398N4710J2559m8405K288M3366k0380m1063L3731
698b26L5724m3073k6208N1011J6589n3869p449M7921p895l9388K8741L7593m3841
$$ plain form
608 23921 -10747 -54616 -33294 33142 46474 3248 -18223 -13122 -20226 -10640 33092 38719 -17939
621 -17939 -45391 -6178 21603 8753 7992 13859 -15581 -35097 5021 38808 7293 -25849 -8416
634 -8416 8494 -1249 6216 23001 -1901 -35522 -13162 29070 23253 -6424 -11000 -7947 -13367
647 -13367 1965 31556 22761 -21106 -37382 -8826 20010 23465 13161 -3852 -25463 -29135 1347
660 1347 35799 29120 -11463 -33302 -17818 3446 13562 23685 18211 -19719 -43878 -9066 33617
673 33617 22310 -5608 -3438 -7189 -28492 -7852 41288 28145 -28471 -26356 13610 4481 -15610
686 -15610 16754 30695 -20634 -37032 17678 30237 -18168 -15880 27486 7106 -33957 -226
698 -226 35498 -7575 -33783 17228 33817 -20052 -27501 20420 12525 -26863 1878 39471 -4370
711d370m0834M3291L5410l3327j4752L0283j0095m1222J9838N1340j0990m2355
723a7783K756J7287j2122j57L1297M864l6656j8240K0740J8017r79p89o30j3724
737f119j3883Q438K3702Q951j5573j5386K519M275l743Q715J8792p926k8942n73
751a6753K3363o43j2118J5739J0440l0432j7554L1202J7283k4007k473K4137j5382
764B802l4414K0967L8789j6604k7019J8186P471l2353K389M5512j08m2797L10
777a6869K7172j3811j5738L2705J6856m0208j9895L2569J1214k3333P581K4956
789B3199k0678l1624K0288K9691j5435j6732J8126N136k6037k596K8666M230k2587
802f353N3J6366r666j8246J4531K3617r889k0958N945J0177j3261m998K5858J1734
$$ plain form
711 -4370 -45204 -1913 33497 170 -14582 15701 5606 -35616 -15778 35562 24572 -17783
723 -17783 -15027 2260 -9862 -10019 21278 26142 -10514 -28754 -8014 10003 9024 8235 7605 -6119
737 -6119 -20002 -11564 12138 21089 5516 -9870 -7351 -3076 -6819 1896 20688 12762 -16180 -16753
751 -16753 6610 5967 -6151 9588 20028 -10404 -27958 3244 20527 -3480 -5953 18184 2802
764 2802 -31612 -10645 28144 11540 -15479 2707 10178 -22175 -19786 25726 25618 -17179 -16869
777 -16869 10303 -3508 -19246 13459 30315 -9893 -29788 2781 13995 -9338 -1757 23199
789 23199 2521 -29103 -8815 20876 5441 -11291 6835 11971 -14066 -16662 12004 16234 -6353
802 -6353 -6300 10066 400 -17846 -3315 20302 10413 -10545 -4600 5577 -7684 -12682 13176 24910
816B4910k9066j9224K0264J3040j4117M494K2127j6878l8227J3014M2163l659
828A8841k6711Q844P595l0470m801M8006J4082m4650j5508K8744k154k0158K6935
841H595K7162l8626l5900L1917K9108k2364o552K5807j2808l7104J7193M0389
853B6817j3238k9558J4131J3848k1713l615K8635N07k7834J647K0960o452j4512
866a0377J0296R592j0149l334R501k874j1044K388R451L360l88n997j0860Q00
880i635J3045M806l408K59q317j6560Q559K8938J230k3691l641O438j1569L170
894a0376L3117K970m0610j1410K8985M273j3088J9156J1028m0591k0805M3190
906E839K4154l0760q414K2547j7212k7667L4302L6458l4860l3435K8682J5451
$$ plain form
816 24910 -4156 -23380 -3116 9924 -4193 301 22428 5550 -32677 -19663 22500 18841
828 18841 -7870 974 8569 -21901 -26702 21304 35386 -9264 -24772 3972 1818 -18340 8595
841 8595 35757 -2869 -38769 -6852 22256 -108 -6660 19147 6339 -30765 -13572 26817
853 26817 13579 -15979 -1848 12000 -9713 -13328 15307 15814 -12020 -10373 10587 4135 -10377
866 -10377 -81 9511 -638 -3972 5529 2655 -8389 -6001 3450 6810 6422 425 -10435 -9635
880 -9635 3410 8216 4808 5067 -3250 -19810 -11251 17687 18917 -4774 -8415 -1977 -13546 -10376
894 -10376 22741 25711 -14899 -26309 2676 6949 -6139 13017 24045 -16546 -37351 5839
906 5839 29993 -767 -9181 13366 -3846 -31513 2789 39247 4387 -29048 -366 15085
918A5085k9016O376L7417j9228m3565K1794L8480k2418k3755K7089P398l4795
930a9138M090L9765j0651l8090J4413K9417j8511j6906K4151M077l0603L900L4099
943B0013o194k9792O959J7403j2354m443K2340q95k8974j251K4466K797j0614
956e39M614j056j7557J812K4115M677j6686n501K358m137N769J6755k352j9787
970g515m457R998L227L273P837p745j8371K735J7502J810o909K391l754j3037
984a3015O418K1090k726j9702J23J0199m967j381J4833j265k1936j025K1258J733
998I637j4218K758O239j2132l267K0731N595k1637p362J4985K498p620Q150O067
1012A0424j7618r826J9424J2798j2952p824O461l968p202J3413J3743j3568j6335
$$ plain form
918 15085 -13931 -7555 29862 10634 -32931 -11137 27343 4925 -18830 8259 15657 -19138
930 -19138 -15048 24717 14066 -24024 -9611 19806 1295 -15611 8540 12617 -17986 -14086 20013
943 20013 13819 -15973 -9014 8389 -3965 -8408 13932 13037 -15937 -17188 7278 10075 -539
956 -539 4075 3019 -14538 -12726 11389 16066 -620 -6121 -3763 -7900 -2131 14624 12272 -7515
970 -7515 -11972 -1974 1253 4526 12363 4618 -13753 -11018 6484 8294 1385 3776 22 -13015
984 -13015 -6597 14493 11767 -7935 -7812 2387 -2580 -3961 10872 9607 -12329 -13354 7904 9637
998 9637 -4581 -1823 4416 -7716 -10983 9748 15343 -6294 -13656 1329 3827 -3793 4357 10424
1012 10424 -7194 -17020 2404 15202 2250 -5574 887 -3081 -10283 3130 16873 3305 -13030
1025a3030P642J0193l975Q08P498q046j4619P188J6831j815j0587M38J008n899
1039f365L839J2427k480j4069j160R432J371k610L374j443r645j03J1875L202
1053G645q373l449K829q80L76O634P98r371m494O690N497q55r59k136n556j52
1069e756Q479M478n645n202M59Q19J990N626Q10q020n044M815N509rn63j277n209
1086c740j968P366N765m293o079q8J339J031M467K557o423o864L325O923N27k072
1102A773j017l700l141N157P501j862p269j774J696P47L563M350l775q519k0P117
1118H27K640j703j70k364n087J503Q269J895o248k648J992m76L31M906P90o696
1134b239k627N457K453k836K91J646l520k090N297K981n034k983L529J479k120
$$ plain form
1025 -13030 -5388 4805 830 1638 9136 1090 -13529 -6341 10490 8675 -1912 -1474 -466 -6365
1039 -6365 -2526 9901 7421 -6648 -7808 1624 2995 385 3759 2316 -7329 -7432 4443 7645
1053 7645 -728 -4177 -1348 -2228 -1852 4782 5580 -3791 -8285 -1595 3902 3047 2088 -48 -5604 -5756
1069 -5756 2723 7201 1556 -3646 -3187 -2368 -378 5248 6058 -1962 -7006 -2191 3318 3309 2746 1469 -3740
1086 -3740 -5708 1658 7423 3130 -2949 -3037 -1698 -667 3800 6357 -66 -6930 -3605 3318 3845 1773
1102 1773 756 -2944 -6085 -928 6573 4711 -2558 -4332 -2636 -1889 1674 6024 2249 -6270 -6290 827
1118 827 3467 1764 1594 -770 -5857 -4354 3915 5810 -438 -3086 -1094 -1570 -1239 3667 4457 -2239
1134 -2239 -4866 591 3044 208 499 2145 -1375 -3465 1832 4813 -221 -3204 325 1804 -316
1149c16J459J556m171k691M950L557l516k760J313k84j230L646K929m358m738
1164d654K139L611O5q9O72l058l446K599N066K59l370k002j27O00K175K237o43
1181B034l195k314J407L533J585k105k023J4j4N4K903J969l602l946K670L671
1197B641j831j081K588j361m526K398N619k415m925K828K808m256r10N885o67
1212B795o672J741O379l506n258N073L615o429j874P339k01p799J897P366l228
1227A238n863M472L560o070j376P267K84p027M41N268j736k899L818J361m594
1242a856q61L816P9j567J681k08l027J052K799j695q98L113j053m603K574M493
1258C839l900k659N626N42p638J185P990l302o291O511L943j0584k325J2762M70
$$ plain form
1149 -316 1143 2699 -1472 -4163 787 4344 828 -1932 -619 -903 -2133 1513 4442 84 -4654
1164 -4654 -2515 1096 1161 1072 1744 -1314 -4760 -2161 2905 3164 -206 -2208 -2335 -1735 440 2677 2034
1181 2034 -1161 -3475 -2068 1465 3050 945 -1078 -1064 -1078 -1024 1879 3848 246 -3700 -1030 2641
1197 2641 810 -271 2317 956 -3570 -1172 4447 2032 -2893 -65 2743 -1513 -2423 3462 2795
1212 2795 -3877 -2136 4243 737 -4521 552 4167 -2262 -4136 3203 3002 -4797 -2900 4466 1238
1227 1238 -4625 -153 3407 -2663 -4039 3228 3512 -3515 -3074 2194 458 -2441 1377 2738 -1856
1242 -1856 -2717 1099 1178 -389 1292 1084 -1943 -891 1908 213 -685 2428 1375 -3228 -654 3839
1258 3839 -61 -2720 2906 3448 -4190 -3005 4985 1683 -4608 1903 5846 -4738 -7063 5699 6169
1273F169j2102L319R952r336q712J4513Q090j6647n431J5689o44j4986Q396J5880
1287A4150j4002j6176J5821J2619j6127m761J8105l226k1353Q132K2162j0091
1299E253j7839J2560J0445j7067l789K1621M9k2323K821J8544p185j3166J2980
1312B904R052j7270n963J8262K353j6642K306J3813o585j0996R626P654j1429
1325b915m455J1977J930j0732l19P073k255l118N669J667p402k922M464K823J363
1340B848R77m612n624K461N372J150J534N3r052o238J0085J0187n355n354L357
1355A789m781q439J1008J5860r183j6385N585Q154p892J333J6464m293k2608J997
1369a1391K0077k374j2094R227O657j8083n988K1869N683k0220j395J6956n813
$$ plain form
1273 6169 -5933 -2614 7338 -1998 -10710 3803 11893 -4754 -10185 5504 4860 -10126 -1730 14150
1287 14150 148 -16028 -207 12412 -3715 -8476 9629 6403 -14950 -6818 15344 5253
1299 5253 -12586 -26 10419 -6648 -10437 11184 11233 -11090 -8269 10275 3090 -10076 2904
1312 2904 11956 -5314 -11277 6985 9338 -7304 -4998 8815 2230 -8766 860 8514 -2915
1325 -2915 -7370 4607 6537 -4195 -4514 2559 304 -2814 2855 4522 -2880 -5802 -1338 1485 2848
1340 2848 3825 -787 -6411 -3950 1422 2572 4106 4159 -4893 -11131 -1046 9141 3786 -1568 1789
1355 1789 -2992 -11431 -423 15437 6254 -10131 -4546 3608 -4284 -2951 13513 9220 -13388 -11391
1369 -11391 8686 6312 -5782 3445 10102 -7981 -13969 7900 13583 -6637 -8032 8924 3111
1382C111j5523J2109J4332j6134j1654J8638P873k0341m367J9443j19j6483P074
1395b041J4926j4172j6493J6375J6942j2871j0974J0240k6j3835P296K1201n516
1408A1052k2252J80J3063j451j899J2041l08k1309o341J9270J0588q816l577K553
1422B794r128p307J5087J5888r646j6343J461P000j593K562R534l277j5762k575
1436a1305J3194N820n831k158J572m439l088P149O429n734o816L012M504k397
1450h8j732L075k48m534J722O767k042r115N9R373K159n993k80K618o069m268
1466h596J1665J0782j0728j4437M962R990k801l23R386m351j9505J08K2077O385
1480A4614j4199l941M820p943m560J8776J2055j8771j6352J0718R030o085M625
$$ plain form
1382 3111 -12412 -303 14029 -2105 -13759 4879 12752 -7589 -11956 7487 7368 -9115 -2041
1395 -2041 12885 -1287 -17780 -1405 15537 2666 -8308 1932 1906 -11929 -4633 16568 11052
1408 11052 -11200 -11020 2043 592 -1307 10734 10426 -10883 -17224 2046 12634 3818 241 2794
1422 2794 -6334 -13641 1446 17334 7688 -8655 -7194 -194 -1787 775 10309 7032 -8730 -11305
1436 -11305 1889 7709 1878 -280 1292 -3147 -6235 914 7343 1609 -5207 -2195 2309 -88
1450 -88 -1820 1255 1007 -3527 -1805 4962 2920 -6195 -6136 3237 5396 -597 -877 1741 -4328 -8596
1466 -8596 3069 13851 3123 -11314 -6352 3638 837 514 9900 5549 -13956 -13848 8229 14614
1480 14614 415 -3526 1294 -6649 -11209 7567 19622 851 -15501 -4783 4247 -1838 2787
1493B787J1514j2825k0867J0511K1957m969j2960O571K268j5642J215K3082J641
1506A4283k2446l162J5609j736r886J0016R255j5335j0506J5404R283j3148m742
1519g111J1520m86j0843N199J0660q500j0798R851J0345q374p498O547J686p315
1533e117L808J1634m451j4856J84J1828K750l862J269q49r181k785J1873R569
1547A1814o086j0289j864K549K333N536N343n317j2012k420R407P079q74k480
1561B719l328o538j143J0390P945o253q964R46K952j433L339P408m002j2008P63
1576g207J1178J007p224J626M710n824m535Q595N269r155n259Q590L863p298j283
1591b947O258k240o213N542P570o721q676N235O532l710j316N498l047j0014L044
$$ plain form
1493 2787 14301 1476 -19391 -8880 13077 8108 -4852 1719 3987 -11655 -10440 12642 14283
1506 14283 -8163 -11325 4284 2548 -7338 2678 11933 -3402 -13908 1496 10779 -2369 -7111
1519 -7111 4409 3923 -6920 -1721 8939 439 -10359 -508 9837 1463 -6035 512 2198 -5117
1533 -5117 -1309 10325 5874 -8982 -8798 3030 5780 1918 3187 2338 -6843 -9628 2245 11814
1547 11814 5728 -4561 -6425 -3876 -1543 3993 9336 4019 -7993 -10413 -1006 6073 5199 2719
1561 2719 -609 -7147 -8290 2100 10045 3792 -5172 -4226 -1274 -2707 632 8040 4038 -7970 -7207
1576 -7207 3971 4978 -2246 -620 4090 -1734 -6269 2326 7595 -1560 -6819 1771 5634 -1664 -2947
1591 -2947 3311 1071 -5142 400 7970 1249 -7427 -2192 4340 630 -686 4812 1765 -8249 -5205
1606e205J2062l53r148J8L473m457q39J0184L114j1888o011Q011M430l799J565
1621A157L930o667p580O852R277l559o404K087R12m240K374Q032j735q965o0O174
1637A585j18k555L138J103n960j875O665K761m978k052L106n6k420K104L010k796
1653F62l660J976L451r52k266L55O57p93J83J705K09k292j392J637K059n95j541
1670e97q0J63p27O06K434l03l353p42L026P50j827N29J326k466j879L625K810
1687C295l434k310K744O54k718J267L667k170m195K293L663k461k141L211Q10
1702B175m103PM468o22l973J568L188k661k401L215J544l406n26L513o36l641
1718b291J284L239j555k295J825R54k633r8L251m2l005j43J750m53m42J581M9
$$ plain form
1606 -5205 6857 6504 -2644 -2626 847 -3610 -4449 5735 8849 -3039 -9050 -1039 3391 -408 1157
1621 1157 5087 -1580 -9160 -2308 6969 3410 -2994 -907 5 -4235 -1861 6171 4436 -4529 -4589 1585
1637 1585 1467 -1088 2050 3153 -2807 -4682 1983 4744 -234 -2286 820 764 -1656 448 3458 662
1653 662 -2998 -1022 2429 1477 -789 -434 223 -570 -387 1318 1527 -765 -2157 -520 1539 944 -597
1670 -597 -677 -514 -1241 -635 1799 1496 -1857 -2599 427 1177 -650 -121 1205 -1261 -3140 485 3295
1687 3295 -139 -2449 295 949 -1769 -502 3165 995 -3200 -907 2756 295 -1846 1365 2175
1702 2175 -1928 -1921 2547 1925 -2048 -480 2708 47 -2354 861 2405 -1001 -1527 1986 1350 -2291
1718 -2291 -1007 2232 677 -1618 207 1161 -1472 -1570 1681 1639 -1366 -1509 241 -212 -654 927 976
1735I76k401m72J927Q39o35j18o14r80O03J897K25j146q22l01N3J616J273j214
1753G06j802J48Q11M43J094L17k129j722J705K095l85p77l0j280r58K123K281
1770B640j466k565L89J040j73R97J250k242k664J478K840k95j258%r67j349K157
1787a88K919j397l341j67J585O21J109J063k294l252J011L420J128j071j145j940
1803a939j102K698L603m24l293j791J00J264K811J769k456l770j52K590J900Q47
1819B655p42l087k225K149L752L85j927j599j429P8L059K327k027l257k63J470
1835f81J310J594j31l484k412K448L445m6j469j175k093k74M070L114k923m034
1851b741k24J470J458K935R29m741m260K392M667J146r71j269l541j961M426N315
$$ plain form
1735 976 -1425 -1897 30 869 234 116 -498 -1478 -875 1022 1247 101 -721 -1022 -969 647 1920 706
1753 706 -1096 -948 -137 306 1400 1717 -412 -2134 -429 1666 1281 504 474 -806 -1764 359 2640
1770 2640 1174 -1391 -1002 38 -135 862 2112 -130 -2794 -1316 1524 1229 -29 -29 -996 -2345 -188
1787 -188 2731 1334 -2007 -2174 -589 32 1141 2204 -90 -3342 -2331 1089 2217 1146 1 -1939
1803 -1939 -3041 -343 3260 2836 -457 -2248 -2148 -884 1927 3696 1240 -2530 -2682 -92 1808 2655
1819 2655 1913 -1174 -3399 -1250 2502 2887 960 -639 -2068 -1990 1069 3396 1369 -1888 -2151 -681
1835 -681 629 2223 2092 -1392 -3804 -1356 2089 2043 574 -601 -2694 -2968 1102 4216 1293 -2741
1851 -2741 -2965 -1495 -37 2898 3827 -914 -5174 -2782 1885 3031 2060 791 -2750 -4711 -285 5030
1867E030j327m483j691l4Q14L841L175l526n501K74L805J596M60P6l389l479K487
1884a872N064L31l213j696o94l4K933K944k110m227m33K323J772J371m70l803
1900a814k391K823L680Oj344j614k797LN199L050l704l944N91P91Q57L804J395
1917D591n823m543M011M683q03o97K51m063k999N743N972l677n243R84R21j210
1933a902L741M460n129p327L015O305p54j758J685k823n523L687Q469j362p345
1948b561o67K393j016J738N584j867q483j297O604K897j769k6j623m766L09P000
1964B450L149m221m082m90P20K316L883J58m637l482J289L561K680j35l209l021
1980c071N92K545K199R64j739m292r24M444K918k311j809M61j578o87M548K572
$$ plain form
1867 5030 3703 -780 -2471 -2505 -1691 2150 5325 1799 -3702 -3428 377 1973 2433 2509 -880 -4359 -1872
1884 -1872 3192 3523 310 -1386 -2080 -2114 819 3763 1653 -2574 -3007 -684 1088 2459 1989 -1814
1900 -1814 -4205 -1382 2298 2304 960 -654 -3451 -3448 1751 4801 1097 -2847 -2256 -1465 -608 3196 4591
1917 4591 -1232 -5775 -1764 2919 2116 1419 1670 -2393 -5392 351 6323 2646 -2597 -1613 -692 -1902
1933 -1902 1839 6299 1170 -6157 -3142 3163 2409 651 2336 -487 -6010 -2323 6146 4784 -2561
1948 -2561 -3228 -835 -1851 -113 5471 3604 -4879 -6176 428 3325 1556 1530 -93 -4859 -4550 2450
1964 2450 5599 1378 -2704 -3194 -2474 -158 3725 3883 -754 -4236 -2947 614 3294 3159 -50 -3071
1980 -3071 -2479 66 2265 3229 1490 -2802 -3726 718 3636 1325 -484 -23 -1601 -2288 2260 4832
1996D832n412m060M023L153k405R8K470l714m419N009O260l995n736K375K092
2011E71k674K082N494l635q183J955P475k39l360J551o48n487J172Q550J236p289
2027a429k729K998L51K7M424J204o832m367M849N181j022j814j87k383k526L643
2043f12N790r28n997k011K818J613j2J892M05m647l440M511N209k437m084J353
2059e77J091k963J053N505j062o940K46O266o00m490K381K898m904k204O935K033
2075D668p384j734O471J97m915K663M155n648m359P015M808o184l434M540k1m415
2091c577L681O084m751o984L231N294k114j233L324j656n948J409O826M19m399
2106c94o12Q86j785K17M193J314l887k874J158K121P28R5k66j064j505n53K402
$$ plain form
1996 4832 -580 -4640 -617 2536 131 229 2699 -1015 -5434 -425 5835 1840 -3896 -1521 571
2011 571 -2103 -21 5473 1838 -6345 -4390 3085 2846 -514 1037 389 -5098 -3926 4624 5860 -1429
2027 -1429 -4158 -1160 -809 -782 3642 4846 -1986 -6353 -1504 3677 2655 841 654 -1729 -4255 -612
2043 -612 5178 4250 -1747 -3758 -940 673 661 2553 2958 -1689 -5129 -618 4591 2154 -1930 -577
2059 -577 514 -2449 -1396 4109 3047 -3893 -3647 2619 2019 -2471 -90 2808 -2096 -4300 2635 4668
2075 4668 -2716 -4450 2021 2218 -2697 -34 4121 -1527 -5886 1129 5937 -247 -3681 859 838 -3577
2091 -3577 104 6188 1437 -5547 -2316 2978 864 -369 2955 1299 -4649 -3240 3586 4005 -394
2106 -394 -1006 -120 -1905 -1688 2505 3819 -68 -2942 -1784 337 1065 1160 894 -170 -1675 -2228 174
$$ [...]
8191a81
##END NTUPLES=NMR FID
##END=
