##TITLE=1H_2PDM2805
 CDCl3, 8 sc, 
 28.5.2019
##JCAMPDX= 6.0         $$ Bruker NMR JCAMP-DX V2.0
##DATA TYPE= NMR FID
##DATA CLASS= NTUPLES
##ORIGIN= UXNMR, Bruker Analytische Messtechnik GmbH
##OWNER= root
$$ XWIN-NMR		Version 3.5
$$ Tue May 28 16:30:31 2019 Russian Standard Time (UT+4h)  she@DPX200
##.OBSERVE FREQUENCY= 200.13155
##.OBSERVE NUCLEUS= ^1H
##.DELAY= (6, 6)
##.ACQUISITION MODE= SIMULTANEOUS
##.ACQUISITION SCHEME= undefined
##.AVERAGES= 8
##.DIGITISER RES= 18
##SPECTROMETER/DATA SYSTEM= spect
##.PULSE SEQUENCE= zg30
##.SOLVENT NAME= CDCl3
##.SHIFT REFERENCE= (INTERNAL, CDCl3, 0, 15.7039)
##AUDIT TRAIL= $$ (NUMBER, WHEN, WHO, WHERE, WHAT)
$$ ##TITLE= Audit trail, XWIN-NMR		Version 3.5
$$ ##JCAMPDX= 5.01
$$ ##ORIGIN= Bruker BioSpin GmbH
$$ ##OWNER= she
$$ F:/spectra/data/she/nmr/H-F/1/audita.txt
$$ ##AUDIT TRAIL=  $$ (NUMBER, WHEN, WHO, WHERE, WHAT)
(   1,<2019-05-28 16:29:28.32 +0400>,<she>,<DPX200>,
      <created by zg, POWCHK disabled, PULCHK disabled
       configuration hash MD5:
       00 E9 B6 7A A2 85 ED C7 34 08 36 98 17 FE 4E 26
       data hash MD5: 16K
       62 31 56 BD 7B 65 93 DA AC DE 05 4F 27 A7 0E 7A>)
$$ ##END=
$$ 
$$ hash MD5
$$ 4B 3B 06 7D 59 17 FD 28 F6 1B CB DD 5F AD 5A C0
##$RELAX= 
##$RELAX= 
##$RELAX= 
##$RELAX= 
##$RELAX= 
##$RELAX= 
$$ Bruker specific parameters
$$ --------------------------
##$DU= <F:/spectra>
##$EXPNO= 1
##$NAME= <H-F>
##$PROCNO= 1
##$TYPE= <nmr>
##$USER= <she>
##$AMP= (0..31)
100 100 100 100 100 100 100 100 100 100 100 100 100 100 100 100 100 100 
100 100 100 100 100 100 100 100 100 100 100 100 100 100 
##$AQSEQ= 0
##$AQ_mod= 1
##$AUNM= <au_zg>
##$AUTOPOS= <>
##$BF1= 200.13
##$BF2= 200.13
##$BF3= 200.13
##$BF4= 200.13
##$BF5= 200.13
##$BF6= 200.13
##$BF7= 200.13
##$BF8= 200.13
##$BYTORDA= 1
##$CFDGTYP= 0
##$CFRGTYP= 5
##$CHEMSTR= <none>
##$CNST= (0..31)
1 1 145 1 1 1 1 1 1 1 1 1 1 1 1 1 1 1 1 1 1 1 1 1 1 1 1 1 1 1 1 1 
##$CPDPRG= <>
##$CPDPRG1= <>
##$CPDPRG2= <>
##$CPDPRG3= <>
##$CPDPRG4= <mlev>
##$CPDPRG5= <mlev>
##$CPDPRG6= <mlev>
##$CPDPRG7= <mlev>
##$CPDPRG8= <mlev>
##$CPDPRGB= <>
##$CPDPRGT= <>
##$D= (0..31)
0 1.2 0 0 0 0 0 0 0 0 0 0.03 0 0 0 0 0 0 0 0 0 0 0 0 0 0 0 0 0 0 0 0 
##$DATE= 1559046567
##$DBL= (0..7)
120 120 120 120 120 120 120 120 
##$DBP= (0..7)
150 150 150 150 150 150 150 150 
##$DBP07= 0
##$DBPNAM0= <>
##$DBPNAM1= <>
##$DBPNAM2= <>
##$DBPNAM3= <>
##$DBPNAM4= <>
##$DBPNAM5= <>
##$DBPNAM6= <>
##$DBPNAM7= <>
##$DBPOAL= (0..7)
0.5 0.5 0.5 0.5 0.5 0.5 0.5 0.5 
##$DBPOFFS= (0..7)
0 0 0 0 0 0 0 0 
##$DE= 6
##$DECBNUC= <off>
##$DECIM= 24
##$DECNUC= <off>
##$DECSTAT= 4
##$DIGMOD= 1
##$DIGTYP= 9
##$DL= (0..7)
0 120 120 120 120 120 120 120 
##$DP= (0..7)
150 150 150 150 150 150 150 150 
##$DP07= 0
##$DPNAME0= <>
##$DPNAME1= <>
##$DPNAME2= <>
##$DPNAME3= <>
##$DPNAME4= <>
##$DPNAME5= <>
##$DPNAME6= <>
##$DPNAME7= <>
##$DPOAL= (0..7)
0.5 0.5 0.5 0.5 0.5 0.5 0.5 0.5 
##$DPOFFS= (0..7)
0 0 0 0 0 0 0 0 
##$DQDMODE= 0
##$DR= 18
##$DS= 0
##$DSLIST= <SSSSSSSSSSSSSSS>
##$DSPFIRM= 0
$$ [...]
##$SUBNAM2= <"">
##$SUBNAM3= <"">
##$SUBNAM4= <"">
##$SUBNAM5= <"">
##$SUBNAM6= <"">
##$SUBNAM7= <"">
##$SUBNAM8= <"">
##$SUBNAM9= <"">
##$SW= 24.9336996594482
##$SWIBOX= (0..15)
0 0 2 0 0 0 0 0 0 0 0 0 0 0 0 0 
##$SW_h= 4990.01996007984
##$TD= 16384
##$TD0= 1
##$TE= 0
##$TE2= 300
##$TE3= 300
##$TEG= 300
##$TL= (0..7)
0 120 120 120 120 120 120 120 
##$TP= (0..7)
150 150 150 150 150 150 150 150 
##$TP07= 0
##$TPNAME0= <>
##$TPNAME1= <>
##$TPNAME2= <>
##$TPNAME3= <>
##$TPNAME4= <>
##$TPNAME5= <>
##$TPNAME6= <>
##$TPNAME7= <>
##$TPOAL= (0..7)
0.5 0.5 0.5 0.5 0.5 0.5 0.5 0.5 
##$TPOFFS= (0..7)
0 0 0 0 0 0 0 0 
##$TUNHIN= 0
##$TUNHOUT= 0
##$TUNXOUT= 0
##$USERA1= <user>
##$USERA2= <user>
##$USERA3= <user>
##$USERA4= <user>
##$USERA5= <user>
##$V9= 5
##$VALIST= <valist>
##$VCLIST= <CCCCCCCCCCCCCCC>
##$VD= 0
##$VDLIST= <DDDDDDDDDDDDDDD>
##$VPLIST= <PPPPPPPPPPPPPPP>
##$VTLIST= <TTTTTTTTTTTTTTT>
##$WBST= 1024
##$WBSW= 4
##$XGAIN= (0..3)
0 0 0 0 
##$XL= 0
##$YL= 0
##$YMAX_a= 610017
##$YMIN_a= -426256
##$ZGOPTNS= <>
##$ZL1= 120
##$ZL2= 120
##$ZL3= 120
##$ZL4= 120
##$ABSF1= 10
##$ABSF2= 0
##$ABSG= 5
##$ABSL= 3
##$ALPHA= 0
##$AQORDER= 0
##$ASSFAC= 0
##$ASSFACI= 0
##$ASSFACX= 0
##$ASSWID= 0
##$AUNMP= <proc_1d>
##$AZFE= 0.1
##$AZFW= 0.1
##$BCFW= 1
##$BC_mod= 2
##$BYTORDP= 1
##$COROFFS= 0
##$CY= 11.3945322036743
##$DATMOD= 1
##$DC= 2
##$DFILT= <>
##$DTYPP= 0
##$F1P= 18.9103706918063
##$F2P= -1.10871071338519
##$FCOR= 0.5
##$FTSIZE= 0
##$FT_mod= 4
##$GAMMA= 1
##$GB= 0.15
##$INTBC= 1
##$INTSCL= 1
##$ISEN= 128
##$LB= 0.24
##$LEV0= 0
##$LPBIN= 0
##$MAXI= 10000
##$MC2= 0
##$MEAN= 0
##$ME_mod= 0
##$MI= 1.114404
##$NCOEF= 0
##$NC_proc= 0
##$NLEV= 6
##$NOISF1= 3.799351
##$NOISF2= 2.8
##$NSP= 1
##$NTH_PI= 0
##$NZP= 0
##$OFFSET= 15.70392
##$PC= 1
##$PHC0= -8654.656
##$PHC1= 13.60025
##$PH_mod= 1
##$PKNL= yes
##$PPARMOD= 0
##$PSCAL= 0
##$PSIGN= 0
##$REVERSE= no
##$SF= 200.130013532006
##$SI= 16384
##$SIGF1= 3
##$SIGF2= 2
##$SINO= 400
##$SIOLD= 16384
##$SREGLST= <1H.CDCl3>
##$SSB= 0
##$STSI= 0
##$STSR= 0
##$SW_p= 3612.71676300578
##$SYMM= 0
##$S_DEV= 0
##$TDeff= 0
##$TDoff= 0
##$TI= <>
##$TILT= no
##$TM1= 0
##$TM2= 0
##$TOPLEV= 0
##$USERP1= <user>
##$USERP2= <user>
##$USERP3= <user>
##$USERP4= <user>
##$USERP5= <user>
##$WDW= 1
##$XDIM= 8192
##$YMAX_p= 0
##$YMIN_p= 0
$$ End of Bruker specific parameters
$$ ---------------------------------
##NTUPLES= NMR FID
##VAR_NAME=  TIME,          FID/REAL,        FID/IMAG
##SYMBOL=    X,             R,               I
##VAR_TYPE=  INDEPENDENT,   DEPENDENT,       DEPENDENT
##VAR_FORM=  AFFN,          ASDF,            ASDF
##VAR_DIM=   8192,          8192,            8192
##UNITS=     SECONDS,       ARBITRARY UNITS, ARBITRARY UNITS
##FACTOR=    0.0002004,     1,               1
##FIRST=     0,             0,               0
##LAST=      1.6414764,     0,               0
##MIN=       0,             -426256,         0
##MAX=       1.6414764,     610017,          0
$$ Real data points
##PAGE= N=1
##DATA TABLE= (X++(R..R)), XYDATA
0 0 0 0 0 8 -8 8 -8 16 -24 32 -40 48 -64 80 -88 112 -136 160 -190 219 -256 304 -351 402 -463 531 -605
27 -605 688 -779 880 -994 1114 -1249 1397 -1560 1738 -1933 2146 -2382 2641 -2926 3238 -3584
43 -3584 3969 -4397 4878 -5420 6035 -6746 7568 -8538 9703 -11129 12929 -15279 18481
56 18481 -23144 30579 -44318 78159 -328097 -265783 560818 198447 -109388 85940 67318
67 67318 -426256 -192578 472442 389873 -266172 -281802 28373 -56038 -137178 238447 312194
78 312194 -130908 -283377 44567 101651 -72204 45166 186847 -92633 -276771 14561
88 14561 239050 55522 -67736 18591 -22817 -125206 17887 160939 8126 -170256 -95338
99 -95338 54412 125104 140753 33566 -158424 -156209 44241 124929 51401 12526 -67589 -211473
111 -211473 -106422 224850 269016 -23385 -151078 -59163 -78903 -75399 163971 239114 -84337
122 -84337 -273143 -53252 100008 29296 103811 196941 -81271 -349174 -96158 238769 131272
133 131272 -44043 38948 -8686 -234400 -93705 299389 241209 -163773 -224505 -5792 4022
144 4022 -35726 148223 190272 -107929 -239214 16571 177868 46475 -29484 10069 -75062
155 -75062 -151920 15284 177043 63003 -87877 -41750 17316 -24902 8012 103422 34523
166 34523 -128774 -108274 52113 93357 18486 -4538 -573 -55353 -68367 41790 119436 24524
178 24524 -109700 -96654 15272 71482 60346 42417 -7335 -93435 -93735 36622 125184 44886
190 44886 -74210 -81753 -28875 8967 64989 106876 28815 -102219 -102084 12211 67254 40410
202 40410 18873 -14213 -79405 -68653 48435 112791 41331 -43930 -54810 -40911 -19027 41940
214 41940 80596 19909 -69311 -69560 3216 54390 50475 14526 -30142 -56700 -38480 16461 60077
227 60077 43479 -21609 -57189 -20357 28489 29053 11867 4449 -24618 -53122 -11431 53830 35139
240 35139 -24885 -18170 12075 -10891 -16217 38185 36129 -45147 -52988 27324 37235 -20037 -4852
253 -4852 36940 -14045 -56908 18609 69408 -8290 -56614 5320 25585 -26798 -4631 59677
265 59677 11443 -69249 -22063 52025 13102 -29329 16022 22676 -45015 -34568 49676 41312
277 41312 -33571 -22744 25202 -5906 -35087 18207 42198 -17427 -36077 15062 18186 -23120
289 -23120 -5494 32450 2519 -32080 -751 21191 -10083 -15076 20406 15073 -20730 -12023 13969
302 13969 9 -11759 12823 17162 -14125 -18016 7450 7505 -4096 9336 12987 -15659 -22687
315 -22687 7987 19779 3140 669 2709 -16536 -19585 14032 28275 260 -16909 -7076 -6520
328 -6520 -6182 19631 29573 -7202 -33613 -10949 12057 7297 8867 13811 -11746 -34838 -6770
341 -6770 30863 21001 -5720 -8781 -11163 -19904 189 32560 20177 -20391 -26396 -2804 7295
354 7295 10428 19880 6837 -27842 -30048 8247 30065 14666 -3204 -11931 -20802 -11610 21424
367 21424 34638 4046 -28402 -26055 -5128 13480 27375 21835 -11502 -36957 -19163 18427
379 18427 32155 17485 -6766 -28597 -31012 -1646 33689 33688 -180 -28943 -29499 -7539 21189
392 21189 34909 15534 -22304 -38531 -16423 18404 33585 19750 -11014 -34186 -26987 6791
404 6791 34002 27476 -4674 -31002 -28680 -197 29420 32660 5178 -27291 -34020 -9313 23031
417 23031 33722 13228 -19769 -34580 -16727 17399 36134 22050 -11745 -34080 -24545 7553
429 7553 32557 27819 -2912 -31455 -30993 -1657 29017 32527 6618 -24643 -33333 -10891 22673
442 22673 35459 14668 -19491 -35352 -19354 12968 33372 22770 -10214 -34171 -25627 6709
454 6709 32052 28228 -957 -29886 -31564 -3746 26783 31156 7440 -22365 -33009 -13812 19618
467 19618 34494 15107 -17093 -30714 -17475 9625 30692 25771 -5623 -32184 -24056 6269
479 6269 25228 21341 2323 -21389 -30414 -6892 28400 32722 3828 -20701 -22507 -10834 9405
492 9405 28693 20098 -16347 -36169 -14843 15990 25252 17693 738 -23729 -31004 -2100 30922
505 30922 26067 -3771 -21335 -20666 -10164 12172 31493 17924 -18819 -32796 -11703 12057 18863
518 18863 14945 1317 -19453 -23272 1656 25836 19179 -4982 -17733 -14943 -5480 8567 19624
531 19624 10971 -12516 -20358 -1375 17513 13851 82 -7394 -12054 -13128 2525 22911 15328
544 15328 -13846 -21514 -712 12258 8196 8143 5265 -16928 -28083 1152 30737 16574 -10529
557 -10529 -10732 -5805 -12542 71 28351 18643 -23568 -30511 1454 14068 5107 12828 16037 -16130
571 -16130 -35522 -1224 30216 10535 -12393 -2899 -2031 -19520 -4492 32564 23519 -18935 -22078
584 -22078 4640 3104 -8801 9969 21472 -9475 -28544 1829 24116 3114 -9472 7545
596 7545 5355 -19182 -12144 18445 14319 -13111 -8397 13221 4408 -13220 -414 14134 -2570
609 -2570 -15974 1983 14056 -4307 -14514 4131 14501 -474 -7171 4925 3343 -14710 -12301
622 -12301 12108 16562 -5018 -12739 1359 3934 -6990 1426 20122 7163 -23787 -19681 10395
635 10395 12887 -3977 4456 16397 -9358 -30711 917 31890 7334 -18522 870 8240 -22058
648 -22058 -16687 32715 32303 -20758 -25743 13270 4575 -25203 6887 42559 -2254 -45761 -4209
661 -4209 32410 -4286 -18352 27967 23724 -40235 -35258 30458 26268 -23975 -4991 32514 -8543
674 -8543 -45282 7489 45695 -3786 -31106 12200 16403 -32051 -19105 38499 23739 -28972
686 -28972 -13320 22099 -4937 -27217 13626 33174 -10608 -28372 6675 13583 -12941 -3380
698 -3380 24522 8017 -22207 -11643 8978 2684 -2344 8930 7822 -7966 -11252 -2138 5045
711 5045 9954 7873 -4756 -9769 -2454 -2648 -4202 12002 19229 -7087 -22599 336 11292 -7279
725 -7279 -962 23706 2542 -34015 -10689 26820 5398 -16584 14153 19496 -30154 -30950 28221
738 28221 29241 -22257 -11840 27261 -6156 -42613 9688 49187 -5696 -37560 12478 21307
750 21307 -32439 -17991 46846 23308 -42773 -17237 32775 -2808 -32820 22008 42758 -24093
762 -24093 -42864 18563 26789 -22099 -7468 37667 3543 -45865 -8640 36229 5019 -20127
774 -20127 12991 17193 -27493 -25584 23748 25715 -11378 -10485 8828 -6626 -20006 7279 26335
787 26335 3744 -16242 -7921 -731 -3599 2913 12748 7036 -7361 -13050 -6489 5892 11164 3437
801 3437 -3569 -1030 -3808 -11598 -906 17744 8723 -12492 -5333 9449 -4453 -14399 9806 20555
815 20555 -7725 -17812 8490 10076 -16480 -6741 25474 11687 -22273 -9882 14443 -3650
827 -3650 -16421 15243 26755 -12305 -28155 4032 14711 -6585 416 22555 -19 -33934
839 -33934 -13783 23165 15218 -5132 3627 4395 -21857 -21237 18047 30278 -1149 -18560 -5992
852 -5992 -3737 -10074 8530 29089 8024 -25962 -20294 6604 9879 2218 9762 8529 -16694 -23928
866 -23928 6527 25381 5596 -10351 -933 -907 -14211 -2559 22263 11247 -17812 -11497 11820
879 11820 5154 -8776 4496 11736 -10521 -16312 11107 17111 -9613 -14178 7751 7416 -7353
892 -7353 3178 14398 -7829 -23784 771 20603 5014 -7035 667 -4588 -16326 1409 25547
905 25547 11962 -15929 -16151 -4001 -1547 7345 20795 8502 -19234 -21399 -190 12759 13821
918 13821 10215 -5170 -22218 -14968 8694 19054 12817 1507 -13671 -21044 -3401 19448 16417
931 16417 -1026 -8269 -11671 -13122 4778 25845 12929 -15970 -15976 158 718 2788 17051 7911
945 7911 -22388 -19759 13131 18227 -1897 -1895 3595 -14134 -17308 15491 26272 -7018 -22218 -461
959 -461 5787 -5191 8330 21239 -7740 -31673 -4334 23079 7967 -5690 4061 -3785 -22693
972 -22693 -2935 30421 16441 -17986 -15795 308 -3593 1365 22725 13632 -22336 -24229 6914
985 6914 16719 5735 5853 1796 -19956 -20475 12031 26859 5649 -10893 -8872 -9491 -5880 14930
999 14930 22790 -1410 -22002 -12844 2586 8172 13389 10843 -9650 -22571 -6521 13763 13585
1012 13585 4388 -3253 -13999 -15432 4189 20649 10584 -7478 -11590 -8948 -3931 10360 18510
1025 18510 1827 -18221 -13321 3137 8849 9654 8631 -5425 -19961 -8974 13842 15780 1570
1038 1570 -5581 -8358 -11372 -351 18609 15491 -7679 -16856 -6211 2577 6778 12776 7057 -12881
1052 -12881 -18769 67 15104 10253 1075 -4542 -12038 -11322 6237 18614 7111 -10011 -11856
1065 -11856 -4894 1418 9769 12804 -469 -16032 -12181 3800 11343 8120 1514 -7556 -13226 -4656
1079 -4656 10872 13660 2004 -8778 -10660 -5411 4597 12870 8616 -5441 -13157 -7215 4016
1092 4016 10730 8959 -582 -10541 -10565 53 10131 10606 2126 -7818 -10816 -3601 7377 10856 4319
1107 4319 -5312 -9920 -5863 3891 10320 6604 -3134 -9000 -6761 981 7954 7833 -413 -8410 -7525
1122 -7525 57 6294 6849 1942 -5734 -8723 -2658 5944 7336 2046 -4063 -6912 -4525 3128 8395
1137 8395 4382 -3857 -6737 -3811 862 5574 6568 9 -7445 -5901 1597 5348 4585 1888 -3328
1152 -3328 -7138 -2471 5732 6241 618 -2479 -3566 -4077 681 7460 4838 -3944 -5522 -902 638
1167 638 1564 5065 2587 -6104 -6384 2437 4838 302 374 1144 -4626 -5763 3778 7373 -1172 -4867
1183 -4867 325 -82 -3796 1894 7148 -781 -7566 -830 4349 -869 -1645 4295 1200 -6590 -2046
1198 -2046 6085 1788 -4176 740 3510 -3101 -3446 4408 3692 -3946 -2178 3985 674 -3693 834
1213 834 3806 -1261 -2690 2121 1975 -2503 -1054 2491 630 -1414 517 646 -1602 -408 1709 152
1229 152 -898 705 -499 -2233 1025 2944 -1617 -2937 1875 1586 -3366 -448 4472 -874 -5691
1244 -5691 1511 5583 -2495 -4758 3363 2668 -5532 -973 7773 341 -8689 -151 7258 -1230 -4344
1259 -4344 5166 3413 -8863 -4447 9650 5399 -6452 -1858 4407 -3869 -5764 7773 9568 -5915
1273 -5915 -9161 2378 3575 -2488 2740 7730 -3302 -11403 -968 8350 3300 -1530 592 -2038
1287 -2038 -6807 -1400 7587 5907 -2290 -5464 -3586 -652 2737 4394 2026 -1982 -4913 -4277 1721
1302 1721 7021 2622 -4832 -3441 1045 -989 -700 6215 4038 -7909 -6750 6422 6055 -4609 -1660
1317 -1660 5539 -2888 -8365 5688 11545 -5071 -11120 4298 7271 -5253 -1464 10037 -1310
1330 -1310 -14951 255 15779 2010 -10277 981 4314 -8863 -3852 15280 8419 -14032 -10586
1343 -10586 6505 3854 -2995 6551 7751 -10910 -15142 4779 13462 1794 -3297 274 -5544 -9959
1357 -9959 3035 14508 5439 -8103 -8003 -2472 67 4310 8222 3275 -6617 -9347 -2442 6339
1371 6339 8054 1840 -4274 -3987 -2462 -1681 3753 8675 1128 -9193 -4215 6059 2371 -3811 2667
1386 2667 4994 -6200 -6836 7926 7501 -8572 -6742 8729 4680 -7971 -62 8521 -5648 -12538
1400 -12538 7140 15283 -4362 -12013 2617 3197 -8278 1762 16650 1193 -18829 -6902 10349
1413 10349 3584 -2030 7973 3582 -16010 -12257 11565 14209 -1714 -4309 98 -7346 -8992 8160
1427 8160 16678 1001 -11691 -5868 368 -271 4463 10075 1876 -10684 -8619 2803 7263 3878
1441 3878 760 -1391 -4435 -4910 566 6735 5158 -2907 -5856 -281 2874 -801 -828 3715 941 -5744
1457 -5744 -1633 6083 817 -7164 -480 7116 54 -5208 2135 2802 -7436 -4324 10343 7280 -8245
1472 -8245 -6638 4037 -351 -4840 7457 11221 -7298 -15097 1626 9709 -169 -259 7729 -2488
1486 -2488 -15815 -2889 15207 7548 -6321 -2270 1051 -7974 -4916 12388 12005 -6545 -10844 357
1500 357 2208 -1888 4695 9051 -2903 -12057 -2702 7252 3423 -989 1589 134 -6079 -3937 4874
1515 4874 5796 -1446 -4132 -329 1159 -1243 -861 2320 1734 -2694 -2612 2405 2693 -3067 -3657 2879 3938
1532 3938 -1860 -2251 2341 -392 -5286 863 8334 1530 -7346 -2459 3801 -992 -1848 6936 5105
1547 5105 -8630 -8561 5729 7222 -2600 -746 5305 -3568 -10828 2354 12960 1335 -8713 -736
1561 -736 3188 -5207 -2725 10336 6205 -9696 -7803 5264 3635 -3778 2173 6469 -4676 -10084
1575 -10084 2287 8874 -696 -4702 2375 1510 -6141 -1916 7590 3146 -6229 -2648 4115 141 -3754
1590 -3754 1884 4421 -2270 -4334 2306 3645 -2283 -2768 2461 2357 -1909 -1006 2210 121 -2924 -85
1606 -85 3791 1667 -2421 -2016 624 539 -177 1600 2417 -1144 -4369 -1257 3464 2554 -840 -708 146
1623 146 -2552 -2815 2816 5163 -763 -4737 -725 1636 -1467 -394 4609 1651 -5790 -3633 3939
1638 3939 2593 -2730 265 3575 -2360 -5700 2044 5877 -1318 -4043 2299 2359 -4092 -1899 5443
1653 5443 2245 -4937 -1137 4568 -393 -4413 1965 4892 -2220 -4148 2836 3177 -3571 -2096 4569
1668 4569 1815 -4437 -1106 3853 -232 -3491 1616 3644 -2165 -3664 1905 2501 -2085 -1169 2627
1683 2627 256 -3316 -386 2914 174 -2171 267 1310 -1327 -1319 1420 1045 -1293 -833 910 301
1699 301 -762 -76 497 -126 -160 323 168 -190 -214 -204 250 1116 483 -981 -786 654 404 -93 997 876
1719 876 -1621 -1858 1250 2188 -151 -764 552 -658 -1941 917 3261 153 -2849 -820 986 -445
1735 -445 -14 2393 531 -3483 -2017 2236 1952 -879 -275 312 -2128 -1988 2272 3155 -995 -2773 -447
1752 -447 433 -256 1334 2310 -970 -3530 -756 2393 1627 17 11 -1026 -2296 -163 3169 2355 -1191
1769 -1191 -2269 -840 259 1192 2203 1088 -1990 -2796 -158 2328 2110 538 -1126 -2182 -1445 1155
1785 1155 2937 1567 -1499 -2791 -1449 836 2284 1910 -266 -2721 -2761 104 2843 2406 -287 -2414
1801 -2414 -2592 -875 1848 3093 1122 -2370 -3296 -1135 1709 2869 1866 -1029 -3366 -2392 1102 3276
1817 3276 2181 -590 -2645 -2681 -135 3040 3230 241 -2691 -2826 -628 2277 3457 1412 -2344 -3400
1833 -3400 -966 1915 3079 2153 -900 -3816 -2832 1567 3805 2008 -927 -2738 -3113 -637 3482 4022
1849 4022 -249 -3758 -2911 -452 1566 3427 2428 -2468 -5154 -1430 3030 2943 1115 -400 -2979 -4093
1865 -4093 465 5206 2963 -2254 -3097 -1508 -703 1793 4642 1618 -4482 -4322 1050 3167 1919 1546
1881 1546 -434 -4371 -3385 3146 5393 864 -2552 -2201 -2014 -449 3827 4649 -988 -5041 -2548 1230
1897 1230 2317 2849 1725 -2788 -5255 -1050 3888 3637 477 -1839 -3455 -2850 1423 4681 2413 -2067
1913 -2067 -3748 -2595 338 3612 3663 -679 -4044 -2977 11 2353 3638 1699 -3292 -4781 -270
1928 -270 3441 2514 958 -237 -3421 -3878 1839 5886 1706 -3147 -2105 -667 -1120 1934 5302 772
1944 772 -5763 -3248 2838 2503 403 1683 39 -5089 -2990 4673 4919 -1435 -2932 -498 -1455 -1139
1960 -1139 3928 4444 -2596 -5674 -706 2647 1244 1479 1513 -2875 -5146 154 4973 2676 -1180 -2102
1976 -2102 -2478 -1995 1754 4539 1824 -2740 -3824 -1684 1455 3786 2698 -1296 -3274 -2143 -166
1991 -166 2460 4143 1258 -4105 -3785 1077 2611 1040 1677 805 -4031 -4005 3012 5183 -692 -2581
2007 -2581 819 -740 -3379 1849 5892 -841 -5983 -49 3814 -1183 -1646 3753 851 -6034 -1567
2022 -1567 6139 1737 -4727 -501 3018 -2542 -2765 4922 3546 -5564 -4245 3909 2531 -2612 883
2037 883 3313 -3468 -5341 3193 5820 -980 -3161 629 -475 -2934 1881 5435 84 -4603 -1653
2052 -1653 1228 579 1728 2806 -628 -3974 -1688 1586 2114 1804 641 -2351 -2878 394 1894 851
2068 851 1251 565 -3143 -3136 2278 3304 -1226 -1207 1837 -1132 -4038 1548 4897 -1396 -4284 1964 2652
2085 2652 -3901 -1951 5260 1239 -5641 -217 5637 -1490 -5627 2851 5167 -3765 -3774 5019 2324 -6449
2101 -6449 -1330 7117 916 -6048 967 4795 -3398 -4438 5467 4979 -5137 -3888 4249 1314 -4332
2116 -4332 1468 5761 -2038 -6066 1307 4309 -1304 -1659 3148 647 -4628 -1298 3826 1474 -1894
2131 -1894 -174 688 -1775 -1385 1680 1825 -310 -1000 -894 -682 314 697 110 522 647 -1638 -2100 1281
2149 1281 2163 -1033 -923 2261 -4 -3959 -258 4540 592 -3299 1012 2586 -3383 -3130 4806 4104
2165 4104 -4033 -2841 3535 130 -4529 2117 6571 -1901 -6543 1377 4273 -2653 -1902 5361 1642
2180 1642 -6944 -2397 5828 1599 -3987 1040 3603 -3714 -4699 3909 4695 -3022 -3194 2642 627 -3901
2196 -3901 227 4594 -138 -4166 -52 2756 -838 -1953 1650 1746 -1779 -1467 1504 1070 -1393 -807
2212 -807 1452 1249 -619 -963 125 340 -497 -30 1839 1272 -2041 -2447 1157 2300 -219 -380 1590
2229 1590 -712 -3880 -124 4770 1707 -3161 -1051 1314 -1996 -1804 4269 3913 -3795 -4595 1639 2069
2245 2069 -1727 905 4091 -1825 -6300 77 5353 463 -2640 1296 933 -4286 -1931 5144 3169
2260 3169 -3714 -2541 2102 -14 -2295 2064 3714 -2057 -4185 985 3088 -595 -1273 1540 322
2275 322 -2577 -491 3008 1214 -2267 -1147 1393 714 -690 426 1000 -999 -1831 618 2523 475
2291 475 -1977 -1142 610 221 -105 1387 1135 -2185 -3035 854 3080 358 -1340 -7 -573 -2497 105
2308 105 4064 1600 -3349 -2407 1025 419 -453 2265 2145 -2988 -4070 1308 3554 143 -804 856
2324 856 -951 -3218 510 4408 1351 -2913 -1524 802 -419 -162 2703 1802 -2756 -2842 1356 2307
2340 2307 38 -210 640 -1133 -2159 685 2882 673 -2003 -1176 314 198 255 1248 472 -1809 -1874
2357 -1874 678 1991 575 -1003 -742 -403 -709 390 1942 734 -2048 -2015 618 1555 341 100 358
2374 358 -1322 -2082 765 3024 835 -1866 -1004 120 -401 467 2419 983 -2595 -2116 1153 1710 264
2391 264 395 468 -1785 -2041 1348 2933 300 -1646 -665 -251 -651 898 2341 264 -2474 -1473 864
2408 864 961 494 710 -334 -1950 -1251 1240 1739 139 -987 -914 -825 -54 1213 1256 -318 -1540 -1075 283
2427 283 1156 1060 -19 -1027 -1005 -357 663 1302 773 -886 -1572 -179 979 964 483 133 -920 -1374 324
2446 324 1902 960 -887 -798 -168 -417 393 1720 761 -1664 -1561 586 952 238 480 286 -1374 -1502
2464 -1502 832 1904 118 -990 -391 -512 -771 758 1730 -120 -1780 -834 508 345 316 848 -258
2481 -258 -1723 -749 1167 999 -58 -291 -390 -873 -213 1256 1099 -478 -973 -300 53 396 1028 553 -769
2500 -769 -1020 104 643 668 413 -157 -914 -617 605 930 285 -171 -425 -715 -98 869 792 -339 -669 -341
2520 -341 -144 133 709 448 -803 -999 14 399 142 310 195 -791 -950 366 963 58 -455 2 -254
2539 -254 -597 294 1031 16 -955 -213 415 -77 38 766 130 -899 -401 819 467 -334 64 246 -445
2558 -445 -356 782 751 -357 -559 270 186 -202 220 504 -211 -568 92 387 55 -179 94 -77 -331 -21
2578 -21 366 91 -263 -221 18 -47 -79 -14 47 -85 -236 -245 97 207 -102 -328 54 211 -282 -303 280 325 -281
2601 -281 -161 390 -26 -552 199 757 -26 -475 234 425 -458 -169 972 497 -882 -490 693 323 -459
2620 -459 365 737 -668 -1049 524 1037 -216 -562 377 -38 -830 152 1188 35 -1189 -367 535 -191
2638 -191 -283 715 362 -1107 -908 726 786 -383 -315 183 -405 -653 523 994 -194 -970 -290 420 75
2657 75 118 422 -7 -873 -422 766 888 -57 -639 -327 -57 55 462 751 42 -1074 -784 771 1192 120
2677 120 -328 -105 -517 -723 598 1698 180 -1671 -917 573 323 140 1104 265 -1957 -1564 1209 1698
2695 1698 -281 -662 182 -903 -1497 1063 2562 -110 -2277 -635 752 -249 145 1893 279 -2516
2711 -2516 -1370 1877 1389 -719 23 581 -1287 -1511 1604 2349 -796 -1934 216 761 -446 388 1630
2728 1630 -205 -2299 -411 1939 898 -724 -173 72 -978 -401 1643 1370 -1172 -1797 -116 880
2744 880 490 441 331 -928 -1705 -248 1734 1487 -526 -1441 -835 -140 366 1250 1245 -782 -2555 -1047 1713
2763 1713 1698 84 -282 -506 -1714 -1103 2099 2816 -616 -2431 -540 525 -205 1020 2478 -325 -3415
2780 -3415 -1237 2457 1511 -683 343 368 -2174 -1674 2600 2820 -1329 -2263 583 400 -1091 875 2538
2797 2538 -785 -3255 -200 2550 315 -1229 546 333 -1985 -752 2630 1482 -2172 -1763 913
2812 913 594 -462 892 1128 -1593 -2400 748 2456 516 -1059 -546 -453 -986 481 2339 1154 -1851
2829 -1851 -2277 201 1556 977 576 337 -1305 -2285 -6 2908 1917 -1209 -1709 -359 -265 -35 2058
2846 2058 2133 -1476 -3276 -289 2145 904 -104 755 -556 -2884 -788 3065 1910 -1790 -1524 466
2862 466 -477 -1031 1743 2294 -1637 -3018 484 2077 -235 -595 1074 -181 -2425 -260 2862 811
2878 811 -2116 -858 1064 -78 -633 1394 1263 -1840 -2035 1239 2127 -119 -874 212 -261 -1195 568
2895 568 2479 543 -2111 -1413 769 856 230 754 589 -1620 -2001 718 2532 641 -1342 -741 -207
2912 -207 -823 237 2282 1183 -2159 -2288 589 1376 21 378 947 -1303 -2571 385 2804 624
2928 624 -1548 -391 211 -1189 -384 2363 1338 -2045 -1797 1111 972 -676 446 1328 -965 -2021
2944 -2021 727 2162 -132 -1341 234 557 -878 -57 1618 488 -1618 -771 1219 734 -508 -42
2960 -42 441 -765 -975 774 1414 -254 -1390 -398 501 95 102 627 63 -1354 -1020 827 1296 -110 -855
2979 -855 -128 -124 -745 251 1511 341 -1634 -945 922 614 -426 406 795 -1167 -1676 796 1753 -280
2997 -280 -1023 496 226 -1240 28 1912 492 -1720 -477 1239 19 -852 959 1081 -1255 -1222 1132
3014 1132 1138 -873 -552 951 21 -1262 120 1372 -239 -1234 262 834 -499 -637 654 422 -848
3031 -848 -414 730 204 -672 -148 395 -124 -424 139 293 -286 -450 145 377 19 -187 -71 149 63 -145
3051 -145 121 349 7 -498 -66 535 158 -435 168 512 -329 -544 437 582 -456 -392 730 369 -759
3070 -759 -143 882 84 -773 312 828 -479 -965 644 801 -635 -647 682 73 -1025 -17 1134
3087 1134 -117 -1098 6 606 -417 -411 799 374 -1042 -616 745 427 -455 109 372 -613 -706 555
3105 555 875 -183 -594 9 30 -215 405 650 -127 -658 -182 298 357 309 185 -224 -456 -78 423 478 201
3126 201 -298 -576 -212 430 379 84 -155 -294 -522 -21 797 430 -577 -591 -60 35 -28 546 354 -793 -922
3147 -922 200 687 44 -107 38 -520 -846 420 1149 97 -750 -336 27 -176 287 973 126 -1136 -602
3166 -602 618 565 179 271 -69 -923 -410 812 921 -88 -479 -345 -315 45 806 775 -405 -928 -338 292
3186 292 570 503 118 -674 -788 49 641 615 77 -520 -822 -331 546 718 121 -386 -691 -532 228 824 474
3207 474 -519 -719 -413 18 535 811 174 -920 -849 192 668 422 276 -199 -888 -599 690 1109 175
3226 175 -531 -402 -352 -110 820 1028 -229 -1126 -409 378 481 545 473 -450 -1137 -205 911 795 -78 -348
3246 -348 -588 -611 144 1063 590 -565 -812 -330 81 549 660 35 -941 -850 142 726 608 26 -540 -836
3266 -836 -353 534 848 222 -446 -764 -562 338 1004 417 -398 -624 -473 -4 665 953 59 -977 -640 234
3286 234 498 500 508 -316 -1150 -468 939 902 -97 -271 -292 -660 -304 931 951 -535 -1136 -213 330 154 514
3307 514 671 -619 -1362 -56 1075 442 -208 -15 -373 -907 130 1157 510 -763 -767 -30 100 291 757
3326 757 266 -887 -825 348 790 314 5 -251 -598 -380 508 934 210 -585 -676 -128 348 656 371 -120
3346 -120 -536 -536 111 799 709 -231 -723 -303 93 234 557 495 -487 -1126 -182 798 481 -182 -2 -284 -842
3367 -842 -200 1145 670 -778 -734 96 -72 -218 652 792 -790 -1234 258 860 -16 -259 374 -183 -938
3386 -938 140 1224 354 -821 -246 417 -156 -114 810 535 -824 -692 532 687 -87 -176 240 -249 -519
3405 -519 324 956 112 -728 -297 248 126 45 343 176 -624 -632 268 763 98 -299 -207 -92 -257 34 724
3426 724 363 -788 -749 371 534 -112 -13 383 -345 -911 156 1069 198 -676 -58 289 -447 -276 909
3445 909 565 -873 -745 637 417 -481 155 820 -299 -975 297 1013 -153 -750 373 428 -622 -386
3463 -386 883 375 -849 -360 713 139 -661 -37 572 -256 -714 258 597 -453 -619 289 444 -426 -335
3482 -335 440 85 -583 -326 571 323 -449 -334 281 -35 -425 103 619 -6 -730 -105 577 34 -406 321
3502 321 447 -458 -582 519 772 -342 -419 538 256 -698 -103 940 241 -834 -106 743 -147 -768 442
3521 442 910 -552 -812 500 615 -715 -352 911 230 -1059 -300 906 86 -757 183 681 -482 -926
3539 -926 457 863 -445 -574 464 193 -759 -185 879 325 -786 -220 566 -58 -485 316 606 -350
3557 -350 -737 220 636 -104 -293 341 290 -444 -260 640 424 -456 -309 377 236 -373 -22 507 19 -656
3577 -656 7 638 -7 -575 51 507 -183 -465 489 419 -625 -624 532 498 -488 -396 427 73 -751 29 964
3598 964 -75 -1036 -46 631 -123 -393 606 533 -888 -727 807 749 -484 -262 480 -199 -774 337 1178
3617 1178 -37 -920 -84 500 -143 -193 745 495 -895 -690 619 564 -242 -101 405 -298 -739 338 842
3636 842 25 -755 -56 398 -172 -139 455 310 -682 -552 407 513 -276 -282 105 -144 -373 27 589 -24 -679
3657 -679 -327 355 166 -238 94 159 -470 -525 432 663 -165 -605 15 267 -156 96 670 160 -839 -333 718
3678 718 497 -274 24 261 -466 -564 612 936 -294 -731 49 247 -234 164 789 41 -1095 -362 740
3697 740 357 -252 38 170 -600 -505 592 759 -369 -674 30 117 -184 167 590 -108 -836 -236 513 288
3717 288 -207 45 41 -421 -255 501 546 -214 -492 49 237 0 183 386 -97 -550 -175 514 409 -126 -227
3738 -227 -21 -61 -53 389 427 -168 -638 -69 391 256 -15 122 -98 -510 -254 573 495 -259 -505 -32 6 -137
3760 -137 228 506 -287 -764 -155 496 174 -138 121 -49 -542 -217 609 445 -370 -429 84 23 -67 371 491
3781 491 -291 -660 -9 540 189 -22 124 -70 -428 -17 546 335 -337 -316 40 77 30 338 255 -272 -478
3802 -478 -5 382 154 -135 -9 -110 -237 43 343 195 -322 -427 -124 140 57 45 80 -218 -355 -48 394
3823 394 170 -231 -212 -134 -83 16 315 180 -257 -479 -21 289 48 58 76 -132 -398 -52 481 282 -271 -129
3845 -129 -3 -99 38 340 249 -224 -383 129 232 -30 -23 118 -153 -321 91 395 59 -219 -74 25 -83 32
3867 32 210 79 -296 -249 97 217 -45 -31 -54 -149 -172 108 218 51 -118 -220 -12 -3 34 77 48 -165 -208 -35
3891 -35 236 90 -158 -68 74 -76 -50 249 151 -202 -227 165 146 -13 46 230 -45 -212 124 266 -24 -253
3913 -253 117 95 -170 -48 353 21 -307 -133 177 -1 -150 -33 126 -170 -212 143 92 -153 -129 74 -31
3934 -31 -170 23 195 -61 -184 2 128 -63 -147 9 -12 -73 -47 43 46 9 12 62 81 -13 67 31 58 26 -63 98
3960 98 153 22 -96 19 98 -11 -20 145 97 -53 -64 216 -17 -171 23 201 -72 -211 59 68 -166 -127 252
3983 252 121 -263 -145 183 -48 -319 54 236 -133 -280 153 223 -232 -76 198 -12 -308 15 312 -35
4003 -35 -277 49 196 -117 -121 210 105 -223 -67 180 83 -148 47 195 0 -139 155 141 -47 -127 66 105
4025 105 16 -61 98 43 -69 -70 37 185 50 -127 -48 65 -23 -113 52 119 -209 -222 108 157 -108 -161 111 -134
4049 -134 -282 24 391 19 -341 40 228 -120 -188 348 209 -334 -296 342 243 -247 18 325 -87 -347 200
4070 200 353 -158 -328 242 214 -275 -43 406 81 -407 -59 353 -2 -271 59 183 -178 -247 208 200 -174
4091 -174 -165 180 -2 -118 29 138 -31 -287 -37 141 65 -197 -69 28 -4 -136 66 201 -66 -309 -88 237
4113 237 56 -177 36 200 -136 -209 213 407 -136 -313 151 170 -173 18 479 -48 -474 47 523 10 -279
4134 -279 207 280 -304 -363 374 364 -369 -226 408 80 -427 82 427 -79 -454 68 370 -177 -342 276 189
4155 189 -362 -187 361 129 -418 -74 323 -5 -357 38 306 -150 -297 219 183 -132 -132 97 126 -236 -87
4176 -87 266 104 -179 -161 166 192 -32 -105 216 7 -256 -90 279 86 -269 -99 257 50 -254 151 355
4197 355 -177 -424 114 409 -193 -263 290 180 -435 -126 504 120 -441 -96 399 -147 -431 150 428 -283
4217 -283 -412 231 251 -446 -221 445 62 -490 -7 418 -53 -421 130 360 -220 -283 260 285 -310 -228 384
4238 384 241 -324 -109 296 62 -218 23 374 -13 -298 46 312 -49 -251 88 161 -155 -176 174 257 -176
4259 -176 -260 56 72 -165 -132 231 88 -296 -149 313 81 -318 -100 319 -62 -362 89 434 -142 -385 138
4280 138 273 -242 -300 356 249 -318 -138 404 130 -437 15 494 -79 -363 149 382 -196 -330 328 315 -310
4301 -310 -252 353 165 -310 -61 420 -16 -385 27 342 -79 -261 171 222 -300 -275 234 192 -270 -221 209 42
4323 42 -304 -82 368 54 -310 -135 194 59 -240 27 191 -114 -293 99 311 -29 -166 197 175 -205 -150
4344 -150 242 237 -229 -119 369 130 -313 23 323 -8 -312 38 366 -111 -283 197 318 -207 -146 293 193
4365 193 -309 -166 373 90 -354 -62 343 -37 -297 131 217 -259 -315 156 207 -199 -144 230 -7 -296 -115
4386 -115 327 31 -288 -38 190 -97 -185 94 231 -167 -250 161 159 -85 -162 126 158 -120 -99 265 226 -104 -60
4409 -60 180 86 -180 43 219 62 -223 25 280 -55 -208 90 221 -94 -233 112 132 -298 -156 161 79
4430 79 -275 -106 246 29 -282 53 243 -45 -290 79 174 -165 -213 103 141 -219 -127 260 138 -208 4 213
4452 213 -50 -217 149 269 -72 -206 155 220 -143 -112 207 110 -135 -125 192 69 -111 -5 128 41 -118 1
4474 1 170 12 -116 35 94 -51 -176 -2 121 -128 -174 56 163 -72 -101 112 91 -141 -80 112 27 -187 -87
4497 -87 181 -21 -156 -1 114 -82 -103 82 166 -185 -122 188 119 -119 41 182 3 -190 19 272 49 -151
4519 -151 123 137 -14 -170 84 198 -86 -60 142 48 -146 -39 137 45 -120 47 58 -46 -144 -10 96 -69
4541 -69 -117 60 65 -124 -33 33 28 -120 -46 46 31 -114 -85 41 -48 -105 -13 138 52 -94 20 126 -31 -84 48 104
4567 104 33 -30 38 67 -26 -9 66 92 -100 16 97 9 -106 -36 60 -9 -89 75 99 -81 -136 44 141 -115 -48 141
4593 141 -33 -168 -67 119 55 -91 6 98 -24 -87 48 61 -41 -132 37 71 -84 -47 62 46 -162 7 134
4616 134 7 -64 -39 113 -24 -83 107 67 -43 -65 44 144 -6 3 101 89 -55 -65 64 42 -15 -70 51 -33 -63
4641 -63 66 129 -1 -37 26 81 -31 -94 4 67 -85 -120 45 129 -97 -83 3 -38 -52 -43 123 38 -198 28 101 -103
4667 -103 -147 106 103 -117 -75 183 9 -58 -19 156 -8 -106 33 131 -41 -92 20 65 -10 -107 4 79 -26 -33 103
4692 103 -5 -38 5 74 12 -62 18 134 -50 -64 29 40 -90 -48 1 42 -69 -48 37 21 -59 -66 -15 9 -65 -115 42
4719 42 10 -104 -41 13 47 -64 32 91 -55 -116 36 58 -62 -15 88 58 -97 -22 143 65 -133 46 172 56
4743 56 -180 73 159 -90 -79 90 108 -106 -104 98 55 -95 -44 128 17 -133 6 175 -57 -187 32 78 -110
4766 -110 -114 129 62 -96 -109 18 -7 -88 -68 135 2 -152 35 43 -68 -139 62 88 -62 -45 121 108 -136 -90 58
4791 58 91 -71 -15 112 112 -80 -57 74 39 -146 -2 129 17 -118 27 183 17 -153 48 122 -65 -158 93
4814 93 132 -62 -122 173 63 -169 -58 196 -25 -224 18 134 -27 -206 108 112 -101 -133 152 58 -187 -72
4836 -72 179 83 -214 -3 178 6 -130 121 184 -57 -117 151 78 -125 -77 186 73 -158 -60 150 29 -161
4858 -161 -27 132 27 -94 53 74 -9 -93 51 134 -25 -57 23 94 -113 -139 110 68 -112 -59 157 76 -172 -83
4882 -83 160 -9 -145 -14 108 -21 -210 111 174 -58 -229 158 97 -163 -113 193 66 -174 -56 189 -20
4903 -20 -161 85 210 1 -235 123 203 -103 -183 123 125 -157 -21 193 30 -200 -38 170 -30 -147 76 210
4925 210 -98 -222 100 167 -64 -187 95 128 -145 -145 55 6 -202 -30 164 75 -148 -15 164 -18 -144 29
4947 29 165 -79 -142 31 221 -74 -89 134 106 -156 -39 226 142 -130 -84 116 19 -149 4 210 -13 -236
4969 -236 107 255 -55 -148 169 161 -118 -67 259 123 -163 -62 122 -2 -177 -31 219 -72 -256 21 89 -54
4991 -54 -115 103 78 -228 -90 178 87 -139 -105 139 15 -168 56 219 -85 -196 61 193 -29 -114 76 72 -98
5014 -98 -6 131 126 -114 -136 162 69 -47 25 100 41 -179 19 221 62 -152 -44 182 -15 -140 130 149 -194
5037 -194 -164 109 163 -113 28 165 -17 -268 5 215 17 -122 -82 122 -7 -96 178 132 -157 -175 69 116
5059 116 -81 -62 168 -80 -250 31 283 69 -183 -57 55 -70 -74 149 193 -102 -121 128 120 19 -18 117 12
5082 12 -145 21 189 64 -121 -36 119 96 -107 22 15 -63 -121 -19 158 -52 -164 -50 -74 -133 -49 168 70 -197
5106 -197 -106 67 2 -95 -35 82 -75 -189 96 240 -23 -106 56 68 -131 -36 201 74 -185 -156 60 51 -58
5129 -58 98 76 -89 -130 113 217 -39 -86 -23 44 -120 -2 192 80 -184 -103 65 -13 -54 29 30 -103 -45 85
5153 85 163 -22 -82 -106 -29 -42 48 89 15 -170 -165 82 130 -26 -19 15 -118 -72 7 104 3 -132 -66 122 30 -21 71
5180 71 -14 -133 -118 151 155 -28 -35 12 -70 -95 62 128 17 -227 -119 95 -24 -22 80 65 -108 -105 78 113 -45 -106
5206 -106 33 -43 -82 58 157 43 -163 -90 83 12 -12 35 19 -210 -85 88 64 -38 -111 -57 -18 -29 75 64 -11
5231 -11 -98 -8 92 -31 -73 -39 -47 -113 -40 134 84 -21 -59 21 56 36 42 47 8 -97 1 103 110 -37 -28 38 -92 -44 -43
5260 -43 48 45 -77 2 31 -12 -21 58 28 -79 -80 108 71 -53 -18 3 -64 -84 66 58 -105 -43 -8 6 53 -21 14 -96 -145
5289 -145 -60 97 38 -111 -21 -9 25 24 70 22 -25 -88 -1 16 -32 38 24 -33 -33 -4 41 86 -6 -47 36 46 9 -28 80
5318 80 -11 -12 3 50 -40 -66 21 35 -17 -86 38 54 -85 -56 16 -27 -59 -42 48 -32 -124 -32 61 -46 -69 23 17 -27 -20 45
5348 45 45 -59 -38 40 -2 -22 -36 112 -28 -33 59 142 -16 -19 76 46 -23 9 95 26 -40 7 72 19 -95 -12 -7 41 -16 26
5378 26 -4 -23 -3 45 -19 -59 -21 13 38 -65 -14 -2 55 -63 -50 29 8 -62 -30 12 -1 -82 5 83 30 -13 18 0 3 -83
5408 -83 49 69 -147 -45 101 53 -92 3 101 11 -22 105 39 -31 -107 10 81 -76 -65 107 57 -96 5 60 11
5433 11 -2 -27 71 -39 -82 71 72 -88 -112 29 -19 7 -20 70 -27 -42 26 57 8 -24 -48 -39 -35 -13 16 45 -43 -97 20
5462 20 62 -5 -43 15 39 -80 -23 121 68 -50 -85 32 40 -41 29 152 22 -130 -6 108 11 -44 49 93 -29 -62
5488 -62 126 79 -97 -81 -6 70 -68 1 5 -114 -109 67 169 -5 -81 31 -47 -55 -3 136 85 -140 -90 55 -16 -21 25
5515 25 74 -53 -99 75 119 -9 -39 -16 -1 -50 -10 111 80 -130 -132 59 72 -51 0 63 -51 -56 -12 127 67 -62
5541 -62 -65 53 -18 71 32 10 -124 -128 41 116 -52 -21 48 -116 -106 5 149 -14 -129 -75 140 11 28 97 36 -133
5567 -133 -123 93 76 -67 -75 23 4 -139 97 132 18 -138 -37 49 42 -48 61 27 -196 -98 100 111 -82 -46 53
5592 53 17 -57 55 167 58 -124 -21 106 -8 15 75 14 -136 -120 96 135 -112 -81 -29 -26 -39 31 83 17 -148
5617 -148 -75 54 3 -104 -3 2 -79 -65 53 66 -55 -114 15 -5 -74 41 71 -29 -83 -39 88 91 -8 8 30 -2
5643 -2 -17 99 82 -54 -125 66 67 -35 0 125 -61 -137 -54 83 30 -115 -67 69 -42 -76 54 108 -68 -150 -86
5668 -86 46 -89 -9 13 -18 -126 -44 135 47 -80 -32 69 -24 -101 10 52 -53 -72 49 66 -53 -19 100 48 -77
5693 -77 -19 85 112 -56 -23 33 55 41 81 55 -15 -113 53 89 28 -124 37 79 -75 -33 88 63 -127 -102 32 44
5719 44 -129 -8 172 -79 -126 22 136 -35 -94 26 1 -89 -25 75 33 -55 -21 46 19 -58 11 85 -55 -86 33
5744 33 134 23 -76 -11 84 -63 -18 176 71 -41 7 81 82 -51 58 123 -61 -46 31 96 5 -67 12 95 -98 -24
5770 -24 30 36 -49 -21 59 44 -41 -51 10 -27 -157 18 60 50 -91 -71 50 -17 -21 22 32 -55 -45 39 64 -38 18 58 33
5799 33 -81 -56 109 84 -75 15 64 12 -8 24 85 32 -94 10 82 -32 -39 45 39 -119 8 64 -19 -41 -41 79 -9
5826 -9 -61 49 33 -26 -93 73 66 -79 -50 31 5 -62 -21 112 18 -69 -11 66 -34 -102 -6 21 1 -100 -20 26 -29 -46
5854 -46 90 58 -13 -62 25 83 -20 22 59 85 -49 -7 10 34 23 -51 25 -28 -25 37 91 -50 -32 18 3 61 -16 86
5882 86 28 -95 -19 46 -2 -54 -24 35 -12 -52 40 44 -33 -7 12 4 -31 -52 41 -52 -64 8 57 -16 34 -5 -28 -43 -55 -15 83
5913 83 -55 -46 13 -23 -41 -31 37 30 -74 -15 87 2 -24 31 55 49 9 61 64 38 -65 17 41 -52 47 8 80 -60 -48 31
5943 31 22 -7 -27 36 15 -101 75 12 -65 -86 -8 65 48 -62 -23 -18 1 -9 65 2 -50 -20 48 -37 -70 104 47 -21 -65
5972 -65 -8 97 -34 -76 -35 0 -42 -32 22 -23 -27 11 35 11 -13 12 19 33 -43 2 -10 14 -52 -8 0 -44 -56 11 55 28 -59
6003 -59 121 26 13 -9 36 -47 -113 55 9 -1 -33 -35 30 -8 -65 8 38 -6 -24 45 51 -15 4 55 -86 -71 8 101 29 -2
6033 -2 8 61 26 -62 66 17 -12 -12 0 100 -46 18 -41 24 -68 81 17 -13 -20 23 0 -30 -41 64 -7 -55 -7 24 40
6062 40 -30 7 35 -16 -25 -40 36 24 -55 -43 -19 10 2 46 43 6 -33 15 56 63 -74 10 70 -21 -26 36 6 -76 -61 20 25 19 -1
6095 -1 64 43 -19 16 37 -35 16 14 79 5 -11 3 7 -105 -19 41 9 -36 -27 29 -50 -60 37 21 -48 -14 97 4 -92 24 34
6126 34 -8 -112 -56 60 40 -44 -12 47 -23 17 -36 18 8 57 -4 7 -24 43 18 25 15 10 6 -55 7 -16 5 1 -30 95 53
6157 53 -4 -43 -4 -13 -82 -42 51 69 7 -36 -7 10 -42 -18 5 -1 -39 19 55 -21 -39 16 -5 -34 -62 28 48 -41 -60 68 78
6188 78 -86 -19 -9 -45 -70 52 72 -22 -4 16 103 -42 -80 55 76 -35 -44 10 38 -37 -27 102 -58 -25 -33 -5 -36 -90
6216 -90 53 6 -30 -69 5 35 -67 -84 78 15 7 -13 -52 -28 -110 -66 50 27 -45 -19 22 -39 -60 32 25 -19 2 15 55
6245 55 -12 -25 20 -11 -100 -9 59 0 -59 -3 32 -8 -7 1 53 -53 -90 61 31 9 -13 38 41 -48 -11 52 55 -76 39 35 -65
6276 -65 48 48 20 -16 -41 25 21 -10 -15 26 -5 -41 21 25 -17 -12 29 48 9 -24 40 111 -1 -45 -17 63 -28 -53 70 75 -108
6307 -108 -2 7 -3 -77 26 32 60 -6 86 81 0 -58 18 63 -44 12 56 34 -84 11 58 51 5 20 3 33 -115 1 88
6336 88 -39 -72 34 101 -38 -33 26 29 -51 -94 -4 49 -58 -74 -58 8 -11 -30 94 -11 -14 17 20 -59 -66 73 2 28 -4
6365 -4 63 87 -1 32 53 -2 15 22 117 38 -46 -65 -1 55 -50 -4 49 -84 -41 41 35 -30 -49 5 -13 -13 -10 58 -14 -31 28 9
6397 9 -14 19 39 110 -27 -34 63 48 -24 32 46 25 -35 -20 67 47 -40 -48 23 15 -7 28 5 -30 -8 47 48 -18 -111 15 49 -1
6429 -1 -16 35 31 -48 -46 55 33 -34 -1 47 -44 -38 79 69 -73 -35 -8 -13 -7 22 37 17 -27 -13 86 41 -53 22 10 -69 -18 66
6461 66 69 -70 -64 20 2 53 -40 40 65 -21 -61 81 35 -11 -7 14 25 -37 56 51 -26 -42 23 23 -43 -29 4 47 -18 -3 71 22
6493 22 -70 -34 22 -4 13 5 -7 36 -12 -20 70 -11 -57 -24 69 22 -59 46 35 -85 -9 36 60 -23 -27 13 -16 -24 5 53 -40
6524 -40 17 18 21 -55 42 15 95 -50 -32 38 13 1 -51 18 19 0 75 78 1 27 23 59 20 -3 65 6 -72 -30 -14 65 -16 23
6556 23 25 -55 -32 58 -1 56 37 -15 11 7 8 34 -1 -25 -44 -28 62 8 -55 -30 17 -16 51 1 35 33 -18 36 1 11 32 0
6588 0 -54 8 -5 19 -27 -29 2 41 25 17 43 -21 18 -12 13 63 -19 67 27 -2 -46 -1 52 38 -6 33 3 -38 -86 81 26
6619 26 -4 -26 66 46 -26 -6 49 16 -8 29 99 18 -93 57 -65 -5 -13 72 81 -34 -7 88 77 3 -47 -10 -6 28 19 64
6649 64 -92 73 49 31 29 -4 -25 40 -11 -14 33 30 -16 -14 13 -16 -2 53 48 -8 0 7 -5 -36 30 -97 -9 -18 -5 19 36 -11 -31
6682 -31 62 12 20 -3 30 5 16 -16 25 26 -44 47 -2 11 -1 -4 33 -33 42 16 7 22 8 80 -18 -16 -37 31 36 2 3 52 15 -73
6716 -73 68 46 38 18 25 -16 20 33 20 27 -44 -81 80 -8 -64 -5 -12 -4 -17 -45 10 -69 49 4 -9 -57 75 72 -31 -11 -47
6747 -47 13 -36 1 -7 83 42 16 -4 33 -44 -25 5 -21 22 2 39 1 29 31 20 -41 -9 -41 63 14 16 -29 34 -28 -48 54
6778 54 18 7 -33 -3 -4 7 -48 42 23 5 34 -6 37 -31 9 -12 55 -44 -56 24 12 30 -20 44 -17 32 44 65 -52 3
6808 3 52 -33 -12 -19 28 -32 -3 48 56 53 43 14 59 -31 58 -67 42 -10 2 -13 -41 17 -46 36 9 -4 9 20 -16 -23 -7 37
6840 37 -58 -44 -1 14 -58 -7 5 38 -41 -5 -24 51 -33 0 45 42 6 -3 -8 -10 5 -25 39 14 -25 68 13 26 7 -14 -39 23
6872 23 42 52 22 -14 5 38 -50 42 -26 -20 -25 -44 12 -18 24 -15 39 42 -22 48 -59 16 7 -13 63 -17 5 51 45 0 55 3
6904 3 -11 -25 3 35 -11 -31 76 96 -28 -18 -15 10 -18 4 15 41 37 -5 61 -4 -28 -23 -2 7 -27 15 22 30 38 -21 34 -3 25
6937 25 -1 -11 20 -20 -10 50 -25 0 32 10 -54 -29 47 56 12 45 37 -8 -36 59 39 -28 3 3 38 -25 18 73 47 -40 12 3
6969 3 17 -88 28 49 -4 27 49 24 -21 -4 47 19 -61 22 24 50 -21 61 -4 21 86 19 33 52 -33 -17 43 11 -3 16
6999 16 -34 10 -19 2 23 -44 18 0 48 -19 8 -13 15 -25 -10 52 -7 -2 -80 66 41 44 57 -2 -12 -60 28 54 -29 27 -29
7030 -29 9 -50 15 36 -5 -29 23 13 -30 11 24 40 33 -23 55 83 -21 25 61 -7 24 122 -6 -33 -53 14 19 21 -50 66
7060 66 24 -21 -55 27 16 -27 17 -1 -14 -25 1 -45 24 -46 17 9 -5 -57 8 -12 6 44 4 3 -46 -13 -17 -2 -21 28 21 -9
7092 -9 -35 25 34 8 10 40 90 -72 -43 10 42 -42 49 13 28 -31 19 72 27 -54 -27 57 -12 -13 -6 -1 -65 -79 -32 44 -33 -19 32
7125 32 5 -19 20 -36 -17 -33 -19 4 -28 3 9 -5 30 17 33 -44 -43 -35 -26 9 -40 55 -15 48 38 83 36 33 -42 53 5 8 -19
7158 -19 -7 11 -24 13 48 49 5 -72 35 -45 8 -17 49 -16 6 -29 -11 2 -62 8 43 -65 -41 27 -46 10 -23 40 53 13
7188 13 -34 -13 -42 -15 10 15 13 47 7 -3 5 -9 24 2 -33 10 7 55 -65 16 48 4 -30 -1 27 4 -38 14 8 31 -31 -20
7220 -20 23 17 23 26 54 -52 -38 21 51 -30 -32 6 -14 -44 -17 -1 44 -62 33 54 -44 -55 -3 14 32 -54 39 2 -9 -23 12
7251 12 -48 -37 -9 2 -24 -33 -22 27 59 -2 5 10 -10 29 13 63 -11 14 47 32 -23 4 -17 17 16 22 3 -40 -12 3 29 -40 -38
7284 -38 -10 9 -65 -81 -12 2 26 -27 29 40 11 10 -22 19 -12 -27 -9 -54 -14 -35 42 35 -25 2 34 -57 -3 -31 87 -10 26
7315 26 41 21 35 -11 27 27 -82 -12 79 -23 -45 11 -18 -53 -24 -28 -52 -45 4 15 18 -16 -29 -50 10 -45 3 66 4 -19 -42
7346 -42 4 92 57 61 17 10 54 5 15 18 -23 -12 -64 11 -6 91 22 -49 87 -8 -30 11 9 -60 -13 -61 -21 -24 -28 30 41 30 35
7379 35 12 5 13 -47 -2 77 -27 -19 -18 16 -36 -32 26 -56 -5 -7 -9 -30 0 -7 25 52 -13 -13 -24 -29 29 22 -95 81 -43 21 5 -38
7413 -38 -32 -38 4 -15 -32 25 18 -80 30 23 -12 45 10 12 -10 -22 14 -30 -19 2 -9 7 24 27 32 11 15 2 25 -2 -29 -29 -10 21
7447 21 -31 -29 27 -32 11 -26 36 16 3 11 3 -51 30 20 -32 -24 28 29 2 -44 52 19 -51 20 15 -6 -53 -43 -10 -41 54 -34 63
7480 63 22 -27 -32 -24 -64 10 6 33 28 -65 -38 12 19 -41 -36 -22 32 9 34 27 -38 13 2 -17 -7 -31 23 18 30 -5 73 12 15 -58 33
7515 33 9 -51 4 -47 11 -96 -28 -4 -7 -30 -37 45 -54 31 -14 -1 12 12 7 -34 -25 65 32 10 47 8 -24 -14 16 1 51 48 -5
7548 -5 54 25 -27 10 -34 -34 14 26 40 -57 7 40 -33 -17 -17 -27 -21 -89 -67 -6 -47 38 69 13 -94 -43 -15 -5 -67 6 -17 -48
7580 -48 11 -13 -28 -57 26 6 -18 13 -42 47 28 -8 -45 20 51 -43 -70 19 1 -40 -8 19 55 33 11 39 -11 -43 -69 29
7610 29 0 11 -6 99 -3 9 31 16 14 10 -15 -35 -30 -9 70 -3 -27 21 -64 -41 60 -30 -59 11 6 25 65 -6 31 29 -10
7641 -10 29 15 -38 -18 -79 17 21 10 28 69 -21 49 -25 -7 -6 -15 31 -5 -17 3 34 -7 48 -34 21 15 11 2 -35 -30 57 48 4 16
7675 16 8 10 40 -54 48 13 92 15 2 17 2 6 21 30 -39 -23 -56 -19 13 -14 24 21 5 28 -13 16 9 -30 26 29 38 4 56 22
7709 22 -47 40 20 36 52 -3 16 -28 3 -4 -31 15 4 40 56 -10 -63 -67 26 32 15 85 56 -21 11 17 -17 -20 0 -4 1 -24 46 8
7743 8 -51 -49 -7 3 -13 -75 -28 3 -45 -64 -40 -30 -6 19 -6 54 2 32 -62 26 -27 2 16 11 21 -43 13 -18 42 75 11 -49
7775 -49 -81 -19 91 -29 27 -2 6 -8 -16 22 32 -36 44 10 -33 -21 16 -24 -5 -17 36 -8 -6 59 -17 7 -8 15 40 17 15
7806 15 -26 5 -8 14 7 44 -53 -49 -39 12 21 -16 -2 -21 28 -55 16 90 0 -14 40 -11 34 -33 18 -8 10 19 60 -52 -2 41
7838 41 -26 -11 20 -3 19 -58 29 37 14 -25 -26 112 -6 29 15 16 -51 17 -28 -67 -58 -11 39 38 -28 -5 -18 8 13 11 31 19 -6
7871 -6 59 0 1 33 -19 32 -26 30 23 -39 43 -19 43 16 -1 45 22 38 -36 33 37 -38 24 20 124 -27 -32 -51 -28 -64 22 39
7903 39 33 4 -43 59 -17 -22 -34 12 56 -55 -48 -47 -66 -9 -70 -58 -40 -1 74 -47 11 12 30 6 -23 13 28 57 -6 -37 -39 -19
7935 -19 -55 -61 27 -42 49 -7 46 -2 -44 -18 26 35 13 -1 70 0 -50 -29 0 23 2 4 60 -16 15 -27 -58 -4 -2 -18 -12 -62 -14
7968 -14 -17 5 -68 24 -25 -31 3 -7 26 36 43 -44 -5 2 0 -49 72 -36 -6 -52 -88 -4 -31 47 36 40 8 3 12 -90 28 -14
8000 -14 -29 -6 26 -12 19 12 3 -15 -77 -10 -13 -6 63 -10 26 5 -47 -36 52 8 1 25 10 6 62 -33 -2 3 -9 24 -43 32 66 -48
8034 -48 -15 72 -29 -45 -12 37 -42 -17 -7 41 -17 16 49 -11 -11 -16 46 18 -16 -49 19 65 54 -42 -24 20 46 -25 -2 -27 42
8065 42 -5 -4 -27 47 17 -20 -40 -21 -29 13 9 -1 26 6 -4 -10 24 51 -57 -50 -12 -5 4 29 28 -9 -15 1 1 67 24 -15 9 -13 18
8100 18 8 -16 -7 4 40 -64 -22 5 35 21 37 43 29 -35 38 -34 49 -1 15 33 -40 7 -28 38 2 0 54 39 70 42 -7
8131 -7 1 -17 23 -44 -2 46 63 42 -9 17 29 -1 31 18 -66 3 27 -35 -40 -22 -13 37 23 -15 -17 -49 76 6 15 -22 15 -26 -27
8164 -27 -23 -2 15 20 -2 39 14 26 28 -12 -8 4 -23 42 9 -22 -7 5 49 42 36 46 -31 25 56 -1 6
8191F
$$ Imaginary data points
##PAGE= N=2
##DATA TABLE= (X++(I..I)), XYDATA
0 0 0 0 0 0 0 0 0 0 4 0 0 -8 8 -5 8 -8 8 -12 12 -14 20 -20 20 -27 28 -34 35 -41 46 -54 55 -61 68 -77 83
35 83 -93 101 -113 126 -137 150 -166 186 -205 228 -254 287 -326 370 -428 500 -593 720 -896 1152
55 1152 -1550 2234 -3536 6529 -16208 105122 610017 195378 -280655 16251 109546 -327765
67 -327765 -204218 458983 376916 -316148 -384902 36214 59826 -14383 274645 278640 -252958
78 -252958 -403208 63375 263369 18177 -32923 54203 -127097 -205232 133919 300726 -16819
89 -16819 -217088 -33481 62998 -36010 2404 87378 -35887 -134402 10917 141889 85796
100 85796 6110 -50365 -127251 -85058 77805 104931 -7278 -33782 -35645 -117872 -40842 223502
112 223502 229562 -88087 -224960 -76641 -11335 3284 179215 197413 -148456 -318079 -12109
123 -12109 227051 109153 29060 45247 -157353 -301325 23916 346670 133599 -164645
133 -164645 -76221 14440 -115598 -22961 266312 150286 -247915 -237631 80033 113453 -11127
144 -11127 89988 135971 -121904 -232214 39204 203113 30641 -88223 -27640 -55465 -104787
155 -104787 58161 203966 51471 -140711 -82544 34533 20062 20154 70091 -10571 -145943
166 -145943 -75727 115028 127597 -13586 -68203 -28042 -24214 -17376 59174 85891 -26062 -122511
178 -122511 -51762 78804 94226 21760 -20807 -39080 -71264 -47039 62396 111831 10146
189 10146 -97022 -67692 17124 49362 63070 65198 -18689 -124970 -88423 52529 101128 33333
201 33333 -22526 -44117 -65545 -23992 85855 110267 -5158 -98632 -67193 -526 30715 54002
213 54002 50049 -21159 -83511 -43515 44108 67542 22722 -25090 -45830 -38794 -4416 38940
225 38940 54033 18889 -38792 -54259 -5922 40394 28747 -2953 -12637 -25637 -36785 6818
237 6818 63301 34241 -37267 -33717 11434 4154 -7627 29283 23305 -49939 -49292 40431 53886
250 53886 -19284 -24037 23311 -6039 -43472 20728 63368 -18177 -67781 6960 45165 -12855
262 -12855 -15095 41351 6197 -65527 -16897 60762 17321 -40607 2158 25517 -32895 -30177
274 -30177 49128 41542 -40131 -34352 24541 4847 -29315 16613 41876 -19551 -43541 14322
286 14322 29219 -15573 -9839 26828 1330 -33646 -406 28411 -4610 -18781 15672 16324 -19941
299 -19941 -14210 16208 5853 -10856 9301 15215 -15877 -20308 10932 15690 -3035 1031 5949
312 5949 -15360 -17888 14837 24260 -2350 -12065 -2857 -9490 -10135 16988 24619 -8049 -24527 -4715
326 -4715 5581 1942 14826 18380 -15276 -34938 -4145 23369 11535 441 2730 -13406 -27086
339 -27086 3320 37006 17493 -18773 -18954 -6594 -5670 9330 30323 10430 -29902 -26788 8953
352 8953 20507 10345 6743 -4815 -27395 -18816 21456 34224 4665 -18647 -16500 -10046 1898
365 1898 24285 24593 -10700 -35590 -17532 12966 24126 20226 4389 -23240 -33752 -4737 30936
378 30936 29694 -29 -23958 -29135 -14528 16869 38501 20926 -19533 -37354 -18432 12503
390 12503 30880 25033 -4473 -34494 -31814 3567 33598 29856 768 -26984 -31978 -8742 24678
403 24678 35924 12234 -22025 -33768 -13669 18418 34408 19269 -14286 -35380 -23235 10301
415 10301 33629 25904 -5164 -31078 -27842 2132 31103 31668 2944 -28569 -33851 -8122 24420
428 24420 33839 11785 -21455 -35371 -16706 17849 35777 20312 -13303 -34214 -23755 8056
440 8056 32774 26741 -5364 -33018 -29902 -195 28412 31191 5744 -25481 -33186 -8809 24206
453 24206 34178 12854 -19574 -34624 -18312 15259 34537 21107 -11035 -31719 -23939 5377
465 5377 31493 28831 -2026 -29962 -27186 -198 24647 29241 9358 -21618 -34056 -11311 21809
478 21809 29153 9440 -13755 -25621 -18462 9681 34479 23055 -13693 -31518 -17105 4903
490 4903 19245 22804 4735 -26582 -32105 694 30121 24694 1959 -15655 -25799 -18315 12875
503 12875 35331 16466 -19248 -28280 -11316 6957 20924 24413 2342 -29473 -29571 3116 26094
516 26094 19875 3282 -10667 -20372 -13468 12581 27872 10103 -17432 -22193 -7038 7335 15294
529 15294 15642 1710 -17632 -17010 5992 20826 8803 -9924 -13677 -8506 -2727 9673 20517
542 20517 6858 -20066 -20445 6368 18696 6191 -2562 -4387 -15878 -17707 11264 32974 9504
555 9504 -22209 -17220 -70 -410 5446 22413 8534 -29043 -27294 13062 25889 5707 535
568 535 3330 -18328 -28287 8176 35767 8013 -21734 -8750 3733 -7353 2121 29480 14858
581 14858 -27913 -26103 9950 13276 -4509 5243 15286 -10984 -26070 6245 28214 2230 -16852
594 -16852 597 5312 -14608 -8436 20295 14463 -15520 -11830 12561 5909 -13538 -2795 13128
607 13128 -1729 -15534 2268 15233 -2779 -13779 4949 15140 -2254 -11697 927 3501
619 3501 -10589 -7089 15101 15745 -8214 -15301 2531 8771 -2662 63 13446 1163 -24347
632 -24347 -14578 18292 19276 -4439 -3596 8760 -8921 -24374 6214 33566 4512 -26161 -5631
645 -5631 11689 -10902 -9929 30347 25824 -28422 -32410 14678 15209 -17329 3331 34601 -6105
658 -6105 -46718 -2068 40509 2404 -23945 15394 18274 -37434 -30979 36662 33463 -25490 -15850
671 -15850 26518 -3738 -39710 9365 47697 -4979 -39723 5862 22257 -22027 -15751 38035
683 38035 22812 -34647 -20456 24169 4071 -23386 11190 31219 -12913 -32281 8191 21790
695 21790 -8152 -6613 19461 4463 -25578 -11131 15990 8654 -3899 4071 4434 -10182 -10528
708 -10528 3423 9438 7163 1384 -9039 -11259 -81 4456 1063 8891 11912 -11092 -23275 2565
722 2565 17839 -2116 -5178 14937 -112 -30993 -7202 32125 10468 -20693 3434 16036
734 16036 -23988 -25447 31101 32547 -24472 -21733 23010 1698 -34562 10045 48231 -7243 -45128
747 -45128 7152 28851 -21563 -17629 41779 20935 -46699 -22367 37357 8439 -30831 13924
759 13924 37649 -25114 -44980 21065 36404 -18480 -16124 29265 3172 -44038 -6166 42946
771 42946 8691 -27724 2776 16373 -22251 -21289 27727 27565 -17499 -19857 7892 582 -13670
784 -13670 9293 24956 -2218 -23373 -7871 7049 3330 4121 9663 1545 -12007 -11483 465
797 465 10876 10801 -311 -8259 -3966 -1036 -4726 3078 16487 5772 -15753 -8461 10076 659
811 659 -11059 8323 18272 -9158 -20370 7282 14064 -11561 -7289 21822 8942 -25584 -12517
824 -12517 17840 3962 -13762 10753 21440 -15601 -29630 7573 22624 -3505 -6268 13446
836 13446 -2946 -30558 -6696 31077 17278 -13292 -7565 1642 -14761 -12046 22825 28114 -9856
849 -9856 -27039 -4970 7091 443 9725 21342 -1567 -30737 -16498 16826 17822 486 566 1433
863 1433 -15505 -16879 13422 27402 882 -18837 -5495 3076 -6551 861 20017 7343 -20957
876 -20957 -12626 14558 9004 -9723 -429 9610 -8312 -14305 11199 17072 -10562 -16238 8570
889 8570 11274 -7152 -2440 9770 -7164 -19941 5219 24003 3153 -14612 -3908 -42 -8154
902 -8154 5019 22814 4993 -23113 -16469 5604 9497 8961 12860 -628 -23037 -16779 10574
915 10574 20040 9303 -1505 -12187 -18926 -4976 18512 20649 3262 -10478 -16505 -13190 6133
928 6133 23206 11912 -11119 -15066 -7264 -2048 10679 22075 4333 -23339 -17373 7167 9647
941 9647 3303 8841 1305 -21963 -14800 19126 21157 -6774 -11362 576 -7503 -10015 16594 23040
955 23040 -11939 -26110 2283 14842 -448 2604 12728 -10118 -28311 2019 29684 8225
967 8225 -14301 -3542 -732 -13507 2447 29143 10256 -26161 -18636 8308 7798 3435 14902
980 14902 5234 -25180 -20637 15590 23135 1242 -6010 -4588 -15420 -11224 18586 26498 -2751
993 -2751 -21030 -9978 -434 2941 14729 15315 -9942 -25528 -7285 13400 13155 7143 707 -14209
1007 -14209 -19045 1594 20338 12035 -4749 -10456 -11438 -6380 11121 20676 3922 -15722 -13429
1020 -13429 -1668 5058 12024 12575 -5209 -20522 -8706 11867 13669 5043 -512 -9648 -16062 -1543
1034 -1543 19117 14392 -6114 -12472 -6776 -2953 5837 17221 8517 -14835 -18584 -141 11041
1047 11041 8613 6149 -957 -15183 -14344 7189 19021 6461 -7695 -9705 -8614 -3334 11033
1060 11033 16800 457 -16241 -11430 2184 8033 9224 6142 -6586 -16487 -6672 11114 13827
1073 13827 3223 -5706 -9668 -8565 2111 14084 10619 -4836 -12997 -7674 2113 9639 11129 2326
1087 2326 -10643 -12607 -1136 10004 10870 3167 -6754 -11639 -5768 6343 12280 6431 -4683 -11062
1101 -11062 -7890 2396 10590 8457 -1745 -9595 -8581 -465 8139 9464 1530 -7922 -9438 -2391
1115 -2391 5690 8584 3911 -4980 -9518 -4300 4860 8164 4161 -2618 -7498 -6221 1767 8521 5982
1130 5982 -2075 -6713 -5312 -105 6111 7584 863 -6933 -6511 -110 4720 5868 3356 -3361 -7962
1145 -7962 -3346 5140 6737 2169 -2069 -4815 -5191 657 7371 5117 -2649 -5203 -2955 -932 2711
1160 2711 6463 2151 -6438 -6092 1228 3479 1828 2475 -4 -6491 -5110 4396 6302 -733 -2529
1175 -2529 -353 -3111 -3456 4691 7064 -2481 -6661 220 2332 -1720 1497 5712 -1502 -7785 -158
1190 -158 6336 529 -2622 2698 1247 -5628 -1492 6763 2318 -5046 -564 3724 -1976 -3304 4044
1205 4044 3786 -4208 -3030 3856 1391 -3862 135 3792 -1073 -3314 1662 2238 -2470 -1583 2553 756
1221 756 -2146 -292 833 -1193 -605 1699 143 -1535 84 49 -1516 826 2630 -1424 -3220 1728
1237 1728 2417 -2536 -1057 4018 -209 -5149 1297 5882 -1756 -5154 2939 3817 -4290 -1620 6780
1252 6780 682 -8413 -237 8391 -77 -5701 3143 3667 -7165 -3649 9862 5268 -8338 -4196
1266 -4196 5111 -924 -4602 6444 7709 -7488 -10167 3798 6796 -1833 -131 4684 -4022 -10342
1280 -10342 1192 10722 2762 -5029 -2185 -1207 -4019 864 8077 3898 -5525 -6597 -1229 2739 4052
1295 4052 3204 -474 -3953 -4030 -1027 4000 6404 755 -6379 -3683 2875 1785 -117 4011 2208 -7460
1311 -7460 -5524 7539 6971 -5202 -4004 4802 -707 -6758 4759 10224 -5661 -11747 4549 9536
1325 9536 -4401 -4341 7287 -509 -12910 1119 16063 1014 -13708 -1485 6793 -4623 -3292
1338 -3292 12700 5768 -15885 -10544 10375 8207 -3762 1465 4313 -10150 -11977 8689 15728
1351 15728 -699 -8893 -2101 -2121 -4822 5826 13656 1280 -12538 -8076 2431 5036 5014 5004 -992
1366 -992 -8767 -7151 2542 9167 6354 -2131 -7088 -4027 637 1976 4185 5721 -1600 -9836 -3352
1381 -3352 7855 3912 -4657 -66 4038 -4852 -6119 7163 7229 -8489 -7434 8706 5832 -8499
1395 -8499 -2840 7743 -3020 -10381 6988 14307 -6178 -14627 2778 7768 -4589 202 12666
1408 12666 -1164 -19067 -4462 15526 6786 -5283 1829 1474 -13239 -7719 15295 14879 -6220
1421 -6220 -10291 -591 -2039 -3633 9636 14033 -3960 -15653 -4664 6007 4056 3648 5656 -2281
1435 -2281 -11792 -5976 7311 9204 1298 -3563 -3760 -3682 -1937 3120 6582 2576 -5265 -6361 775
1450 775 4430 185 -1600 2089 525 -5005 -1425 5879 1302 -6596 -521 7304 373 -6407 579
1465 579 3876 -4708 -3009 9540 5947 -9749 -7709 5992 3874 -3392 4560 7903 -8366 -14057
1479 -14057 4707 13617 337 -4653 3130 -2298 -12256 467 16975 6175 -11115 -6155 2550
1492 2550 -2933 -1893 11450 8845 -10370 -12833 2750 6857 -91 2031 5316 -4876 -11645 -145
1506 -145 10258 3894 -3878 -1460 -346 -4492 -1918 6097 5323 -3149 -5287 115 2488 -259 -627
1521 -627 1964 1264 -2666 -2196 2500 2689 -2615 -3021 3319 4143 -2316 -3311 1781 922 -3514 1129 7214
1538 7214 261 -8262 -2310 5768 1369 -2146 4060 3004 -8523 -7186 7546 8659 -3696 -4269
1552 -4269 3125 -2103 -8132 3535 12632 -352 -11578 -1994 5533 -2033 -2209 8224 4183 -10859
1566 -10859 -7753 7478 6287 -3976 -630 4679 -4133 -8573 3844 10147 -1135 -6902 1063 2804
1580 2804 -4284 -1290 7357 2684 -6996 -3098 5037 1520 -3575 1215 4145 -2287 -4452 2384 4131
1595 4131 -2138 -3039 2493 2631 -2167 -1720 1981 507 -2586 79 3439 747 -3349 -2086 1440 1409
1611 1409 -141 618 1060 -1890 -3725 -49 4170 2228 -2288 -2133 -13 -1131 -1259 3109 4276 -2027
1627 -2027 -5529 -352 3286 42 -641 3078 816 -5568 -2869 5080 3641 -3034 -1220 2916 -1504
1642 -1504 -4548 2549 6204 -1455 -5095 1634 3224 -3086 -1978 5040 2209 -5368 -1779 4753 412
1657 412 -4363 1239 4779 -2134 -4693 2457 3662 -3185 -2562 4082 1833 -4719 -1655 4068 421
1672 421 -3686 972 3408 -2177 -3854 2019 3134 -1972 -1852 2205 527 -3136 -311 3231 271
1687 271 -2598 -4 1710 -772 -1233 1472 1264 -1399 -1002 1094 703 -719 -48 726 -2 -286 339
1704 339 250 -160 -144 110 394 794 69 -1173 -664 915 756 -270 202 390 -1489 -1517 1551 2137 -779
1723 -779 -1695 125 -50 -1209 931 2676 -472 -3364 -775 1904 388 -372 1313 15 -3232 -1416
1739 -1416 3027 2235 -1542 -1267 281 -1099 -1049 2454 2770 -1726 -3231 196 1703 438 787 1331 -1325
1756 -1325 -3139 230 3375 1600 -1111 -1040 -728 -1188 665 3068 1384 -2350 -2588 78 1462 1347
1772 1347 1196 -299 -2470 -2206 997 2845 1339 -980 -2106 -1711 -169 2025 2443 96 -2672 -2626
1788 -2626 -35 2053 2188 526 -1688 -2873 -1518 1675 3267 1354 -1745 -2805 -1415 1004 2707
1803 2707 2364 -410 -3181 -2561 728 3057 2506 201 -2277 -2965 -661 2726 3442 737 -2185 -2847
1819 -2847 -1214 1619 3425 1984 -1590 -3413 -1747 1218 3029 2433 -610 -3521 -2906 685 3164
1834 3164 2431 8 -2608 -3522 -1093 3070 3843 348 -2888 -3087 -1428 1273 3789 2646 -2185 -4547
1850 -4547 -1748 1825 2818 2313 323 -3526 -4292 673 4709 2724 -918 -2146 -2564 -1890 2215 5297
1866 5297 1527 -3980 -3583 209 1658 2327 3136 -257 -5130 -3248 3031 4375 904 -884 -1651 -3415
1882 -3415 -1421 4302 4796 -1165 -4498 -2176 148 1261 3452 2755 -2933 -5630 -1106 3521 3051 1049
1898 1049 -714 -3571 -3997 986 5102 2793 -1908 -3396 -2587 -466 2966 4324 488 -3885 -3709 -408
1914 -408 2519 3781 1949 -2492 -4414 -1363 2433 3315 2293 -491 -4012 -3579 1788 4771 1958 -1334
1930 -1334 -1878 -2572 -1799 3144 5425 75 -4980 -2481 1236 912 1813 3465 -874 -6121 -2418 4460
1946 4460 3358 -1005 -729 -765 -3816 -1459 5250 4266 -3271 -4458 63 743 114 3149 2837 -3807 -5684
1963 -5684 934 4589 1486 -447 -227 -2680 -3536 1865 5679 1565 -3318 -2909 -963 328 2705 3786
1979 3786 21 -4179 -3286 568 3189 3350 773 -2856 -3542 -619 2011 2873 2479 -851 -4670 -2908
1995 -2908 2704 3744 383 -491 -498 -3290 -2548 3812 4997 -1805 -4333 264 705 -1975 1568 4768
2011 4768 -1626 -6454 167 5007 -385 -2611 2357 998 -5149 -1270 6354 1766 -5593 -1312 3824
2026 3824 -933 -2555 3987 3158 -5522 -4055 4899 3803 -2957 -872 2708 -2383 -4145 3688 6099
2041 6099 -1997 -4785 503 1352 -1472 1701 4475 -1124 -5508 -1174 3087 1583 523 1107 -1596
2056 -1596 -3864 -647 3122 2289 213 -1070 -2668 -2192 1451 2713 421 -467 -563 -2631 -1968 2931
2072 2931 3514 -1621 -2550 1236 -170 -2966 1484 4679 -1424 -4789 1525 3436 -2883 -2124 4770 1678
2088 1678 -5522 -763 5633 -577 -5511 2334 5643 -3216 -4569 4408 3018 -5685 -1688 7092 1222
2103 1222 -6702 -175 5357 -2118 -4420 4617 4681 -5518 -4710 4625 2729 -4086 161 4913 -2157
2118 -2157 -6252 1579 5425 -1238 -3044 1987 773 -4061 -939 4443 1573 -2953 -1011 988 -963
2133 -963 -909 1894 1685 -1044 -1559 -483 95 781 971 68 -110 144 -1135 -1369 1710 2436 -1025 -1595
2151 -1595 1523 327 -3085 83 4569 612 -3987 76 2818 -2202 -2687 4375 3688 -4624 -3815 3665
2167 3665 1522 -3805 1168 5647 -2228 -6947 1434 5502 -1739 -3008 3952 1387 -6507 -2104 6535
2182 6535 2296 -4961 -453 3468 -2643 -4121 4045 4914 -3433 -4099 2616 1813 -3168 32 4446 -176
2198 -176 -4545 0 3460 -305 -2185 1478 1896 -1727 -1656 1681 1344 -1346 -770 1491 1007 -1030 -1127
2215 -1127 375 755 -121 -34 1189 487 -2160 -2020 1669 2613 -570 -1489 566 -446 -2830 454 4604
2232 4604 999 -4237 -1791 1959 -412 -1250 3372 2767 -4430 -4767 2590 3615 -1383 -376 2743 -1799
2248 -1799 -5466 1133 6276 510 -4015 67 1461 -2785 -1173 5142 2799 -4543 -3086 2765 1438
2263 1438 -1769 1349 3000 -2248 -4073 1549 3869 -581 -2070 968 679 -2122 -303 2987 759
2278 759 -2783 -1213 1859 992 -963 -236 695 -846 -1425 955 2269 -197 -2498 -1104 1222 874
2294 874 -306 469 318 -2094 -2113 1718 3264 -138 -2389 -498 225 -1178 726 3541 683 -3986
2310 -3986 -2315 2238 1834 -387 1172 1167 -2954 -3242 2399 4232 -245 -2294 67 -321 -1936 1173
2326 1173 4178 493 -3876 -1680 1815 739 -204 1795 819 -3060 -2511 2157 2812 -514 -1377 -10
2342 -10 -732 -1410 1146 2670 -74 -2628 -1189 1053 850 151 537 -112 -1783 -1244 1286 2090 -65
2359 -65 -1734 -863 136 141 611 1404 139 -2196 -1463 1474 2070 130 -684 -168 -937 -1144 1318 2849 69
2378 69 -2618 -1122 1006 564 391 1492 146 -2723 -1760 2011 2174 -273 -778 -138 -1398 -1330 1823
2395 1823 2736 -600 -2587 -831 569 41 779 1559 -543 -2738 -1043 1728 1452 -75 -283 -655 -1571
2412 -1571 -418 1863 1639 -564 -1514 -824 12 667 1199 734 -917 -1594 -485 1031 1393 606 -585
2429 -585 -1129 -561 450 1145 1020 100 -1280 -1285 404 1488 774 -217 -539 -842 -776 755 1856 411 -1542
2448 -1542 -1065 255 284 451 1133 47 -1994 -1331 1166 1348 -56 -344 -159 -1167 -964 1276 1833 -390
2466 -390 -1544 -415 125 -112 820 1362 -536 -1942 -434 1259 712 -6 309 -446 -1435 -190 1642
2483 1642 1149 -572 -755 -222 -220 284 1283 696 -986 -1141 7 534 430 557 35 -998 -840 501 993
2502 993 348 -162 -579 -809 -222 776 782 -172 -652 -479 -444 159 896 509 -720 -880 -152 294 296 469 134
2523 134 -963 -861 388 764 88 -50 -20 -579 -576 696 1133 -222 -725 -46 188 -193 402 928 -101
2542 -101 -1064 -96 719 202 -150 423 39 -905 -166 1010 439 -561 -199 279 -284 -352 662 545 -597
2561 -597 -650 296 372 -215 -23 302 -276 -636 84 514 -35 -313 -23 -39 -169 17 327 52 -326 -173 112
2582 112 128 16 24 61 8 -80 -79 183 136 -44 -132 120 257 -117 -126 391 326 -204 -183 381 74 -449 151 751 -41
2607 -41 -701 93 543 -283 -333 662 299 -986 -596 757 395 -479 -15 493 -595 -883 592 1020 -476
2626 -476 -881 132 119 -582 172 1031 -77 -1307 -349 799 109 -384 442 235 -992 -641 973 819
2644 819 -497 -517 229 -10 -318 515 928 -319 -1031 -4 829 296 -90 146 -96 -621 -131 881 757
2663 757 -374 -832 -152 360 287 355 302 -346 -1098 -448 1001 1130 -319 -959 -322 -106 -234 687 1195 -425
2683 -425 -1938 -677 1089 662 -168 336 -69 -1717 -960 1703 1812 -754 -1304 50 -254 -690 1233
2700 1233 2128 -628 -2560 -276 1596 338 -127 1100 6 -2365 -815 2392 1599 -1207 -764 497
2716 497 -649 -958 1652 2012 -1199 -2345 405 1350 -173 -30 1047 -400 -2125 -126 2244 703
2732 703 -1422 -708 270 -360 -166 1395 843 -1663 -1819 508 1444 363 -220 -189 -879 -1143 497 1918
2750 1918 913 -1253 -1758 -301 839 909 903 407 -1220 -2075 -78 2366 1709 -690 -1137 -530 -707 -98
2768 -98 2282 2051 -1483 -2891 -146 1603 525 529 1314 -788 -3220 -440 3185 1605 -1504 -772 257
2785 257 -1454 -891 2627 2376 -2120 -2851 789 1363 -661 369 1821 -1107 -3082 325 3061 342
2801 342 -1972 -2 660 -1330 -406 2435 1202 -2509 -1760 1522 1313 -496 182 744 -1387 -1736 1362
2818 1362 2715 49 -1917 -721 290 13 785 1848 307 -2338 -1898 1179 2218 667 -530 -591
2834 -591 -1147 -1349 852 2776 1086 -2250 -2182 154 839 461 1335 935 -2073 -3010 538 2940 658
2851 658 -1152 -254 -567 -1942 -47 3207 1486 -2561 -1989 988 538 -568 1300 1659 -1806 -2821
2867 -2821 1074 2670 -183 -1337 647 131 -1783 193 2776 519 -2530 -871 1656 573 -677
2882 -677 846 870 -1713 -1634 1673 2268 -681 -1563 29 208 -629 616 1873 -88 -2454 -1085 1501
2899 1501 1338 -200 -88 -129 -1486 -1373 1311 2450 -69 -2153 -1056 460 44 446 1628 431 -2502
2916 -2502 -2030 1348 2051 -165 -517 291 -1046 -1802 1005 2949 297 -2310 -713 864 -338 -58
2932 -58 1920 896 -2340 -1673 1604 1527 -711 -173 905 -731 -1690 950 2259 -348 -1818 79 943
2949 943 -500 -322 1309 227 -1758 -695 1459 841 -852 -397 332 -409 -765 766 1163 -655 -1525
2966 -1525 -118 887 289 -202 258 -143 -1074 -514 1119 1239 -470 -1232 -132 320 -177 321 1213 -28
2984 -28 -1685 -786 1342 936 -436 -1 480 -888 -1205 1141 1923 -426 -1465 297 618 -763 -35
3001 -35 1732 219 -1882 -442 1472 241 -956 435 884 -1132 -1245 1149 1232 -1038 -826 866 250
3018 250 -1190 96 1308 -277 -1382 165 959 -378 -756 583 462 -855 -377 747 263 -736 -227
3035 -227 600 -14 -414 128 385 -265 -337 250 458 -21 -248 -58 194 118 -70 24 374 44 -401 10 487
3056 487 130 -530 16 445 -237 -561 428 598 -513 -594 589 312 -801 -266 860 48 -907 -2 814
3075 814 -472 -890 623 791 -697 -755 595 360 -805 -50 1044 -67 -1196 -26 855 -175 -541
3092 -541 613 377 -958 -470 974 651 -623 -129 413 -338 -506 689 908 -351 -785 92 317 -16
3110 -16 246 503 -304 -729 -53 600 362 -6 -108 -377 -365 164 556 242 -181 -459 -436 74 499 343 -228
3131 -228 -320 -267 -290 125 705 242 -755 -630 250 435 103 224 132 -713 -695 523 914 -7 -438 -61 -334
3152 -334 -396 595 1071 -145 -1025 -234 473 197 231 650 -43 -1108 -300 912 709 -151 -170 -198 -619 -58
3172 -58 937 799 -533 -834 -135 120 248 608 381 -728 -1078 8 638 483 157 -295 -725 -498 304
3191 304 750 342 -414 -707 -510 106 709 573 -193 -667 -576 -69 556 872 150 -772 -730 -6 491 632 517
3212 517 -248 -999 -539 643 930 246 -267 -409 -655 -185 956 952 -269 -919 -404 47 247 698 579 -632
3232 -632 -1254 -152 776 587 36 -65 -662 -910 150 1118 589 -506 -705 -416 -173 426 958 203 -987
3251 -987 -886 56 620 487 310 -319 -961 -508 488 895 360 -322 -666 -526 134 863 646 -109 -725 -583
3271 -583 -40 697 903 83 -768 -660 -66 456 692 574 -391 -1101 -446 727 742 229 -80 -515 -904 -158
3291 -158 1153 822 -471 -790 -301 -236 134 940 586 -885 -1248 77 728 244 186 231 -719 -1098 310
3310 310 1267 325 -683 -339 -134 -413 297 1130 244 -1033 -675 410 550 250 329 -76 -883 -536 720
3329 720 884 98 -367 -377 -326 -90 656 747 -136 -750 -545 160 607 532 76 -519 -609 -226 423 811 380 -611
3351 -611 -919 -158 403 375 306 80 -607 -904 67 1005 341 -524 -369 -129 -470 93 1090 460 -1055 -831
3371 -831 472 448 -93 383 508 -763 -1018 566 1232 -33 -527 155 -10 -631 199 1181 95 -1052
3389 -1052 -419 562 153 -214 514 266 -835 -567 715 798 -354 -456 134 -162 -381 309 696 -104 -883
3408 -883 -233 445 264 -68 57 -71 -564 -446 513 697 -129 -722 -188 140 -6 92 566 152 -766 -593
3428 -593 522 704 -158 -271 242 -212 -649 334 1155 70 -958 -148 490 -82 -244 725 463 -920 -764
3447 -764 799 695 -468 -124 593 -279 -966 330 1043 -225 -886 240 491 -581 -378 770 349 -924
3465 -924 -354 751 174 -743 -88 631 -213 -636 276 625 -360 -688 336 519 -270 -363 358 213 -529 -193
3485 -193 658 334 -524 -304 415 175 -283 105 585 -65 -645 12 691 98 -455 101 445 -387 -516 492
3505 492 680 -402 -614 409 290 -529 -218 922 259 -907 -261 750 -46 -743 299 738 -475 -948
3523 -948 425 652 -584 -525 703 290 -984 -302 920 200 -855 -15 754 -391 -871 561 837 -446
3541 -446 -701 438 401 -551 -180 897 217 -881 -251 735 167 -460 270 531 -393 -628 337 759 -141
3560 -141 -446 185 262 -379 -174 543 333 -588 -438 383 243 -391 -128 354 -85 -617 18 637 -27 -684
3580 -684 -59 509 -146 -474 285 429 -563 -596 535 561 -557 -457 464 173 -597 42 888 -60 -1018 -34
3600 -34 846 62 -509 370 471 -755 -587 932 811 -573 -496 420 70 -562 378 1080 -204 -1062 -90
3619 -90 780 -41 -333 491 230 -961 -538 771 708 -463 -415 229 -208 -545 288 815 -141 -928 -166 425
3639 425 9 -235 313 134 -667 -414 524 534 -332 -368 102 125 -265 85 584 -33 -681 -170 622 279 -217
3660 -217 -21 230 -199 -306 463 673 -352 -717 107 464 3 8 459 -5 -851 -303 852 517 -423 -320
3680 -320 185 -245 -329 625 771 -502 -943 57 554 -100 20 438 -178 -1016 -220 881 455 -525 -203
3699 -203 169 -384 -322 636 673 -508 -815 137 426 -60 83 456 -156 -711 -6 824 357 -305 -87 91
3719 91 -237 -107 540 563 -354 -523 120 426 141 53 161 -206 -441 48 639 304 -326 -329 -33 20 15 234 282
3742 282 -351 -675 -49 486 215 -292 -191 -107 -400 -75 593 427 -517 -594 54 251 8 154 303 -288 -720
3763 -720 87 684 247 -248 -58 -81 -355 23 657 417 -492 -489 189 249 0 298 377 -372 -550 203 678 145
3785 145 -311 -23 -126 -305 64 528 229 -452 -314 157 161 -14 153 88 -330 -379 158 441 32 -316 -182
3806 -182 -67 -113 130 361 83 -362 -365 56 298 62 16 1 -213 -191 123 435 104 -253 -176 77 145 39 303
3829 303 141 -406 -274 230 379 95 -39 45 -83 -217 150 495 169 -349 -118 131 -14 -19 206 144 -359
3850 -359 -317 193 382 18 -141 12 -194 -165 96 359 28 -339 -169 50 26 0 220 -37 -292 -255 130 137
3872 137 21 -121 -86 -60 -59 59 137 34 -225 -59 83 147 25 -29 -6 -166 -159 57 308 49 -188 -44 120
3895 120 25 -21 173 122 -232 -183 196 210 -44 -83 55 -31 -201 86 316 -40 -278 63 188 -102 -76 186 15
3918 15 -340 -79 250 59 -195 -10 156 -134 -220 183 216 -200 -54 114 -25 -155 35 188 -33 -186 2
3939 2 194 37 -82 71 63 -6 56 159 59 24 25 -3 19 37 17 29 47 -11 -49 13 153 -45 -111 -7 9 -35 -99
3966 -99 66 83 -178 -100 131 6 -291 33 190 -151 -243 90 130 -227 -136 108 151 -252 -90 275 24 -289
3988 -289 96 274 -160 -299 210 241 -220 -165 260 89 -223 -29 331 -25 -272 30 276 -123 -241 250 151
4009 151 -198 -142 250 109 -149 -101 97 -53 -150 155 140 -104 -195 22 55 -13 -21 -1 -16 -73 5 59 94 -53 -187
4034 -187 -9 78 -26 -18 94 71 -173 -125 114 174 -114 -201 169 29 -218 -5 353 -10 -338 -17 283 -7
4056 -7 -174 266 174 -314 -125 347 218 -243 -81 309 -53 -319 212 412 -219 -338 161 278 -212 -159 248
4077 248 73 -397 -117 392 23 -312 45 220 -252 -242 214 225 -257 -199 173 197 -98 10 167 -3 -255
4098 -255 -67 309 76 -214 -121 87 30 -40 80 207 -23 -239 -40 284 109 -177 27 213 -128 -150 205
4119 205 274 -140 -291 164 290 -200 -70 324 -29 -493 -73 478 75 -391 59 295 -229 -375 374 343 -405
4140 -405 -318 377 114 -408 8 409 -139 -553 177 431 -114 -327 211 246 -384 -122 458 184 -375 -102 329
4161 329 94 -237 67 296 -52 -247 188 312 -108 -202 112 187 -80 -77 145 49 -243 -216 220 201 -107 -113 98
4184 98 24 -144 -15 284 53 -358 -147 299 80 -257 45 283 -176 -442 173 440 -135 -324 245 150 -381
4205 -381 -134 510 120 -475 -97 421 3 -366 283 449 -280 -425 406 376 -318 -195 425 198 -354 -28
4225 -28 530 -26 -429 106 441 -109 -400 209 288 -303 -192 389 205 -392 -129 351 84 -256 -20 266 -84
4246 -84 -315 67 328 -28 -302 -17 143 -215 -184 156 178 -163 -281 109 139 -134 -194 172 75 -307 -121 338
4268 338 124 -234 -98 282 47 -238 79 412 -79 -359 205 318 -152 -252 345 250 -333 -203 370 149
4288 149 -438 -22 349 -17 -479 114 384 -211 -351 268 342 -300 -284 284 196 -388 -158 352 -55 -421 -9
4309 -9 323 -66 -344 123 217 -274 -312 199 281 -317 -287 231 154 -243 -101 321 85 -282 -75 294 99 -216
4331 -216 44 226 -142 -260 125 259 -84 -246 131 257 -110 -125 278 216 -283 -173 345 142 -280 -12 294
4352 294 -4 -368 30 333 -161 -353 142 320 -279 -279 165 233 -335 -147 280 99 -418 -91 362 -57 -307
4373 -307 116 282 -185 -298 145 233 -165 -224 166 140 -223 20 295 65 -291 6 264 91 -192 86 281
4394 281 -32 -259 127 223 -49 -45 150 121 -168 -199 190 129 -245 -106 231 99 -182 -23 207 -16 -257 -43
4416 -43 194 -53 -275 66 155 -103 -174 119 61 -239 -184 175 116 -202 -106 247 49 -254 54 344 -31 -282
4438 -282 38 254 -91 -173 189 154 -165 -71 261 127 -249 -99 278 24 -135 85 245 -124 -168 56 230
4459 230 -84 -105 117 42 -240 -128 131 87 -120 -100 123 -14 -150 -37 156 -79 -189 33 90 -49 -147 -6
4481 -6 111 -127 -103 71 154 -146 -138 85 68 -130 -96 144 23 -214 26 164 -17 -151 3 173 -23 -139 46
4504 46 164 -54 -118 131 117 -53 -67 227 18 -205 14 186 76 -236 27 187 -53 -84 154 123 -113 -221
4526 -221 139 26 -144 -107 75 19 -196 -20 135 -32 -184 -13 106 -26 -131 19 110 -111 -139 78 103 -51
4548 -51 -69 23 42 -28 -38 65 -29 -98 -31 104 19 -9 88 87 1 -90 81 77 -45 -42 68 118 -20 -84 112 66 -62 -74
4576 -74 48 75 -96 -79 116 21 -131 37 170 -114 -128 126 86 -156 -114 65 12 -175 -74 139 -20 -93 -27
4599 -27 121 24 -86 8 127 -38 -111 60 49 -77 -22 71 54 -59 10 90 53 -40 -10 102 10 -34 127 78 -22
4624 -22 -4 77 100 -44 5 94 25 -70 4 61 26 -18 -55 -11 -25 -88 -37 74 -30 -96 8 33 8 -101 -56 -24 -57 -90
4652 -90 102 68 -112 -75 80 33 -101 -51 110 5 -150 -20 123 -3 -154 61 56 -93 -68 70 52 -127 -42
4675 -42 132 31 -54 16 112 -27 -129 41 128 -55 -94 64 98 -77 20 131 -14 -78 -35 109 -13 -50 60 34
4699 34 -3 -129 4 73 -54 -44 3 62 -47 -40 30 -31 -77 -52 47 73 -85 -74 40 -13 4 3 30 -30 -79 67 100 19
4727 19 -98 56 113 -26 -143 32 104 -151 -19 70 91 -119 -7 139 -43 -111 33 240 -35 -113 79 110 -150
4750 -150 -168 128 97 -106 -97 92 30 -135 -24 49 -26 -158 55 90 0 -141 79 78 -91 -58 61 14 -149 7
4774 7 89 -60 -105 0 87 -22 -76 18 85 -16 -9 103 147 -37 -88 85 45 -64 -41 148 117 -114 -61 127 61 -124
4800 -124 -56 176 2 -127 1 138 19 -142 121 108 -82 -183 158 125 -150 -82 142 38 -162 1 251
4821 251 30 -189 34 191 -49 -211 70 162 -87 -153 92 165 -170 -72 210 22 -163 -31 244 12 -210
4842 -210 60 141 -88 -76 124 166 -123 -80 82 38 -184 -88 152 97 -151 8 179 -54 -192 -42 114 -45
4864 -45 -172 -25 61 -127 -164 86 93 -132 -111 93 118 -120 -83 129 46 -199 -79 95 42 -173 -19 171 12
4887 12 -101 81 220 -41 -107 113 171 -120 -137 199 142 -210 -63 250 65 -262 23 139 -81 -203 93 180
4909 180 -111 -182 146 158 -129 -94 207 106 -171 -51 185 61 -226 52 164 -101 -174 71 126 -101 -166 133
4931 133 134 -59 -70 137 -20 -192 5 221 -3 -152 55 159 2 -131 69 185 8 -141 104 147 -70
4952 -70 -57 38 169 -94 -118 201 148 -127 -119 151 65 -129 -28 197 -31 -290 17 170 -57 -162 50 126 -204
4975 -204 -132 135 21 -185 -97 124 53 -179 -34 161 -15 -279 51 203 -109 -203 169 111 -193 -56 203 16
4997 16 -165 -139 172 28 -134 -34 177 -41 -162 70 199 -19 -138 51 136 -4 -71 95 145 -102 -117 139
5019 139 119 -115 -13 155 -1 -202 -5 225 16 -165 -30 115 -82 -85 51 76 -185 -200 24 168 -85 -38
5041 -38 80 -20 -177 -57 257 24 -250 -39 198 -78 -198 98 136 -216 -208 88 145 -43 -35 147 61 -149 93
5064 93 211 -6 -132 -2 172 -70 -76 99 117 -101 -104 65 103 -101 -92 90 21 -124 46 131 36 -157 -153 79 13
5089 13 -69 15 32 -100 -116 35 195 24 -95 -45 25 -111 -45 115 51 -139 -101 116 61 -103 15 36 22 -141
5113 -141 69 249 -7 -101 6 24 -32 4 227 83 -103 -43 152 93 -19 -34 95 -84 -135 100 221 -48 -147
5136 -147 -37 105 -26 -16 207 -59 -198 -107 105 77 -161 -21 49 -111 -129 70 170 -73 -180 -5 35 -42
5158 -42 -1 71 33 -180 -70 27 86 -79 -81 -11 -95 -10 51 139 -34 -76 -58 134 -31 42 52 30 -54 -92 109 146 -43
5185 -43 -64 -14 -9 -62 8 141 -76 -205 -15 116 28 -60 39 20 -116 -105 151 113 -91 -52 -10 59 -117 5 53 -22
5211 -22 -178 -18 73 1 -67 -10 14 -124 -37 90 66 -66 -115 43 10 34 8 57 -58 -128 21 125 105 18 -25 -30
5237 -30 -34 -24 106 65 -65 -112 9 85 52 109 19 -23 -99 26 106 65 -54 -98 -22 -24 1 41 90 -53 -85 29 31 -40
5265 -40 -51 23 3 -101 -32 86 4 -98 -75 82 -22 -58 103 29 -30 -87 10 90 -15 -39 112 50 -60 44 109
5290 109 84 -60 -18 21 7 -40 54 64 -91 -89 44 81 -7 -10 17 -4 -29 -3 17 25 32 -36 17 -2 -22 -55 52 -41 -19 29
5320 29 37 -39 -32 -60 -27 11 -13 58 23 -63 -76 48 101 -58 6 48 44 -34 -45 71 28 -124 3 57 -7 -20 95 62 -81
5349 -81 -58 76 28 -55 38 75 56 -92 26 91 5 -116 23 52 -42 -23 17 87 -14 10 37 -78 -26 -4 -2 44 -35
5376 -35 -26 28 -29 -37 -43 22 -105 37 23 29 25 -42 -12 58 10 -28 -8 1 -43 -41 -15 49 -62 47 40 -57 -95 26 17 -12 -36 2
5408 2 -20 -71 -41 94 49 -124 -32 73 26 -30 20 129 -12 -110 14 42 -79 -59 24 57 -87 -42 71 29 -102 -22
5434 -22 -21 -39 -36 71 36 -74 -111 69 121 -97 -55 -53 50 -15 -10 32 23 -92 -65 25 -9 -14 44 8 -53 -10 90 38 7 -67
5464 -67 -14 7 -63 6 55 33 -86 -117 31 16 40 -58 39 -12 -91 -20 138 -52 -116 -31 -19 -67 -19 57 38 -126 -52 50
5492 50 86 11 -27 40 -53 -127 73 103 -22 -56 -28 89 -7 18 135 44 -123 -82 128 87 -71 15 22 -1 -67 111 168
5519 168 -25 -166 17 97 -1 -24 95 45 -72 -77 50 79 -43 16 89 -15 -74 -16 133 -49 -123 -32 106 -13
5543 -13 39 33 21 -120 -127 96 70 -42 -31 23 18 -38 56 83 -55 -69 -24 77 25 40 93 54 -129 -86 60 114 -79 -94
5571 -94 -47 -53 -25 8 75 -41 -148 15 95 60 -19 -17 -57 -82 -105 109 137 -82 -45 30 43 -20 77 145 -44 -131 -29 151
5599 151 58 -91 -44 37 -90 -43 128 113 -52 -118 -10 14 -34 -2 118 -10 -76 -20 134 61 -68 -49 83 -71
5623 -71 -9 87 133 -78 -118 61 98 -24 3 81 -60 -130 -27 143 79 -84 -23 73 4 -78 119 94 -74 -120 40
5648 40 121 -57 -29 90 6 -128 -72 151 52 -49 -50 7 30 51 82 128 -52 -108 69 114 -12 -87 48 3 -85 39
5674 39 135 101 -123 -23 68 74 -91 114 109 -20 -48 -15 115 -44 -29 12 39 -88 37 109 -19 -53 -51 74 0 -76
5700 -76 -5 88 -39 -92 11 104 -28 -91 -20 22 -83 -47 83 -30 -94 -47 103 95 -45 -3 103 6 -88 20 153
5725 153 -24 -88 21 58 -38 -56 137 78 -126 -39 122 86 -7 -40 70 -22 -40 40 120 -7 -95 11 52 -70 -14
5750 -14 59 87 -103 -79 37 -38 -61 -39 62 -79 -48 15 35 51 -117 -43 49 -34 -70 94 -27 -33 -125 9 38 -44 -1
5777 -1 24 -36 -50 -4 45 -46 -77 -26 24 27 -74 42 119 3 -31 80 79 -73 -82 85 61 -91 -52 83 -4 -41 33 134
5805 134 58 -71 -13 70 -45 -26 35 86 -39 -71 87 57 -61 -1 63 11 3 -29 100 13 -76 104 21 21 -12 44 28
5832 28 -46 -44 49 43 -33 -4 125 -9 -30 38 25 46 -101 29 153 -26 -34 15 61 9 27 47 59 -18 -70 86 36 10
5860 10 -23 51 51 -109 -41 74 11 -68 -50 21 -38 -96 -24 -18 -22 -76 48 37 -29 -56 -14 64 -71 -31 64 11 -39 -26 -5 -72
5890 -72 -29 65 60 -48 0 76 55 -37 -26 -5 -24 -33 -60 151 57 -62 -44 80 28 -31 18 39 -15 -41 69 55 17 29 58
5919 58 -7 -30 16 70 -4 -1 -33 27 -26 -31 22 -2 -58 -10 11 -27 -50 -88 30 55 -45 33 40 91 -25 -77 8 32 -46 -32
5949 -32 34 2 -57 -47 131 18 -35 -18 -7 3 -10 32 108 -5 -103 76 0 -53 -31 48 -41 34 -36 58 16 -22 -8 -26
5977 -26 -70 -47 47 5 -82 -53 18 24 -10 -20 -2 -9 -24 8 0 3 -41 5 -26 -19 -8 2 -27 -50 23 -4 11 -24 -19 19 -50 -88 39
6010 39 99 16 -101 -17 34 15 44 27 56 -9 -18 -6 68 34 -51 10 26 -49 -8 129 31 -116 -62 86 6 3 60 108 -35
6039 -35 -37 4 39 -33 -77 15 -12 4 -18 53 -9 -138 -8 33 15 14 -42 57 -52 36 5 26 4 -49 0 30 9 17 49 44 15
6070 15 2 38 5 -28 -47 35 -25 36 -15 76 28 -75 10 22 58 -57 7 -39 7 -14 44 18 28 14 30 21 27 16 35 -1
6100 -1 -59 -7 26 44 14 42 -8 -51 -1 -2 24 -45 -36 64 -53 -24 49 54 12 -29 -3 38 -7 6 68 -21 -75 5 40 48 -66
6131 -66 10 51 -51 -44 0 90 -22 -5 -5 18 -79 4 32 -8 -48 -13 29 56 6 -19 -3 -24 -32 30 30 -61 35 33 -6 -14 -63 -3
6163 -3 30 -12 -38 -5 -2 -64 -57 40 32 -51 -51 32 -85 -167 -6 70 18 -24 34 7 -59 -52 24 13 6 -34 26 29 12 20 83 -23 -35
6196 -35 20 -4 13 -20 44 -9 -13 -60 15 40 -25 14 38 0 -21 29 41 1 -17 52 56 -9 -45 9 -21 -69 -15 -25 67 -10 60
6227 60 1 -22 -72 -48 30 -9 -3 -48 32 70 -66 47 28 -5 5 38 51 -31 -34 5 -10 -43 -10 79 42 -77 7 24 -26 -32
6257 -32 -6 110 -11 -34 -10 1 -15 17 34 2 -118 36 43 28 30 44 73 -35 -43 3 93 -51 -44 78 87 -78 11 89 20
6286 20 -20 32 47 14 -47 25 22 -18 -9 66 26 -34 -14 -60 56 -12 -45 9 64 11 -10 -4 -12 24 10 31 40 -51 -27 69 -38 -84
6318 -84 107 59 -55 -72 11 62 -44 -12 76 106 -29 -30 39 11 -63 -19 38 13 -50 37 70 9 -55 54 3 -46 -80 68
6346 68 42 -60 12 59 10 -48 43 78 -34 -52 17 25 23 -15 -17 5 -121 -30 59 83 -81 -57 25 29 -34 -42 -8 -18 -45 17 43
6377 43 -52 -49 12 47 -58 -44 -11 -44 39 -72 48 41 -61 -2 129 34 -65 33 58 7 -13 84 65 45 5 90 110 -28
6405 -28 -42 73 82 -10 40 25 35 -83 -21 31 9 -79 43 40 -55 -30 126 24 6 -65 51 24 -45 -86 65 -6 -13 2
6433 2 94 -19 -65 -41 63 -23 -79 102 -11 -79 -33 14 26 12 -10 78 26 -19 -63 68 78 17 -1 68 40 28 7 23
6461 23 -45 -92 6 100 6 -3 8 13 -11 -44 62 76 2 -35 5 32 -38 -32 -36 -51 -74 -7 19 -54 -29 43 22 7 32 61 6 -102
6493 -102 -100 12 -31 -63 -4 52 -20 -129 -17 56 29 18 1 -16 -17 44 52 5 -51 -61 9 21 -72 33 53 6 -37 13 131
6522 131 -33 -67 38 22 47 -41 -17 14 -1 -19 35 17 -8 7 4 -38 -53 64 32 138 -48 20 22 -36 -40 1 -8 -9 -83 -7
6552 -7 2 -14 -41 10 29 -39 7 113 -2 -40 -36 16 12 -60 -43 -31 3 -32 62 18 -76 -1 64 -5 1 68 34 -5 -51 -41 27 73
6584 73 -16 45 70 -28 -50 74 29 -7 22 -18 -48 -74 -5 -3 13 -9 -59 14 79 -14 64 -8 -37 -46 7 7 -43 -39 -18 -65 5 -79
6616 -79 -41 26 2 -33 -53 -12 11 67 14 6 -37 61 45 -12 9 0 34 -27 14 -55 53 -37 -31 39 16 28 -13 39 52 55 10 40
6648 40 -59 -29 19 41 38 11 -2 13 -56 -93 20 -22 -20 -39 -62 13 -32 4 -13 0 -50 32 -28 -38 -3 -29 -20 -16 -23 25 -4 -62
6680 -62 -14 20 -10 -19 14 -20 -25 -40 23 62 -45 -27 -35 31 -19 51 -39 81 0 -53 -28 -5 -25 39 20 19 4 -13 47 32 14
6711 14 52 26 -35 -83 28 21 -1 -35 38 -60 -31 63 14 57 2 1 24 10 -56 -7 -76 3 -57 2 49 22 21 28 -31 -14 -7 36
6743 36 12 -31 25 12 18 -56 -5 22 42 43 -11 32 -26 -31 48 26 30 -76 50 55 25 -56 -31 29 -69 13 3 16 -26 54 20 17
6775 17 -55 34 10 -39 -16 -6 32 -1 -1 49 8 -97 33 -17 18 30 27 -35 15 31 37 43 -23 15 22 17 -61 42 66 -20 25 11
6807 11 24 -15 0 -16 5 -30 -30 -23 11 -34 -14 50 -3 -10 -42 2 41 -49 40 85 -18 -48 6 33 -20 -45 -66 -3 -12 -20 -12 14 -2
6840 -2 2 7 45 -61 -41 3 -19 -19 51 29 7 12 22 57 -34 -32 14 52 -60 -10 -14 32 -53 -77 42 1 -53 -13 50 48 -7 8 8
6873 8 -11 -63 3 85 44 18 -15 14 -23 34 57 13 -34 16 21 -34 -36 -3 1 12 15 -25 7 -44 41 -55 39 -5 32 -20 -57 -35 71
6906 71 40 -9 -30 -21 31 -43 -8 -6 5 -34 -20 73 -13 -63 46 -24 -14 3 -28 38 58 -35 -40 58 4 -54 -10 85 -6 -30 -21 16
6938 16 36 -50 24 33 -1 13 75 -14 -8 -11 5 72 -54 -20 14 -41 -75 -8 37 -12 -41 24 1 -28 17 61 49 -15 6 62 45
6969 45 10 18 12 46 -47 77 8 -52 -61 10 52 -24 -28 7 -40 8 23 -45 36 -91 -57 -27 2 -78 -17 -35 -18 10 4 45 41 14
7001 14 10 58 3 12 27 -16 -25 29 99 4 2 -16 -46 -8 -16 -4 26 28 -20 30 64 -10 -27 59 29 83 -13 94 -9 -75 49 8
7033 8 -24 -20 5 7 -7 33 49 -14 -47 -2 45 1 6 -111 0 29 28 11 36 12 13 9 12 -9 -17 22 -8 -60 13 37 6 -28 54 83
7067 83 20 -42 -13 -8 30 -26 -25 73 49 22 12 -10 -3 -44 17 73 -5 12 6 -8 -61 -21 47 -25 -70 34 29 -10 -40 15 64 -28
7099 -28 -23 18 61 3 -18 39 8 -10 21 30 -66 -14 -25 25 -14 -16 -3 -38 7 -16 17 47 13 8 -11 53 45 92 60 15 -9 23 -51
7132 -51 -14 -43 -22 -17 23 13 1 -5 -4 14 2 88 -18 31 -11 10 -19 -42 0 37 34 -51 3 22 -45 -6 49 -24 22 1 -5 -19
7164 -19 31 9 24 -95 -4 28 8 -40 -4 -4 -1 -25 -42 -28 36 -36 3 65 -52 -8 27 20 -61 -36 2 28 -59 -65 10 -23 16
7195 16 -9 -20 -27 -27 44 15 39 -101 35 -16 -31 -54 -25 24 -39 1 -2 68 -30 -24 23 -58 22 -12 -14 -82 8 -29 -14 50 -50
7226 -50 77 -29 15 -33 1 45 -41 41 -11 -31 -55 35 -20 -37 -91 40 21 19 -13 -11 22 33 37 9 20 14 10 7 -50 -28 49 -19
7258 -19 -10 -25 20 -53 41 -77 47 -6 -40 -24 27 38 -91 15 49 35 -27 -65 -27 6 -26 -24 -45 -42 -45 -65 7 -12 -42 24
7288 24 -19 -33 3 -13 16 -10 -38 45 -21 -11 10 -1 42 -57 27 8 16 -6 -3 -10 -19 47 83 7 61 2 49 21 -10 55 27 36 -38
7321 -38 39 7 49 -21 25 76 4 15 -15 -12 -17 -20 -8 -26 -40 -16 17 -13 -43 19 12 44 -17 15 -31 14 -36 -13 -49 33 -4 -28
7353 -28 -25 -35 46 77 59 -16 27 55 -6 -7 3 0 -20 42 31 -2 -6 -15 26 10 8 -1 4 19 -23 -26 16 30 -20 32 25 -12 7 -25 51
7388 51 -51 -27 26 -41 -52 13 -25 -6 8 -58 36 9 -30 -16 -29 -33 19 58 6 -55 42 -9 -23 -36 -20 18 -14 14 100 18
7418 18 -44 -49 39 -8 -46 58 39 99 53 46 27 9 -11 -14 -50 13 17 49 -59 -25 -12 41 -18 -7 -91 -9 33 -60 -37 10 -19
7449 -19 1 -29 -2 20 -39 -61 -17 -6 -51 -26 13 -24 -76 -27 -29 15 -16 -6 -15 5 35 2 34 -40 -33 36 -5 -24 49 -5 -27 -15
7481 -15 6 -6 3 -33 64 46 44 41 44 31 -23 33 -25 6 -29 21 48 -20 -13 -24 -56 -25 -18 -46 38 -93 -5 -41 -39 10 -61 -15 -34
7514 -34 -59 -33 -40 34 -47 -30 35 41 -25 -13 31 15 67 49 -1 -15 25 25 2 42 -29 23 -2 -27 30 1 95 -83 -5 54 -53
7545 -53 20 15 -20 0 7 22 19 -2 -3 21 -5 -10 -11 47 -11 14 10 0 -10 -14 25 14 -23 0 12 -24 -38 24 -9 -6 9 20 -21 38 -5
7580 -5 1 32 5 34 42 13 10 -4 11 -5 4 14 11 -28 -7 -36 69 -51 6 24 12 10 19 40 13 6 24 1 1 30 -39 -85 21 31
7614 31 -45 45 -5 15 -20 -10 69 21 -16 15 -43 19 70 27 -25 9 41 77 -61 -14 67 111 17 -31 32 27 33 22 31 -11 -76
7645 -76 -97 7 -61 23 39 51 45 0 -52 -16 -57 8 39 -39 -31 -17 -26 -10 -53 -41 -13 -64 17 3 29 17 21 -21 -24 -53 -3 29
7677 29 7 -21 -46 39 -41 9 -61 -21 -21 -49 -6 -3 -54 -41 -56 -17 -11 34 32 -7 3 35 20 15 -5 -12 -78 -9 1 9 -39 10 17 -8
7711 -8 76 -12 13 59 -5 -53 17 17 -10 -4 -34 -6 2 5 -34 36 -54 -41 41 16 35 21 8 -34 -100 -1 38 -40 21 -32 40 -55 19
7744 19 63 22 28 -54 22 4 -73 -25 -5 46 -107 -39 61 4 -32 1 49 27 -16 12 7 5 9 -37 86 -34 30 -11 -32 -50
7774 -50 -25 -22 50 -40 32 8 -21 29 -32 23 51 -27 -6 -54 11 -13 -4 53 -59 53 33 29 -22 -43 25 -25 24 -43 22 56 10
7805 10 -73 40 7 46 29 -44 -17 -53 55 14 -4 44 24 -11 33 5 7 -34 -88 41 35 -14 0 -18 -66 -90 15 -68 20
7834 20 -22 15 4 -8 -15 29 -48 -3 16 -38 41 -42 4 -1 0 -8 68 54 -9 26 30 3 -4 18 25 1 45 -14 -3 4 32 45 4 -45
7868 -45 -81 -27 28 96 6 -81 -30 -13 -33 6 20 47 -25 8 39 6 -19 -5 -11 -11 12 -36 -16 29 -38 20 32 -34 -40 -20 43 18
7900 18 -68 46 -30 -17 -2 53 -45 -4 -12 52 55 -67 14 12 34 -76 48 33 16 32 1 72 -13 19 -16 -43 68 32 35 -86
7930 -86 -45 8 3 24 -35 25 48 6 -110 -47 -45 -2 24 66 32 35 1 27 -34 43 -29 -12 10 -29 4 -17 -47 -133 36 -22 -36
7961 -36 -50 15 -13 5 19 -79 20 -28 70 37 -9 30 16 26 86 33 -13 13 -33 -6 -14 60 19 -43 -4 40 -14 9 35 -2 -18
7992 -18 9 5 13 -48 -60 49 3 -39 13 6 -6 -36 -48 -83 20 4 13 -69 -32 -7 30 -37 39 49 15 35 -12 38 -21 -42 42
8023 42 20 -34 -19 31 -27 -14 -10 41 21 -20 -53 9 -20 -19 -6 13 36 5 -62 -3 8 -40 -38 18 21 26 -7 87 6 -22 43 45 13
8056 13 -1 13 -3 13 -72 -1 -29 -22 32 2 37 -120 -2 39 67 -1 21 19 -31 39 27 14 -18 53 1 14 45 5 49 -18
8086 -18 56 62 -7 26 9 30 -20 -15 25 49 -6 -21 -38 -9 5 44 21 4 -8 19 -29 34 -36 -85 -3 -17 22 -23 -3 -2 -49 7
8118 7 15 -25 12 53 33 -52 -104 -8 27 -30 -50 30 -13 -47 -11 43 17 -45 -41 -6 51 30 5 -16 12 -37 -62 -84 4 18 -64 40
8150 40 2 -17 36 -4 53 -16 32 6 -6 8 47 30 17 10 -9 63 35 -25 12 -2 -37 -21 8 -46 -49 3 33 30 17 -38 -43 30
8182 30 15 93 -14 -40 35 0 -23 4 -13
8191a3
##END NTUPLES=NMR FID
##END=
