##TITLE=1H_2PBPA2212
 CDCl3
 8 sc, 
 23.12.2022
##JCAMPDX= 6.0         $$ Bruker NMR JCAMP-DX V2.0
##DATA TYPE= NMR FID
##DATA CLASS= NTUPLES
##ORIGIN= UXNMR, Bruker Analytische Messtechnik GmbH
##OWNER= root
$$ XWIN-NMR		Version 3.5
$$ Fri Dec 23 13:47:52 2022 Russian Standard Time (UT+4h)  she@DPX200
##.OBSERVE FREQUENCY= 200.13135
##.OBSERVE NUCLEUS= ^1H
##.DELAY= (6, 6)
##.ACQUISITION MODE= SIMULTANEOUS
##.ACQUISITION SCHEME= undefined
##.AVERAGES= 8
##.DIGITISER RES= 18
##SPECTROMETER/DATA SYSTEM= spect
##.PULSE SEQUENCE= zg30
##.SOLVENT NAME= CDCl3
##.SHIFT REFERENCE= (INTERNAL, CDCl3, 0, 15.7039)
##AUDIT TRAIL= $$ (NUMBER, WHEN, WHO, WHERE, WHAT)
$$ ##TITLE= Audit trail, XWIN-NMR		Version 3.5
$$ ##JCAMPDX= 5.01
$$ ##ORIGIN= Bruker BioSpin GmbH
$$ ##OWNER= she
$$ F:/spectra/data/she/nmr/H-F/1/audita.txt
$$ ##AUDIT TRAIL=  $$ (NUMBER, WHEN, WHO, WHERE, WHAT)
(   1,<2022-12-23 13:46:48.21 +0400>,<she>,<DPX200>,
      <created by zg, POWCHK disabled, PULCHK disabled
       configuration hash MD5:
       00 E9 B6 7A A2 85 ED C7 34 08 36 98 17 FE 4E 26
       data hash MD5: 16K
       F8 4C 48 EF 83 83 D9 2F 96 58 1A F7 2C EF C8 ED>)
$$ ##END=
$$ 
$$ hash MD5
$$ 1A 0B E5 B4 7B 83 4D 71 9E D7 50 FE 24 8D 25 2E
##$RELAX= 
##$RELAX= 
##$RELAX= 
##$RELAX= 
##$RELAX= 
##$RELAX= 
$$ Bruker specific parameters
$$ --------------------------
##$DU= <F:/spectra>
##$EXPNO= 1
##$NAME= <H-F>
##$PROCNO= 1
##$TYPE= <nmr>
##$USER= <she>
##$AMP= (0..31)
100 100 100 100 100 100 100 100 100 100 100 100 100 100 100 100 100 100 
100 100 100 100 100 100 100 100 100 100 100 100 100 100 
##$AQSEQ= 0
##$AQ_mod= 1
##$AUNM= <au_zg>
##$AUTOPOS= <>
##$BF1= 200.13
##$BF2= 200.13
##$BF3= 200.13
##$BF4= 200.13
##$BF5= 200.13
##$BF6= 200.13
##$BF7= 200.13
##$BF8= 200.13
##$BYTORDA= 1
##$CFDGTYP= 0
##$CFRGTYP= 5
##$CHEMSTR= <none>
##$CNST= (0..31)
1 1 145 1 1 1 1 1 1 1 1 1 1 1 1 1 1 1 1 1 1 1 1 1 1 1 1 1 1 1 1 1 
##$CPDPRG= <>
##$CPDPRG1= <>
##$CPDPRG2= <>
##$CPDPRG3= <>
##$CPDPRG4= <mlev>
##$CPDPRG5= <mlev>
##$CPDPRG6= <mlev>
##$CPDPRG7= <mlev>
##$CPDPRG8= <mlev>
##$CPDPRGB= <>
##$CPDPRGT= <>
##$D= (0..31)
0 1.2 0 0 0 0 0 0 0 0.06 0 0.03 0 0 0 0 0.0002 0 0 0 0 0 0 0 0 0 0 0 0 
0 0 0 
##$DATE= 1671788807
##$DBL= (0..7)
120 120 120 120 120 120 120 120 
##$DBP= (0..7)
150 150 150 150 150 150 150 150 
##$DBP07= 0
##$DBPNAM0= <>
##$DBPNAM1= <>
##$DBPNAM2= <>
##$DBPNAM3= <>
##$DBPNAM4= <>
##$DBPNAM5= <>
##$DBPNAM6= <>
##$DBPNAM7= <>
##$DBPOAL= (0..7)
0.5 0.5 0.5 0.5 0.5 0.5 0.5 0.5 
##$DBPOFFS= (0..7)
0 0 0 0 0 0 0 0 
##$DE= 6
##$DECBNUC= <off>
##$DECIM= 32
##$DECNUC= <off>
##$DECSTAT= 4
##$DIGMOD= 1
##$DIGTYP= 9
##$DL= (0..7)
0 120 120 120 120 120 120 120 
##$DP= (0..7)
150 150 150 150 150 150 150 150 
##$DP07= 0
##$DPNAME0= <>
##$DPNAME1= <>
##$DPNAME2= <>
##$DPNAME3= <>
##$DPNAME4= <>
##$DPNAME5= <>
##$DPNAME6= <>
##$DPNAME7= <>
##$DPOAL= (0..7)
0.5 0.5 0.5 0.5 0.5 0.5 0.5 0.5 
##$DPOFFS= (0..7)
0 0 0 0 0 0 0 0 
##$DQDMODE= 0
##$DR= 18
##$DS= 0
##$DSLIST= <SSSSSSSSSSSSSSS>
$$ [...]
##$SUBNAM2= <"">
##$SUBNAM3= <"">
##$SUBNAM4= <"">
##$SUBNAM5= <"">
##$SUBNAM6= <"">
##$SUBNAM7= <"">
##$SUBNAM8= <"">
##$SUBNAM9= <"">
##$SW= 18.05172834244
##$SWIBOX= (0..15)
0 0 2 0 0 0 0 0 0 0 0 0 0 0 0 0 
##$SW_h= 3612.71676300578
##$TD= 16384
##$TD0= 1
##$TE= 0
##$TE2= 300
##$TE3= 300
##$TEG= 300
##$TL= (0..7)
0 120 120 120 120 120 120 120 
##$TP= (0..7)
150 150 150 150 150 150 150 150 
##$TP07= 0
##$TPNAME0= <>
##$TPNAME1= <>
##$TPNAME2= <>
##$TPNAME3= <>
##$TPNAME4= <>
##$TPNAME5= <>
##$TPNAME6= <>
##$TPNAME7= <>
##$TPOAL= (0..7)
0.5 0.5 0.5 0.5 0.5 0.5 0.5 0.5 
##$TPOFFS= (0..7)
0 0 0 0 0 0 0 0 
##$TUNHIN= 0
##$TUNHOUT= 0
##$TUNXOUT= 0
##$USERA1= <user>
##$USERA2= <user>
##$USERA3= <user>
##$USERA4= <user>
##$USERA5= <user>
##$V9= 5
##$VALIST= <valist>
##$VCLIST= <CCCCCCCCCCCCCCC>
##$VD= 0
##$VDLIST= <DDDDDDDDDDDDDDD>
##$VPLIST= <PPPPPPPPPPPPPPP>
##$VTLIST= <TTTTTTTTTTTTTTT>
##$WBST= 1024
##$WBSW= 4
##$XGAIN= (0..3)
0 0 0 0 
##$XL= 0
##$YL= 0
##$YMAX_a= 744549
##$YMIN_a= -935968
##$ZGOPTNS= <>
##$ZL1= 120
##$ZL2= 120
##$ZL3= 120
##$ZL4= 120
##$ABSF1= 10
##$ABSF2= 0
##$ABSG= 5
##$ABSL= 3
##$ALPHA= 0
##$AQORDER= 0
##$ASSFAC= 0
##$ASSFACI= 0
##$ASSFACX= 0
##$ASSWID= 0
##$AUNMP= <proc_1d>
##$AZFE= 0.1
##$AZFW= 0.1
##$BCFW= 1
##$BC_mod= 2
##$BYTORDP= 1
##$COROFFS= 0
##$CY= 11.3945322036743
##$DATMOD= 1
##$DC= 2
##$DFILT= <>
##$DTYPP= 0
##$F1P= 2.36226072786647
##$F2P= -0.459571619588291
##$FCOR= 0.5
##$FTSIZE= 0
##$FT_mod= 4
##$GAMMA= 1
##$GB= 0.15
##$INTBC= 1
##$INTSCL= 1
##$ISEN= 128
##$LB= 0.24
##$LEV0= 0
##$LPBIN= 0
##$MAXI= 10000
##$MC2= 0
##$MEAN= 0
##$ME_mod= 0
##$MI= 1.114404
##$NCOEF= 0
##$NC_proc= 0
##$NLEV= 6
##$NOISF1= 3.799351
##$NOISF2= 2.8
##$NSP= 1
##$NTH_PI= 0
##$NZP= 0
##$OFFSET= 15.70392
##$PC= 1
##$PHC0= -19109.17
##$PHC1= 13.20073
##$PH_mod= 1
##$PKNL= yes
##$PPARMOD= 0
##$PSCAL= 0
##$PSIGN= 0
##$REVERSE= no
##$SF= 200.130013532006
##$SI= 16384
##$SIGF1= 3
##$SIGF2= 2
##$SINO= 400
##$SIOLD= 16384
##$SREGLST= <1H.CDCl3>
##$SSB= 0
##$STSI= 0
##$STSR= 0
##$SW_p= 3612.71676300578
##$SYMM= 0
##$S_DEV= 0
##$TDeff= 0
##$TDoff= 0
##$TI= <>
##$TILT= no
##$TM1= 0
##$TM2= 0
##$TOPLEV= 0
##$USERP1= <user>
##$USERP2= <user>
##$USERP3= <user>
##$USERP4= <user>
##$USERP5= <user>
##$WDW= 1
##$XDIM= 8192
##$YMAX_p= 0
##$YMIN_p= 0
$$ End of Bruker specific parameters
$$ ---------------------------------
##NTUPLES= NMR FID
##VAR_NAME=  TIME,          FID/REAL,        FID/IMAG
##SYMBOL=    X,             R,               I
##VAR_TYPE=  INDEPENDENT,   DEPENDENT,       DEPENDENT
##VAR_FORM=  AFFN,          ASDF,            ASDF
##VAR_DIM=   8192,          8192,            8192
##UNITS=     SECONDS,       ARBITRARY UNITS, ARBITRARY UNITS
##FACTOR=    0.0002768,     1,               1
##FIRST=     0,             0,               0
##LAST=      2.2672688,     0,               0
##MIN=       0,             -935968,         0
##MAX=       2.2672688,     744549,          0
$$ Real data points
##PAGE= N=1
##DATA TABLE= (X++(R..R)), XYDATA
$$ [...]
2798b596M314J191n398m47N928m50o069J396N909k310n780L490M897l937l972
$$ -2596 1718 2909 -2489 -2936 2992 2542 -3527 -2131 3778 1468 -4312 -822 4075 138 -3834
2813c834M352K897l813k493L411J844k737j715J963K404j609l135J920L704k847
$$ -3834 518 3415 -398 -2891 520 2364 -373 -2088 -125 2279 670 -2465 -545 3159 312
2828C12l847M068L333m972k451N239J300n437J87M747j035l996J716K616j729
$$ 312 -3535 533 3866 -1106 -3557 1682 2982 -2455 -2268 2479 1444 -2552 -836 1780 51
2843E1j350J280N24k52m12k22M30P46o58j272J577R88k478J81K450j189k134K238
$$ 51 -1299 -19 505 253 -159 -381 49 795 137 -1135 442 1430 -1048 -867 1583 394 -1740 498
2861D98J119l195O33K842j910k108K760J159l509L04L520j584k840K298J952k715
$$ 498 1617 -1578 -945 1897 -13 -2121 639 1798 -1711 -1407 2113 529 -2311 -13 1939 -776
2877g76r07K232J96j277J88O62l0J95j050m09K309L26l572O87M183k299m209L971
$$ -776 -1683 549 745 -532 -344 318 288 483 -567 -976 1333 1659 -1913 -1226 2957 658 -3551 420
2895D20L422n309k102N959M69n922Q97N131j801m051K047L103j799k249J265J906
$$ 420 3842 -1467 -3569 2390 2859 -3063 -2166 2965 1164 -2887 -840 2263 464 -1785 -520 1386
2911A386k29k585k5L139N12m252m30N631q09n767J827O298l746n842N213M567
$$ 1386 1157 -1428 -1453 1686 2198 -2054 -2484 3147 2338 -3429 -1602 4696 950 -4892 321 4888
2927D888n944l177O006J524n304l32M092q0k808m12J992J242j680k421K451K712
$$ 4888 -1056 -4233 1773 3297 -2007 -2339 1753 1673 -1135 -1547 445 1687 7 -2414 37 2749
2943B749k915l258M201K874m997k069N802Q30o154P92N473k144m228K552L210
$$ 2749 -166 -3424 777 3651 -1346 -3415 2387 3217 -2937 -2145 3328 1184 -3044 -492 2718
2958B718k915j525K260L67j302R3P5K89P51j135r57K052M89k687N52K526j147
$$ 2718 -197 -1722 538 905 -397 -304 -229 60 811 -324 -1281 771 1260 -1427 -875 1651 504
2975E04k537K473J494l118l53L326j189k533K129J607k295q48K727n67k143J190
$$ 504 -2033 440 1934 -1184 -1537 1789 600 -1933 196 1803 -492 -1340 1387 820 -1323 -133
2991a33J631j900p53J959k51j479Q62L28n62K16k2n33J045K98j835M91K397j626
$$ -133 1498 -402 -1155 804 553 -926 -64 264 -298 -82 -104 -637 408 706 -1129 -638 1759 133
3009A33k758L136K049l837j054M561k53m398J301L961k082l408K548K489k309
$$ 133 -2625 511 2560 -1277 -2331 2230 1977 -2421 -1120 2841 759 -2649 -101 2388 79
3024G9k056J748K053j446k269J127K635j151l272J353M057j965m430L041M331
$$ 79 -1977 -229 1824 378 -1891 -764 1871 720 -2552 -1199 2858 893 -3537 -496 3835
3039C835l993l827M555L369n467k261N734J149m937n53M509L6l488l91L067O40
$$ 3835 -158 -3985 570 3939 -1528 -3789 1945 3094 -1843 -2396 2113 2149 -1339 -1730 1337 1977
3055A977l108j081L247J516m019j364M518R95m993n0M972p25m766J466M104j803
$$ 1977 -1131 -2212 1035 2551 -1468 -2832 1686 2681 -2312 -2362 2610 1885 -2881 -1415 2689 886
3071H86l706K427K715k245k212K090J913j744j702J515J619j194j804J299J839
$$ 886 -2820 -393 2322 77 -2135 -45 1868 124 -1578 -63 1556 362 -1442 -143 1696
3086A696j638j774K039J260j922j551K697P30k869K3K840r37k257J602J146j552
$$ 1696 58 -1716 323 1583 -339 -1890 807 1537 -1332 -1309 1531 594 -1663 -61 1085 -467
3102d67l14J002K17p70oL32J31J62l65L2N66m21p88Q57O15j434J72J737r02j596
$$ -467 -781 221 438 -332 -338 -6 125 287 -78 -46 520 99 -689 168 783 -651 -479 1258 356 -1240
3122a240J444J275k272o38K528j4k790O58K484j109k236J670J825j510j529J433
$$ -1240 204 1479 -793 -1431 1097 1083 -1707 -1049 1435 326 -1910 -240 1585 75 -1454 -21
3138b1J487j187j607R92K085j155k392J083L295k143l446K913L482l981k914M476
$$ -21 1466 279 -1328 -336 1749 594 -1798 -715 2580 437 -3009 -96 3386 -595 -3509 967
3154I67K107m721j180M691M59m153k48L816rl575j65L246O03l049j052L365J468
$$ 967 3074 -1647 -2827 1864 2323 -1830 -2078 1738 1729 -1846 -2011 1235 1838 -1211 -2263 1102 2570
3171B570m320q40M851M38n465N34N401j469n074K640M168l074l424L145K630k967
$$ 2570 -1750 -2590 2261 2699 -2766 -2232 3169 1700 -3374 -734 3434 360 -3064 81 2711 -256
3187b56j850K438J381j776j785J790J776j473k204J506K360j677k793K558K796
$$ -256 -2106 332 1713 -63 -1848 -58 1718 245 -1959 -453 1907 230 -2563 -5 2791
3202B791l045k611L939J704m658j81M444j112l671J915K568k255j250J946K23
$$ 2791 -254 -2865 1074 2778 -1880 -2061 2383 1271 -2400 -485 2083 -172 -1422 524 747
3217G47r06R2k16K89P27q18j131J685Q62k685K64K416o75k279J694J252j945o56
$$ 747 -159 -67 -283 6 733 -85 -1216 469 1331 -1354 -1090 1326 651 -1628 66 1318 -627 -1283
3235a283K592n88k384J855J467k235o33K681p88k500J662K123k455j059K461P0
$$ -1283 1309 721 -1663 192 1659 -576 -1209 1472 684 -1816 -154 1969 -486 -1545 916 986
3251I86k052P19J015m28j34m29l92J565j6k433O80L161j680l712L130L264m064
$$ 986 -1066 -347 668 240 106 -323 -715 850 834 -1599 -919 2242 562 -3150 -20 3244 -820
3268h20k248M780J263n167l6M788q28m032J443K871j118k319P62J763N9j943q11
$$ -820 -3068 1712 2975 -2192 -2228 2560 1732 -2300 -857 2014 896 -1423 -661 1102 1161 -782 -1593
3285a593K706Q51l358j092M531K97n344Q17N595j979n348L421M340l877l443M447
$$ -1593 1113 1964 -1394 -2486 2045 2342 -3002 -2185 3410 1431 -3917 -496 3844 -33 -3476 971
3301I71K040m244r60L501M04k499m94J824R62j447j629J508K369k134k777K934
$$ 971 3011 -1233 -2193 1308 1712 -787 -1281 543 1505 58 -1571 -63 2306 172 -2605 329
3317C29K718m020j942M753Q72n176L56M951j662m188K301K935k205j884K009J113
$$ 329 3047 -973 -2915 1838 2710 -2466 -2110 2841 1179 -3009 -708 2227 22 -1862 147 1260
3333A260j230r84J075O91oj550j05J696L11k321K83K596r32k403J324K318k367
$$ 1260 30 -954 121 812 806 -744 -849 847 1158 -1163 -880 1716 784 -1619 -295 2023 -344
3350c44j459K682K40k392R76J756k008p07K126k33k226J663J060j750l87J669
$$ -344 -1803 879 1119 -1273 -297 1459 -549 -1256 870 637 -1589 74 1134 -616 -1003 666
3366F66j80j104M65P07l79k46j97J84R50m62j360M95J924j209k257K460J675l000
$$ 666 486 -618 -153 554 175 -71 -268 -84 866 404 -956 -461 1463 254 -2003 457 2132 -868
3384h68j349L561O59m137L69L804j151l339J793K537j342k203J146J931p94j917
$$ -868 -2217 1344 2003 -2134 -1765 2039 888 -2451 -658 1879 537 -1666 -520 1411 617 -1300
3400a300M31K276k15k931N91L560j060l910J840L682k569l456L349K917l994k147
$$ -1300 -869 1407 1192 -1739 -1148 2412 1352 -2558 -718 2964 395 -3061 288 3205 -789 -2936
3416b936M038J156l586q37L527L95l065n73K990P53k950r54K917J061k977j008
$$ -2936 1102 2258 -1328 -2165 1362 1757 -1308 -1881 1109 1862 -1088 -2042 875 1936 -1041 -2049
3432b049L389R55m048n34M500m52m383J103M068j567l407J893K827j886k282J481
$$ -2049 1340 2295 -1753 -2287 2213 1761 -2622 -1519 2549 982 -2425 -532 2295 409 -1873 -392
3448c92J869j229j795Q30K051j087j853Q62K329j344k068J525K239k012j647K008
$$ -392 1477 248 -1547 -717 1334 247 -1606 -744 1585 241 -1827 -302 1937 -75 -1722 286
3464B86J082k205k16J891m5j477L96R07m78m69N36k0k69k5J70n23L19K91n87M64
$$ 286 1368 -837 -1053 838 793 -684 -288 619 141 -328 208 188 -81 -106 64 -459 -140 151 -436 28
3484B8m0k81L72N19j126j3J279n92j512J370J285j830r96K526L40k643M45K456
$$ 28 -12 -293 79 598 -528 -541 738 146 -1366 4 1289 -541 -1537 989 1329 -1314 -869 1587
3502A587j015j868J155J361r73j059M69J277k44j444N5J740k36k317M44K754r92
$$ 1587 572 -1296 -141 1220 247 -812 -343 934 690 -754 -699 1041 805 -1512 -1068 1686 694
3519F94l179J962K999k652k551L170K406l912j571M006O79l519m3L191k36k582
$$ 694 -2485 -523 2476 -176 -2727 443 2849 -1063 -2634 1372 2051 -1468 -1511 1680 1444 -1138
3535a138j59K200O88k360q34K617J395l713j053M081R02m675l77N110q56m935
$$ -1138 -1297 903 1591 -769 -1603 1014 2409 -1304 -2357 1724 2626 -2049 -2426 2684 1828 -3107
3551c107J713M457k356l835K780L025k880k035K216J760j851j144J071J713r51
$$ -3107 -1394 3063 707 -3128 -348 2677 -203 -2238 -22 1738 -113 -1257 -186 1527 576
3566E76k164P46K838j037l142J684L266k776k690L122K219l869r10L484K88l439
$$ 576 -1588 -842 1996 959 -2183 -499 2767 -9 -2699 423 2642 -1227 -2137 1347 1635 -1804
3582a804Q88K287j198j245J152M94r22K59P5j69N03j1j000N63J192j461n10J654
$$ -1804 -916 1371 173 -1072 80 574 -348 -89 -14 -183 320 309 -691 -128 1064 -397 -907 747
3600G47N0k181J260J672j973r55K466l57k169J231J928k413o67K808n67k498J263
$$ 747 797 -1384 -124 1548 -425 -1380 1086 729 -1440 -209 1719 -694 -1361 1447 880 -1618 -355
3617c55J727j894q28J913J58j386J85P69j72n0l33k46Q25N49j585l14K764q79
$$ -355 1372 -522 -1350 563 721 -665 -480 289 117 67 -266 -512 313 862 -723 -1037 1727 848
3635H48l094J789L160k992k374L884J363m488m33M642j021l648J455K947j540
$$ 848 -2246 -457 2703 -289 -2663 1221 2584 -1904 -2337 2305 1284 -2364 -909 2038 498
3650D98k108R34J568l20j501n08K257J145l171r98L943O57m558K28M963j244n132
$$ 498 -1610 -676 892 572 -929 -1437 820 1965 -1206 -2204 1739 2396 -2162 -1934 3029 1785 -3347
3667c347K236M632l163l795L803K741l820j756L235J122k560p62J621J057q77
$$ -3347 -1111 3521 358 -3437 366 3107 -713 -2469 766 1888 -672 -1434 187 1244 367
3682C67k133J032K512j189k978J813L334l030k805L959J892m373n23M116l14l747
$$ 367 -1766 -734 1778 589 -2389 -576 2758 -272 -3077 882 2774 -1599 -2122 1994 1680 -2067
3698b067J124K779j480j750J548Q46r41n55K25M99L63p68p39J354M51j709l26
$$ -2067 -943 1836 356 -1394 154 1000 59 -496 -271 228 591 -177 -916 438 889 -820 -1146
3715a146K274k56k588J178K186j666j439K053O80k336L27K022j117j249J656L45
$$ -1146 1128 872 -1716 -538 1648 -18 -1457 596 1276 -1060 -733 1289 172 -1077 579 924
3731I24j686N03J239j035q42J520l29r52N33O62p84J40j04j27N68J36j062O1J721
$$ 924 -762 -259 980 -55 -897 623 294 -658 -125 537 -247 -107 -211 -338 230 366 -696 -635 1086
3750A086r46j947J925J812k858j001K916Q43l239R8K956l62l059R44K517r81k218
$$ 1086 140 -1807 118 1930 -928 -1929 987 1830 -1409 -1311 1645 1283 -1776 -832 1685 704 -1514
3767a514P94K231q39j898L09K163o4k759K7L249n11l530R95L795j687l779K496
$$ -1514 -720 1511 672 -1226 -917 1246 1182 -1577 -1550 1699 1188 -2342 -1347 2448 761 -3018 -522
3784e22L538l132k785L384K076l207j362K551J591k465j551K467J351j917j821
$$ -522 3016 -116 -2901 483 2559 -648 -2010 541 2132 -333 -1884 583 1934 17 -1804
3799a804K191J808k764j730L113J535l687r77L884L55l768J00L546o83k803Q50
$$ -1804 387 2195 -569 -2299 814 2349 -1338 -2315 1569 1924 -1844 -1744 1802 1119 -1684 -834
3815h34K617j232k263J062J936q13j595M76J759k87j991M11K280r65k216J417
$$ -834 1783 551 -1712 -650 1286 473 -1122 -646 1113 826 -1165 -754 1526 561 -1655 -238
3831b38J885j515j986K129J176k018n15J912J7j574J19J102j87n99P4J62J57L4
$$ -238 1647 132 -1854 275 1451 -567 -1082 830 847 -727 -608 494 307 -292 -218 -56 101 135
3849A35m73R4O94l63n58P77M02r08L3Q79n75m32Q46j98j149P15J067j290q24J846
$$ 135 -338 -244 450 87 -471 306 708 -200 -167 712 137 -295 551 353 -796 -81 986 -304 -1128 718
3869G18K75k157K74K199p48j812P04J704r19j323R92J056m92j204N8J680M0k130
$$ 718 993 -1164 -890 1309 561 -1251 -547 1157 238 -1085 -93 963 471 -733 -675 1005 1045 -1085
3887a085Q4K545k40l130R17L564k000l213K508K876l320k086L352J333k928p23
$$ -1085 -1001 1544 1304 -1826 -909 2655 655 -2558 -50 2826 -494 -2580 772 2105 -823 -1546
3903a546K321N65k080n14J506J125j627j591J672K074k416j810K900J858l513
$$ -1546 775 1340 -740 -1254 252 1377 -250 -1841 -169 1905 -511 -2321 579 2437 -1076
3918a076j410M177N20m234M44M101j205l637J707L027k141j901J676J561j559
$$ -1076 -2486 1691 2211 -2023 -1579 2522 1317 -2320 -613 2414 273 -1628 48 1609 50
3933E0j182Q60J443n20k045K87K497j98l253R93L369j582l412K512K720l038j826
$$ 50 -1132 -272 1171 651 -1394 -1107 1390 1192 -2061 -1068 2301 719 -2693 -181 2539 -499 -2325
3950b325L132J115l136p9K701o49j504N06R48m86l30j19j42O43J90j363M40J612
$$ -2325 807 1922 -1214 -1293 1408 759 -745 -239 709 223 -107 -226 -368 275 465 -898 -458 1154
3968A154j034j627J888Q85k353J89K004q90j535J558O02j694N55J621j599o98
$$ 1154 120 -1507 381 1266 -1087 -898 1106 216 -1319 239 841 -853 -298 1323 -276 -974
3984i74K026j1k235Q29J760j285j221J615O43j616j10J110k31m45l0j73M58N43
$$ -974 1052 1041 -1194 -365 1395 110 -1111 504 1147 -469 -579 531 300 -145 -175 -348 110 653
4002F53j099p65K123K72l060O67L351j825k912K802K310l365j735L784R15l513
$$ 653 -446 -1211 912 1184 -1876 -1209 2142 317 -2595 207 2517 -848 -2583 1201 2116 -1397
4018a397K10K411j94k207N29J582k73j150l91J484R39k089j509K951J335l662
$$ -1397 -1187 1224 1030 -1177 -648 934 661 -489 -880 604 1543 -546 -2055 896 2231 -1431
4034a431q51M503j98m513R83M412k080l787K681L000k899k156K580J671k206r80
$$ -1431 -2282 2221 2023 -2490 -1507 2905 825 -2962 -281 2719 -180 -2336 244 1915 -291 -1271
4050a271J496J213j124j420P74J942p38k801J423K862j946l104K677K932l505
$$ -1271 225 1438 314 -1106 -332 1610 872 -1929 -506 2356 410 -2694 -17 2915 -590
4065e90k114L676R91l438l81L118l26k509R43J565o85q30r0R25K40o71o70J020
$$ -590 -2704 972 1963 -1475 -1856 1262 936 -1573 -630 935 250 -580 -670 255 495 -176 -846 174
4083A74R62j410p58J743L78j793k03K167q94j524J201P86j082n60J385l04j027
$$ 174 1136 -274 -1032 711 1089 -704 -907 1260 366 -1158 43 829 -253 -813 572 268 -759
4100g59Q97K87r30m7J048m70q26J002O50j230j07R04l64k12j9K69O6K72p50k28
$$ -759 138 425 -505 -552 496 26 -800 202 852 -378 -485 419 55 -157 -176 93 159 431 -319 -547
4120e47J267O8j763Q86J972j982j613K159J212k430p50K434J84k212K14K016k01
$$ -547 720 788 -975 -89 1883 -99 -1712 447 1659 -771 -1521 913 1097 -1115 -901 1115 914
4137I14j954n3K000k8j618l68J947K28k334J06K608j32k830K45L251q56l245J500
$$ 914 -1040 -1093 907 879 -739 -1107 840 1068 -1266 -1160 1448 1316 -1514 -1269 1982 1126 -2119 -619
4155f19L291k318k690K329K302k393j919K405J328j915j545J812J629j728k033
$$ -619 2672 354 -2336 -7 2295 -98 -2017 388 1716 -199 -1744 68 1697 -31 -2064
4170b064J901K228j987k569K860K020k813j886L413J207l345p37L011N95k789
$$ -2064 -163 2065 78 -2491 369 2389 -424 -2310 1103 2310 -1035 -1772 1239 1834 -955
4185i55k96K499Mk198j87K122J0j998j89K055J99k149K2K049M3k391K87K518j008
$$ -955 -1251 1248 1252 -946 -1133 989 999 -999 -1188 867 1066 -1083 -1061 988 1031 -1360 -1073 1445 437
4204D37j691P39J816j424j081J421N53j060l39J043j64n43J61L2J11J12l10M2
$$ 437 -1254 -515 1301 -123 -1204 217 770 -290 -629 414 250 -293 -132 -100 11 123 -187 -145
4222a45M59k77n07M42N27p40k85J143o78q63J115M21j274K14J509j128j094J524
$$ -145 314 37 -470 -28 499 -241 -526 617 -61 -924 191 612 -662 -448 1061 -67 -1161 363
4240C63P72j536m32J649k58j507O19J141m65j020O77O13j79q36j81J100M25j486
$$ 363 1135 -401 -833 816 558 -949 -330 811 346 -674 3 616 437 -399 -580 520 945 -541
4258e41o02K014K68k580J72L097r91l060J457L081k108k645K558K021k662j291
$$ -541 -1143 871 1139 -1441 -1269 1828 837 -2223 -766 2315 207 -2438 120 2141 -521 -1812
4274a812K466R20k082o67J505R99j230j278R83K083j670k298K198K341k779k241
$$ -1812 654 1574 -508 -1175 330 1329 99 -1179 -196 1887 217 -2081 117 2458 -321 -2562
4290b562L335J561l448j128L898Q4l450L17K966q28k295R37K004j110j277L27
$$ -2562 773 2334 -1114 -2242 1656 1740 -1710 -1393 1573 745 -1550 -613 1391 281 -996 -669
4306f69J306J97j641k33J892N87k380m58K812k3l016Q83K729j541k356K019J552
$$ -669 637 834 -807 -1040 852 1439 -941 -1399 1413 1390 -1626 -743 1986 445 -1911 108 1660
4323A660k472m94K159n2j712M05Q76k75m25K86k97M57K52p12j48J405n89j296
$$ 1660 -812 -1306 853 801 -911 -506 370 95 -330 -44 -341 116 368 -344 -492 913 324 -972
4341i72J132R09j474m80J816k14j929J051J204j487j66J256l04j189J146L49j315
$$ -972 160 1069 -405 -885 931 717 -1212 -161 1043 -444 -610 646 342 -847 299 648 -667
4358f67q1J500m60j544J378O31j176j14P71J42o10L10j15N1N57p01o83J460N28
$$ -667 -748 752 292 -1252 126 757 -419 -533 238 380 -230 80 -35 16 573 -128 -811 649 1177
4377A177k199J48K631q73k851J923K105k032j957K469J364k888q41K897K59k398
$$ 1177 -1022 -874 1757 884 -1967 -44 2061 29 -1928 541 1905 -983 -1824 1073 1332 -1066
4393a066q9J690L80j400p13J321J028j141j806K005J857k559j687L100J245l582
$$ -1066 -1155 535 915 -485 -1198 123 1151 10 -1796 209 2066 -493 -2180 920 2165 -1417
4409a417n57M080m86l570J026L029j633k243J201K163j369j535R51J339o12j480
$$ -1417 -1974 2106 1620 -1950 -924 2105 472 -1771 -570 1593 224 -1311 -360 979 367 -1113
4425a113K55J846j53k021K93K480o07k970J487K534j929k232K583J375k445r94
$$ -1113 -858 988 835 -1186 -893 1587 980 -1990 -503 2031 102 -2130 453 1828 -617 -1611
4441a611K479L09k135K55J358R0j056q8Q06J9o55n03P40P00j068r08J535M82j492
$$ -1611 868 1177 -958 -703 655 745 -311 -399 407 426 -229 -732 8 708 -360 -1268 267 749 -743
4460g43l26J784J16j832O87J242j008o26J081n8p61L69O79o60M0O44n03n36M63
$$ -743 -1069 715 831 -1001 -314 928 -80 -706 375 317 -444 -75 604 -56 -16 628 125 -411 52
4479E2N71r98l9P85p2l75q0J59K9K15n18k85J077k31j292M65J574q27j662J357
$$ 52 623 -375 -414 371 299 -76 -156 3 32 247 -271 -556 521 290 -1002 -537 1037 210 -1452 -95
4499i5J460j475j367K278N00j938m26J913K40j887k10J753J36j354n72J550P38
$$ -95 1365 -110 -1477 801 1301 -637 -1063 850 1090 -797 -1007 746 882 -472 -1044 506 1244
4516A244j821r00K294O82k582l73K791j15k972N83K715q87k360R06K456j266j865
$$ 1244 -577 -1477 817 1499 -1083 -1456 1335 1220 -1752 -1169 1546 659 -1701 -795 1661 395 -1470
4533a470R42K081j239j698J139J844j086j889Q98K077j168k246J727K002j887
$$ -1470 -528 1553 314 -1384 -245 1599 513 -1376 -478 1599 431 -1815 -88 1914 27
4548B7k003K109J718k487j157K628N01k151m23K070Qj564k42J490L53j404o33
$$ 27 -1976 133 1851 -636 -1793 835 1336 -815 -1238 832 840 -724 -966 524 877 -527 -1160
4565a160J689P49j879n79J911M31k045rK051k80j970O43J569n44j472N76J181
$$ -1160 529 1278 -601 -1180 731 1162 -883 -892 1159 879 -1091 -448 1121 577 -895 -319 862
4582H62p52n71M27J91k21j53R0K08J59k29n03O91K21q06O7Q86n02n10N80J26o10
$$ 862 110 -461 -34 157 -64 -217 -127 81 240 11 -492 199 420 -386 -319 567 65 -445 135 261 -349
4603c49L28O66r31k05J282n28j354J150P71j194n71J512J65j413J43J125k72q43
$$ -349 -21 645 -286 -491 791 263 -1091 59 830 -364 -935 577 742 -671 -528 597 325 -518
4621e18K24O26O9o58m61Q13P20j054j042J644R53j757r45K347K68k469L01K642
$$ -518 -294 332 401 -257 -718 95 815 -239 -1281 363 1316 -441 -1386 961 1229 -1240 -939 1703
4639A703j063k356J352K186j762j564J722J038j301j057J141Q66p77j067L03J880
$$ 1703 640 -1716 -364 1822 60 -1504 218 1256 -45 -1102 39 905 128 -939 -636 1244
4655A244j001j656P79K413j513k223J983K073k890j155L163O79l027l88K891k34
$$ 1244 243 -1413 -634 1779 266 -1957 26 2099 -791 -1946 1217 1896 -1131 -1519 1372 1138
4671A138k530M61K035m02j327J5J192K80j367l75J401O16j786p57K333M93k628
$$ 1138 -1392 -931 1104 702 -625 -610 582 862 -505 -880 521 1137 -649 -1406 927 1420 -1208
4688a208j82K895p11k394J152J961j589j320J879N67j372m26J288k41n50J29l17
$$ -1208 -1390 1505 794 -1600 -448 1513 -76 -1396 483 1050 -322 -748 540 299 -251 -122 -439
4705d39N81M20q29l26Q79L62j050O7J118q34q82J334K54j255K19J065p57m97R64
$$ -439 142 562 -267 -593 286 648 -402 -335 783 -51 -933 401 655 -600 -381 684 -73 -570 394
4724C94r2r30N54R67j048n79J389j59j142M60J044p99o43Q01J48m36j96K90ML75
$$ 394 302 -628 -74 893 -155 -734 655 496 -646 -186 858 59 -584 217 365 -71 -267 23 27 402
4744D02n13j99N68O04j258m95J690K63k249M00K215r50k280J585J715j924r68
$$ 402 -111 -310 258 862 -396 -891 799 1062 -1187 -787 1428 478 -1802 -217 1498 -426 -1394
4761a394J950P64j677m39J323K79p83o30N88R55p97j411J309J362j363j715J910
$$ -1394 556 1320 -357 -796 527 806 23 -607 -19 936 139 -1272 37 1399 36 -1679 231
4778B31J547k707j010K927O02k989k4K897k41k617N61K129p57j603N38J481k93
$$ 231 1778 -929 -1939 988 1590 -1399 -1423 1474 1233 -1384 -823 1306 549 -1054 -516 965 672
4795F72j253j99J640O9j652n18K302J9k489N34K129o38k279J365J725j542j341
$$ 672 -581 -780 860 929 -723 -1241 1061 1080 -1409 -875 1254 616 -1663 -298 1427 -115 -1456
4812a456J696Q74j561k42J012M25q18n78O31N99m64p31O40P29n36j040R08P77
$$ -1456 240 1114 -447 -689 323 748 -70 -648 -17 582 118 -613 27 756 220 -820 88 865
4830H65j085n11J149M57j313R6Q30k11p46L16O24o22k99N02r0l09N31k60k14J78
$$ 865 -220 -731 418 875 -438 -342 488 277 -469 -153 471 -151 -450 52 -38 -347 184 -76 -290 -112
4850a12K23l25j49M50q7J5O3j5m9J70j75k31O93j63p63J40J213n74j031P33R99
$$ -112 111 -214 -363 87 0 15 78 63 14 184 9 -222 471 308 -455 -315 898 324 -707 26 1025
4871A025j125r03J026R46j562m43J363L95j159m13J195K81r71q02J205J033j435
$$ 1025 -100 -1003 23 969 -593 -1036 327 722 -437 -850 345 626 -345 -1147 58 1091 -344
4888c44q35J750O19j813q29K340L73k108k17K233n4k211L70K000o25j893O84J701
$$ -344 -1179 571 1190 -623 -1452 888 1261 -847 -1064 1169 1115 -1096 -726 1274 649 -1244 -560 1141
4906A141n46j620K26J755j39k234O96J958m17k298P55K113q33k008J065K118j610
$$ 1141 595 -1025 -799 956 817 -1417 -721 1237 820 -1478 -723 1390 557 -1451 -386 1732 122
4923A22j558J728R76j586o43J073P35j005n28R59N88r14q41R98Q60j233o88J145
$$ 122 -1436 292 1268 -318 -961 112 847 -158 -686 273 861 -53 -894 104 964 -269 -957 188
4941A88Q88j654k13J435n7j187j94J563m20j173N87Q63n50m61N36R2Mm08j1N9
$$ 188 1076 -578 -791 644 587 -600 -794 769 349 -824 -237 626 76 -385 151 243 247 -161 -172 -113
4961a13N47n47m5M43n2o36K06Q57m04p66N98J57m05J7L65k95l53O49J6r33M68
$$ -113 434 -113 -158 285 233 -403 -197 660 256 -510 88 245 -160 -143 222 -73 -426 223 239 -694 -226
4982b26Q50o71o85J074K00r69j32J116k9r01n1J060m45l89j54M06N51p26o66P74
$$ -226 624 -47 -732 342 542 -427 -559 557 528 -373 -424 636 191 -198 -352 54 605 -121 -787 -13
5002a3R64j218j019J765O53j989m61K363l37j983O58J978j049j738J551J027o99
$$ -13 951 -267 -1286 479 1132 -857 -1318 1045 708 -1275 -617 1361 312 -1426 125 1152 453
5019D53j287N17R31j51r96P7J257o3j466L1J938n18k214J126J985j375j948J809
$$ 453 -834 -317 614 463 -533 -456 801 738 -728 -697 1241 723 -1491 -365 1620 245 -1703 106
5037A06J437k093j049K175O73j847l94J532k3r52l14J091M05p74o42Q24J229j437
$$ 106 1543 -550 -1599 576 1249 -598 -992 540 517 -435 -749 342 747 -27 -669 155 1384 -53
5055e3j000J428R93k069l31J997o8k139N60J785p71j555J105J141j087o56N30
$$ -53 -1053 375 1368 -701 -1032 965 897 -1242 -682 1103 332 -1223 -118 1023 -64 -720 -190
5072a90M71m57n0p3L95Q8o49J00P17N9j152J87J358m83j140O98Q94q70l54Q40
$$ -190 281 -176 -226 -299 96 184 -465 -365 352 411 -741 -554 804 321 -819 -121 773 -97 -451 389
5092C89j20p94Q64K08j012L04P62n58o32R01L09j146L46N37j78p23N46L78n19
$$ 389 269 -525 339 547 -465 -161 601 43 -589 312 621 -525 -179 358 180 -543 3 381 -138
5111a38k55L40J66L9j74l28M77N19p43o91J269M59j673j05K021l11k098R25J467
$$ -138 -393 -53 113 152 -22 -350 127 646 -97 -788 481 940 -733 -838 1183 872 -1226 -301 1166
5130A166r30j551J227J091j127o07P09O31n27p41M75Q42l72j234M56J496o38j459
$$ 1166 236 -1315 -88 1003 -124 -731 -22 609 82 -659 -184 658 286 -948 -492 1004 366 -1093
5148a093J057J585j533j512J876R82j692r71J907N50j969j9J667j53j398J0J243
$$ -1093 -36 1549 16 -1496 380 1362 -330 -1301 606 1156 -813 -832 835 682 -716 -706 537
5165E37M9q79m21J268K06j274o85J753M14j737k32K018k64j857O22J781r93j373
$$ 537 586 -293 -714 554 760 -514 -1199 554 968 -769 -1001 1017 753 -1104 -482 1299 306 -1067
5183a067R59J198r48r30Q91O03n23q89O36O04l48q66M92P69l98q91N41P34n67
$$ -1067 -108 1090 142 -788 103 706 183 -706 -70 534 186 -680 -188 581 183 -708 -167 567 0
5202@r80J003M50p23l65R71l5p05K5Q12j51o80L45J14j50M95l12k18N5L74l72
$$ 0 -980 23 473 -250 -615 356 321 -384 -359 453 302 -378 -33 81 -69 426 114 -104 -49 325 -47
5223d7j10K57J00m45K49j10J82J21j77k66M59K52p48r6Q12Rj125K86J124l91j040
$$ -47 -157 100 200 -245 4 -106 76 197 20 -246 213 465 -283 -379 433 442 -683 -397 727 336 -704
5244g04P65N02m29p81N57P57o79q34Q70N63m20q10M82J033p09j130Q89J045j172
$$ -704 61 563 134 -647 -90 667 -12 -846 24 587 167 -643 -161 872 163 -967 -78 967 -205
5263b05r80J552Q73j674q42J744N04j760O4J451l2j238k14J506j88j195k46J639
$$ -205 -1185 367 1240 -434 -1276 468 972 -788 -724 727 695 -543 -757 749 561 -634 -880 759
5281G59J58j598j85J629J43j854j18K005k10k048R18J551r50j470J168J160j183
$$ 759 917 -681 -866 763 906 -948 -1066 939 729 -1319 -401 1150 200 -1270 -102 1058 -125
5298a25j067J254O50p30o59M01Q59m80r07N69J030n75j062Q94J013j004j013J143
$$ -125 -1192 62 712 -18 -677 -276 583 103 -804 -235 795 220 -842 52 1065 61 -952 191
5316A91R09j729j18J159K48j120J82O56l29l99K17J60k7R4m01L64K24k25n27L48
$$ 191 1100 -629 -747 412 660 -460 -278 378 49 -350 -133 27 0 94 -307 57 281 56 -471 -123
5336a23M37n79j81R50k07o05K48M22n03l0O54k64p56P68N1o63O3J033n00q32P81
$$ -123 314 -265 -446 504 297 -308 -60 362 -141 -171 483 219 -537 231 282 -381 -318 715 215 -617 164
5357A64L16n90m69P72K43p40J51L07O5k74l90N84J35k93n30M55P92m87r61Q24
$$ 164 480 -110 -579 193 436 -304 -153 154 219 -55 -445 139 274 -19 -549 -94 698 211 -750 74
5377G4R63j577m17J683K00j782J56J800n48j641O58J325o27j098P62N70k8r65
$$ 74 1037 -540 -957 726 926 -856 -700 1100 552 -1089 -431 894 267 -831 -69 501 473 -492
5395d92J73R58j70j393M79J287j27j859L35K043q51j789J157J811j688j265J630
$$ -492 -319 639 469 -924 -445 842 715 -1144 -809 1234 383 -1406 -249 1562 -126 -1391 239
5412B39J003j428p99J172N94j056j58P32K87n28q07P28Q24p53j042P76J458j303
$$ 239 1242 -186 -985 187 781 -275 -433 299 586 58 -749 -21 803 50 -992 -216 1242 -61
5430f1j204J624N62j644j98J626l4j614O66R68n63n65J42P42m45j50K5J58L79
$$ -61 -1265 359 921 -723 -921 705 671 -943 -277 691 128 -437 -295 447 2 -148 -123 35 414
5449D14l98m29M64O78j066n3O81J72j106O13O48p33n56Q26K67p99K15O80n56k80
$$ 414 16 -413 51 729 -337 -390 291 463 -643 -30 618 -115 -671 155 422 -377 -162 518 -38 -318
5469c18N40N3o04K42L76m73n7P84j25p94K95N98m28l10J35P5m2K87n78M39L97
$$ -318 222 275 -329 -87 289 -184 -241 543 418 -376 -81 517 89 -221 -86 -11 -53 234 -344 95 492
5490D92n74l97O15N73j141l74J233K59j315l7J398j88j390O01R92n30j181Q16
$$ 492 -82 -479 136 709 -432 -806 427 686 -629 -666 732 544 -846 -245 747 217 -964 -148
5508a48Q92q02n80L89R10m58r34L83J160l36j433O67J622j305j305J174J356j494
$$ -148 744 -58 -638 -249 661 203 -731 -348 812 476 -957 -290 1332 27 -1278 -104 1252 -242
5526b42q56J346Q88j606n76J414J52n91p58J032L72q38m55Q49N47q57o80J286
$$ -242 -1098 248 1136 -470 -1046 368 520 -71 -829 203 575 -263 -718 131 678 -179 -859 427
5544D27L77j474k05J597j50j310j40J627j11j464O78P85m04q39M92O83o33l37
$$ 427 804 -670 -875 722 572 -738 -878 749 638 -826 -148 637 233 -606 -114 569 -64 -401
5562d01L50K86k9o68L00N51J4j048M55Q34o19o64O86N64o90k42M36K52m56j31
$$ -401 -51 235 206 -462 -162 389 403 -645 -190 644 25 -639 47 611 -79 -321 115 367 -89 -220
5582b20N90l50j52K38j68K5m1j66n4K83K3k63r9L53Pk06Q3J55l4K00l00j09K06
$$ -220 370 20 -132 106 -62 -37 -78 -244 -298 -15 8 -255 -354 -1 6 -200 -117 38 4 204 -96 -205 1
5605AM40o21j33O05k18n48J31P52k14o02L81P15o74n92O09L53k74m41J52R40p40
$$ 1 441 -180 -313 292 74 -474 -343 409 195 -407 -26 689 15 -577 32 385 111 -330 -178 762 22
5626B2p36N29R00p15q30P04J044r92r66J070J108j359p32J233O00j210l43J097
$$ 22 -714 -185 715 0 -830 -126 918 -74 -1040 30 1138 -221 -953 280 880 -330 -673 424
5644D24K66j018k25P56L91q63j77Q08M19r77o01J124M17j195k63J439J4j697N2
$$ 424 690 -328 -553 203 594 -269 -446 362 781 -196 -797 327 744 -451 -714 725 739 -958 -906
5663i06J617k50j441Q52J093p38r27O91O79m95n88L55O64l33p03N0J190m76j149
$$ -906 711 461 -980 -128 965 227 -700 -9 670 175 -413 -58 606 273 -430 -380 810 334 -815
5682h15O91J163j033r46J053N57r72n06J238mq50r8N69J16m68N7M70n5j80j59
$$ -815 -124 1039 6 -940 113 670 -302 -808 430 426 -424 -522 47 163 -305 -248 222 167 -13 -172
5702a72J71K38k68k92K99L76l04k04L82J97n45q0M77j57n93O41n2l51K75K67m88
$$ -172 -1 237 -31 -323 -24 352 48 -156 226 423 -122 -202 275 118 -475 166 114 -237 38 305 -183
5723a83j66O49O8q46P08K41n84l44O88K53p25q3O27j90j10r7j5L54Mm82K23L36
$$ -183 -349 300 368 -478 230 471 -113 -457 231 484 -241 -324 303 113 3 -94 -109 245 249 -233 -10 326
5745C26k95o41M24Q98j127l05Q85P08j431l34J594l02j199M49R86l25r01L57O86
$$ 326 31 -610 -186 712 -415 -720 165 873 -558 -892 702 400 -799 -350 636 311 -590 -233 453
5764D53o5p00k3M89N71j105k68J146L97j488l4J520k90j803R16J383q23j244R01
$$ 453 388 -312 -335 154 725 -380 -648 498 895 -593 -627 893 603 -1200 -284 1099 276 -968 -67
5783f7Q55q74o46O99N94p12k64M32N88o94m26M99N66m34r40P81Q22p25r63R04
$$ -67 788 -86 -732 -33 561 -151 -415 17 605 -89 -515 -16 550 116 -824 -43 779 54 -909 -5
5803eJ012j213o29J330K90j344o5J304n27o26L14N21l57k67j01K12M97l87l07
$$ -5 1007 -206 -835 495 785 -559 -624 680 153 -473 -159 362 5 -262 -363 -151 346 -41 -348
5822c48M55K83m80m40R27Qr02K82O74l97n20N51P0k28n2L73k12k63M59k6l77K19
$$ -348 107 390 -90 -530 397 405 -497 -215 459 62 -458 93 163 -65 -117 256 44 -219 240 214 -163 56
5844E6K19m05k55N87N4n49J62L07k59QJ89j88J64j08l25J67N35m12m39M19M63
$$ 56 275 -130 -385 202 256 -293 -131 176 -83 -75 114 -74 90 -18 -343 -176 359 -53 -492 -73 390
5865C90p76j07R73J94j275J70O98L13j188M26O55j70q20K14P24l65n42K53O50
$$ 390 -386 -493 480 674 -601 -431 267 580 -608 -182 473 303 -517 -303 421 56 -486 -233 417
5884D17j00q56J74R61j49j114K70J185p02r62P95R17q90q27J014O51r19m98R53
$$ 417 317 -539 -365 596 447 -667 -397 788 86 -876 -81 836 -54 -881 133 784 -135 -633 320
5903C20M72r04n38Q63N54j033m08Q77M29p00p11O87R53j139l65R14O14j435q8
$$ 320 792 -112 -650 213 767 -266 -674 203 632 -68 -779 -92 861 -278 -643 271 885 -550 -638
5922f38J214j5j158L3J069j16p23J11P12l12n36L2Q96k93o02N5O01J5o19j89J033
$$ -638 576 561 -597 -564 505 389 -334 -223 489 177 -359 -327 569 276 -326 -271 330 345 -274 -463 570
5943E70l34p23L44N35m11k37K72K87l04j76L01m2j05L2J64j9j49o1r7J06L5J98
$$ 570 236 -487 -143 392 -19 -256 16 303 -1 -177 124 82 -23 9 173 154 5 -56 -153 -47 -12 186
5965A86k81R2J21q4N6j08O8M9J48k96J18L07k17m33M07J03p01K18N06K2r13N62
$$ 186 -95 -3 118 34 90 -18 50 99 247 -49 69 376 159 -274 133 236 -465 -247 259 281 -632 -70
5987g0L92l48j11L4M42k48m42Q4N32k30k63J73M36j95o78K27R29m78j016O43Q66
$$ -70 322 -26 -137 -103 339 91 -351 -267 265 35 -228 -55 381 186 -492 -265 664 186 -830 -187 679
6008F79q18m35O95O34j000l82Q28N68j063n01R86K43p53m05Q63M72q46k89O53
$$ 679 -139 -574 121 755 -245 -627 201 769 -294 -795 191 434 -319 -724 139 611 -235 -524 129
6027A29L53n55o66J155K82j283p9J396k46j169K85Q78k16r95N23N06l03k33r6
$$ 129 482 -73 -739 416 698 -585 -664 732 486 -683 -398 480 264 -731 -208 298 -5 -238 -334
6046c34P67k46n30J9P71O5q49J40Q87l20p49J49P01m13n37Q02K48o31m18N72K67
$$ -334 433 187 -343 -324 447 512 -337 -197 690 370 -379 -230 471 58 -479 323 571 -60 -478 94 361
6067C61m46j19J99O2n4l7j24L01j09k28j7L30J03o33L79L19o39J02M21K9k88m
$$ 361 -85 -204 -5 57 3 -34 -158 143 34 -194 -211 119 222 -411 -32 287 -352 -250 171 200 -88 -92
6089i2K85k44J19Q7j02m27O79O3m92M1K48M4n97O07R4m86j1N04n9m15O1K06Mk08
$$ -92 193 -51 68 155 53 -374 305 368 -124 -83 165 209 -388 219 313 -173 -184 320 261 -154 -93 113 117 -91
6113i1k36J91M97k60n33L37P01n33p93J042N20j056k19Q01J41q04j97R04j52p13
$$ -91 -327 -136 361 101 -432 -95 606 73 -720 322 842 -214 -433 368 509 -295 -492 412 260 -453
6133d53J42O57j4l98m06P35O0n42l99Q91K53j025j17J217Q6j279R0J179m52r87
$$ -453 -311 346 332 -66 -472 263 323 -219 -618 273 526 -499 -616 601 687 -592 -502 677 225 -762
6153g62M29J002m64o80L66N45n06m13M65L76o9o05J56L47k1o92K81Q95n88o57
$$ -762 -333 669 205 -475 -109 436 -70 -483 -18 358 289 -316 -160 187 166 -526 -245 650 62 -595
6173e95P92M12p03o63J069J24p14k04Q31l9o57J15K97j8r2J38J42n4j55l62K54
$$ -595 197 609 -94 -757 312 436 -278 -482 349 310 -347 -232 65 47 -45 93 235 181 26 -336 -82
6194h2L33r2o49P08K86n80j82L39M9l41J0P49l28l26L79k20k13K21j26n9j4K38
$$ -82 251 159 -490 218 504 -76 -258 81 130 -211 -201 548 220 -106 273 53 -160 61 -65 -124 -138 100
6216A00L4l65L33L37o82N2M03m7l60L3L36k58q4K3K86o1Qk54N1L49m45j94O67
$$ 100 134 -231 102 439 -243 -191 212 165 -195 -162 174 -84 -168 -145 141 80 88 -166 -115 234 -211 -405 262
6239B62K27r55l7Q40j6p99K27P60m38k88p4O87k84l56n9N79J55o35j9O44n8p47
$$ 262 489 -466 -503 337 321 -478 -251 509 71 -217 -291 396 112 -244 -303 276 431 -204 -223 421 363 -384
6261c84n4J065m85p71K49J050o77m73L91P00o45n66O20M32p82l15P88L39m11n11
$$ -384 -438 627 142 -629 -380 670 -7 -480 -89 611 -34 -600 20 452 -330 -645 143 482 71 -440
6281d40O09K12l94l51N79M44p80m92P73M15p41l45R43K5q93m2R48k90m35L3N94
$$ -440 169 381 -13 -364 215 659 -121 -613 160 575 -166 -511 432 457 -436 -478 470 180 -255 -222 372
6302C72k86l35lM09J0m49l3N90J6o47K04L40L1m37J94K17j79l55M15K71l54k48
$$ 372 86 -249 -252 157 167 -282 -315 275 291 -356 -152 188 219 -218 -24 193 14 -341 74 345 -9 -257
6324b57K37K55j08j18L8K0L8j36L3Qn1O2m1J68j87J1j66K27Pj05j31l9N00p7l00
$$ -257 -20 235 127 9 47 67 105 -31 2 10 -41 21 -20 148 -39 -28 -194 33 40 -65 -196 -235 265 188 -112
6349a12m9K57Nl66K29J92L1m32o0N16J4o93L73L59j42n64L11M23Mn65M5M74j03
$$ -112 -161 96 101 -265 -36 156 187 -245 -305 211 225 -468 -95 264 122 -442 -131 292 296 -269 -224 250 147
6372A47n87K01P95m47n63L05O66o22m56N46O01q74k95O87L76o52k85O21K19n24
$$ 147 -440 -239 556 109 -454 -149 517 -105 -561 -15 586 -288 -583 104 480 -172 -457 164 383 -141
6392a41o7M21K42n86l95N18N33p36n81J198J05q56q5Q16J74j154K88R88n88m49
$$ -141 -208 213 455 -131 -526 -8 525 -211 -792 406 511 -345 -430 386 560 -594 -306 682 94 -355
6412c55K76M22r7m03k7N74j28m95j44O14J83p84pQ84l73m58K38P08n10o61O42
$$ -355 -79 343 246 -157 -184 390 262 -233 -377 237 420 -364 -371 513 140 -318 -80 628 118 -543 99
6433I9R3k76n57P69K07n53O8K73j46J18l60K64J88j36k14J20K29r2l37K02M24
$$ 99 192 -84 -641 128 335 -218 -150 123 -23 95 -265 -1 187 51 -163 -43 186 94 -243 -41 383
6454C83l01l00K44M4l17N8J90k39K78J31qk99K24K03m86K03M31l17l25K02J31
$$ 383 82 -218 26 70 -247 -189 1 -238 40 171 163 -136 88 291 -195 8 439 122 -203 -1 130
6475A30l51n3M92m0k27r2n5K24K6n0l2K53q9n24J26P25m41m67N56M63o72m60Q29
$$ 130 -221 -274 218 178 -49 -141 -196 28 54 4 -28 225 136 -388 -262 463 22 -445 111 574 -98 -558 271
6498B71J94j065M39O89n42o3j18L98k6m39N7K91J05l55q3M57K01o59q8Q15L6j010
$$ 271 465 -600 -161 528 -14 -77 -195 203 177 -262 -205 86 191 -164 -247 210 411 -248 -336 479 515 -495
6520d95J61R43k42r19M64O04n04m52L19N46l16m91K12L68n0m08L3N17m2n49P6
$$ -495 -334 609 367 -552 -88 516 12 -440 -121 425 109 -382 -170 198 148 -260 -227 290 248 -301 -225
6541b25O94l71p15O34N35l53p45N82O47q37P5K03K5r5l57M11J54n06K09K61q5
$$ -225 469 98 -617 17 552 199 -546 36 683 -154 -79 124 149 54 -303 108 262 -244 -35 226 141
6562A41qm45K37L62m24j85M60K15m63o8L54m4k09p0K40p5l01K71J65j92J61q5
$$ 141 133 -312 -75 287 -137 -322 138 353 -110 -178 176 132 -77 -147 93 18 -283 -12 153 -39 122 37
6584C7q8oJ61o7n6K5J74l26R5J22l66K24K29o5j56n4O2P5j5mk38K02L30k21k95
$$ 37 -51 -57 104 37 -19 6 180 -146 -51 71 -295 -71 158 93 -63 -117 -55 20 5 1 -237 -35 295 74 -221
6609b21K33M78o00j36L34K7l00J63L63j20n55L13M25l21k86N2O01l24l62j06N53
$$ -221 12 490 -110 -246 88 115 -185 -22 341 221 -334 -21 404 83 -203 -151 450 126 -236 -342 211
6630B11J93q38o2Q51J8p87J17P60n59m16N89M54o23m75P49M07p65j55N41K73m36
$$ 211 404 -434 -496 355 373 -414 -297 463 -96 -512 77 531 -92 -567 182 589 -176 -331 210 483 47
6651D7n60L32N81l88n74N98M27o73m11Q99K76p25k69O15R4o49J9N59K5n74J35
$$ 47 -513 -181 400 12 -562 36 463 -210 -621 278 554 -171 -440 175 269 -380 -361 198 223 -351 -216
6672b16L21m0k49q1L14J62k84k99O37J73p34M3O29m2m74J42K08j35k95R5K81Q
$$ -216 105 65 -184 -265 49 211 -73 -372 265 438 -296 -253 376 334 -140 2 210 75 -220 -125 156 164
6694A64j42j42K40k6j66K9J04J46j83p4m2L78m45j1J35J49p7J6J43j52l7j01M1
$$ 164 22 -120 120 94 -72 -43 61 207 24 -50 -92 286 -159 -170 -35 114 37 53 196 44 7 -94 -53
6717e3J27K8J12l82K03K1l44j01N47p1l83K50K15r2l15J31J55L7l03K9L86L2l48
$$ -53 74 102 214 -168 35 56 -288 -389 158 87 -296 -46 169 77 -238 -107 48 85 -218 -189 197 229 -119
6740a19J9M06Lo46J41Q63m45m86K05N86m87n47M11O28o91k81O30L00p18LK29J61
$$ -119 -100 306 309 -337 -196 667 222 -264 -59 527 40 -507 -96 532 -159 -440 190 490 -228 -225 4 165
6762A65j62m38M32M52m07m45N08L10l76m56O42L35q33j67J092k20p89K19O30j88
$$ 165 3 -435 -3 449 42 -403 105 415 39 -417 225 560 -273 -440 652 432 -357 -138 492 304
6782C04q60M74N65k70l42j97N67k56l82m8P37J42p74k4M81K21p57K90M64p5n72
$$ 304 -556 -82 483 213 -129 -326 241 -15 -397 -445 292 434 -340 -364 117 338 -419 -129 335 260 -312
6803c12L23N05p85j96N66K36l98l7J52M5k67j0K85J72j79l02P3K12R6m77K40L58
$$ -312 11 516 -269 -465 101 337 -61 -98 54 99 -168 -178 107 279 100 -202 -129 83 179 -298 -58 300
6825C00m02j75K47L00l83L8J47K1q1L12k97J6k2O3k15J8K44jl37K09M05n97P3
$$ 300 -102 -277 -30 270 -113 -75 72 93 12 324 27 43 21 84 -131 -113 131 130 -207 2 407 -190 -117
6848a17L59p1j31j36K57j83j29J51l2m5O5k83L64K63k45o51M80Q12p97l30M18
$$ -117 242 171 40 -96 161 -22 -151 0 -32 -77 -12 -295 69 332 87 -564 -84 728 -69 -399 19
6869A9K87o73kO94J65q42Q4L57K13l58j11K85M5k77k39N78J85p15j94R80q3p02
$$ 19 306 -367 -369 325 490 -352 -268 89 302 -56 -167 118 163 -114 -353 225 410 -305 -499 481 398 -304
6891c04j82R16%j112L64Q51n35n64N95L44l32l70L56K41k10k48K56L28l63l20
$$ -304 -486 430 430 -682 -318 533 -2 -566 29 373 41 -329 27 268 58 -190 66 394 31 -289
6911b89K12N60l66n81M46N29l81o81O27M09o77j59P01j11n36J39M17j81l42J30
$$ -289 -77 483 117 -464 -18 511 130 -551 76 485 -192 -351 350 239 -297 -158 259 78 -264 -134
6931a34J35L3N2k10L35P5l25m42N84K8k02j58N30o9l61q6L75n7m20J50L50l44
$$ -134 1 34 86 -124 211 286 -39 -481 103 131 -71 -229 301 232 -129 -215 160 103 -317 -167 183 -161
6953a61j28L71o5j49K19k91J69J27j28J5j52M42j37j92J08P8J2j69k2K37N1p5
$$ -161 -289 82 17 -132 87 -204 -35 92 -36 -21 -173 269 132 -60 48 126 138 -31 -53 184 235 160
6975A60k47K38K04k11m70L38K60o02mN41K60n02k25L84J41n06n1M97l3o05J41
$$ 160 -87 151 355 144 -326 12 272 -330 -334 207 467 -35 -260 124 265 -241 -292 205 172 -433 -292
6996b92L94J66o12O8N65J54p46KP15k88l93J06O73k62p57M72N06l40n41K33O71
$$ -292 102 268 -344 -276 289 443 -303 -301 414 126 -267 -161 512 250 -507 -35 471 131 -410 -177 494
7017D94l48o38L34N50n91l79M38P61o61o64P75L63n35n13O36M20o41n51J016J31
$$ 494 146 -492 -158 392 -199 -578 -140 621 -40 -704 71 434 -101 -614 22 442 -199 -750 266 397
7037C97n37j21L88J92l11j64L65rm49r6M53K45o76J61L39L3l83P5L79k7p07L41
$$ 397 -140 -261 127 319 8 -156 209 200 -249 -345 108 353 -323 -162 177 210 -173 -98 281 254 -453 -112
7059a12M06k74j38L3L20k50k18K63l5M6j42KJ89Pj58j04K31Pl14K51K71m25Pn4
$$ -112 294 20 -118 -85 235 -15 -233 30 -5 41 -101 -99 90 97 -61 -165 66 73 -241 10 281 -144 -137 -191
7083a91J84N6O1j99j44K95J87k45k74K08K20l27N6M50j95l18m7N18m11q3J1N25
$$ -191 -7 49 110 -89 -233 62 249 4 -270 -62 158 -169 -113 337 142 -176 -223 295 -116 -199 -188 337
7105C37m45J1k6K2J19j23J27J55P1n83K69O12m23m56J23O92m51l44L94L42o18
$$ 337 -108 -97 -123 -101 18 -105 22 177 248 -335 -66 546 123 -333 -210 482 31 -313 81 423 -195
7126a95k32P57L2l56l10N94k7m57j07L64M27m83l29K37M69n45o0L35J96n72j61
$$ -195 -427 330 362 6 -304 290 263 -194 -301 63 490 7 -322 -85 384 -161 -221 114 310 -262 -423
7147d23P77J04j035P6Q93j28q06K74N72j63m94Q0N43J9l85k58N05J41m33rM89
$$ -423 354 458 -577 -501 392 264 -542 -268 304 141 -353 -273 270 289 -96 -354 151 292 -141 -150 339
7168C39J68r19J18P10j95p39M70N73n60k93K86L73o23J12R0K14j03k33K09K91
$$ 339 507 -412 -294 416 221 -518 -48 525 -35 -328 -42 331 -292 -180 -90 124 21 -212 -3 288
7188B88l28j95J3N37l07k69K09O7qk59L35J7l06Q8L10N3l28K09k20O5J56j7l18
$$ 288 -40 -235 -222 315 8 -261 -52 15 7 -252 83 100 -206 -118 192 245 -83 126 -94 -29 127 110 -208
7211b08J12K71k05j78J58M46n65j10L49P4l45J56o1J19J66j53j00K84l9l32rM25
$$ -208 -96 175 -30 -208 -50 396 -169 -279 70 144 -201 -45 -106 13 179 26 -74 210 171 -161 -170 255
7233B55o6m13M7O35n73j72N57R9m86l97Q88j08n60k9L84J59l22l6K38K33l09m69
$$ 255 189 -224 -177 458 -115 -287 270 369 -117 -514 374 266 -294 -323 61 220 -102 -138 100 333 24 -445
7255d45N03K75m02l50M51O45r27j79R66k8r99QR47p6r82L25P44l43m86J85M83
$$ -445 58 333 -69 -419 32 677 -250 -429 537 509 -490 -482 465 389 -593 -268 476 133 -353 -168 315
7276C15r3q54N68L60j23l88p5O83l85m98M96M25l07o63N09M63k74n30L71O14o82
$$ 315 222 -632 -64 296 173 -215 -290 393 8 -490 6 431 124 -539 -30 433 159 -371 0 614 -68
7297f8k70L98K7k45O3l1L81k19l53J37M40j75n56N15j8j36j80M90Rk09r0J48%
$$ -68 -338 60 87 -158 -95 -126 255 36 -317 -180 260 85 -471 44 26 -110 -290 200 209 0 -90 58 58
7320E8l12K33J97k35J15k23K11j1K14j82j57P5K5l50K84J34n4mK5m6q8m9K10P3
$$ 58 -254 -21 176 -59 56 -167 44 33 247 65 -92 -17 8 -342 -58 76 22 18 43 -3 -91 -140 70 143
7344A43pl0j63R0L2Q5l42K36K69k64k43K71L23n75k70P46j0n88n2P11j35n61r2
$$ 143 136 106 -57 33 65 150 -192 44 313 49 -194 77 400 -175 -445 301 291 -297 -349 362 227 -334 -426
7367d26Q24k13n31J13N02k24n43L3P93J68q87L22M34l13o02M92O78l51n36J56
$$ -426 398 185 -346 -233 269 45 -498 -465 328 496 -391 -69 365 52 -550 -58 620 269 -267 -111
7387a11M00k76l20L20L99m11m75N54M14o10m32N03N11m52n12M70N06n83j70K23
$$ -111 289 13 -307 13 412 1 -474 80 494 -116 -548 -45 466 14 -498 -28 478 -105 -275 -52
7407e2L74n05k54M84J39l28j29N66Mk12l43L63J92l46m98O74J45m94r2N15K57
$$ -52 322 -183 -437 47 186 -142 -271 295 299 87 -256 107 299 -47 -545 129 274 -220 -312 203 460
7428D60n74L2L41q1n76K78N12l01m16M54pp1j94j73L20O2j94L2M38k99o1k39K97
$$ 460 -114 -82 259 178 -398 -120 392 91 -325 129 122 51 -143 -316 4 66 -128 -96 342 43 -18 -257 40
7451D0m2q6K10L7o1Q3j75j3J41lO0l73J39Q3j35j13L01K27o39K34N94m19k57o8
$$ 40 -2 -88 122 159 98 181 6 -7 134 131 191 -182 -43 40 -95 -208 93 320 -319 -85 509 90 -167 -235
7475b35K38J40k54P5MJ76l41k2K61K17n55pR25n68n09K02O29j72o16M14K47l09
$$ -235 3 143 -111 -36 -32 144 -197 -219 42 259 -296 -303 622 54 -455 -253 376 204 -412 2 249 -60
7497f0n43O85L89n85l87N22Q5m12k10N44M12k61o87N29K96l40o97N83R46q28l35
$$ -60 -603 82 471 -114 -501 21 106 -306 -516 28 440 179 -508 21 317 -23 -720 -137 809 -19 -354
7518c54M26K33l54m13P44L6n98J23M82K1m58j93N24p2k26k06N45J21n11m17Q13
$$ -354 72 305 -49 -462 282 318 -280 -157 325 346 -112 -305 219 147 -79 -285 260 381 -130 -547 266
7539B66J21o12k47O14J3o32L06O45l36m97L88K35n5l21kJ67J05k26o9M56k47j33
$$ 266 387 -225 -472 142 155 -477 -171 474 138 -359 29 264 209 -112 -114 53 158 -68 -137 319 72 -61
7561f1j24N62k68k87J78K25J0m42K36P2k14l17M84K8k35J49P9j90K94N4l81R8
$$ -61 -185 377 109 -178 0 225 235 -207 29 101 -113 -430 54 82 -153 -4 75 -115 179 233 -148 -50
7583e0J92q5j37J80R1q0l53M28J44m47j77L21R7j78M9j19K05Q1n39K82K27J63
$$ -50 142 57 -80 100 191 111 -242 186 330 -117 -294 27 124 -54 -5 -124 81 162 -377 -95 132 295
7605B95o28J81O03l33n42L83L76n42j20N67J24l97k84L95L52n72r8L09L56m89
$$ 295 -333 -152 451 118 -424 -41 335 -207 -327 240 364 -33 -317 78 430 -142 -240 69 425 -64
7625f4m08O50J03l68m69O19L79n04m90Q94K54j019JP53j7p12J71N86l12k75r2
$$ -64 -472 178 281 -87 -556 63 442 -62 -552 342 596 -423 -422 331 314 -398 -227 359 47 -228 -320
7646c20N79K1m45J09K99J7o56Q3O06j62m28j07Q24l58n34L84O28o00l45L66L06
$$ -320 259 280 -165 -56 243 260 -396 -313 293 131 -297 -404 420 62 -472 -88 540 -60 -405 -39 267
7667B67k58n75O42M85o93j55K76O3j0l07J71J22J5m07K35L92j73k63P1M77k03
$$ 267 9 -566 76 561 -132 -287 -11 52 42 -265 -94 28 43 -364 -129 263 90 -173 -102 375 172
7688A72m29N52j40k05qJ51j18K1L5O4j8P3l55J12K00J08k83n1O7N4j72J23R2J68
$$ 172 -257 295 155 -50 -58 93 -25 -4 31 95 77 150 -205 -93 107 215 -68 -119 -52 2 -170 -47 45 213
7712B13l73J31J12Rj73j7o3L37j01l02L14L92m61l56N03J96m97r9L46q4j91n2
$$ 213 -160 -29 83 92 -81 -98 -161 176 75 -227 87 479 18 -338 165 361 -136 -235 111 27 -164 -216
7734b16K69j2n3j54K08L95m43k62N27L9l86k1K52K66p76l2P54op22N7N71J18o78
$$ -216 53 41 -12 -166 42 437 -6 -268 259 298 -88 -109 143 409 -367 -399 355 349 -373 -316 255 373 -305
7757c05J29O62l74n80K80O65l24m54K63N13r2p74L1Q90k81m73J59M53j71o41M27
$$ -305 -176 486 112 -468 -188 477 153 -301 -38 475 383 -391 -360 530 249 -224 -65 388 217 -424 3
7778CL31j32m91L39K94m15j97L72R3l21J0K25K12n32k80N15J84j71k62L78J09
$$ 3 334 202 -289 50 344 -71 -268 104 197 -124 -114 111 323 -209 -489 26 210 39 -223 155 264
7799B64l32k88O04J05m88j27M01l4j46j50N53l08j27R6j53L13m57R7M23q5l46
$$ 264 -68 -356 248 353 -135 -262 139 105 -41 -191 362 54 -73 23 -130 183 -274 -177 246 161 -185
7820a85J29J13J76k55qJ74Q3m29J98R7o6j00J01k72K8L82l03rK12J38l05L8M09
$$ -185 -56 57 233 -22 -30 144 227 -202 -4 93 27 -73 28 -244 -216 166 -137 -146 66 204 -101 -63 346
7843C46j67l47l3L20Q7k72R4J49m9k78PM72p6l69j61O05j2n54n5O00oo05K63L57
$$ 346 179 -168 -201 119 206 -66 28 177 128 -150 -143 329 253 -116 -277 328 316 -238 -293 307 301 -304 -41 316
7867C16r2n23K07K73j14m97J93M59j96p2m1L20o5m18K45M82l20n42K65Q06q77
$$ 316 224 -299 -92 181 67 -430 -237 222 26 -46 -87 233 168 -250 -5 477 157 -385 -120 686 -191
7888a91k94M51M76m84l50L93L28o28j33N51J27k13m43N05J55k39k79K32N26m58
$$ -191 -485 -34 442 -42 -392 1 329 -299 -432 119 246 33 -410 95 250 11 -268 -36 490 32
7908C2j13K15K02l92j32M69j6m07R4N46l78l97J46M48k22k98M11j44j33Q5l6N2
$$ 32 -81 134 336 -56 -188 281 265 -142 -48 498 120 -277 -131 317 95 -203 208 64 -69 16 -20 32
7930C2Q1l98O3M57q1l79k8M58Q3m08P9J63L2l07Q0M25o3n32L67j23L1P2K3k69
$$ 32 113 -285 -222 235 154 -225 -253 205 288 -120 -41 122 154 -153 -73 352 289 -243 124 1 32 104 127 -142
7954a42K25o4j68J41J34j11k76M11Q0k29n7J74J4m18J00J80J00k19OL5J66K0l30
$$ -142 83 19 -149 -8 126 15 -261 150 230 1 -56 118 132 -286 -186 -6 94 -125 -119 -84 82 102 -228
7977b28qN99j42n49J97N70k14p45M72K74m14q1L94L7j83m02M04K21k53k32M1P37
$$ -228 -236 363 221 -328 -131 439 225 -520 -48 226 -188 -269 125 162 -21 -423 -19 202 -51 -283 -242 495
7999D95l38l45J09N12l79o58O42M10o24k02M69L02o64j84O72K67p64L4L61L30
$$ 495 157 -188 -79 433 54 -604 38 448 -176 -378 91 393 -271 -455 217 484 -280 -246 115 445
8019D45o77J26K16K67m56j65L54J42l74k72N35J16p30K90M94n6n20J36O39l90
$$ 445 -232 -106 110 377 -79 -244 110 252 -122 -394 141 257 -473 -183 311 255 -265 -129 510 120
8039A20l10K6M89j44j58j5J02j32k23M5M96n3m56j00O62l49j75K05K70j70k95
$$ 120 -190 -164 325 181 23 8 110 -22 -245 -200 296 243 -213 -313 349 0 -175 30 300 130 -165
8060a65J51J03qk75M29n9j44k1J20R0Q4l97j22K43J72j66m4K3N7p0R1K1r7J07
$$ -165 -14 89 81 -194 235 176 32 11 131 221 305 -92 -214 29 201 35 -9 14 71 1 92 113 16 123
8084A23p3J1N1j05l13K48R0M5l16K54J27j69k84J86M29m53k45P61j74l21r7M25
$$ 123 50 61 112 7 -306 -58 32 77 -239 15 142 -27 -311 -125 304 -149 -394 367 193 -128 -225 200
8106B00J40k94k98K75k8R3m88N29J13n06k55P52J40n49l34N15L23o11L3M38K09
$$ 200 340 46 -252 23 -5 88 -400 129 242 -264 -519 233 373 -176 -510 5 328 -283 -250 188 397
8127C97p00L9N34j40k75j54N05j09m02R8N43j05o78J33M79K6o15O2O27r5o44M61
$$ 397 -303 -264 270 130 -145 -299 206 97 -305 -207 336 231 -447 -314 165 191 -424 -362 265 170 -474 -13
8149a3M89o17r9M5O83o33j60K39L06p6n39K86N80l12n94J92P40m65l10K03J05
$$ -13 476 -141 -240 -195 488 -145 -305 -66 240 164 -375 -89 491 179 -415 -223 517 52 -258 -55 50
8170E0j93k62N96o3j43k36K82l2r3j56L11m7p3k06M35J8k71q2R2J39k07
$$ 50 -143 -405 191 128 -15 -251 31 -1 -94 -250 61 14 -59 -265 170 188 -83 -165 -73 66 -141
8191a41
$$ Imaginary data points
##PAGE= N=2
##DATA TABLE= (X++(I..I)), XYDATA
0@%%%%%%Qq%%Qj6J6k3L1m0M8n6P2q7J03j20J40j65J92k23K60l01L43l91M48n11
$$ 0 0 0 0 0 0 0 8 0 0 0 8 -8 8 -15 16 -24 24 -32 40 -47 56 -64 76 -89 103 -120 140 -161 182 -209 239 -272
32b72N78o49P33q27R24j030J149j281J425j581J749j934K138k360K602k867L158
$$ -272 306 -343 390 -437 487 -543 606 -675 750 -831 918 -1016 1122 -1238 1364 -1503 1655
49A655l478L831m220M653n138N684o305P014p833Q798r947J1341j3078J5303j8264
$$ 1655 -1823 2008 -2212 2441 -2697 2987 -3318 3696 -4137 4661 -5286 6055 -7023 8280 -9984
64i984K2401k8570L8684n7914J06097m24581n82101J543738j24737j280306O62906
$$ -9984 12417 -16153 22531 -35383 70714 -353867 -935968 607770 483033 -797273 -134367
75a34367Q23568q48632k62121O56383o0503l23231J60543M518n1614J25886j09230
$$ -134367 689201 -159431 -421552 234831 174328 -148903 11640 16158 -35456 90430 -18800
86a8800j52380K39843J28481l00087j33460L97333J14648n54957K473P33099k72099
$$ -18800 -171180 68663 197144 -102943 -236403 160930 275578 -279379 -276906 456193 184094
97A84094p82241N95189N94406q62578k13957R28692j89948p38310M68188L77549
$$ 184094 -598147 -2958 591448 -271130 -485087 443605 253657 -484653 -16465 361084
107C61084n03665n359L21089k13506m0148K03427j96959l1822L10046j59401k79373
$$ 361084 -142581 -147940 173149 -40357 -80505 122922 -74037 -105859 204187 44786 -234587
118b34587L02340J73524l94281o1419M44836o1067m73282J99504M49130l66057
$$ -234587 67753 241277 -153004 -214423 230413 169346 -303936 -104432 344698 -21359
128b1359l46319N21338J56600n91495Q8334N12867l11500k90387M21882J9786
$$ -21359 -367678 153660 310260 -281235 -192901 319966 8466 -281921 139961 159747
138A59747l58162J90549J61367k60363O9363J88914k25311j9941K63533j66028
$$ 159747 -198415 -7866 153501 -106862 -37499 151415 -73896 -93837 169696 3668
148C668j92586L01066M3225l63893J17719L39837k70922k60366L94010J42023
$$ 3668 -188918 112148 155373 -208520 -90801 249036 -21886 -282252 111758 253781
158B53781m66286J5988M72230j90565m00121L31361K55816l82116p7054L28371
$$ 253781 -212505 -196517 275713 85148 -314973 16388 272204 -109912 -186966 141405
168A41405o3855j85629J23484K2729p1027R7005p0614j35660K33130P7771l52689
$$ 141405 77550 -108079 15405 38134 -32893 64112 -6502 -142162 90968 168739 -183950
179a83950M8885L97055j97121l72629L22371K93913m07533j85211M43789O0769
$$ -183950 -135065 261990 64869 -307760 14611 308524 -99009 -284220 159569 220338
189B20338m28918N7243L62990j40683k58125J67722J38141j31676l9810M6759
$$ 220338 -208580 -151337 211653 70970 -187155 -19433 118708 -12968 -52778 -6019
199f019O925O4086n1170j49054J56215J68326k74384j10638L56688O35l77583
$$ -6019 906 64992 13822 -135232 20983 189309 -85075 -195713 160975 161610 -215973
210b15973J25383L39901k27232k61054K83315J59501k95626o5709K66824q081
$$ -215973 -90590 249311 22079 -238975 44340 203841 -91785 -157494 109330 101249
220A01249k14183N3811J48660o7909q0707M2454K5830J7432o762r3309M0362J54098
$$ 101249 -112934 -59123 89537 21628 -59079 -16625 9205 26637 19875 -73434 -33072 121026
232A21026j15747j63223K12333J14718k89019j8283L15590r4803k77406J90519
$$ 121026 5279 -157944 54389 169107 -119912 -138195 177395 82592 -194814 -4295
242d295J89148k36581q3491K23722p406j69608N8125R6507p1023l2591N0670j0279
$$ -4295 184853 -51728 -135219 88503 81097 -88511 -30386 66121 -4902 -37493 13177 2898
254B898q407K4322m2065r144Q0288l2922r3824R2395P7459j51593k6524J94934
$$ 2898 -5509 18813 -23252 -32396 47892 14970 -78854 13541 91000 -60593 -87117 107817
266A07817m9299j98763J37881J57292k12697p7781K50172j3043k38605R0923J86851
$$ 107817 58518 -140245 -2364 154928 -57769 -135550 114622 101579 -137026 -46103 140748
277A40748j37049j17464J38681N3366j04580k0286M7398K6972M966o7904l3151
$$ 140748 3699 -113765 24916 78282 -26298 -46584 814 27786 32752 -35152 -68303
288f8303J26897K5768j87451J5892K32833q3819k47382J63843K25843k33036j68911
$$ -68303 58594 84362 -103089 -87197 145636 61817 -185565 -21722 204121 -28915 -197826
299a97826K76388R2635k82950j5151K54889m3992j98010P2279J31819o2746p7670
$$ -197826 78562 171197 -111753 -126904 127985 83993 -114017 -41738 90081 27335 -50335
310e0335K1415N2955L0673o7018p6447J12353R5972j74638q1973K34092L0433
$$ -50335 -28920 24035 54708 -12310 -88757 23596 119568 -55070 -137043 97049 127482
321A27482k73637M5057K78464j27425k44277J94489J81355k28635r9931K28294
$$ 127482 -146155 -101098 177366 49941 -194336 153 181508 -47127 -147058 81236
331H1236K4526j92681K7621J35397m1641p1756J8306K4715L2406j0521r0591L3542
$$ 81236 105762 -86919 -59298 76099 34458 -37298 -18992 5723 38129 27608 -62983 -29441
343b9441J36748r0757j56924J61911J36147k29257p8687K67193n811k66816R2014
$$ -29441 107307 16550 -140374 21537 157684 -71573 -150260 116933 111122 -155694 -63680
354f3680K26081j57256j54028J86167O9722j71287P294J22127n3487n3437N9694
$$ -63680 162401 5145 -148883 37284 107006 -64281 -56987 65140 11653 -41784 17910
365A7910j1888k7283N7582k5622o7307Q3216M0367j26552J4374J40380q4283j20090
$$ 17910 6022 -21261 36321 10699 -56608 26608 66975 -59577 -45203 95177 10894 -109196
377a09196J43917O4919j80762J1601J81636r2748j46114J56658P9805j89606O1
$$ -109196 34721 99640 -81122 -69521 112115 19367 -126747 29911 109716 -79890 -79829
388g9829J80611p3226j36603J20149P4362j24945r836R4235l1738l6820M0827
$$ -79829 100782 27556 -109047 11102 85464 -39481 -49317 44918 13180 -23640 17187
399A7187k2836j0738O6204m6623p7459J12528N3033j68461L16J98840p1557j97511
$$ 17187 -5649 -16387 49817 3194 -74265 38263 91296 -77165 -76849 121991 50434 -147077
411a47077J41211J61116j98186j02563K24007L1183k16223L3464J77387p6415
$$ -147077 -5866 155250 -42936 -145499 78508 109691 -106532 -73068 104319 27904
421B7904j17519Q8886N7678o4294j4354J4784N190M0959l1685p9623Q5667Q7807
$$ 27904 -89615 -729 56949 -7345 -21699 -6915 -1725 39234 7549 -72074 13593 101400
433A01400j46358o0147J98134N248k23821O1421K14767j26895j78418J72554J23125
$$ 101400 -44958 -105105 93029 98277 -125544 -64123 150644 23749 -154669 17885 141010
444A41010j94856o4807J89386J2681j59824K2843J13950l3283o6903J3709L3636
$$ 141010 -53846 -118653 70733 83414 -76410 -53567 60383 27100 -39803 -26094 7542
455G542K9135k6016p7788M9264J14940r5700j22677J55383R7024k03758m2297
$$ 7542 36677 10661 -67127 -17863 97077 1377 -121300 34083 131107 -72651 -114948
466a14948K24494k3715k10404Q0323J69386j14567j16717J22649O6799j09037
$$ -114948 109546 85831 -124573 -44250 125136 10569 -106148 16501 83300 -25737
476b5737k9591Q0080Q116m7653n801J6309J6826L362l8600q951O7090k702r0819
$$ -25737 -55328 24752 32868 -14785 -20586 -4277 12549 15911 -22689 -31640 35450 32748 -58071
489e8071L4075J01171p7003q5756J19328M5030j42770J1740J39484o6438j07167
$$ -58071 -23996 77175 172 -85584 33744 78774 -63996 -52256 87228 20790 -86377
500h6377J05870N6853j19569m984J06623l3183p7076M6661M2092m1016j8240K2463
$$ -86377 19493 76346 -43223 -48207 58416 25233 -51843 -5182 36910 -4106 -22346 117
512A17R381q62j6274j9494L4651L1731o0923k9774Q9251J2491j13145K0278J26960
$$ 117 9498 8636 -7638 -27132 7519 39250 -21673 -51447 37804 50295 -62850 -42572 84388
525H4388n9302j22800J00937R9285j30848o0151J43061J6946j34066J7051J08520
$$ 84388 25086 -97714 3223 102508 -28340 -88491 54570 71516 -62550 -45499 63021
536F3021l4360p9282L3801N5246k0407m6155P04N1174J5292p0265k1918R6235
$$ 63021 28661 -50621 -16820 38426 18019 -28136 -27432 23742 39034 -31231 -53149 43086
548D3086J2332j21358J0838J39002m2931j42967P9927J31895j11915j04967J32603
$$ 43086 55418 -65940 -55102 83900 40969 -101998 -22071 109824 -2091 -107058 25545
559B5545P1834j35204l9697J23274K0108j04548j5127Q7618K2591p8891l7304
$$ 25545 97379 -37825 -77522 45752 65860 -38688 -53815 33803 56394 -22497 -59801
570e9801Q0531M8740r4233n1108J11142M3025j27936k9028J37940J0797j41784
$$ -59801 20730 69470 -24763 -75871 35271 78296 -49640 -78668 59272 70069 -71715
581g1715J1654J37928l6325j25344N7900J05979o9442q0092O9285N5700n6930
$$ -71715 -60061 77867 41542 -83802 -25902 80077 10635 -69457 -172 55528 -1402
592a402l7724L9185L3702k0894m3262J1717O0135j7599p4195L6980P5662o2855
$$ -1402 -39126 59 33761 12867 -30395 -18678 41457 23858 -50337 -13357 62305 -550
604e50o4018Q2872M0837r3557j3817R1543j4117p9345L5347O1061m7056l9845
$$ -550 -64568 18304 59141 -34416 -48233 43310 29193 -50152 -14805 46256 -800 -40645
616d0645M9024K1200m3946n390L3880k652j8942Q85P011J2960l572l1168J4144
$$ -40645 8379 29579 -14367 -19757 14123 11471 -7471 -6586 425 13385 9813 -21355 -7211
629g211M5654l6037m8251O2323L3341q4698n616R3876k8881q6947N7728O3968
$$ -7211 38443 2406 -45845 16478 49819 -34879 -40495 53381 24500 -62447 -4719 59249
641E9249p4462l5462P6258R728o7887O894N3975j3728l7956J2894K5131m502j7370
$$ 59249 -15213 -50675 25583 35311 -32576 -25682 28293 14565 -23391 -10497 14634 10132 -7238
654g238q481K0477K3680l3808l3525N7289L2922q5554j7429J10755j3258j23588
$$ -7238 -15719 4758 28438 -5370 -38895 18394 51316 -34238 -51667 59088 45830 -77758
666g7758N1571J16510q7726r1625J08598N7196j12195k6697R9170P244p7973l613
$$ -77758 -26187 90323 2597 -89028 19570 76766 -35429 -62126 37044 44288 -33685 -37298
678c7298N7551J2742m4847k8323M4076M5316n3350n7695P0804O4887r1464o3146
$$ -37298 20253 32995 -11852 -40175 3901 49217 -4133 -61828 8976 73863 -17601 -80747
690h0747J14338N0905j34653k5564J47044q006j46717M2817J28844p0173r8177
$$ -80747 33591 84496 -50157 -75721 71323 63317 -83400 -40583 88261 18088 -80089
701h0089Q1622O0992p4476l1213N1330J7069k3711k2062Q52M1595P312o5972J485
$$ -80089 1533 62525 -11951 -43164 8166 25235 1524 -20538 -19686 21909 29221 -36751 -35266
714c5266Q7029k4411r5425N5782Q8643q4906o6811J06344L6468j14501j691J07890
$$ -35266 51763 27352 -68073 -12291 76352 -8554 -75365 30979 67447 -47054 -48745 59145
726E9145k9422q8228N0839N9627n8775k9490N0367N479l2222M865Q776n40J0439
$$ 59145 29723 -58505 -7666 51961 -6814 -36304 14063 19542 -12680 -7815 961 421 10860
739A0860j6732k0265M0793J4111o2215O426P3918l6165p0307O6610N2287q8139
$$ 10860 -5872 -26137 14656 28767 -33448 -27022 46896 10731 -59576 7034 59321 -28818
751b8818k1155R6423j4580q7762M8381O4975o9756l3489P4059J679o2956K2290
$$ -28818 -49973 46450 31870 -55892 -7511 57464 -12292 -45781 28278 29957 -32999 -10709
763a0709M0684l3086j6305K7366l610j0029J0607j2877l212L0680j6842l8934
$$ -10709 29975 -3111 -19416 7950 4340 -5689 4918 -7959 -11171 19509 2667 -36267
775c6267M4252L4079p0367j6635R0714j0373r8917M2971R3827p1865p6452R3045
$$ -36267 7985 42064 -28303 -44938 45776 35403 -63514 -20543 73284 1419 -75033 18012
787A8012N0996j00425k2751R5180j025p8985J3834N6803j2903l6829k071K5705
$$ 18012 69008 -31417 -54168 41012 39987 -38998 -25164 31639 18736 -18093 -20164 5541
799E541K3076k9135m3750M4492N5283o9083n4034R5108L8985j15176j2976J23478
$$ 5541 28617 -518 -44268 224 55507 -13576 -67610 27498 66483 -48693 -61669 61809
811F1809j7113j16946M5253R9166o4146p3900P1893M8467o5966k7455N0863J5828
$$ 61809 44696 -72250 -26997 72169 8023 -65877 6016 54483 -11483 -38938 11925 27753
823B7753l1405j6297J5126K7087p581m4753J1249O0514k6173p0087M8287O7265
$$ 27753 -3652 -19949 -4823 22264 14683 -30070 -18821 41693 15520 -54567 -6280 60985
835F0985p2611n2791R0585K9530r8532k403R3706k1186p8838L8142N8757m3817
$$ 60985 -11626 -64417 26168 55698 -42834 -45237 48469 27283 -51555 -13413 45344 1527
847A527l7384L9924K0907k7588j1970J2920J2713J77k2022o267L6133L786n0658
$$ 1527 -35857 4067 24974 -2614 -14584 -1664 11049 11226 -10796 -17063 19070 22856 -27802
860b7802P415N8597k5532n7602M4661M5434o0369k5946O6664K275o2377J9554
$$ -27802 -20387 38210 12678 -44924 -263 45171 -15198 -41144 25520 27795 -34582 -15028
872a5028M8100l3658k8657L8035J0517l3421L602K3890r725j2283R375L938k854
$$ -15028 33072 -586 -29243 8792 19309 -14112 -10510 13380 3655 -8628 747 4685 1831
885A831o33n592L955J3405j3680j7388K6987J5436m2116o853N4634r160o2059
$$ 1831 1198 -4394 -439 12966 -714 -18102 8885 24321 -17795 -24648 29986 20826 -41233
898d1233K8493N9643m7061m9703O0222L4010o4976j8345O2060P151n3674k297
$$ -41233 -12740 46903 -158 -49861 10361 44371 -20605 -38950 23110 30261 -23413 -25710
910b5710M5034M687l9006j0450L9437J7090m4593k0452N3103J9964o1675j5191
$$ -25710 19324 24011 -14995 -25445 13992 31082 -13511 -33963 19140 39104 -22571 -37762
922c7762O9545O170p6033O004P8120k0571p5610L3665O7337m4715n5174N0008
$$ -37762 31783 37953 -38080 -32076 46044 25473 -50137 -16472 50865 6150 -49024 984
934I84M1091m7978l0461M0257K6726l2005k9886K8241L8012l1759m4357M2887
$$ 984 42075 -5903 -36364 3893 30619 -1386 -31272 -3031 34981 3222 -41135 1752
946A752M5482n5474l9024O7376K6935p3390j3048P3533M84o9059Q181O2505j4266
$$ 1752 47234 -8240 -47264 20112 47047 -26343 -39391 34142 34626 -34433 -26252 36253 21987
959B1987n6917J7795N1283k1044m5475K1257L9339j9033l5917J5315L6732j2559
$$ 21987 -34930 -17135 34148 13104 -32371 -11114 28225 9192 -26725 -11410 25322 12763
971A2763m1167J3097M8256j9899n1804L2440M9081m5987l7263N5468J9821n4322
$$ 12763 -28404 -15307 32949 13050 -38754 -6314 42767 -3220 -40483 14985 34806 -19516
983a9516k925M6056r769l2715J4392J9664j2202j1135N491Q121n84j0072j802
$$ -19516 -22441 23615 13846 -18869 -4477 15187 2985 -8150 -2659 5462 4878 -5194 -6996
996f996J3752J71j7608L617J9906r768k0450J8051J8909k7866j2949L7468L164
$$ -6996 6756 6927 -10681 -7064 12842 3074 -17376 675 19584 -8282 -21231 16237 19401
1009A9401m3309J0947M4208k5488l8379L7778K7485m3301j4169M1112L423l3810
$$ 19401 -23908 -12961 31247 5759 -32620 5158 32643 -10658 -24827 16285 19708 -14102
1021a4102Q45K4407K209j8822j0056J7946J8156k3655k4403L3569K5603m6092
$$ -14102 -13257 11150 13359 -5463 -15519 2427 20583 -3072 -27475 6094 31697 -14395
1033a4395k1328N7197J1585o3837J676O6582j6714o3084L1082N4930m1381m1154
$$ -14395 -35723 21474 33059 -30778 -29102 37480 20766 -42318 -11236 43694 2313 -38841
1045c8841M5462K6740m1896j6200L3466J2932k4025j6521J6724K4991j6689l5122
$$ -38841 6621 33361 -8535 -24735 8731 21663 -2362 -18883 -2159 22832 6143 -28979
1057b8979K3716M1934l6627m3622N0677L8291o3859k6990P2379J2465p5642K993
$$ -28979 -5263 36671 44 -43578 7099 45390 -18469 -45459 26920 39385 -36257 -33264
1069c3264P3600j7234o4692K7696N2420l1855l8498K9849K7093k0769k0751Q736
$$ -33264 40336 23102 -41590 -13894 38526 6671 -31827 -1978 25115 4346 -16405 -7669
1081g669K2149J878l1841o052M5543J047n8265J1631O3575k9136o0112M6029M6769
$$ -7669 14480 16358 -15483 -21535 24008 25055 -33210 -21579 41996 12860 -47252 -1223 45546
1094D5546n7101k8782N9176R624n2303N409L9863j3782k5281J4929J2859r607
$$ 45546 -11555 -40337 18839 28463 -23840 -18431 21432 7650 -17631 -2702 10157 550
1106E50l865J550Q67P908l909j4339J1922J6670k2625j2353L1735J808l7055J3095
$$ 550 -3315 -1765 -898 7010 3101 -11238 684 17354 -5271 -17624 14111 15919 -21136 -8041
1120h041L5229k9883k6054M2447J0201m8394Q668M4714k5229l4175L5624J9556
$$ -8041 27188 -2695 -28749 13698 23899 -24495 -15827 28887 3658 -30517 5107 24663
1132B4663l8353m379L3446o266k3136J0391J1519o214k737k037n23J3517l422
$$ 24663 -13690 -18069 15377 9111 -14025 -3634 7885 1671 -1066 -3103 -3626 9891 6469
1145F469k3165J3389K9125k7411k8114M1974J8493n3418l694N8051j3981n5437
$$ 6469 -16696 -3307 25818 -1593 -29707 12267 30760 -22658 -26352 31699 17718 -37719
1157c7719K9120M6140m0465l2607M4937J8659m2598p491L4764K147k4942k812
$$ -37719 -8599 37541 -2924 -35531 9406 28065 -14533 -22024 12740 14887 -10055 -12867
1169a2867J7187Q978j3044j8267J5454K8700k3898l5485L7884L5301n3316k7367
$$ -12867 4320 13298 254 -18013 -2559 26141 2243 -33242 4642 39943 -13373 -40740
1181d0740O5886J3635p3354L441P1985j9526o3802L0951M9771l5316l5991L2275
$$ -40740 25146 38781 -34573 -31132 40853 21327 -42475 -11524 38247 2931 -33060 -785
1193g85K5368k4197k0785J4788K2422p477k8384M908L7125p278m4460J5090M8438
$$ -785 24583 386 -20399 -5611 16811 9334 -19050 -14142 22983 15705 -28755 -13665 34773
1206C4773k5656m7013L6881M0738m5865k9869N0559J6823n0421l619M4828o799
$$ 34773 9117 -37896 -1015 39723 -6142 -36011 14548 31371 -19050 -22669 22159 15360
1218A5360l5733J2037K4529j2357j5433Q132R578j822q899m675J2946P818j9379
$$ 15360 -20373 -8336 16193 3836 -11597 -3465 6113 4291 -4608 -9283 3663 11481 -7898
1231g898o270K6435j59l0432J0465L0514k1146k4368K9486J5228l4649k936L4168
$$ -7898 -14168 12267 12108 -18324 -7859 22655 1509 -22859 6627 21855 -12794 -15730 18438
1244A8438p808k9298J5216K1236j8879j2684J8435N243j5114j769J0431J048o417
$$ 18438 10630 -18668 -3452 17784 -1095 -13779 4656 9899 -5215 -6984 3447 4495 -1922
1257a922l475M214P461n612j0852R573J3345j5842j2460K2632Q713k8546r48L2116
$$ -1922 -5397 -1183 6278 666 -10186 -613 12732 -3110 -15570 7062 15775 -12771 -13719 18397
1271A8397p957l1680J7630K7540k4553k1671K8953J3966k9427p875K6515M771
$$ 18397 10440 -21240 -3610 23930 -623 -22294 6659 20625 -8802 -16677 9838 14609
1283A4609k3066n318K0509P700k0860j1352K4096J3098k9450j2704L5787R658
$$ 14609 -8457 -13775 6734 14434 -6426 -17778 6318 19416 -10034 -22738 13049 22707
1295B2707m1147m499M4413j592m4590Q451M2984j3815l9613J7403L6149j8820
$$ 22707 -18440 -22939 21474 19882 -24708 -16257 26727 12912 -26701 -9298 26851 8031
1307H031l2253J8621K9215j7286k8249J6497K8228j7124k9641J8738L0491k1667
$$ 8031 -24222 -5601 23614 6328 -21921 -5424 22804 5680 -23961 -5223 25268 3601
1319C601l0816K5500K8875l0316k4720L3880J9224l5486j2860L4576P213l1531
$$ 3601 -27215 -1715 27160 -3156 -27876 6004 25228 -10258 -23118 11458 18671 -12860
1331a2860k871K8373K79k4463J63K2102J141k1747j614K2842J297k5154J214K7010
$$ -12860 -15731 12642 12921 -11542 -11379 10723 11864 -9883 -11497 11345 12642 -12512 -11298 15712
1345A5712n423k8073J0555K6531j6433k2648K0573J6907k3269j0736K3301M913
$$ 15712 10289 -17784 -7229 19302 2869 -19779 794 17701 -5568 -16304 6997 11910
1357A1910k0902o80J7197j355j2914J731R604Nq134k249R260M303j1749m229J5538
$$ 11910 -8992 -9672 7525 6170 -6744 -5013 4591 4596 -3538 -5787 3473 7776 -3973 -8202 7336
1372G336J182j8504M292J9545j1577j6877J7571J1401k2338l632K3445n010k1490
$$ 7336 8518 -9986 -5694 13851 2274 -14603 2968 14369 -7969 -11601 11844 6834 -14656
1385a4656J1595J6647j5569j1151J6828N716j5395k338J2366K608r496m447Q253
$$ -14656 -3061 13586 -1983 -13134 3694 9410 -5985 -8323 4043 6651 -2845 -7292 961
1398I61Q257q714j2880J2675J6634j9161j7918K7595J5618l5710r298M0855M12
$$ 961 9218 504 -12376 299 16933 -2228 -20146 7449 23067 -12643 -21941 18914 19326
1411A9326m2953R610L9499j7055l3622K0584K6202k0584j9766J7008J6426j2761
$$ 19326 -23627 -14017 25482 8427 -25195 -4611 21591 1007 -18759 -1751 14675 1914
1423A914j6027Q638J8810n695k3952O534K9382j0069l3195J7095L4476k5402l2104
$$ 1914 -14113 -5475 13335 7640 -16312 -9778 19604 9535 -23660 -6565 27911 2509 -29595
1436b9595L3848K5887m0036j6160M1502N749l8607K456L2508p885k5135Q307J8269
$$ -29595 4253 30140 -9896 -26056 15446 21195 -17412 -14956 17552 9667 -15468 -7161 11108
1449A1108n535j4392J481J3090L251j6027n808K0844O383k6823l090L2004k905
$$ 11108 5573 -8819 -7338 5752 9003 -7024 -12832 8012 14395 -12428 -15518 16486 13581
1462A3581l4878J2037L4435k1848k8998K9686J9704l2860q224L0206j234k3585
$$ 13581 -21297 -9260 25175 3327 -25671 4015 23719 -9141 -17365 12841 11607 -11978
1474a1978O938J4134p120o298K191J665M428j450j0371N323J2356j0415j2140
$$ -11978 -5040 9094 1974 -4324 -2133 -468 3960 2510 -7861 -2538 9818 -597 -12737
1487a2737J5757R150j9974l553K1793k806k1015J0662J7477j7494j0603K1804
$$ -12737 3020 12170 -7804 -11357 10436 7630 -13385 -2723 14754 -2740 -13343 8461
1499H461J633k2065Q834J7661j7053r331K0153j31j7488O929J0500r306l072N839
$$ 8461 10094 -11971 -3137 14524 -2529 -11860 8293 8162 -9326 -2397 8103 -1203 -4275 1564
1513A564j935J330J744r059K409J4208r604j5263J7413J3354k4527q284K9360
$$ 1564 -371 959 2703 -6356 -3947 10261 657 -14606 2807 16161 -8366 -16650 12710
1526A2710K619l1855M434L1888j1370k9042J7796K3865k1400j6874K1088J0075
$$ 12710 15329 -16526 -12092 19796 8426 -20616 -2820 21045 -355 -17229 3859 13934
1538A3934j7480n917J1041N958n336j0430K908J6694m805k3048J0689K6177j8842
$$ 13934 -3546 -9463 1578 7536 2200 -8230 -5322 11372 6567 -16481 -5792 20385 1543
1551A543k4870K6342J9983l1930j2672L4766N239l4071J547L1013o831k5928R979
$$ 1543 -23327 3015 22998 -8932 -21604 13162 18401 -15670 -14123 16890 10059 -15869 -5890
1564e890K1164j0656j6454Q719J3248m752j2976N09J5918J127k1195K94K6121
$$ -5890 15274 4618 -11836 -3117 10131 5379 -7597 -7088 8830 9957 -11238 -10944 15177
1577A5177n093k9346J1782K8577j8509k4509K3572J8184k5849j1747K5491O695
$$ 15177 10084 -19262 -7480 21097 2588 -21921 1651 19835 -6014 -17761 7730 14425
1589A4425k2602l242J9110J333j5367n53J2523J698j0597l344R509N338j0017
$$ 14425 -8177 -11419 7691 9024 -6343 -6896 5627 7325 -3272 -6616 2893 8231 -1786
1602a786p025J2477O799j5881m591J8961r33j9420O778J6415j1732j1122J4447
$$ -1786 -8811 3666 10465 -5416 -10007 8954 8021 -11399 -4621 11794 62 -11060 3387
1615C387M591j4544J525J1891n528p547O832M003o065j468M510J582l519k851
$$ 3387 7978 -6566 -5041 6850 1322 -6225 607 4610 -1455 -2923 1587 3169 -350 -3201
1629c201L687M408m309n788O067O837r443o604J2347N589j5424l299J7125M58
$$ -3201 486 4894 585 -5203 864 7701 -1742 -8346 4001 9590 -5834 -9133 7992 8450
1643H450j8833L390J8565o799j7709R413J5672j1136j2517J1437J0427j0781r329
$$ 8450 -10383 -6993 11572 4773 -12936 -3523 12149 1013 -11504 -67 10360 -421 -9750
1656i750R815J0184r369j1247R915J3087j2638j3618J6644J2689k0777r588K3035
$$ -9750 65 10249 880 -10367 -452 12635 -3 -13621 3023 15712 -5065 -14653 8382
1669H382N534k3772j540K3045k496k0940L595J9382m354j8249M175J8184m139
$$ 8382 13916 -9856 -11396 11649 9153 -11787 -8192 11190 6836 -11413 -7238 10946 6807
1682F807j8885M950J9783o328k0545Q580K0676j0430k0468J2835J9916j5049j8255
$$ 6807 -12078 -7128 12655 6327 -14218 -5638 15038 4608 -15860 -3025 16891 1842 -16413
1695a6413J7183J6296j9364j3379J9984R997j9547o681J7369M596j4728m714J2563
$$ -16413 770 17066 -2298 -15677 4307 14304 -5243 -11924 5445 10041 -4687 -9401 3162
1708C162O188j2175q006J3004Q944j5362q138J8101N475j9612j484J9856k466
$$ 3162 9350 -2825 -10831 2173 11117 -4245 -12383 5718 11193 -8419 -9903 9953 7487
1721G487j8053O167J4706q716j0323R865O399r382k809P047L32m081K38J491Q39
$$ 7487 -10566 -4399 10307 1591 -8732 1133 7532 -1850 -4659 2388 2720 -1361 -1123 368 1207
1736A207m71k796O35M657k898n404N839M262r079j076J1098l317j1465Q067R696
$$ 1207 736 -2060 -1425 3232 334 -5070 769 5031 -4048 -5124 5974 2657 -8808 -741 8955
1751H955j1950n834J4463J229j4319L034J3268o470j0597Q411P118q625l849P256
$$ 8955 -2995 -8829 5634 6863 -7456 -4422 8846 2376 -8221 190 7308 -1317 -5166 2090
1765B090J657m657j681J542L694J49p312K33J1081l454j4393R163J4618j5123
$$ 2090 3747 -910 -2591 -1049 2645 2794 -4518 -4285 6796 3342 -11051 -1888 12730 -2393
1779b393j2005K0154P061k2465j066K2295m207j9900P963J6618q844j3506Q962
$$ -2393 -14398 5756 12817 -9648 -10714 11581 7374 -12526 -4563 12055 3211 -10295 -1333
1792a333J0498p197r301N062R490l051j1432J410J4785j628j8668L965K1782q978
$$ -1333 9165 1968 -7333 -2271 7219 4168 -7264 -5854 8931 7303 -11365 -7400 14382 5404
1806E404k3366J4817K2051k0485j7685K3994J1574k4476n522K2701Q46j8542J266
$$ 5404 -17962 -3145 18906 -1579 -19264 4730 16304 -8172 -13694 9007 9853 -8689 -7423
1819g423J3927n50r790j944Q135N402q788p820J0744R537j4661r151J8370O549
$$ -7423 6504 5954 -3836 -5780 2355 7757 -1031 -8851 1893 11430 -3231 -12382 5988 12537
1833A2537k1667j748K2735m488k1309R967J7374j3987j1213J4939M948j3355J78
$$ 12537 -9130 -10878 11857 7369 -13940 -3973 13401 -586 -11799 3140 8088 -5267 -5089
1846e089R510k468m919K206J169L77J005l781l15O588k215p890N626P888r987
$$ -5089 4421 1953 -2966 -760 409 786 1791 -1990 -2305 4283 2068 -5822 -196 7692 -2295
1861b295n143J3083P60j4277M125J3124r289r880J2794M853j4200Q63J2720n773
$$ -2295 -7438 5645 6405 -7872 -3747 9377 88 -9792 3002 7855 -6345 -5482 7238 1465
1875A465q960Q387M577q377q25O496j961k638K310k86k96K152l375j552O863o59
$$ 1465 -7495 892 5469 -2908 -3733 2763 802 -1836 474 188 -108 2044 -1331 -2883 3980 3321
1891C321r433M916R789r371q802J4126N416j7283j380J8788m052j7753Q399J4730
$$ 3321 -6112 -1196 8593 -778 -9580 4546 9962 -7321 -8701 10087 6035 -11718 -3319 11411
1905A1411j1065j1294J2057P385j0103n414P395N029m266o830K946R802k893j3405
$$ 11411 346 -10948 1109 8494 -1609 -7023 372 5401 1135 -5695 -2749 7053 4160 -9245
1919i245N427J5573q437j6484J2695J5230j6547j2596J9503Q600k0679m442J9939
$$ -9245 -3818 11755 3318 -13166 -471 14759 -1788 -14384 5119 13719 -6960 -11402 8537
1932H537K68j7385J984J3975k839j0878J573Q641Q43q091l134R502M916j2461
$$ 8537 8805 -8580 -6596 7379 4540 -6338 -4765 3876 4719 -3372 -6506 2996 7912 -4549
1946d549m159J5202K232j7545J700J7926n726j6084R086J2857j1015r327J1747
$$ -4549 -8708 6494 8726 -8819 -7119 10807 5081 -11003 -1917 10940 -75 -9402 2345
1959B345O058j0961l891R548J688p329j094N281J702m576k900M092M329m745n266
$$ 2345 8403 -2558 -6449 3099 4787 -2542 -3636 1645 3347 -1229 -4129 -37 4292 -453 -5719
1974e719O551N379q765m009J0761J259j1275K148J0254m607q108O842N011p553
$$ -5719 832 6211 -2554 -6563 4198 5457 -5818 -3670 6584 1977 -6131 711 5722 -1831
1988a831j648O256l37m356J147K196j141j023M28L69O23j047j118K183O75l300
$$ -1831 -3479 2777 2440 -1916 -769 1427 286 -737 -309 60 683 -364 -1482 701 1376 -1924
2004a924J79M446k231m891M702M581o983l051Q945J140j0310J622J0459m043r428
$$ -1924 -1745 2701 470 -4421 281 4862 -2121 -5172 3773 4913 -5397 -3775 6684 2641 -6787
2019f787N863P917o296o656O103N706n581n852M664P020m864q528N720R479p004
$$ -6787 -924 6993 697 -5959 144 5850 269 -5583 -919 6101 1237 -7291 -1571 7908 904
2034I04j0188Q786J0169j1361q878J3255P480j4459n229J5070K256j3891l13J2804
$$ 904 -9284 -498 9671 -1690 -10568 2687 10167 -4292 -9521 5549 7805 -6086 -6399 6405
2048F405p76j1143O19J0109J72r550j288J0102J754j2019j238J4125q53j5219
$$ 6405 5629 -5514 -4895 5214 5386 -4164 -5452 4650 6404 -5615 -6853 7272 6419 -8800
2062h800L530J4621o213j3272Q660J1106r718r277J0151O959r444n331Q803M391
$$ -8800 -5270 9351 3138 -10134 -1474 9632 -86 -9363 788 7747 -1697 -7028 1775 6166
2076F166q180l817P599L943o906m275O927M641p201n521Q750N382j0810l976J2200
$$ 6166 -2014 -5831 1768 5711 -1195 -5470 1457 6098 -1103 -6624 2126 7508 -3302 -7278 4922
2091D922J560j3151J929J2308n213r599O686O021o718k894N101J073k654p03N21
$$ 4922 6482 -6669 -4740 7568 2355 -7244 -558 5463 -1255 -4149 952 2025 -629 -1332 -811
2106h11J745N64l021n96M626n78n285K453M903l903l606N554J114o111J074O185
$$ -811 934 1498 -1523 -2119 2507 1929 -3356 -903 4000 97 -3509 2045 3159 -2952 -1878 4307
2122D307l749n273O432K599q095M52Q245l230p411N365N344o619k631O091R29
$$ 4307 558 -4715 1717 4316 -3779 -3327 4918 1688 -5723 -358 4986 -1633 -4264 1827 2756
2137B756m447l59K304J489n02l749L43O372j510q335L948R663p096r497J0131
$$ 2756 -1691 -2050 254 1743 1241 -2508 -2165 4207 2697 -5638 -1690 7973 877 -8620 1511
2152A511P769j2818m711J3636J795j4013J744J1926l731r396M347O623l180n261
$$ 1511 9280 -3538 -8249 5387 7182 -6831 -5087 6839 3108 -6288 -1941 4682 1502 -3759
2166c759J562M771L71n860j515Q041J550j0236m41J2414j887j3365N029J3495
$$ -3759 -2197 2574 2945 -2915 -4430 3611 5161 -5075 -5516 6898 5011 -8354 -3325 10170
2180A0170q571j1755J0810R443j2662o012J2759L038j1931k26R306o21o750J43
$$ 10170 1599 -10156 654 10097 -2565 -8577 4182 7220 -4711 -4937 4369 3748 -3002 -2859
2194b859M296J735l494m145M206O405p111o972J0206N885j2535l296J4203m05
$$ -2859 1437 3172 -322 -4467 -261 6144 -967 -7939 2267 8152 -4383 -7679 6524 6119
2208F119j3712L709J1871n953r361P176O293o895l336N472J643l530r87J273J197
$$ 6119 -7593 -3884 7987 2034 -7327 -151 6142 -753 -4089 1383 3026 -504 -1491 -218 979
2223I79K80k548j189M559L43n642J018O498l591n713N847L872p522m74P633l026
$$ 979 1259 -1289 -2478 2081 2424 -3218 -2200 4298 707 -5006 841 4713 -2809 -3283 4350 1324
2239A324o199N880L545p439o5P236k630n967M816L753n441j577M732j81l594J205
$$ 1324 -4875 1005 4550 -2889 -2954 4282 1652 -4315 501 4254 -1187 -2764 1968 1787 -1807 -602
2255f02J358n37R8j373n85L679J38n993J711P252m558p128P474N847r817l222
$$ -602 756 219 317 -1056 -1641 2038 2176 -3817 -2106 5146 588 -6540 934 6781 -3036 -6258
2271f258J0794L93j0345J941R531l828p636M650N969m650m531L749L435k076l906
$$ -6258 4536 4929 -5416 -3475 6056 2228 -5408 -758 5211 561 -3970 -221 3214 1138 -2768
2286b768J155M755p89o425R09Q554k740r741N102R950p883q691J0308O531j1937
$$ -2768 -1613 3142 2353 -4072 -3163 5391 2651 -7090 -1988 7962 79 -8612 1696 8227 -3710
2301c710l437J1591J346j0269L27Q532q41p035L65O115Q29o189j691O664K512
$$ -3710 -7147 4444 5790 -4479 -4152 4380 3539 -3496 -3131 2984 3813 -2376 -4067 2597 5109
2316E109q026k263R039J305r983k27J0532j423j0608L284R688m967q244O175O361
$$ 5109 -2917 -5180 3859 5164 -4819 -5046 5486 4063 -6545 -3261 6427 1460 -6784 -609 5752
2331E752o308m167N411K610l936j964K740K142j682l137J825L949k219m591L224
$$ 5752 -556 -4723 688 3298 -638 -2602 138 2280 598 -2539 -714 3235 1016 -3575 -351
2346c51M289m401l087N205J404n275J0M767j366m406K857K974l480j509L491K91
$$ -351 3938 -463 -3550 1655 3059 -2216 -2206 2561 1195 -3211 -354 2620 -860 -2369 1122 1413
2362A413l253J064K105j468j317J551P36r66m57K38J230J6j878O4L020r49l827
$$ 1413 -1840 -776 1329 -139 -1456 95 831 -135 -592 -354 876 892 -986 -922 2098 1149 -2678
2379b678K338L490l734k593M791J258n277j80N190q77m998J546M404j847l884
$$ -2678 -340 3150 -584 -3177 1614 2872 -2405 -2585 2605 1728 -3270 -1724 2680 833 -3051
2394c051K109L821k719l247K270L547j913m265K782M412l066m950M086N271n269
$$ -3051 -942 2879 160 -3087 -817 2730 817 -3448 -666 3746 680 -4270 -184 5087 -182
2409a82n309O845M279p632l051Q101J405p975l18O898K31o480l26O269P05o258
$$ -182 -5491 1354 5633 -1999 -5050 3051 4456 -3519 -3837 3061 3292 -3188 -3514 2755 3460 -2798
2425b798j280O738J348p564q75Q592k4r054J055R166k315q660L612P863m343o986
$$ -2798 -4078 2660 4008 -3556 -4431 4161 4137 -4917 -3862 5304 2989 -5671 -2059 5804 1461 -5525
2441e525M991N877n091m698M935L494m091l224L176L369l044l590K499M552l264
$$ -5525 -534 5343 252 -4446 489 3983 -108 -3332 -156 3213 169 -3421 -922 3630 366
2456C66m930M600M608n988l176O574J809p193L84O391j833m723K573L378k873
$$ 366 -4564 36 4644 -1344 -4520 2054 3863 -3330 -2946 3445 1612 -3111 -538 2840 -33
2471c3k139K617J095j749m47R49L53k04r18l32J608p9k347P25K954j836l077L361
$$ -33 -2172 445 1540 -209 -656 293 646 442 -476 -808 800 721 -1626 -901 2053 217 -2860 501
2489E01K234m844n3M993j745m667L933K735m761n18M810j493l802K666K459k853
$$ 501 2735 -2109 -2162 2831 1086 -3581 352 3087 -1674 -2192 2618 1125 -2677 -11 2448 -405
2505d05j316K491P07j802m50P59R55l59j868L54K711o68l781J762M595l239n329
$$ -405 -1721 770 1477 -325 -775 -16 939 580 -1288 -934 1777 1109 -2672 -910 3685 446 -4883
2522d883N142M894o918l698Q500J632q830O12Q367k513o707L111M874k532l402
$$ -4883 259 5153 -1765 -5463 3037 4669 -4161 -3549 4818 2305 -4402 -1291 3583 1051 -2351
2537b351J477K967K9l767j478N525J228o633r58Q371q20q778K162Q751m093q106
$$ -2351 -874 2093 2122 -1645 -3123 2402 3630 -3003 -3961 4410 3590 -5188 -3026 5725 1632 -6474
2553f474N628O853o543n253P204L248o979j587O091K73m215l30K890J281j881
$$ -6474 -846 6007 -536 -5789 1415 4663 -2316 -3903 2188 2461 -1754 -2084 806 2087 206
2568B06k487J906L880k783n066M888M573o820k995P997P74q147J334P507l431
$$ 206 -2281 -375 3505 722 -4344 544 5117 -1703 -4698 3299 4073 -4074 -2740 4767 1336
2583A336n920M515L602m400j821L554M95k257j96J173M23N7j104n46K290K27l043
$$ 1336 -4584 -69 3533 -867 -2688 866 1361 -896 -1092 81 504 561 -543 -1089 1201 1428 -1615
2600a615M21L765j856l661L253L188m516j788N250m98m610K176L309l664j409
$$ -1615 -1194 2571 715 -2946 307 3495 -1021 -2809 2441 1943 -2667 -491 2818 -846 -2255
2615b255L648m76l203J943K219k729p40K704m17k129J295R79q85r9P5n06J283
$$ -2255 1393 917 -2286 -343 1876 -853 -1593 1111 694 -1435 -140 839 -46 -145 -70 -576 707
2632G07L40k391O11L329k039l825L866L140n377k088O635M47p038J148O374k382
$$ 707 1047 -1344 -733 2596 557 -3268 598 3738 -1639 -3727 2908 3355 -3683 -2535 3839 1457
2648A457n585L212M357l339l227K756K781j983k692J046L389p15m023N69N287
$$ 1457 -4128 -916 3441 102 -3125 -369 2412 429 -2263 -1217 2172 1457 -2566 -1997 3290
2663C290j138o260K562O407m072n936N490N084o467l705O781K229o725p28N707
$$ 3290 2152 -4108 -1546 4861 789 -5147 343 5427 -1040 -4745 2036 4265 -2460 -3188 2519
2678B519j67m574J70L603M22l312j231L490J808m236j651N301Q31n616l16O240
$$ 2519 2352 -2222 -2052 1551 1973 -1339 -2570 920 2728 -1508 -3159 2142 2973 -2643 -2959 3281
2694C281r35o146K017N603k798m744L324M186l780k979L345K429l125k002K844
$$ 3281 2346 -3800 -1783 3820 1022 -3722 -398 3788 8 -2971 374 2803 -322 -2324 520
2709E20J365k185j639J780K013j721k503K358K652l274k091L350J807l972o65
$$ 520 1885 -300 -1939 -159 1854 133 -2370 -12 2640 -634 -2725 625 2432 -1540 -2205
2724b205L979n94l185J018K605j524j127J485N3p32J9M71k12k44L20M7j49k38
$$ -2205 1774 1180 -2005 -987 1618 94 -1033 452 505 -227 -208 263 51 -193 127 174 25 -213
2742b13r2P65j54j112M38J321r46j725J922J573k782q09L127K71l455L47L877
$$ -213 -305 460 306 -806 -368 953 7 -1718 204 1777 -1005 -1814 1313 1584 -1871 -1524 2353
2759B353j271l422J553L245j554l228J967K654j611k812J319L036j293l279J299
$$ 2353 1082 -2340 -787 2458 904 -2324 -357 2297 686 -2126 -807 2229 936 -2343 -1044
2774a044L709j772m199K648M287l703l845M514L187n239j988N265Q74m859j71
$$ -1044 2665 893 -3306 -658 3629 -74 -3919 595 3782 -1457 -3445 1820 2694 -2165 -2336
2789b336M380j12l826Q1L518M35l541j049M247J060m893p06N443m9n981J054O113
$$ -2336 2044 1932 -1894 -1813 1705 2140 -1401 -2450 1797 2857 -2036 -2742 2701 2652 -3329 -2275 3838
2806C838k001n840K693N334l497m637L944L673m129k557L691J937k945j675K389
$$ 3838 1837 -4003 -1310 4024 527 -4110 -166 3507 -622 -3179 512 2449 -496 -2171 218
2821B18K010j991k724K027L488k435l930L673L516m496l104N501J680n580m71
$$ 218 2228 237 -2487 -460 3028 593 -3337 336 3852 -644 -3748 1753 3433 -2147 -2618
2836b618N313p59m525J670L163k138j831J703Q09q45l86l9K79P54o36j122J471
$$ -2618 2695 1936 -2589 -919 2244 106 -1725 -22 787 -58 -444 -483 -204 550 -86 -1208 263
2853B63J160k248l00K443p69k138J639J790k776m78L257j039k773K448J735l639
$$ 263 1423 -825 -1125 1318 549 -1589 50 1840 -936 -1414 1843 804 -1969 479 2214 -1425
2869a425l74L789r23l399J872K704k522j486K407N09j933P3J031k09K22q90m03
$$ -1425 -1799 1990 1067 -2332 -460 2244 -278 -1764 643 1152 -781 -708 323 114 336 -554 -957
2886i57J789O22l011K21M103j542m430K985M233n037k740N782J438o131J11N643
$$ -957 832 1454 -1557 -1336 2767 1225 -3205 -220 4013 -1024 -3764 2018 3456 -2675 -2564 3079
2902C079j349m854K238L350j988k592J564K112p68k081r4K585N79l811l81M820
$$ 3079 1730 -3124 -886 2464 476 -2116 -552 1560 792 -1289 -1383 1202 1781 -2030 -2411 2409
2918B409p8n753J497O186k884o168M293N604n664l837O069J969n566p68M594N20
$$ 2409 2331 -3422 -1925 4261 1377 -4791 -498 5106 -558 -4395 1674 3643 -1923 -2691 1903 2423
2934B423l959k18K777P77k231j558J792K877k796l144L642L075m746k400N440
$$ 2423 -1536 -1754 1023 1800 -431 -1989 -197 2680 -116 -3260 382 3457 -1289 -3689 1751
2949A751J494o092jN945j184n249K446L740k870k261K820J034k142p2J139j94
$$ 1751 3245 -2847 -2848 3097 1913 -3336 -890 2850 -20 -2281 539 1573 -569 -641 498 304
2965C04J72k73j098J252R67k459j45K773q82k622J805K252k925r48L164l87k735
$$ 304 476 203 -895 357 1324 -1135 -1280 1493 611 -2011 -206 2046 -879 -1827 1337 950 -1785
2982a785J562K205k547j184K973r6k664J105J934j497j362K003M01j678K16J326
$$ -1785 -223 1982 -565 -1749 1224 1128 -1536 -431 1503 6 -1356 647 1048 -630 -414 912
2998I12q83j55k4o0M51N50j732l0K578j092k775K210K555l349j687M118L55m463
$$ 912 29 -126 -150 -210 241 791 -941 -971 1607 515 -2260 -50 2505 -844 -2531 1587 1942 -2521
3016b521R15M124j635l712K454K954k251k375J956K093j602j937J101K344q45
$$ -2521 -1606 2518 883 -2829 -375 2579 328 -2047 -91 2002 400 -1537 -436 1908 1063
3031A063l112R51L585j392m256K339M250l265m238M318L359m663k789N459J617
$$ 1063 -2049 -1098 2487 1095 -3161 -822 3428 163 -4075 243 3602 -1061 -3850 1609 3226
3046C226n214o27M605J92l916j72L516K37k868j164L284J594l750j558M121J429
$$ 3226 -1988 -2615 1990 2182 -1734 -1906 1610 1847 -1021 -2185 1099 2693 -1057 -2615 1506 2935
3062B935m932m67M849k90n146J374M471j884l872K256L087k176k466K106J919
$$ 2935 -1997 -2464 2385 2095 -3051 -1677 2794 910 -2962 -706 2381 205 -2261 -155 1764
3077A764j786j619J416J687j253j613J164J837j397j749J636J887k072j716K423
$$ 1764 -22 -1641 -225 1462 209 -1404 -240 1597 200 -1549 87 1974 -98 -1814 609
3092F09J295k927l19K740m84k438J189J894j510j231J387O93j293j4L47J55j40
$$ 609 1904 -1023 -1342 1398 914 -1524 -335 1559 49 -1182 205 898 -395 -409 -62 93 -47
3109d7l42M1O64k53q34J012M65j157m31J940o43j460J056J451j902r32K360L17
$$ -47 -389 -348 316 63 -771 241 706 -451 -882 1058 415 -1045 11 1462 -440 -1372 988 1305
3127A305k526M9K670r37k364J429K091j616j839J647J203j102j579J000J853r15
$$ 1305 -1221 -1172 1498 561 -1803 -374 1717 101 -1738 -91 1112 10 -1569 -569 1284 369
3143C69k188J052K885j404l426K504L317l302l005M063K345m623j359M660J138
$$ 369 -1819 -767 2118 714 -2712 -208 3109 -193 -3198 865 3210 -1413 -2772 1888 3026
3158C026m978j82M089k99l381J97L080L64l243p48L003J365l748j246M498Q32
$$ 3026 -1952 -2134 1955 1656 -1725 -1528 1552 1916 -1327 -2075 928 2293 -1455 -2701 1797 2629
3174B629m949m06N767j103n380K121M740k745l880L126K941k989k122K768J523
$$ 2629 -2320 -2726 3041 1938 -3442 -1321 3419 674 -3206 -80 2861 -128 -2250 518 2041
3189B041k198j465J643J681j528j768J550K106j719k769K300K761k884k636L577
$$ 2041 -157 -1622 21 1702 174 -1594 -44 2062 343 -2426 -126 2635 -249 -2885 692
3204F92J956m174r98M719o31m114J516L272k157j832K128N26j270R3L87n6N69
$$ 692 2648 -1526 -2524 2195 1564 -2550 -1034 2238 81 -1751 377 903 -367 -274 113 57 626
3221F26n26r01J357P30k142k98K585o51k404J263J977j873j046K188jk376J014
$$ 626 100 -801 556 1286 -856 -1154 1431 780 -1624 -361 1616 -257 -1303 885 884 -1492 -478
3238d78K175k223r93K636k35k567J211K416k360j109K533O8k056M57J409m88l85
$$ -478 1697 -526 -1519 1117 882 -1685 -474 1942 -418 -1527 1006 1074 -982 -525 884 396 11
3255A1j08K9O52J95j872K46K817j180l717K345L866l840k921M642J873n097q66
$$ 11 -97 -68 584 779 -1093 -847 1970 790 -2927 -582 3284 -556 -3477 1165 3038 -2059 -2925
3272b925N102k99m318J119L592j513k533J101K102l88k066n0K236N55k829j232
$$ -2925 2177 1878 -2440 -1321 2271 758 -1775 -674 1428 1040 -1026 -1076 1160 1715 -1114 -2346
3288b346M121P93m989J53N417j591m893K257M946l650m087M334K652m288j606
$$ -2346 1775 2568 -2421 -2268 3149 1558 -3335 -1078 3868 218 -3869 465 3117 -1171 -2777
3303b777M095O55l128l39K251M67j483j169J294J983j583k572K496K775l394k877
$$ -2777 1318 1973 -1155 -1494 757 1224 -259 -1428 -134 1849 266 -2306 190 2965 -429 -3306
3319c306M847J686n480j42M912n35m972K098L636k509k580K338J687j839j043
$$ -3306 1541 3227 -2253 -2395 2517 1982 -2990 -892 2744 235 -2345 -7 1680 -159 -1202
3334a202J068O59k66r62l4J437M34k152j56K525l95k659J210K446j968j729K467
$$ -1202 -134 525 259 -703 -737 700 1134 -1018 -1174 1351 956 -1703 -493 1953 -15 -1744 723
3351G23P35k742K81K196q95j378J829J94k056Q37J375j734m33J724r1j318J25
$$ 723 1458 -1284 -1003 1193 298 -1080 749 943 -1113 -276 1099 -635 -1068 656 565 -753 -628
3368f28R18m06j93Q3Q2K28K91j296K02K218j143k313K009K044k788j677L592J071
$$ -628 290 -116 -309 -226 -144 84 375 -921 -719 1499 356 -1957 52 2096 -692 -2369 1223 2294
3386B294m143K9L843o07l766J326L075j567k157J318J787r56k025O40K141k03
$$ 2294 -1849 -1820 2023 1416 -2350 -1024 2051 484 -1673 -355 1432 476 -1549 -909 1232 1029
3402A029k580M9L531r89l592J548L983k296l806L102L339l663k748M093J872m042
$$ 1029 -1551 -1502 2029 1040 -2552 -1004 2979 683 -3123 -21 3318 -345 -3093 1000 2872 -1170
3418a170j086L858L60l230n28K863N37k606r61K754J009k993j117L358J201m187
$$ -1170 -2256 1602 1962 -1268 -1796 1067 1604 -1002 -1963 791 1800 -1193 -2310 1048 2249 -1938
3434a938k67M131l9m210O14M203j479l768J977L440k109k451J747J992j649j675
$$ -1938 -2205 1926 1887 -2323 -1709 2494 1015 -2753 -776 2664 555 -1896 -149 1843 194 -1481
3450a481J101J856q19k150P55K338q68k545J345K344j785k109K072J632k551l93
$$ -1481 -380 1476 657 -1493 -738 1600 732 -1813 -468 1876 91 -2018 54 1686 -865 -1258
3466a258K114k02j605M13J318p17p65Q35J31l24J80n0j94J77J22l60K79K61o59
$$ -1258 856 654 -951 -538 780 63 -702 133 264 -60 120 70 -124 53 175 -185 94 355 -304
3485c04K93M91p28l01J154m16j391R68J425j598j167K213P63k601j9K671o69k295
$$ -304 -11 480 -248 -549 605 189 -1202 -234 1191 -407 -1574 639 1402 -1199 -1218 1453 784 -1511
3503a511J028J904j069j407R54J132o78j245K54J750k13k233N81K619r75k992
$$ -1511 -483 1421 352 -1055 -101 1031 353 -892 -638 1112 899 -1334 -753 1866 891 -2101
3519b101J579K937k124l125K947K494l491j871L821J161m028j94L462l7k869L40
$$ -2101 -522 2415 291 -2834 113 2607 -884 -2755 1066 2227 -1801 -1995 1467 1430 -1439 -1099
3535a099K231L0j910q53K431J276k925j514L967Q37m312n38M774k20n049J232
$$ -1099 1132 1162 -748 -1601 830 2106 -819 -2333 1634 2471 -1841 -2379 2395 2175 -2874 -1642
3551a642M578j964m036K521L306k671k456K382J724j875j752J489J721q94j922
$$ -1642 2936 972 -3064 -543 2763 92 -2364 18 1742 -133 -1885 -396 1325 431 -1491
3566a491P93K308p73k814J126L490k299l148L115K647l696j402L557M28l369K84
$$ -1491 -698 1610 837 -1977 -851 2639 340 -2808 307 2954 -742 -2144 1413 1841 -1528 -1244
3582a244K832j100j969J553O63r27R6J75l56L27L07j014K76J445j212j148K002
$$ -1244 1588 488 -1481 72 735 -192 -96 79 -277 50 357 -657 -381 1064 -148 -1296 706
3599G06K13k251Q72J924j564j201K267L3k421J082K035k015j259K658Q4k475Q47
$$ 706 919 -1332 -460 1464 -100 -1301 966 999 -1422 -340 1695 -320 -1579 1079 1163 -1312 -465
3616d65J922j512j290J778N26j627j11J267k02p70M12l22O10L86j341k38K116
$$ -465 1457 -55 -1345 433 959 -668 -779 488 286 -484 -72 -394 216 602 -739 -977 1139
3633A139l14k850J493K941k472k633L580K009m305r16M421k77m107J173L224j199
$$ 1139 825 -2025 -532 2409 -63 -2696 884 2893 -1412 -2328 2093 1816 -2291 -1118 2106 907
3649I07k597J019J995p04j470r8J405J017k460j129L451Q77m283j43M730o29m963
$$ 907 -1690 -671 1324 620 -850 -948 457 1474 -986 -2115 1336 2213 -2070 -2213 2517 1888 -3075
3666c075J704M720k613m171L418L174l460k373L560J327k911p89K040Q58j340
$$ -3075 -1371 3349 736 -3435 -17 3157 -303 -2676 884 2211 -700 -1489 551 1409 69
3681F9j536J049K082j125k698J558L120k308l080L529K226m446j113M318M84m253
$$ 69 -1467 -418 1664 539 -2159 -601 2519 211 -2869 660 2886 -1560 -2673 1645 2129 -2124
3697b124P43L460j500k146J516J384j297o74Q32K53q2n34o17J431K09j382m28
$$ -2124 -1381 2079 579 -1567 -51 1333 36 -638 194 447 365 -169 -786 645 854 -528 -956
3714i56K028l7k321N45K202j367j588J819J097k558K77K055p94j652J385R98j708
$$ -956 1072 1035 -1286 -741 1461 94 -1494 325 1422 -1136 -859 1196 402 -1250 135 1133 -575
3731e75j97J774q24r50J368j24r16M88M15o01j51M29r0j00L02k90n80J469m95
$$ -575 -772 1002 178 -772 596 472 -444 44 459 -142 -293 136 46 -54 248 -42 -622 847 352
3750C52j776J423J607j992j607K559J275l319l43L477l05l309Q36K893j018k349
$$ 352 -1424 -1 1606 -386 -1993 566 1841 -1478 -1821 1656 1351 -1958 -1122 1771 753 -1596
3766a596J067K232r58k016M82K099k74k349L2L119k90l567P72L730j312m070K187
$$ -1596 -529 1703 745 -1271 -789 1310 1036 -1313 -1281 1838 1548 -2019 -1247 2483 1171 -2899 -712
3783g12L819k997l041L235K420l211k169L492J285k695j205K159J421k124j502
$$ -712 3107 110 -2931 304 2724 -487 -2656 836 2121 -574 -1779 380 1801 -323 -1825
3798a825K258J677k612j698L152J610l423j499L725P65l757j65L649l52l581J082
$$ -1825 433 2110 -502 -2200 952 2562 -861 -2360 1365 2130 -1627 -1792 1857 1505 -2076 -994
3814i94K856j084k584J410J579o53j789O08J547k81k004O64K178r59k126J345
$$ -994 1862 778 -1806 -396 1183 530 -1259 -651 896 615 -1389 -725 1453 494 -1632 -287
3830b87K001j592j934J963J661k069j214K275L54j816L5J426l69q32P8L52M4R6
$$ -287 1714 122 -1812 151 1812 -257 -1471 804 1158 -658 -623 803 434 -398 -320 32 76 172
3848A72l81jO76n44l94K71N93o02l47Q09j31o63R59m5r66L76J189r78j058J753
$$ 172 -209 -210 466 -78 -472 -201 392 -210 -557 252 121 -542 417 372 -594 -218 971 -7 -1065 688
3868F88L48j872q8K070m33j976Q66J652r94j254P18J336p90j269M64J229j85j745
$$ 688 1036 -836 -924 1146 713 -1263 -397 1255 261 -993 -275 1061 271 -998 -534 695 510 -1235
3886a235j02K380j6k788O24L491j317l674K287L033k748k605L380J645l188j115
$$ -1235 -1337 1043 1027 -1761 -1137 2354 1037 -2637 -350 2683 -65 -2670 710 2355 -833 -1948
3902a948L059N19k273o50J706R63j862j019J608J815k254j887K490K082l520j356
$$ -1948 1111 1630 -643 -1293 413 1376 -486 -1505 103 1918 -336 -2223 267 2349 -1171 -2527
3918b527L989Q11m163l5M322r88l938J639L570k323k593K116J793j585j396J012
$$ -2527 1462 2273 -1890 -1925 2397 1409 -2529 -890 2680 357 -2236 -120 1673 88 -1308 -296
3934b96J342k57j778P4K217r0l017Q27L336j451l369K030L234l021k329L350J256
$$ -296 1046 789 -989 -915 1302 1212 -1805 -978 2358 907 -2462 -432 2802 -219 -2548 802 2058
3951B058l097o19K906k99j976K53J601q34k19J76P8M34j74r40K72J615r45j527
$$ 2058 -1039 -1658 1248 949 -1027 -774 827 -7 -226 -50 28 462 288 -652 -380 1235 290 -1237
3969a237J456J438k335l75K183o77j672J307J055k151J60J869j144j078J752K58
$$ -1237 219 1657 -678 -1053 1130 453 -1219 88 1143 -1008 -848 1021 -123 -1201 551 809
3985H09k011L38K122q61j888J553J121j473n00J301N1o74j83L11J33L16o79o81
$$ 809 -1202 -864 1258 397 -1491 62 1183 -290 -790 511 562 -112 -295 16 149 465 -214 -895
4003h95J865K70k649L78L171j395l479K601K867l533j595L307J325l655j07K988
$$ -895 970 1240 -1409 -1031 2140 745 -2734 -133 2734 -799 -2394 913 2238 -1417 -1524 1464
4019A464l18k434L33J964j54j203m31J280P57j642j278K379J146l087j029L962
$$ 1464 1146 -1288 -955 1009 855 -348 -779 501 1258 -384 -1662 717 1863 -1224 -2253 1709
4035A709M71m231K96M480j517m270K439L316k684k497K861J669k548j127J795
$$ 1709 2180 -2051 -1755 2725 1208 -3062 -623 2693 9 -2488 373 2042 -506 -1633 162
4050A62J136j330j365J013J802o88k225O57K996j606l218K513K809l009k297L645
$$ 162 1298 -32 -1397 -384 1418 730 -1495 -838 2158 552 -2666 -153 2656 -353 -2650 995
4066I95J350l867l33L361k11k716O58J962q38r71J78O61K11m04j021R32J005j276
$$ 995 2345 -1522 -1855 1506 1295 -1421 -763 1199 361 -610 -432 229 440 36 -985 -53 952 -324
4084c24j060J936O60k008k02J904m84j480J020J096j111q27J338q8j100R68M22
$$ -324 -1384 552 1212 -796 -998 906 422 -1058 -38 1058 -53 -880 458 370 -730 238 660
4101F60j010n1R95n18p93P05N97j118p5R63r2n85K13N9q4N06p62j65P93L65j473
$$ 660 -350 -401 594 76 -717 -12 585 -533 -608 355 263 -322 -109 -50 -134 372 -390 -555 238 603 -870
4122h70M54J896j338j824J877J535k172q79K411K80k395j96K392j57k030K06J854
$$ -870 -416 1480 142 -1682 195 1730 -442 -1321 1090 1370 -1025 -1221 1171 1014 -1016 -810 1044
4139A044l23j680l7J920P2j846n13K503n1k499J55L109p07l471J498L199j671
$$ 1044 721 -959 -996 924 996 -850 -1363 1140 1089 -1410 -1255 1854 1147 -2324 -826 2373 702
4156G02l055K259K493k545j890K349J724k125j660J885J662j909j722J599K074
$$ 702 -2353 -94 2399 -146 -2036 313 2037 -88 -1748 137 1799 -110 -1832 -233 1841
4171A841j677k467K132K632k761k391L308J538l347p89K928N70k826M0K466o1
$$ 1841 164 -2303 -171 2461 -300 -2691 617 2155 -1192 -1981 947 1517 -1309 -1269 1197 1136
4187A136k244J04J803L68j943k36J836L68k116QJ742M62k504K66K334p44k205
$$ 1136 -1108 -1004 799 1167 -776 -1012 824 1192 -924 -916 826 1288 -1216 -950 1384 640 -1565
4204a565J159J747j196j319J246P17j288k27J251m8q78L32M08j91r5q7j4K56j8
$$ -1565 -406 1341 145 -1174 72 789 -499 -726 525 477 -401 -69 339 148 53 -34 -48 208 190
4223A90n48K32P64o37n67J001j63j012R72O16j551Q8J355m67j481J411P43j504
$$ 190 -358 -126 638 1 -566 435 272 -740 232 848 -703 -615 740 273 -1208 203 946 -558
4241e58m55J760J12j692K22J607n22j507Q28R29n88n85K9R99J19j152n25J889
$$ -558 -1013 747 859 -833 -611 996 474 -1033 -205 724 136 -449 -420 579 698 -454 -979 910
4259I10M03k439j18K768l62l085J203K817j730k888K457K167k743j414K724O96
$$ 910 1313 -1126 -1244 1524 1162 -1923 -720 2097 367 -2521 -64 2103 -640 -2054 670 1366
4275A366j988o71J655Q46j356j032R09J788j059k210J746K054k146k220L170J833
$$ 1366 -622 -1293 362 1208 -148 -1180 -271 1517 458 -1752 -6 2048 -98 -2318 852 2685
$$ [...]
8191b15
##END NTUPLES=NMR FID
##END=
