##TITLE=1H_2PBP507
 CDCl3, 8 sc, 
 5.7.2019
##JCAMPDX= 6.0         $$ Bruker NMR JCAMP-DX V2.0
##DATA TYPE= NMR FID
##DATA CLASS= NTUPLES
##ORIGIN= UXNMR, Bruker Analytische Messtechnik GmbH
##OWNER= root
$$ XWIN-NMR		Version 3.5
$$ Fri Jul  5 16:23:05 2019 Russian Standard Time (UT+4h)  she@DPX200
##.OBSERVE FREQUENCY= 200.13155
##.OBSERVE NUCLEUS= ^1H
##.DELAY= (6, 6)
##.ACQUISITION MODE= SIMULTANEOUS
##.ACQUISITION SCHEME= undefined
##.AVERAGES= 8
##.DIGITISER RES= 18
##SPECTROMETER/DATA SYSTEM= spect
##.PULSE SEQUENCE= zg30
##.SOLVENT NAME= CDCl3
##.SHIFT REFERENCE= (INTERNAL, CDCl3, 0, 15.7039)
##AUDIT TRAIL= $$ (NUMBER, WHEN, WHO, WHERE, WHAT)
$$ ##TITLE= Audit trail, XWIN-NMR		Version 3.5
$$ ##JCAMPDX= 5.01
$$ ##ORIGIN= Bruker BioSpin GmbH
$$ ##OWNER= she
$$ F:/spectra/data/she/nmr/H-F/1/audita.txt
$$ ##AUDIT TRAIL=  $$ (NUMBER, WHEN, WHO, WHERE, WHAT)
(   1,<2019-07-05 16:22:08.50 +0400>,<she>,<DPX200>,
      <created by zg, POWCHK disabled, PULCHK disabled
       configuration hash MD5:
       00 E9 B6 7A A2 85 ED C7 34 08 36 98 17 FE 4E 26
       data hash MD5: 16K
       80 EF DB 37 9C E6 23 D2 7D CE AA 54 87 56 4D 9F>)
$$ ##END=
$$ 
$$ hash MD5
$$ B5 0D 8E 84 25 44 9A 7E F0 99 99 24 F2 D9 A0 2A
##$RELAX= 
##$RELAX= 
##$RELAX= 
##$RELAX= 
##$RELAX= 
##$RELAX= 
$$ Bruker specific parameters
$$ --------------------------
##$DU= <F:/spectra>
##$EXPNO= 1
##$NAME= <H-F>
##$PROCNO= 1
##$TYPE= <nmr>
##$USER= <she>
##$AMP= (0..31)
100 100 100 100 100 100 100 100 100 100 100 100 100 100 100 100 100 100 
100 100 100 100 100 100 100 100 100 100 100 100 100 100 
##$AQSEQ= 0
##$AQ_mod= 1
##$AUNM= <au_zg>
##$AUTOPOS= <>
##$BF1= 200.13
##$BF2= 200.13
##$BF3= 200.13
##$BF4= 200.13
##$BF5= 200.13
##$BF6= 200.13
##$BF7= 200.13
##$BF8= 200.13
##$BYTORDA= 1
##$CFDGTYP= 0
##$CFRGTYP= 5
##$CHEMSTR= <none>
##$CNST= (0..31)
1 1 145 1 1 1 1 1 1 1 1 1 1 1 1 1 1 1 1 1 1 1 1 1 1 1 1 1 1 1 1 1 
##$CPDPRG= <>
##$CPDPRG1= <>
##$CPDPRG2= <>
##$CPDPRG3= <>
##$CPDPRG4= <mlev>
##$CPDPRG5= <mlev>
##$CPDPRG6= <mlev>
##$CPDPRG7= <mlev>
##$CPDPRG8= <mlev>
##$CPDPRGB= <>
##$CPDPRGT= <>
##$D= (0..31)
0 1.2 0 0 0 0 0 0 0 0 0 0.03 0 0 0 0 0 0 0 0 0 0 0 0 0 0 0 0 0 0 0 0 
##$DATE= 1562329327
##$DBL= (0..7)
120 120 120 120 120 120 120 120 
##$DBP= (0..7)
150 150 150 150 150 150 150 150 
##$DBP07= 0
##$DBPNAM0= <>
##$DBPNAM1= <>
##$DBPNAM2= <>
##$DBPNAM3= <>
##$DBPNAM4= <>
##$DBPNAM5= <>
##$DBPNAM6= <>
##$DBPNAM7= <>
##$DBPOAL= (0..7)
0.5 0.5 0.5 0.5 0.5 0.5 0.5 0.5 
##$DBPOFFS= (0..7)
0 0 0 0 0 0 0 0 
##$DE= 6
##$DECBNUC= <off>
##$DECIM= 24
##$DECNUC= <off>
##$DECSTAT= 4
##$DIGMOD= 1
##$DIGTYP= 9
##$DL= (0..7)
0 120 120 120 120 120 120 120 
##$DP= (0..7)
150 150 150 150 150 150 150 150 
##$DP07= 0
##$DPNAME0= <>
##$DPNAME1= <>
##$DPNAME2= <>
##$DPNAME3= <>
##$DPNAME4= <>
##$DPNAME5= <>
##$DPNAME6= <>
##$DPNAME7= <>
##$DPOAL= (0..7)
0.5 0.5 0.5 0.5 0.5 0.5 0.5 0.5 
##$DPOFFS= (0..7)
0 0 0 0 0 0 0 0 
##$DQDMODE= 0
##$DR= 18
##$DS= 0
##$DSLIST= <SSSSSSSSSSSSSSS>
##$DSPFIRM= 0
$$ [...]
##$SUBNAM2= <"">
##$SUBNAM3= <"">
##$SUBNAM4= <"">
##$SUBNAM5= <"">
##$SUBNAM6= <"">
##$SUBNAM7= <"">
##$SUBNAM8= <"">
##$SUBNAM9= <"">
##$SW= 24.9336996594482
##$SWIBOX= (0..15)
0 0 2 0 0 0 0 0 0 0 0 0 0 0 0 0 
##$SW_h= 4990.01996007984
##$TD= 16384
##$TD0= 1
##$TE= 0
##$TE2= 300
##$TE3= 300
##$TEG= 300
##$TL= (0..7)
0 120 120 120 120 120 120 120 
##$TP= (0..7)
150 150 150 150 150 150 150 150 
##$TP07= 0
##$TPNAME0= <>
##$TPNAME1= <>
##$TPNAME2= <>
##$TPNAME3= <>
##$TPNAME4= <>
##$TPNAME5= <>
##$TPNAME6= <>
##$TPNAME7= <>
##$TPOAL= (0..7)
0.5 0.5 0.5 0.5 0.5 0.5 0.5 0.5 
##$TPOFFS= (0..7)
0 0 0 0 0 0 0 0 
##$TUNHIN= 0
##$TUNHOUT= 0
##$TUNXOUT= 0
##$USERA1= <user>
##$USERA2= <user>
##$USERA3= <user>
##$USERA4= <user>
##$USERA5= <user>
##$V9= 5
##$VALIST= <valist>
##$VCLIST= <CCCCCCCCCCCCCCC>
##$VD= 0
##$VDLIST= <DDDDDDDDDDDDDDD>
##$VPLIST= <PPPPPPPPPPPPPPP>
##$VTLIST= <TTTTTTTTTTTTTTT>
##$WBST= 1024
##$WBSW= 4
##$XGAIN= (0..3)
0 0 0 0 
##$XL= 0
##$YL= 0
##$YMAX_a= 453068
##$YMIN_a= -334333
##$ZGOPTNS= <>
##$ZL1= 120
##$ZL2= 120
##$ZL3= 120
##$ZL4= 120
##$ABSF1= 10
##$ABSF2= 0
##$ABSG= 5
##$ABSL= 3
##$ALPHA= 0
##$AQORDER= 0
##$ASSFAC= 0
##$ASSFACI= 0
##$ASSFACX= 0
##$ASSWID= 0
##$AUNMP= <proc_1d>
##$AZFE= 0.1
##$AZFW= 0.1
##$BCFW= 1
##$BC_mod= 2
##$BYTORDP= 1
##$COROFFS= 0
##$CY= 11.3945322036743
##$DATMOD= 1
##$DC= 2
##$DFILT= <>
##$DTYPP= 0
##$F1P= 18.9103706918063
##$F2P= -1.10871071338519
##$FCOR= 0.5
##$FTSIZE= 0
##$FT_mod= 4
##$GAMMA= 1
##$GB= 0.15
##$INTBC= 1
##$INTSCL= 1
##$ISEN= 128
##$LB= 0.24
##$LEV0= 0
##$LPBIN= 0
##$MAXI= 10000
##$MC2= 0
##$MEAN= 0
##$ME_mod= 0
##$MI= 1.114404
##$NCOEF= 0
##$NC_proc= 0
##$NLEV= 6
##$NOISF1= 3.799351
##$NOISF2= 2.8
##$NSP= 1
##$NTH_PI= 0
##$NZP= 0
##$OFFSET= 15.70392
##$PC= 1
##$PHC0= -9018.005
##$PHC1= 15.60096
##$PH_mod= 1
##$PKNL= yes
##$PPARMOD= 0
##$PSCAL= 0
##$PSIGN= 0
##$REVERSE= no
##$SF= 200.130013532006
##$SI= 16384
##$SIGF1= 3
##$SIGF2= 2
##$SINO= 400
##$SIOLD= 16384
##$SREGLST= <1H.CDCl3>
##$SSB= 0
##$STSI= 0
##$STSR= 0
##$SW_p= 3612.71676300578
##$SYMM= 0
##$S_DEV= 0
##$TDeff= 0
##$TDoff= 0
##$TI= <>
##$TILT= no
##$TM1= 0
##$TM2= 0
##$TOPLEV= 0
##$USERP1= <user>
##$USERP2= <user>
##$USERP3= <user>
##$USERP4= <user>
##$USERP5= <user>
##$WDW= 1
##$XDIM= 8192
##$YMAX_p= 0
##$YMIN_p= 0
$$ End of Bruker specific parameters
$$ ---------------------------------
##NTUPLES= NMR FID
##VAR_NAME=  TIME,          FID/REAL,        FID/IMAG
##SYMBOL=    X,             R,               I
##VAR_TYPE=  INDEPENDENT,   DEPENDENT,       DEPENDENT
##VAR_FORM=  AFFN,          ASDF,            ASDF
##VAR_DIM=   8192,          8192,            8192
##UNITS=     SECONDS,       ARBITRARY UNITS, ARBITRARY UNITS
##FACTOR=    0.0002004,     1,               1
##FIRST=     0,             0,               0
##LAST=      1.6414764,     0,               0
##MIN=       0,             -334333,         0
##MAX=       1.6414764,     453068,          0
$$ Real data points
##PAGE= N=1
##DATA TABLE= (X++(R..R)), XYDATA
$$ plain form
0 0 0 0 0 0 -8 8 -8 8 -16 24 -24 32 -40 48 -60 72 -88 105 -128 145 -173 201 -233 268 -310 353 -404 459
28 459 -519 589 -662 743 -834 935 -1042 1162 -1292 1436 -1592 1764 -1954 2164 -2396 2652
44 2652 -2939 3261 -3621 4033 -4505 5057 -5704 6478 -7432 8629 -10190 12317 -15408 20316
58 20316 -29337 51318 -211427 -110535 410373 -4927 -270224 78937 274620 -184626 -295443
69 -295443 149332 294016 -90914 -169033 78881 55657 -156103 -11660 205498 59775
79 59775 -161802 -57963 66946 -25279 -59245 111461 144033 -58338 -164218 -17846 103511
90 103511 35944 -41109 29622 81387 -41103 -147904 -4325 176312 69384 -138621 -72853
101 -72853 90007 -4042 -129298 46331 198196 -17500 -210802 -27024 135535 -17791
$$ packed form
0@%%%%qJ6j6J6k4M0m8N6p2Q8j08J32j60J93k33K73l18L74m34N01n78O63p57Q63
28D59r78J108j251J405j577J769j977K204k454K728l028L356l718M118m560N048
44B652n591O200o882P654q538R562j0761J2182j3910J6061j8819K2507k7725L5724
58B0316m9653Q0655k62745J00892N20908m15300k65297L49161J95683m59246j10817
69b95443M44775J44684l84930p8119K47914k3224k11760J44443K17158j45723
79E9775k21577J03839J24909r2225l3966J70706L2572k02371j05880J46372J21357
90A03511o7567p7053P0731N1765j22490j06801J43579J80637j06928k08005O5768
101g2853J62860r4049j25256J75629J51865k15696j93302J83778J62559j53326
$$ plain form
111 -17791 -86869 104894 112702 -134955 -143978 98178 106083 -76645 -32239 101691 -22543
122 -22543 -158228 4270 152607 10307 -104487 13184 56745 -78271 -74323 98283 108828
133 108828 -51438 -82946 19545 30360 -30043 -1868 62954 33327 -43919 -54851 -266
144 -266 45451 35351 -9283 -22711 3822 1232 -30680 -3955 62069 42330 -43987 -52336 12977
157 12977 24654 -9554 4402 32133 -2591 -44064 -20982 15734 13464 6044 7342 -13538 -33525
170 -33525 -8669 25831 17381 -5791 -1800 4606 -14439 -26522 2249 39188 26426 -26737 -41819
183 -41819 6907 35034 -8765 -34736 19931 46903 -28453 -70344 17837 82122 1783 -69640
195 -69640 -2789 57304 -9496 -59101 16332 70676 517 -57443 -6172 39825 3824 -21161
$$ packed form
111a7791o9078J91763P808k47657r023K42156P905j82728M4406J33930j24234
122b2543j35685J62498J48337j42300j14794J17671M3561j35016L948J72606J0545
133A08828j60266l1508J02491J0815o0403K8175O4822k9627p7246j0932N4585
144b66M5717j0100m4634j3428K6533k590l1912K6725O6024j9739q6317q349O5313
157A2977J1677l4208J3956K7731l4724m1473K3082L6716k270p420J298k0880j9987
170c3525K4856L4500q450k3172L991O406j9045j2083K8771L6939j2762n3163j5082
183d1819M8726K8127m3799k5971N4667K6972p5356m1891Q8181O4285q0339p1423
195f9640O6851O0093o6800m9605P5433N4344p0159n7960N1271M5997l6001k4985
$$ plain form
207 -21161 11800 19668 -16246 -15592 19926 12639 -17267 3061 29185 -13101 -49972 7522 61296
220 61296 99 -64311 -2401 62872 -8907 -79237 3451 83937 -2553 -89935 -5762 80555
232 80555 260 -76410 4515 69770 -13426 -68535 15629 62739 -13642 -45455 23146 34245
244 34245 -32872 -27041 41084 26575 -36737 -14692 39877 6728 -42988 -768 47629 1714
256 1714 -46004 -443 44588 -109 -41911 3094 42734 -4849 -46634 1960 48271 1760
268 1760 -45771 76 46350 -3709 -50807 4818 55495 -2446 -54062 4702 53021 -8512
280 -8512 -52438 11257 49141 -16174 -47704 16958 40434 -21576 -35338 21913 23152 -30485
292 -30485 -19767 31147 11325 -34068 -4945 34708 -3886 -39780 6782 41909 -7505 -40402
$$ packed form
207b1161L2961P868l5914O54L5518p287k9906K0328K6124m2286l6871N7494N3774
220F1296o1197o4410O1910O5273p1779p0330Q2688Q0486q6490q7382Q4173Q6317
232H0555q0295p6670Q0925O5255q3196n5109Q4164M7110p6381l1813O8601J1099
244C4245o7117N831O8125j4509o3312K2045N4569l3149m9716M2220M8397m5915
256A714m7718M5561M5031m4697m1802M5005L9640m7583m1785M8594M6311m6511
268A760m7531M5847M6274n0059m7098N5625N0677n7941n1616N8764M8319o1533
280h512m3926O3695L7884o5315l1530O4662K3476o2010j3762N7251J239n3637
292c0485J0718N0914j9822m5393K9123L9653l8594l5894M6562L5127m9414l2897
$$ plain form
304 -40402 11222 43175 -9180 -41766 9813 44815 -3594 -40805 3773 43612 3821 -38425
316 -38425 -4197 38040 6872 -35650 -7270 35075 9600 -30880 -8494 25996 3010 -25304
328 -25304 -734 21415 -4537 -18729 9226 14181 -17118 -13024 21640 9273 -28626 -7782
340 -7782 33671 6034 -38760 -6113 40602 4061 -44547 -5852 43963 5476 -43970 -7193
352 -7193 40862 6365 -40012 -9172 34730 8988 -30081 -8448 25218 6488 -21643 -4966
364 -4966 18546 4361 -12589 1540 12398 -2979 -7839 10777 10837 -12329 -8751 19683 13985
377 13985 -18993 -11827 24392 13850 -27916 -16042 30770 19866 -29979 -21044 27346 16799
389 16799 -31536 -19620 28368 15871 -30040 -16498 26583 11460 -28286 -11560 24328 5369
$$ packed form
304d0402N1624L1953n2355l2586N1579L5002m8409l7211M4578L9839l9791m2246
316c8425L4228M2237l1168m2522K8380M2345k5475m0480K2386L4490k2986k8314
328b5304K4570K2149k5952j4192K7955M955l1299M094L4664j2367l7899K0844
340g782M1453k7637m4794L2647M6715l6541m8608L8695M9815l8487m9446L6777
352g193M8055l4497m6377L0840M3902k5742l9069K1633L3666j8730k8131J6677
364d966K3512j4185j6950J4129J0858j5377m860J8616O0k3166L578K8434n698
377A3985l2978P166L6219j0542m1766J1874M6812j0904m9845Q935M8390j0547
389A6799m8335J1916M7988j2497m5911J3542M3081j5123l9746J6726L5888j8959
$$ plain form
401 5369 -25879 -2864 26276 1253 -25351 967 23711 -4806 -24513 6661 25734 -4999
413 -4999 -20836 9850 21171 -11781 -20915 12625 19178 -13931 -16124 18263 16535 -19640 -15307
426 -15307 21221 12503 -25910 -12637 30367 16456 -28436 -14112 30518 13778 -32640 -14834
438 -14834 33604 17665 -29799 -14559 30904 15856 -28416 -16054 23361 11760 -21373 -8036
450 -8036 20419 5272 -19320 -4390 13060 -5286 -16805 6744 15039 -12141 -16280 15835 16586
463 16586 -21913 -22418 20936 22311 -23167 -22927 27351 28053 -25531 -29035 24350 28854 -23329 -26779
477 -26779 25414 29948 -19616 -24155 20612 22013 -19697 -18712 18822 15054 -16972 -8159 19676
490 19676 5371 -20013 -2505 18127 -3994 -20305 8335 23523 -9322 -23784 10887 23006
$$ packed form
401E369l1248K3015K9140k5023k6604K6318K2744k8517j9707L1174J9073l0733
413d999j5837L0686J1321l2952r134L3540O553l3109k193L4387j728l6175M333
426a5307L6528q718l8413J3273M3004j3911m4892J4324M4630j6740m6418J7806
438a4834M8438j5939m7464J5240M5463j5048m4272J2362L9415j1601l3133J3337
450h036K8455j5147k4592J4930J7450j8346j1519K3549Q295k7180m139L2115P51
463A6586l8499n05M3354J375m5478K40N0278P02n3584l504N3385M504n2183l450
477b6779N2193M534m9564m539M4767J401m1710R85L7534l768l2026Q813K7835
490A9676j4305k5384J7508K0632k2121j6311K8640J5188l2845j4462L4671J2119
$$ plain form
502 23006 -14623 -25110 15549 26544 -15039 -26256 15310 26058 -15168 -26453 13051 23386
514 23386 -14945 -24337 13231 22678 -12802 -21952 10133 16320 -13887 -16975 13064 14692 -13730
527 -13730 -12804 14052 10187 -15555 -7678 17770 6680 -18633 -3908 22361 6285 -18969 -892
540 -892 22335 868 -21785 2273 25079 282 -21437 3126 21493 -4399 -20448 6515
552 6515 20189 -8256 -21189 6757 18258 -8525 -17166 9448 15391 -13300 -19871 8714 17075
565 17075 -8683 -16118 8389 14914 -9603 -16899 6967 16107 -5466 -15138 3939 13036 -3418
578 -3418 -10118 5206 9258 -7005 -10232 5548 7513 -5283 -1894 10909 868 -16083 -2935
591 -2935 17908 3780 -18084 -1462 21993 2101 -24273 -1603 29496 6883 -28929 -9640
$$ packed form
502B3006l7629j0487M0659J0995m1583j1217M1566J0748m1226j1285L9504J0335
514B3386l8331r392L7568R447l5480r150L2085O187l0207l088L0039J628k8422
527a3730R26K6856l865k5742P877K5448j1090k5313J4725K6269j6076k5254J8077
540h92K3227k1467k2653K4058K2806k4797k1719K4563J8367k5892j6049K6963
552F515J3674k8445j2933K7946J1501k6783q641K6614N943k8691o571K8585Q361
565A7075k5758p435K4507O525k4517p296K3866R140k1573r672J9077R097j6454
578c418o700J5324M052j6263l227J5780J965j2796L389J2803j0041j6951J3148
591b935K0843j4128k1864J6622K3455j9892k6374K2670L1099k2613l5812J9289
$$ plain form
603 -9640 28020 13002 -22353 -8049 25829 10077 -26474 -14303 22058 15024 -15711 -9810 13675
616 13675 3442 -16950 -3284 14774 -1340 -15917 2587 11296 -11855 -14026 17294 16024 -24126
629 -24126 -23639 21097 21313 -22968 -18201 29214 19958 -33162 -24706 30891 26437 -24239 -19528 25049
643 25049 16058 -25047 -12200 28039 14986 -23064 -12868 18115 7674 -14378 2251 20669
655 20669 -3091 -25148 -1411 21884 1737 -16043 6489 18949 -12559 -27142 10820 31366
667 31366 -6224 -28223 7335 23922 -14890 -25195 21842 30769 -22905 -34354 17899 26408
679 26408 -21375 -18767 30208 16347 -39489 -22958 34344 18522 -30625 -9204 31140 -1448
691 -1448 -39799 -15 39978 3068 -31895 146 23109 -9160 -20517 17690 26753 -12399
$$ packed form
603i640L7660j5018l5355J4304L3878j5752l6551J2171L6361p034l0735N901K3485
616A3675j0233k0392J3666J8058j6114j4577J8504Q709k3151k171L1320j270m0150
629b4126M87M4736K16m4281M767M7415r256n3120Q456N5597m454n0676M711M4577
643B5049q991m1105J2847M0239j3053l8050J0196L0983j0441k2052J6629J8418
655B0669k3760k2057K3737K3295k0147j7780K2532J2460l1508j4583L7962K0546
667C1366l7590k1999L5558J6587l8812j0305M7037Q927n3674j1449N2253Q509
679B6408m7783K608M8975j3861n5836J6531N7302j5822m9147K1421M0344l2588
691a448l8351L9784L9993l6910l4963L2041K2963l2269j1357L8207R063l9152
$$ plain form
703 -12399 -23461 7393 14853 -6093 -2101 18774 6586 -21656 -13342 16399 15309 -7344 -5177
716 -5177 11798 804 -22994 -8939 26257 18835 -20834 -21492 13576 12378 -19894 -9775 29016
729 29016 15064 -33000 -25076 22046 20214 -14767 -7226 18415 -721 -27291 -4696 23150 7515
742 7515 -9258 2912 1759 -18575 -7479 23484 13657 -17709 -9268 13951 -2015 -21672 5229
755 5229 32111 4772 -30576 -15006 17695 13279 -8095 -3045 14098 5530 -18731 -16919 13293
768 13293 26655 3030 -18126 -5819 9716 -561 -8574 8649 17211 -4183 -18334 -3853
780 -3853 7175 1808 4551 9535 -7075 -21017 -2230 15408 125 -9888 9740 11365 -20999
793 -20999 -25431 14146 27816 -5656 -19980 4725 10475 -13720 -12636 17725 20569 -9881 -20007
$$ packed form
703a2399j1062L0854P460k0946L992K0875j2188k8242Q314K9741j090k2653K167
716e177J6975j0994k3798J4055L5196p422l9669o58L5068j198l2272J0119L8791
729B9016j3952m8064P924M7122j832l4981P541K5641j9136k6570K2595K7846j5635
742G515j6773J2170j153k0334J1096L0963r827l1366Q441K3219j5966j9657K6901
755E229K6882k7339l5348J5570L2701m416k1374N050J7143q568k4261J812L0212
768A3293J3362k3625k1156J2307J5535j0277q013J7223Q562k1394j4151J4481
780c853J1028n367K743M984j6610j3942J8787J7638j5283j0013J9628J625l2364
793b0999m432L9577J3670l3472j4324K4705N750k4195J084L0361K844l0450j0126
$$ plain form
806 -20007 1474 11448 -519 -2066 10439 6796 -13135 -14583 6999 15671 1149 -5809 3994
819 3994 2223 -13361 -8478 15526 16027 -8061 -12391 4808 3944 -9982 235 18157 3926 -18123
833 -18123 -6319 12460 1084 -8669 9691 14688 -14035 -22154 9508 20610 -7443 -14369 12460
846 12460 11931 -20797 -19644 17825 21868 -12946 -20299 7754 12709 -11429 -12678 12026 13966 -10279
860 -10279 -15839 3492 10901 -29 -3054 3967 1143 -6513 -1507 6609 2600 -1240 5524 4851 -8995
875 -8995 -8798 10975 14398 -7373 -13252 8394 13799 -9514 -15265 10996 19074 -9270 -22120 4304
889 4304 20635 -1966 -18561 1088 17019 -1785 -19205 -2331 17228 5048 -13683 -5843
901 -5843 9654 3519 -8672 -3022 6765 2113 -4566 -789 1203 -2969 104 6113 -1630 -10299 954
$$ packed form
806b0007K1481R974j1967j547J2505l643j9931j448K1582Q672j4522o958R803
819C994j771j5584M883K4004N01k4088m330J7199q64j3926J0217J7922j4231k2049
833a8123J1804J8779j1376r753J8360M997k8723q119L1662J1102k8053o926K6829
846A2460n29l2728J153L7469M043l4814p353K8053M955k4138j249K4704J940k4245
860a0279n560J9331P409j0930l025P021k824p656N006Q116m009l840O764o73j3846
875h995J97J9773L423k1771n879K1646N405k3313n751K6261Q078k8344j2850K6424
889D304J6331k2601j6595J9649J5931j8804j7420J6874J9559j2180j8731P840
901e843J5497o135j2191N650R787m652o679L777J992m172L073O009p743q669J1253
$$ plain form
916 954 12232 -1778 -15080 1734 17369 -1609 -20026 -370 20615 2321 -19235 -2136
928 -2136 19711 4161 -17830 -4470 17454 7284 -13195 -5622 13289 7484 -10092 -6054 9877
941 9877 6545 -7934 -4837 8441 4402 -8176 -3237 7916 447 -10169 64 10090 -2904
954 -2904 -12347 3363 11198 -7532 -13723 7731 12098 -11415 -12728 12997 11723 -15727 -11421 16843
968 16843 9391 -18918 -7767 21469 7695 -21551 -6150 22346 5412 -22197 -4642 22287
980 22287 5446 -19786 -4405 18691 4618 -16581 -4750 14253 5091 -10999 -3591 9690
992 9690 3611 -7082 -1803 5634 -20 -4352 3501 5841 -4664 -5504 7908 6862 -11024 -8715
1006 -8715 13872 10974 -16320 -13294 18175 15036 -20749 -18716 19233 17900 -20839 -19552 19473
$$ packed form
916I54J1278j4010j3302J6814J5635j8978j8417J9656K0985j8294k1556J7099
928b136K1847j5550k1991J3360K1924j0170k0479P573J8911n805j7576M038J5931
941I877l332j4479L097J3278m039j2578M939J1153p469j0616J0233J0026j2994
954b904r443J5710P835j8730o191K1454M367k3513j313K5725j274k7450M306K8264
968A6843p452k8309J1151K9236j3774k9246J5401K8496j6934k7609J7555K6929
980B2287j6841k5232J5381K3096j4073k1199J1831J9003r162j6090P408J3281
992I690o079j0693N279P437n654m332P853K340j0505q40J3412j046j7886K309
1006h715K2587k898k7294L026L1469l139l5785K033L7949j333l8739J287L9025
$$ plain form
1019 19473 18020 -20132 -19155 16652 15482 -16349 -14166 13915 11094 -11846 -7368 10411 3676
1032 3676 -9531 -263 9633 -929 -6922 5796 8188 -7188 -7809 10163 10177 -9800 -9873 11636
1046 11636 12194 -11054 -12849 11578 14621 -11419 -16543 10359 17720 -9159 -18142 8404 17948
1059 17948 -9038 -19332 7720 18950 -6755 -17689 6295 15517 -7349 -14339 7338 12050
1071 12050 -8427 -10408 8488 7846 -9295 -5658 9168 1411 -12157 -433 13163 -801 -14052
1084 -14052 1222 12942 -4331 -14733 5263 16085 -5209 -16474 5217 16694 -4596 -15693
1096 -15693 5925 16856 -4897 -15743 6349 17838 -3728 -15443 5025 15813 -4437 -14592
1108 -14592 5745 15809 -4071 -14188 3885 12318 -4955 -11682 4730 9885 -5676 -9078 4839
$$ packed form
1019A9473j453l8152R77L5807j170l1831K183K8081k821k2940M478J7779o735
1032C676j3207R268R896j0562n993J2718K392j5376o21J7972J4j9977p3K1509
1046A1636N58k3248j795K4427L043k6040n124K6902P361k6879q983K6546R544
1059A7948k6986j0294K7052J1230k5705j0934K3984R222k2866o990K1677M712
1071A2050k0477j981J8896o42j7141L637J4826p757j3568J1724J3596j3964j3251
1084a4052J5274J1720j7273j0402J9996J0822k1294j1265K1691J1477k1290j1097
1096a5693K1618J0931k1753j0846K2092J1489k1566j1715K0468J0788k0250j0155
1108a4592K0337J0064j9880j0117J8073Q433j7273o727J6412N155j5561l402J3917
$$ plain form
1121 4839 5933 -6790 -5442 5912 1645 -8462 -435 9713 -1443 -12099 1473 12574 -3236
1134 -3236 -14593 3875 16801 -3565 -18491 3028 19860 -1727 -20656 244 20705 1479
1146 1479 -19413 -1751 18936 2902 -17585 -3851 15554 4415 -12123 -2772 10229 2241
1158 2241 -7044 108 5059 -1792 -2069 5653 1875 -6954 276 10511 -82 -12529 154 14732
1172 14732 974 -15742 -1627 16682 2672 -17676 -5434 15716 5452 -15845 -7499 13443
1184 13443 6928 -13551 -9045 10140 7138 -10347 -7784 8421 6372 -7634 -5347 6443 2986
1197 2986 -6476 -1111 7214 366 -6148 2562 7256 -3311 -6407 5891 7525 -6369 -6350 8964
1211 8964 7740 -8633 -6691 9677 6312 -10115 -5547 11243 5884 -10815 -5415 10642 4825
$$ packed form
1121D839J094j2723J348J1354m267j0107Q027J0148j1156j0656J3572J1101j5810
1134c236j1357J8468J2926k0366j4926K1519J6832k1587j8929K0900K0461j9226
1146A479k0892J7662K0687j6034k0487J3734J9405j1139j6538R351J3001p988
1158B241r285P152M951o851k77P722l778q829P230J0235j0593j2447J2683J4578
1172A4732j3758j6716J4115J8309j4010k0348J2242K1150j0264k1297Q346K0942
1184A3443o515k0479M506J9185l002j7485K563J6205k049j4006K287J1790l457
1197B986r462N365Q325o848o514Q710M694j0567l096J2298J634j3894J9J5314
1211H964j224j6373J942J6368l365j6427M568J6790n359j6699N400J6057n817
$$ plain form
1224 4825 -10663 -4911 10187 5056 -9529 -4872 8918 5099 -8582 -5725 7335 5422 -6888
1237 -6888 -5622 6270 5327 -6145 -5837 4326 3644 -5363 -3443 4906 1805 -5757 -1537 4429 -1521
1252 -1521 -5654 2865 5922 -4997 -6783 6731 7637 -7673 -7757 9501 8751 -9941 -8115 12401
1266 12401 10814 -10633 -9980 11117 10835 -9355 -9350 10163 10864 -7787 -9743 6574 8958 -5001
1280 -5001 -7860 3572 6127 -2780 -4648 1606 2042 -2383 -1261 1014 -2180 -2657 3685 3424 -6016
1295 -6016 -5812 6547 6492 -8675 -9163 9131 11251 -9226 -13222 8523 13968 -8199 -15263 7001
1309 7001 15287 -5944 -14926 5042 14165 -3987 -12927 2688 10336 -2285 -7143 3442 5418
1322 5418 -3614 -2557 5055 730 -5477 2586 8129 -3240 -8580 6166 11674 -5953 -12566 6495
$$ packed form
1224D825j5488N752J5098n131j4585M657J3790l819j3681K857J3060j913j2310
1237f888J266J1892r43j1472L08J0163o82r007J920Q349l101p562M220N966n950
1252a521m133Q519L057j0919j786J3514R06j5310q4J7258p50j8692J826K0516
1266A2401j587k1447O53K1097k82k0190NJ9513P01j8651j956J6317K384j3959
1280e001k859J1432K555q907j868O254M36m425J122K275l194m77O342k61r440
1295f016K04J2359n5j5167m88J8294K120k0477l996K1745N445k2167p064K2264
1309G001Q286k1231q982J9968R123j8152q940J5615P648j2621m858J0585J976
1322E418r032J057P612m325o207Q063N543j1369n340J4746N508j7627o613J9061
$$ plain form
1336 6495 13929 -5747 -12986 6801 13434 -6898 -13864 5590 12214 -5624 -11384 4541 8561
1349 8561 -5965 -8348 4817 5482 -6402 -5628 5182 3277 -6269 -2707 6153 1590 -7230 -2018
1363 -2018 6780 1683 -6325 -459 7295 727 -7079 -287 7503 572 -6294 1462 7318 -2019 -7199
1378 -7199 3904 8579 -4345 -8620 5651 8998 -6624 -8470 8959 9707 -9705 -10557 9429 10448
1392 10448 -8554 -8424 9447 7738 -9532 -7516 8214 6563 -6222 -4133 4851 1299 -4814 0
1406 0 3654 -1830 -3291 2293 996 -5362 -1632 6213 1633 -7940 -4139 6042 3388 -6507 -4156
1421 -4156 6518 5349 -6709 -7927 4923 9618 -2405 -9135 2098 10260 -599 -9722 1170
1434 1170 11549 1227 -10064 -1508 9493 3133 -5813 -843 5042 -51 -4213 198 2764 378
$$ packed form
1336F495P434j9676p239J9787O633k0332o966J9454O624j7838n760J5925M020
1349H561j4526k383J3165O65j1884P74J0810j905r546L562Q860m563q820N212
1363b018Q798n097q008N866P754o568p806O792P790o931o866P756N856r337n180
1378g199J1103M675j2924m275J4271L347j5622j846J7429P48j9412q52J9986J019
1392A0448j9002J30J7871j709j7270K016J5730j651j2785K089Q984l552o113M814
1406@L654n484j461N584j297o358L730P845m580r573L801J0181k654r895K351
1421d156J0674j169j2058j218J2850M695j2023o730J1233Q162j0859r123J0892
1434A170J0379j0322j1291Q556J1001o360q946M970N885n093m162M411K566k386
$$ plain form
1448 378 761 1320 -3522 -4861 3207 5953 -3350 -6657 3213 6392 -4665 -8267 4007 9458 -2864
1463 -2864 -10886 -546 9209 2104 -7637 -2479 6924 2492 -8269 -5467 6923 7379 -4558 -7244
1477 -7244 2467 5239 -3031 -4695 3378 4350 -3103 -3585 2455 1878 -1839 1632 3736 -3344 -5279 4407
1493 4407 6946 -3527 -4993 6668 6366 -7911 -7218 8853 9306 -6592 -7538 6920 6427 -7525
1507 -7525 -5697 8114 5695 -8014 -5957 6282 3870 -6553 -2862 6563 975 -9100 -3278 7559
1521 7559 2944 -7040 -2525 6108 545 -8281 -2014 8290 3187 -6870 -2885 5669 1419 -5572
1535 -5572 240 6659 -244 -6412 1117 5990 -2170 -4510 5643 5799 -7787 -7264 8956 8356 -8903
1550 -8903 -7269 11214 7901 -12773 -9068 13341 10546 -11632 -9553 11300 9067 -10544 -8092
$$ packed form
1448C78L83N59m842j339Q068K746r303l307R870L179j1057l602J2274N451j2322
1463b864q022J0340R755p105r741N158R403m432j0761K802J2390M56j1937k686
1477g244R711K772q270j664Q073R72p453m82O040n77l717L471K104p080j935R686
1493D407K539j0473j466J1661l02j4277O93J6071M53j5898r46J4458m93j3952
1507g525J828J3811k419j3709K057J2239k412j0423L691R425n588j0075N822J0837
1521G559m615r984M515Q633n563q826O267J0304n103j0057L985Q554m250o991
1535e572N812O419o903o168P529M873q160k340J0153J56j3586N23J6220o00j7259
1550h903J634J8483l313k0674L705K2409k795k2178K079K0853k233j9611K452
$$ plain form
1563 -8092 10105 8014 -8251 -6875 6349 5013 -4712 -2596 3947 123 -4449 130 2972 -2270
1577 -2270 -2784 3770 2205 -7108 -5316 6428 5819 -7012 -7067 6672 7035 -8107 -9278 7944 11024
1592 11024 -6781 -11803 5851 12197 -4620 -10922 5567 11904 -4291 -10834 4120 10741 -2126
1605 -2126 -7429 3412 6214 -3443 -4468 3984 3329 -3360 -580 4214 -1439 -5577 2211 6255 -2995
1620 -2995 -6829 3522 7144 -4357 -8188 4214 8772 -4042 -9909 2463 9471 -1755 -9180
1633 -9180 1361 8736 -1761 -9932 146 9141 432 -8519 -748 6976 -731 -7462 762 6878
1647 6878 -1523 -6682 1875 5760 -2736 -4895 4129 4770 -4815 -4236 5698 4565 -4969 -2331 6657
1662 6657 2714 -6388 -1538 7269 1987 -5887 253 7164 -396 -7376 869 7733 -1017 -7815 1281
$$ packed form
1563h092J8197k091j6265J376J3224j336r725K116O543l824m572M579K842n242
1577b270n14O554j565r313J792J1744o09j2831n5J3739L63j5142j171J7222L080
1592A1024j7805n022J7654O346j6817o302J6489O337j6195o543J4954O621j2867
1605b126n303J0841K802r657j025Q452o55o689K780M794n653m138P788M044r250
1620b995l834J0351L622j1501l831J2402M558j2814n867J2372P008j1226p425
1633i180J0541P375j0497q171J0078Q995q709q951P771P724p707o731Q224O116
1647F878q401n159Q557L885q496k159R024O41r585N79R934j133r534K638Q988
1662F657l943r102M850Q807n282p874O140O911p560o980Q245O864q750o798R096
$$ plain form
1677 1281 8064 -1826 -9142 1053 9000 -1460 -10484 -188 9576 98 -9904 -1046 8815 393
1691 393 -9504 -1679 8012 1590 -6699 -1257 4975 42 -4016 919 2702 -2026 -1251 3704 442
1706 442 -4987 747 6854 -1118 -8488 1116 10036 -404 -10314 334 11340 606 -11354 -1240
1720 -1240 11570 2920 -10053 -2691 9787 3996 -8180 -3935 7139 4293 -5268 -3352 4581 3016
1734 3016 -3281 -2008 2125 359 -1916 535 1047 -2481 -1404 3190 614 -5716 -2204 5724 1619
1749 1619 -7356 -2787 7286 2343 -8437 -3379 7914 3155 -8203 -3552 8143 4117 -6904
1762 -6904 -3548 6643 3520 -5681 -2513 6123 3319 -4533 -2100 4600 2259 -3417 -1141 3581 985
1777 985 -2705 254 3134 -299 -2728 979 2487 -1805 -2267 2845 2577 -3283 -2621 3710 2249 -4732
$$ packed form
1677A281O783r890p316J0195P947j0460r024J0296R764r478j0002Q858R861q422
1691C93r897P825R691o422q289N442O232m933m058M935J783m728P75M955l262
1706D42n429N734O107p972p370R604Q920j0440r910J0648J1006j0734j1960J0114
1720a240J2810q650j2973P362J2478n791j2176M245J1074k846r561J916P933j565
1734C016o297J273M133j766k275K451N12l528J077M594k576o330L512P928m105
1749A619q975M569J0073m943j0780N058J1293m759j1358M651J1695m026j1021
1762f904L356J0191l123r201L168Q636k804p852K433O700k341n676K276M722k596
1777I85l690K959K880l433k429L707J508m292m62N112k68n860O62O331j461o981
$$ plain form
1793 -4732 -2565 5200 2678 -5654 -2853 5636 2369 -6413 -2855 6156 2379 -6735 -3229 5979 2875
1808 2875 -6150 -3564 4763 2558 -5221 -2996 4541 3067 -3971 -3273 2602 2463 -1984 -1505 2074 1581
1824 1581 -979 21 1280 -336 -309 2478 1342 -2747 -612 5020 2169 -5091 -2045 6392 2937
1839 2937 -7074 -3388 7995 4865 -7634 -5717 6523 5270 -6659 -5853 5609 5564 -5159 -6212
1853 -6212 2973 5042 -2218 -4659 341 2591 -301 -1706 -132 533 135 10 -920 -2014 145 3416
1869 3416 1146 -4049 -2415 4347 3364 -4876 -4718 4988 5916 -4626 -6505 4768 7696 -4044 -7957
1884 -7957 3719 8093 -2648 -6862 3234 7056 -2125 -5529 2383 4881 -1807 -2882 2834 2618
1898 2618 -2280 -1168 2805 418 -3068 165 3148 -949 -3818 817 3671 -1456 -4665 263 3558
$$ packed form
1793d732K167P765k522q332K801Q489l267q782L558R011l777r114L506R208l104
1808B875r025K586Q327k205p779K225P537j474p038O98N875j39m447M79L579m93
1824A581k560J000J259j616K7K787j136m089K135N632k851p260L046Q437l455
1839B937j0011L686J1383l130j2499J917J2240j253j1929Q06J1462m5j0723j053
1853f212R185K069p260k441N000K250k892j405J574O65l98j25r30j094K159L271
1869C416k270n195J634O762r83q240J58R706R28j0542j879J1273K928j1740l913
1884g957J1676M374j0741m214J0096L822r181l404P912K498o688j075N716k16
1898B618m898J112L973k387l486L233K983m097k869M635K854n127l209M928L295
$$ plain form
1913 3558 -1441 -4559 865 4236 -1662 -5406 868 4806 -1774 -5536 1860 5746 -2517 -6158 3210
1928 3210 6906 -3410 -7115 4045 7638 -3749 -6921 4729 7419 -4357 -6626 4603 6500
1941 6500 -3830 -4996 4294 4512 -3435 -2863 3442 1604 -3236 38 3858 -655 -3617 1901 3778
1956 3778 -2982 -4223 4056 5390 -4329 -6427 4209 7147 -4116 -8033 3507 8130 -3997 -9507
1970 -9507 3113 9621 -2841 -10467 1239 8920 -1762 -8929 1151 7483 -1651 -7009 1221 5033
1984 5033 -1844 -3560 2287 1983 -2914 -28 4250 -833 -4708 2556 6284 -2702 -6425 4182 8403
1999 8403 -3222 -8322 3706 9247 -2727 -9006 2857 9928 -1533 -9593 627 8985 18
2012 18 -8353 -627 7272 527 -6607 -835 5393 219 -4929 -391 3144 -1009 -2339 1999 1394 -3493
$$ packed form
1913C558m999l118N424L371n898l744O274L938o580l762P396L886q263l641R368
1928C210L696j0316l705J1160L593j1387l172J1650K690j1776k269J1229J897
1941F500j0330j166R290K18p947N72O305j838m840L274L820m513k962N518J877
1956C778o760j241Q279J334r719k098J0636K938j1263l917J1540M623j2127n510
1970i507J2620O508j2462p626J1706P681j0682p167J0080O332r134n358Q230L812
1984E033o877j716N847l04m897K886M278n083l875P264L728q986l723J0607M221
1999H403j1625n100J2028N541j1974o279J1863P071j1461q060J0220Q358q967
2012A8q371P726P899o745p134N772O228n174n148M538L535m153j330M338o05m887
$$ plain form
2028 -3493 -1333 3882 231 -5249 -155 5997 -120 -6757 -103 6700 -242 -7162 -336 6785 438
2043 438 -6172 -497 5703 623 -5130 -698 4705 1040 -3843 -494 4151 1116 -3273 -274 3946
2058 3946 680 -3643 90 4696 757 -3919 107 4492 -334 -4744 638 4957 -298 -4453 255
2073 255 3277 -1492 -3191 1412 1972 -2432 -1901 2072 159 -3366 -58 3359 -1111 -4738 399 4597
2089 4597 -539 -4825 245 5078 131 -5597 -1582 5452 3237 -4253 -3627 4038 4469 -3670 -4922
2104 -4922 3859 6364 -2541 -6371 1861 6073 -830 -4319 1475 3543 -1658 -2497 1950 1818 -991
2119 -991 857 1506 -3015 -2639 4463 4068 -4511 -3922 5365 3953 -6494 -4744 6859 5738 -6350
2134 -6350 -6631 4568 5651 -4190 -5554 3204 4945 -3343 -6166 922 5196 247 -4170 -1217 2252
$$ packed form
2028c493K160N215l651n480N094O152o117o637O654O803o942o920O826P121o347
2043D38o610N675O200n080n753M432N403l665m883L349M645l035m389K999M220
2058C946l266m323L733M606l939m676M026M385m826m410N382M319n255m155M708
2073B55L022m769j699M603N60m404N31L973j913l525L308L417m470l627N137M198
2089D597n136m286N070M833m947n728M015P034k215p490O26P665M31q139j252
2104d922Q781K505q905l830Q232M212o903l489N794K068n201q39M447j32k809
2119i91J848O49m521L76P102l95q579N89R287j412j0447J750J1603j121j2088
2134f350k81J1199J083r841j364Q758J741q288k823P088M274m949m417K953L469
$$ plain form
2149 2252 -106 -2750 225 3026 553 -2138 -577 602 -500 677 3011 228 -3595 -7 4403
2164 4403 220 -4050 1618 5991 -1570 -7107 1373 7990 -59 -6572 921 6080 -1975 -6654 1953
2179 1953 6959 -704 -5742 211 3669 -1405 -3072 2103 3114 -2284 -3465 957 2068 -1090 -880
2194 -880 1874 224 -3519 -1931 2824 2376 -1871 -1886 1367 353 -3173 -1107 3689 2166 -3261 -2488
2210 -2488 2164 1127 -2628 11 3989 234 -4632 -508 4715 673 -3750 1232 4933 -1655 -5811
2225 -5811 1691 7288 212 -5526 490 5224 -1057 -5178 1679 6314 -93 -5397 -1018 3326 483
2240 483 -2128 453 1456 -1598 -2038 633 557 -1105 625 1840 -2276 -4556 1113 5275 -325 -5429
2256 -5429 -23 5132 -922 -6762 228 7892 1345 -7657 -2528 6557 2834 -5670 -2183 5764 2411
$$ packed form
2149B252k358k644K975K801k473k691J561J179j102J177K334k783l823L588M410
2164D403m183m270N668M373p561n537Q480O617q049o513P493N159q055m679Q607
2179A953N006p663n038N953L458n074j667N175J011n398j181M422J111l158K10
2194h80K754j650l743J588M755m48m247j5L253j014l526K066M796j523n427P73
2210b488M652j037l755K639L978l755m866M124N223m042m423M982L701o588m156
2225e811P502N597p076n738O016M734o281m121O857M635o407n304M379M344k843
2240D83k611K581J003l054m40K671p6j662J730J215m116k280N669M162n600n104
2256e429N406N155o054n840O990P664o547r002N129R085l723q504L487P947l353
$$ plain form
2271 2411 -5314 -2721 4471 3131 -2358 -1615 1526 59 -1312 1264 1846 -1175 -584 2582 -5 -4112
2287 -4112 142 5912 1346 -5878 -1505 5978 1609 -6101 -1264 6811 1690 -7049 -2746 6071 2786
2302 2786 -5161 -2582 4010 1054 -4850 -1726 3995 1385 -3451 -1474 1763 -552 -2343 942 2331
2317 2331 -1434 -2389 1420 1751 -2069 -1373 3214 1867 -3578 -1978 3952 2549 -3359 -1516 4313 1684
2333 1684 -4467 -1467 5206 2379 -4227 -1490 4402 965 -4540 -454 5038 754 -4647 -559 4173
2348 4173 33 -3921 493 3778 -936 -3947 701 3412 -895 -2851 852 1941 -1760 -2086 1642
2363 1642 1615 -1767 -1342 1449 166 -2499 -328 2556 -118 -3226 -18 3165 -431 -3898 95 4175
2379 4175 -6 -4675 -341 4915 1122 -4607 -1067 4896 1737 -4365 -1696 4630 2783 -3208 -2151
$$ packed form
2271B411p725K593P192j340n489P43L141j467j371K576N82l021N91L166k587m107
2287d112M254N770m566p224M373P483m369p710M837Q075n121q739M303Q817l285
2302B786p947K579O592k956n904L124N721k610m836J977L237k315j791L285J389
2317B331l765r55L809L31l820O96M587j347n445J600N930j403n908J843N829k629
2333A684o151L000O673k827o606K737N892l437n505M086N492m284n401M088M732
2348D173m140l954M414L285m714l011M648K711m307j956L703J089l701l26L728
2363A642k7l382M25K791j283k665K171K884k674l108L208L183l596l467L993M080
2379D175m181m669M334N256l793n729L540N963l159o102K669O326j847n991J057
$$ plain form
2394 -2151 3153 2342 -1982 -1565 1849 1520 -693 -326 362 -536 -8 1376 -333 -2510 170 3242 -164
2411 -164 -4311 -610 4441 585 -5520 -1877 5077 2149 -5225 -2995 4477 2959 -4432 -3733 3432
2426 3432 3707 -2661 -3619 1845 3144 -1328 -2711 677 2103 -305 -1254 323 717 -146 301 502 -911
2443 -911 -829 1627 1697 -1505 -1692 2229 2647 -2160 -2857 2556 3742 -1869 -3414 2395 3966 -2039 -3718
2460 -3718 2128 3826 -1990 -3591 2097 3491 -2224 -3270 1984 2536 -2698 -2953 2248 2188 -2787 -2451
2476 -2451 2113 1513 -2818 -1951 2123 1190 -2490 -1233 2049 739 -2049 -514 1821 3 -1706 591
2492 591 2057 -626 -1893 1401 2363 -1460 -2335 2210 3381 -1918 -3231 2470 4098 -2238 -4180 2427
2508 2427 4771 -2039 -4701 2185 5038 -1717 -4964 1431 4699 -1125 -4155 1043 3723 -904 -3189
$$ packed form
2394b151N304q11m324M17L414l29k213L67O88q98N28J384j709k177K680L072l406
2411a64m147L701N051l856o105L643O954k928p374K230P472j518p391O99P165
2426C432K75o368r58N464J299m472j383L388J426k408r49J577L94q63M47K01j413
2443i11Q2K456P0l202j87L921M18m807o97N413J186n611j545N809J571o005j679
2460c718N846J698n816j601N688J394n715j046N254N52n234k55N201o0m975L36
2476b451M564o00m331Q67M074r33l680J257L282j310k788J535K335j818j709K297
2492E91J466k683j267L294R62l823q75M545J171n299j313N701J628o336j942O607
2508B427K344o810k662O886K853o755l247O395L268n824l030N198K680m627k285
$$ plain form
2523 -3189 616 2200 -916 -1588 828 551 -1385 -62 1325 -1039 -2494 875 2556 -1820 -3505
2538 -3505 1565 3697 -2052 -4769 1381 4940 -1434 -5483 1001 5798 -389 -5834 -67 5839 670
2553 670 -5234 -582 5387 1431 -4134 -800 4043 1290 -2784 -442 2457 454 -1199 726 1025
2568 1025 -1108 -432 1973 136 -2664 68 3477 -51 -4191 -357 4324 318 -5013 -1013 4854
2583 4854 1086 -5016 -1830 4477 1603 -4684 -2216 3992 1982 -3895 -2072 3383 1597 -3362 -1522
2598 -1522 2892 901 -2901 -415 2871 27 -2957 457 2849 -872 -2826 1416 3105 -1346 -2679
2613 -2679 1918 2864 -1735 -2235 2300 2390 -1909 -1452 2710 1690 -2398 -954 2992 1043 -2932 -589
2629 -589 3603 800 -3802 -974 3818 901 -4357 -1483 4186 1634 -4467 -2443 3847 2098 -4207
$$ packed form
2523c189L805J584l116o72K416k77j936J323J387k364j455L369J681m376j685
2538c505N070K132n749k717O150L559o374m049O484M797o187n445N767N906n169
2553F70n904M652N969l956n565L334M843k753m074K342K899k003j653J925K99
2568A025k133O76K405j837k800K732L409l528m140L834M681m006n331M000N867
2583D854l768o102L186O307k874o287K468O208k010n877J823N455j786m959J840
2598a522M414j991l802K486L286k844k984L414K392l721j954M242J689m451j333
2613b679M597R46m599n00M535R0m299M57M162j020m088J444L946j949l975K343
2629e89M192k803m602K828M792k917n258K874N669k552o101K024O290j749o305
$$ plain form
2644 -4207 -2875 3250 2253 -3294 -2510 2429 1790 -2255 -1590 1440 561 -1138 474 925 -1251 -690 2283
2661 2283 773 -2957 -561 4033 1288 -4130 -1340 4785 2113 -4559 -2237 4692 3111 -4074 -3105
2676 -3105 3918 3749 -2950 -3650 2346 3761 -1442 -3257 1207 3201 -457 -2726 0 1897 180
2691 180 -1144 -123 237 -261 284 303 -1297 -1172 1557 1136 -2698 -2235 2678 2485 -3249 -3374 2681 3127
2709 3127 -3055 -3573 2673 3632 -2404 -3750 1657 3392 -1098 -2842 1011 2744 -247 -1958 315
2724 315 1938 534 -863 -177 841 491 78 351 406 -100 86 521 -109 -620 550 1465 -249 -1762
2742 -1762 -22 1886 -89 -2066 70 2152 -430 -2525 178 2317 -514 -2334 384 1706 -1009
2757 -1009 -1971 1057 1824 -1312 -1976 850 1306 -1389 -1561 1225 1666 -1053 -2056 271 1594 17
$$ packed form
2644d207J332O125r97n547P84M939o39m045O65L030q79j699J612M51k176N61K973
2661B283j510l730K396M594k745n418K790O125k672o672K322O929j581p185R69
2676c105P023j69o699p00N996J415n203j815M464J994l658k269K726J897j717
2691A80j324J021L60m98N45J9j600J25K729m21l834M63M913j93n734j25O055M46
2709C127o182n18O246R59o036j346N407J735m490j744L853J733k991j711K273
2724C15J623j404j397O86J018l50m13K73N5n06J86M35o30n11J170R15j714j513
2742a762J740J908j975j977K136K082k582k095K703K139k831j820K718J322k715
2757a009r62L028P67l136o64K826M56k695j72K786M41k719j003K327J323j577
$$ plain form
2773 17 -1379 -217 1396 554 -1306 -748 1364 1407 -568 -1182 282 1241 562 -284 -229 426 940 449 -1085
2792 -1085 -899 1840 2337 -1242 -2869 1006 3324 -819 -3614 681 4068 -310 -4587 -910 3912
2807 3912 1146 -3491 -1895 2266 1333 -2336 -1969 1391 2062 -704 -2388 -950 1386 1404 -577 -1495
2823 -1495 20 1370 135 -1740 -808 1950 2112 -1286 -2756 486 3278 538 -2930 -662 3331
2838 3331 1177 -3376 -1569 3833 2801 -2751 -2752 2181 2534 -1532 -1752 1976 2120 -1367 -1974 599 1463
2855 1463 142 -263 40 -487 -476 423 266 -735 -144 1084 -215 -2293 -717 2201 1035 -2255 -1571
2872 -1571 1548 719 -2396 -1250 2501 1564 -2548 -2101 1805 1627 -1786 -1095 2249 1203 -2394 -1242
2888 -1242 2418 1522 -1680 -677 1958 409 -1994 157 2810 619 -1977 -307 1734 -119 -1371
$$ packed form
2773A7j396J162J613q42j860N58K112M3j975o14J464R59o79q46N5O55N14m91j534
2792a085J86K739M97l579j627L875K318m143k795M295L387m378m277L677M822
2807C912k766m637J596M161r33l669L67L360O71k766j684J438K336J8j981r18
2823a495J515J350j235j875R32K758J62l398j470L242K792k740l468K268L993
2838C331k154m553J807N402j032n552jM933L53m066k20L728J44l487o07K573Q64
2855A463j321m05L03n27J1Q99j57j001N91J228j299k078J576K918j166l290O84
2872a571L119q29l115J146L751r37m112M47L906j78l413O91L344j046l597J152
2888a242L660q96l202J003K635j549k403K151K653k191k596J670K041j853j252
$$ plain form
2903 -1371 1016 1932 -749 -1823 457 1177 -710 -498 1696 524 -2211 -965 2045 688 -2224 -380
2919 -380 2642 -32 -3696 -649 3959 1113 -3923 -1534 3346 919 -3923 -1253 4098 1553 -4076
2934 -4076 -2336 2711 1865 -2155 -1310 1793 731 -1748 -598 1207 446 -222 578 -64 -1558 387
2950 387 2890 481 -2762 -237 3390 578 -3784 -392 4927 1712 -4552 -2222 4351 2676 -3683
2965 -3683 -2551 3687 2753 -3553 -3233 2734 3067 -2068 -2711 1111 1554 -1363 -1159 1092 423 -1127 -137
2982 -137 395 -1358 -831 2082 1180 -2794 -1818 2700 1704 -3069 -1861 3354 2162 -3466 -2544 3244 2858
2999 2858 -2690 -2636 2353 2337 -2085 -1900 2297 2261 -1647 -1909 1408 1679 -964 -829 1554 965 -1364 -664
3017 -664 1655 733 -1257 -215 1664 131 -1843 63 2110 -20 -2067 89 1806 -666 -2142
$$ packed form
2903a371K387R16k681j074K280P20j887K12K194j172k735J246L010j357k912J844
2919c80L022k674l664L047M608k846n036K389M880k427m842K670N351k545n629
2934d076J740N047q46m020Q45L103j062k479J150J805p61o68Q00o42j494J945
2950C87K503k409l243K525L627k812m362L392N319l215o264K330O573j675o359
2965c683J132O238r34o306L20N967L33n135o43L822M43k917K04K251o69j550R90
2982a37N32j753N27K913r02l974R76M518r96m773J208N215j192n628R22N788l86
2999B858n548N4M989j6m422J85M197l6l908k62L317K71k643J35K383n89k329P00
3017f64K319r22j990J042J879j533j974J906K047k130k047K156J717k472j476
$$ plain form
3032 -2142 816 2017 -1206 -2378 862 1643 -1681 -1888 1799 1674 -2303 -2135 1929 1827 -2130 -1814
3048 -1814 2079 1680 -2255 -1872 2143 2061 -1661 -1998 1402 1981 -907 -1485 1110 1811 -449 -1367 385
3065 385 1354 125 -604 240 617 -49 128 440 -275 -581 787 1161 -985 -1494 1296 2134 -1403 -2652
3083 -2652 1300 2854 -1392 -3390 1193 3577 -1143 -3988 412 3644 -377 -3690 -268 2990 160
3098 160 -2866 -672 2121 548 -1855 -841 970 577 -441 -308 -139 -76 415 583 -627 -886 912
3115 912 1659 -570 -1774 766 2550 -152 -2579 170 3337 676 -2991 -713 3268 1290 -2960
3130 -2960 -1401 2923 1747 -2455 -1641 2232 1437 -2056 -1466 1554 1048 -1410 -856 913 59 -1146
3146 -1146 -20 825 -755 -1186 680 923 -1166 -1134 1247 895 -1663 -1270 1569 1257 -1634 -1285 1486
$$ packed form
3032b142K958J201l223j172L240P81l324k07L687j25l977J68M064j02l957L16
3048a814L893l99l935L83M015q2l722l37L400N79k888n78K595P01k260r18J752
3065C85R69j229p29Q44L77o66J77L12p15l06J368L74k146n09K790Q38l537j249
3083b652L952J554m246j998M583K384m720k845M400L232m021l313L422L258k830
3098A60l026K194K793j573k403J014J811l93j018J33J69O3M91J68j210k59J798
3115I12P47k229j204K540J784k702k427K749L167k661l667K278L981j978m250
3130b960J559M324j176m202Q14L873p95l493N90L020n06k458N54J769q54j205
3146a146J126Q45j580m31J866K43k089L2K381l52k558L93K839l12k891L49K771
$$ plain form
3163 1486 1062 -1649 -1011 1661 1062 -1645 -895 1876 990 -1694 -646 2019 831 -1895 -486 2253
3179 2253 980 -1910 -607 2238 970 -1850 -839 2066 1210 -1518 -989 1331 914 -1021 -711 805
3195 805 323 -702 -171 216 -458 -447 721 -56 -1598 -482 1626 329 -2311 -947 2179 704 -2837
3212 -2837 -1416 2613 1610 -2666 -2042 2367 2096 -2027 -2304 1694 2367 -1207 -2049 992 2101 -332
3228 -332 -1490 129 1230 334 -411 -92 266 325 583 -22 -746 14 1385 435 -1569 -568 1964 1250
3246 1250 -1907 -1484 1860 1858 -1747 -2128 1562 2244 -1421 -2614 835 2362 -704 -2501 121 1944
3262 1944 -293 -1997 -147 1216 -108 -1301 -323 506 -6 -246 1 -268 -455 372 580 -638 -742
3279 -742 934 1190 -828 -1269 1052 1667 -666 -1381 1022 1828 -550 -1469 860 1813 -352 -1433 509
$$ packed form
3163A486m24k711O38K672n99k707P50K771q86k684J048K665j188k726J409K739
3179B253j273k890J303K845j268k820J011K905q56k728N29K320m17j935L10J516
3195H05m82j025N31L87o74J1J168p77j542J116K108j297k640J364L126j475l541
3212b837J421M029j003m276O24M409k71m123k77L998O73l574q42L041J109k433
3228c32j158J619J101q96p45L19L58N9K58o05p24P60J371r50k004J001K532p14
3246A250l157M23L344kl605l81L690O82l665j193L449J527l066j797K622J823
3262A944k237j704J850J363j324j193R78Q29n12k40K47k69j87Q27K08j218j04
3279g42J676K56k018m41K321O15k333p15K403Q06k378r19K329R53k165j081J942
$$ plain form
3296 509 1483 -287 -1016 674 1188 -580 -1144 450 1014 -544 -799 559 654 -869 -874 630 698 -793
3314 -793 -891 401 482 -606 -554 400 109 -646 -263 265 -243 -450 411 365 -932 -747 936 767 -1246 -1012
3334 -1012 1505 1262 -1524 -1569 1607 1919 -1217 -1811 1298 2163 -792 -1892 717 2242 47 -1667
3350 -1667 -155 1499 729 -609 -568 559 855 16 -783 -439 720 1198 -316 -1628 -386 1569 701
3367 701 -1727 -1311 1518 1373 -1747 -2174 1192 2378 -1051 -2908 129 2463 -117 -2510 -259 2247
3383 2247 442 -2176 -1034 1504 1096 -811 -862 375 548 33 -355 -188 312 887 233 -1009 -563 1353
3401 1353 1268 -826 -1195 904 1537 -545 -1445 870 2030 -190 -1845 -83 1816 508 -1357 -326
3417 -326 1388 393 -1382 -697 1153 665 -916 -736 493 175 -673 -297 620 -98 -968 -282 319 -304
$$ packed form
3296E09R74j770p29J690N14j768n64J594N64j558k55J358R5j523nJ504O8j491
3314g93r8J292Q1j088N2R54k91p55L83N28n08k07Q61m6j297J85J683j69k013K34
3334a012K517k43k786m5L176L12l136n94L109Q65k955j100K609J525k195j714
3350a667J512J654p70j338M1J127K96q39p99L44J159M78j514j312J242J955q68
3367G01k428M16K829j45l120m27L366J186l429j857L037K334k580k393K251K506
3383B247j805k618J142K538m08j907n1J237J73n15l88J67N00N75o54j242M46J916
3401A353q5k094l69K099O33k082r00K315J160k220j655J762J899j308j865J031
3417c26J714r95j775O85J850m88j581J80J229l18q48L76R17p18q70O86O01o23
$$ plain form
3435 -304 -477 475 318 -908 -858 459 570 -527 -255 706 191 -924 -275 1041 525 -646 -49 767
3453 767 53 -826 417 1379 104 -1121 28 1309 236 -1017 214 1634 203 -1830 -528 1839
3469 1839 819 -1602 -704 1652 704 -1744 -977 1686 1147 -1407 -1215 775 741 -688 -485 466 19
3486 19 -470 -229 -190 -648 269 1094 -367 -1933 -226 1912 157 -2242 -383 2404 473 -2866 -1162
3503 -1162 2808 1723 -2560 -2002 2173 2199 -1692 -1992 1815 2434 -1083 -2215 838 2167 -74 -1221
3519 -1221 311 974 -73 -315 291 -7 -103 908 503 -1522 -1052 1899 1431 -2099 -1912 2125 1932 -2496
3537 -2496 -2477 2332 2585 -2396 -3051 1615 2548 -1647 -2503 1339 2042 -1400 -2161 950 1657 -837 -1215
3554 -1215 753 615 -900 -307 1118 140 -1218 161 1373 -239 -1482 738 1873 -561 -1891 710
$$ packed form
3435c04j73R52j57j226N0J317J11j097K72R61n15j115O49J316n16j171N97Q16
3453G67p14q79J243R62j275j225J149J281j073j253J231J420j431k033J302K367
3469A839j020k421Q98K356r48k448P67K663n39k554J92J990l4j429K03R51m47
3486A9m89K41L9m58R17Q25j461j566J707K138j755k399J859K787j931l339J704
3503a162L970j085m283N58M175K6l891l00L807O19l517j132L053J329k241j147
3519a221J532O63j047k42O06k98r6J011m05k025M70K951m68l530J87M037j93m428
3537b496J9M809K53m981o55M666R33m195q56L842P03l442p61L111P07k494l78
3554a215J968j38j515N93J425r78j358J379J212j612j243K220J135k434j330K601
$$ plain form
3570 710 2127 -562 -1895 925 2130 -827 -1953 1087 2097 -926 -1691 1365 1725 -1411 -1580 1631
3586 1631 1437 -1768 -1412 1641 1100 -1853 -1203 1778 1020 -1970 -1303 1423 918 -1514 -959 1133 506
3603 506 -1309 -698 892 401 -744 -350 470 -173 -562 469 514 -715 -672 1052 814 -1079 -702 1636
3621 1636 1206 -1532 -1318 1782 1779 -1494 -1692 1667 1985 -1325 -2009 1248 2194 -691 -2016 444 1871
3638 1871 -113 -1505 -68 1269 288 -1012 -561 403 614 -50 -584 -519 86 566 -158 -986 -389 958
3656 958 471 -1383 -1315 981 1483 -981 -2051 508 2009 -449 -2262 153 2295 246 -2318 -663
3672 -663 2139 1003 -1599 -991 1360 1127 -907 -845 899 1178 -32 -592 135 620 459 7 -182 -135
3690 -135 348 570 -183 -582 216 1019 29 -1199 -463 1179 640 -1231 -764 973 662 -1364 -1094 1050
$$ packed form
3570G10J417k689j333K820J205k957j126L040J010l023p65L056L60l136j69L211
3586A631j94l205L56L053n41k953O50K981p58k990O67K726n05k432N55K092o27
3603E06j815O11J590m91j145L94Q20o43l89J031M5j229M3J724k38j893L77K338
3621A636m30k738K14L100ll273j98L359L18l310o84L257R46k885j325K460J427
3638A871j984j392J437J337r81j300M51R64K11o64n34O5O05M80p24q28N97J347
3656I58m87j854O8K296N02k464j070K559J501k458j813K415K142k049k564J655
3672f63K802j136k602O08K351k33k034O2J744K79j210n60P27M85j61m52j89M7
3690a35M83K22p53l99P98Q03r90j228P36J642n39j871M67J737l11k026K70K144
$$ plain form
3708 1050 969 -1132 -1119 737 627 -991 -723 879 446 -1083 -518 905 291 -925 -138 933 32 -1032
3726 -1032 -90 1011 256 -801 -91 707 168 -464 -9 656 275 -143 -95 282 89 153 351 77 -353 72
3746 72 742 129 -752 57 1190 180 -1444 -555 1665 861 -1661 -1091 1404 943 -1617 -1337 1348 1269
3764 1269 -1390 -1620 703 1190 -617 -1267 15 656 -110 -647 -338 204 460 145 -547 -642 489 997
3782 997 -279 -1043 238 1392 11 -1441 -200 1737 801 -1394 -866 1384 1378 -1010 -1222 1065 1641
3799 1641 -547 -1517 590 1746 -51 -1439 -44 1209 290 -868 -196 532 290 -318 -394 -209 151
3816 151 489 -132 -903 -321 833 372 -1221 -787 1132 674 -1392 -1086 1047 1072 -1102 -1289 664 1077
3834 1077 -674 -1105 358 1003 -360 -906 270 710 -15 -499 165 571 41 -116 327 294 -74 25 406
$$ packed form
3708A050q1k101J3J856j10j618K68J602m33j529N65J423o14j216P87J071r01j064
3726a032R42J101p55j057P10P98n39o32M55O65l81m18M8L77j93O4J98k74m30M25
3746G2O70o13q81Q09J133j010j624Q89K220q04k522N70K495m61k560K80K685p9
3764A269k659k30K323M87j807o50J282O41p66n37L09N42K56l15o92r5J131N08
3782I97j276p64J281J154j381j452J241J937r36k195N28K250ok388k12K287N76
3799A641k188r70K107J156j797j388J395J253r19j158O72P28k42o08p6J85L60
3816A51L38o21p71N82J154m61j593M34J919m58k066L06K133K5k174j87J953M13
3834A077j751m31J463O45j363n46J176M40p25m84O64M06n30j57M43l3l68R9L81
$$ plain form
3853 406 78 -290 146 594 46 -435 133 636 -70 -534 251 520 -256 -485 346 354 -616 -532 574 389 -870
3874 -870 -532 837 393 -1163 -764 943 604 -1186 -976 907 911 -982 -1187 532 997 -432 -1070 176
3892 176 873 5 -654 -187 387 383 -135 -314 -162 491 765 -50 -763 99 1330 474 -1180 -450 1545 1048
3912 1048 -1275 -1086 1428 1577 -1060 -1555 1004 1960 -561 -1754 301 1647 -14 -1527 -261 1095
3928 1095 266 -1021 -641 463 343 -326 -543 -341 181 343 -83 -828 -478 718 527 -949 -1005 808
3946 808 1220 -858 -1447 782 1678 -521 -1737 394 1831 -118 -1589 211 1658 142 -1312 -10
3962 -10 1281 308 -832 -83 758 264 -369 81 436 -67 -135 386 182 -338 -14 609 36 -721 -80 781
3982 781 110 -955 -157 851 44 -1095 -275 949 -29 -1194 -246 922 -55 -1195 -68 1015 -260
$$ packed form
3853D06l28l68M36M48n48m81N68N03p06m64P85K69p76k29Q31Qr70Q4J106j85j259
3874h70L38J369m44j556L99J707l39j790K10J883Mj893k05J719M65j429o38J246
3892A76O97q68o59M67N74mn18j79J52O53K74q15p13Q62J231q56j654P30J995m97
3912A048k323J89K514J49k637m95K559R56k521j193K055J346j661j513J266J356
3928A095q29j287L80J104j20o69k17K02N22J62m26p45L50J196j91j476n6J813
3946H08M12k078n89K229Q96k199j216K131J437j949j471J800J447j516j454J302
3962a0J291r73j140P49Q41m94o33M50L55n03o8N21k04n20L24O23n73p57O41Q61
3982G81o71j065P98J008q07j139Q20J224r78j165R48J168r77j140J127J083j275
$$ plain form
3999 -260 -1228 96 1061 -289 -1140 295 1133 -399 -1214 379 1234 -213 -1094 298 1191 -109 -892
4016 -892 250 964 141 -598 36 594 165 -161 138 167 -38 194 398 -173 -401 437 783 -386 -1090 373
4036 373 1294 -331 -1616 89 1726 -48 -1976 -316 1951 460 -2103 -807 1729 838 -1669 -1045
4052 -1045 1203 933 -1076 -1062 595 887 -212 -625 -197 246 289 98 -389 -395 515 758 -397 -1069 341
4071 341 1535 178 -1532 -341 1800 799 -1497 -825 1741 1348 -1417 -1345 1331 1727 -851 -1507 695
4088 695 1535 -541 -1322 302 1128 -163 -973 -63 437 -165 -272 73 -183 -460 132 265 -493 -675 586
4107 586 603 -935 -1105 633 1085 -683 -1209 519 1088 -619 -1204 444 1255 -356 -1125 238 995 -252
4125 -252 -858 439 919 -330 -807 563 903 -501 -637 842 806 -717 -725 983 920 -688 -676 808 724
$$ packed form
3999b60r68J324R65j350q51J435Q38j532q15J593Q55j447q81J392Q93j300p83
4016h92J142P14q23p39O34N58m29l26K99K9k05K32K04n71k28Q38L46j169p04J463
4036C73R21j625j285J705J637j774j928J660K267j491k563J296K536q91k507O24
4052a045K248k70k009J4J657K92j099m13M28M43M3j91m87oR10K43j155o72J410
4071C41J194j357j710J191K141j001k296O72K566l93k765P2K676L96k578o56K202
4088F95Q40k076p81J624Q26j291q10R10N00o02j07L45k56k77N92J33p58j82J261
4107E86J7j538j70J738M52j768n26J728N69j707n85J648Q11j611p69J363P57j247
4125b52o06J297M80j249m77J370L40j404j36J479l6j523qJ708o3j608J2J484q4
$$ plain form
4144 724 -769 -591 880 641 -695 -556 495 290 -507 -146 412 -241 -708 164 484 -491 -664 467
4162 467 561 -975 -915 890 1029 -999 -1393 775 1324 -779 -1571 701 1626 -526 -1691 320 1709
4179 1709 27 -1418 -26 1393 275 -1015 -90 962 400 -429 -192 206 146 381 318 -432 -400 669
4197 669 853 -788 -951 952 1328 -976 -1719 738 1875 -461 -2017 269 1902 -224 -2001 -160
4213 -160 1811 292 -1715 -738 1109 647 -946 -689 431 496 -422 -483 -63 288 260 79 -540 -497 492
4232 492 751 -367 -949 365 1203 -265 -1316 262 1683 268 -1519 -224 1539 563 -1189 -325
4248 -325 1320 590 -968 -511 982 601 -507 -306 409 26 -348 187 408 -111 -273 189 87 -629 -254
4267 -254 614 282 -738 -572 373 161 -557 -226 463 142 -596 -314 277 139 -277 29 262 -333 -473 308
$$ packed form
4144G24j493J78J471k39j336J39J051k05p97L61N58o53m67Q72L20r75j73J131
4162D67R4j536O0J805J39k028l94K168N49k103p92K272R25k152j165K011J389
4179A709j682j445J392J419j118j290R25J052n62q29K37L98o0K35o3p50L2J069
4197F69J84j641j63J903L76k304p43K457J137k336j556K286J633k126j777J841
4213a60J971j519k007R77J847m62j593K57J120O5r18o1M20L51k8j81o19M3R89
4232D92K59j118n82J314Q38j468j051J578J421j415j787J295J763r76j752Q64
4248c25J645p30j558M57J493l81j108K01P15l83l74N35K21n19j62M62j02p16L75
4267b54Q68l32j020J66R45k12p18L31O89l21p38K82N91j38m16L06K33n95j40P81
$$ plain form
4287 308 615 -142 -473 309 583 -379 -683 619 1143 -184 -1081 61 1100 137 -667 20 918 241 -723
4306 -723 -264 616 682 -81 -397 -176 282 264 -128 -371 66 635 26 -959 -472 967 677 -895 -1090 508
4326 508 806 -624 -1145 311 1134 -252 -1445 -328 1101 485 -955 -753 599 551 -603 -725 349
4343 349 905 11 -873 -333 640 683 -167 -555 168 808 100 -775 -157 1050 795 -716 -809 588 1078 -141
4363 -141 -876 221 1006 109 -1025 -339 1021 726 -672 -850 364 735 -319 -705 49 702 -12 -733
4381 -733 -372 433 381 -398 -525 -3 275 -100 -416 -158 180 216 -307 -481 38 514 190 -433 -259 290 280
4402 280 -328 -256 369 521 -185 -366 283 531 72 -184 239 342 -202 -215 326 368 -133 -252 359 297 -346
4423 -346 -336 519 605 -441 -643 410 543 -404 -559 325 473 -361 -687 37 352 -114 -369 -114 -84 -72 50
$$ packed form
4287C08L07p57l31P82K74r62l04J302N24j327q97J142J039r63q04O87Q98o77r64
4306g23M59Q80O6p63l16K21M58j8l92k43M37N69o09r85M87J439k90j572j95J598
4326E08K98j430n21J456Q23j386j193J117J429o16j440K02J352m8j154j22J074
4343C49N56q94q84N40R73M3q50l88P23O40p08q75O18J207k55j511r3J397M90j219
4363a41p35J097P85q97j134O86J360k95j398j78J214L71j054l86P54O53p14p21
4381g33L61Q05n2p79j27N22K78l75l16K58L38L6n23j74N19M76l24o23J74N49j0
4402B80o08P2O25J52p06j81O49K48m59k56M23J03n44j3N41M2n01j19O11o2o43
4423c46J0Q55Q6j046k02J053J33r47j55Q84J48q34l26P24L15m66k55K55L0J2J22
$$ plain form
4444 50 -122 -409 -67 516 -86 -952 -250 972 431 -1132 -702 979 800 -993 -938 977 1259 -722 -1227
4463 -1227 577 1408 -137 -1126 227 1191 188 -864 -200 849 415 -376 -245 260 253 211 12 -400 -197
4482 -197 639 397 -846 -604 909 783 -1011 -1240 806 1209 -892 -1445 650 1379 -678 -1688 292
4499 292 1335 -312 -1393 -177 935 -8 -906 -103 665 56 -512 -130 212 -9 -41 133 -8 -237 213
4518 213 558 -134 -501 334 821 -125 -787 295 1131 66 -977 139 1215 45 -1049 149 1174
4535 1174 16 -1151 59 1062 -69 -993 158 894 -209 -899 167 705 -370 -787 219 503
4551 503 -467 -668 374 472 -427 -587 211 283 -392 -393 340 270 -326 -315 293 60 -291 -26 403 -94 -429 159
4573 159 657 -127 -645 385 984 -244 -986 392 1276 -18 -1212 143 1453 99 -1323 -118 1441
$$ packed form
4444E0j72k87L42N83o02q66P02J222n41j563M30J681j79j793N5J915K82j981n05
4463a227J804Q31j545r89J353R64j003j052O64J049m34p91J31N05pm2j99m12K03
4482a97Q36k42j243K42J513j26j794k29K046M03k101n53K095P29k057j010J980
4499B92J043j647j081J216J112r43q98Q03P68o09n68L82L42k21l2J74j41k29M50
4518B13L45o92l67Q35M87r46o62J082Q36j065j043J116J076j170j094J198J025
4535A174j158j167J210J003j131r24J151P36j103o90J066N38j075m17J006K84
4551E03r70k01J042R8q99j60P98P2o75jP33p0n96J1O08k33l51K65M29m97l35N88
4573A59M98p84n18J030N99j228p42J378Q84j294j194J355J310j354j422J205J559
$$ plain form
4590 1441 363 -1205 -366 1111 523 -825 -496 564 487 -399 -441 31 172 63 -203 -315 -233 312 391
4609 391 -531 -810 237 852 -385 -1253 43 1358 142 -1476 -398 1374 514 -1420 -763 1291 899
4626 899 -1096 -1043 885 1088 -590 -976 443 895 -77 -584 122 525 197 -109 -16 88 256 422 24
4645 24 -358 -28 667 208 -720 -327 878 482 -821 -708 722 744 -769 -913 481 820 -567 -969 366
4664 366 740 -425 -880 213 579 -409 -641 227 434 -458 -425 325 263 -484 -258 459 158 -445 -160 538
4684 538 225 -416 -101 504 155 -305 -3 445 64 -132 152 258 -27 -46 312 260 -287 -164 512 348 -454
4705 -454 -392 546 555 -615 -714 627 784 -651 -953 505 914 -499 -1085 234 874 -309 -1012 -25 738
4724 738 -28 -708 -184 357 181 -300 -335 -137 223 284 -225 -546 42 700 152 -692 -330 891 613 -729
$$ packed form
4590A441j078j568Q39J477n88j348L29J060p7q86m2M72J41j09k66j12Q2N45P9
4609C91r22k79J047O15j237q68J296J315j216j618J078J772q60j934O57K054l92
4626H99j995N3J928K03j678l86J419M52r72n07P06M03l28l06R3J04J68J66l98
4645B4l82L30O95m59r28L93J205l96j303J13J430K2j513j44J394L39j387m02J335
4664C66L74j165m55J093L66r88k32Q68K07q92L3P50o2p47K26P17l01o03K85O98
4684E38l13o41L15O05l49m60L02M48l81j96K84J06k85j9L58n2n47J23O76j64q02
4705d54O2R38Rj170r9J341J57j435l02J458M09j413n86J319O40j183p03R87P63
4724G38p66o80N24N41j76m81l5J98L60O1n09l21N88O58n48q44L62J221k78j342
$$ plain form
4744 -729 -680 750 1000 -510 -971 496 1345 -61 -1163 40 1324 397 -1013 -460 1006 679 -709
4761 -709 -573 575 653 -363 -642 9 374 208 -223 -428 -66 508 162 -695 -584 534 693 -645 -978
4780 -978 335 954 -351 -1144 31 997 -6 -1075 -248 881 322 -753 -455 492 504 -274 -384 242
4798 242 430 -18 -288 131 208 64 7 -6 -17 85 310 109 -336 -42 536 226 -503 -167 536 256 -407
4819 -407 -216 466 81 -453 -60 392 -19 -335 80 308 -230 -506 209 374 -423 -600 262 451 -429 -665
4839 -665 146 572 -197 -582 0 570 30 -519 -218 363 263 -259 -279 87 330 118 -142 -241 155 357 106
4860 106 -359 -95 639 519 -541 -650 639 945 -427 -993 410 1118 -254 -1086 155 1219 136
4877 136 -1123 -335 791 403 -629 -466 394 402 -364 -561 -131 493 336 -373 -646 -46 522 102 -697 -309
$$ packed form
4744g29M9J430K50j510m61J467Q49j406j102J203J284r27j410N53J466l27j388
4761g09J36J148P8j016k79O51L65j66m31k05L62N74l46q57J11J118J59j338l33
4780i78J313O19j305p93J175R66j003j069Q27J129n59j075K98R47J2p78j10O26
4798B42J88m48k70M19P7j44n7j3j1J02K25k01m45K94N78l10p29L36P03k80o63
4819d07J91O82l85n34L93M52m11l16M15K28n38k76P15J65p97j77Q62J89q80k36
4839f65Q11M26p69l85N82N70n40n49L01N81j00n22k0L66K43k12k60r9L96K02k51
4860A06m65K64P34j20j060j09J289L06j372n66J403P08j372q32J241J064j083
4877A36j259P88J126l88j032J63Q60Qp66j97M30O24j57p09k73O00N68m20p99L88
$$ plain form
4897 -309 683 423 -822 -838 623 1036 -310 -1069 23 1023 15 -973 -56 1213 412 -1064 -581 897
4915 897 828 -353 -555 376 543 -224 -399 234 495 238 -233 -363 -98 449 447 -269 -464 159 422 -342 -630
4936 -630 299 849 -117 -1078 -352 676 268 -581 -270 480 124 -745 -474 493 514 -353 -456 47 26 -182
4956 -182 40 360 116 -363 -274 155 17 -73 307 480 -220 -549 98 580 178 -151 116 300 -140 -303 188
4977 188 507 192 -134 0 -59 -113 269 506 -65 -324 22 293 -166 -404 283 847 -226 -1040 -233 845
4997 845 352 -757 -443 653 300 -868 -653 668 790 -524 -948 62 572 8 -470 -85 393 58
5015 58 -440 -344 139 589 304 -425 -545 209 679 44 -562 44 898 230 -928 -365 1065 945 -692 -875
5035 -875 630 974 -350 -830 453 1119 -176 -1080 -119 942 317 -681 -301 471 207 -431 -401 126 277
$$ packed form
4897c09R92k60j245j6J461M13j346p59J092J000j008r88R17J269q01j476M83J478
4915H97o9j181k02R31J67p67j75O33K61k57m71j30K65N47kp16j95O23K63p64k88
4936f30R29N50r66r61P26J028m08q49L11P50l56q69K71R67K1q67j03N03k1k08
4956a82K22L20k44m79Q9M29j38r0L80J73p00l29O47M82m02l29K67J84m40j63M91
4977A88L19l15l26J34n9n4L82K37n71k59L46K71m59k38O87N64j073q14Q07J078
4997H45m93j109L14J096l53j168K15J321J22j314m24J010N10n64m78L85M78l35
5015E8m98R6M83M50k85p29j20P54M70o35o06O06Q54o68j158N63J430j20j637j83
5035h75J505L44j324m80J283O66j295r04R61J061o25r98L80P72k64o38L0N27J51
$$ plain form
5054 277 -7 -341 -408 -100 339 155 -500 -365 327 362 -514 -607 406 720 -441 -1012 188 914 -71 -836
5074 -836 69 906 65 -810 -37 882 267 -591 -201 605 298 -417 -98 502 114 -256 -19 322 -19 -165
5094 -165 219 248 -251 -247 369 193 -375 -262 475 174 -493 -324 413 202 -484 -278 317 -19 -537 -90 419
5115 419 -36 -601 -35 539 -142 -677 129 621 -186 -789 60 807 -107 -871 -19 884 67 -787 -44 843
5135 843 261 -694 -255 742 383 -399 -181 299 261 -16 -15 98 -76 223 294 -155 -418 245 689 -202 -922
5156 -922 155 1062 -87 -1144 -89 1094 39 -1248 -419 1134 465 -1097 -683 774 600 -722
5172 -722 -723 365 573 -310 -630 -13 332 44 -275 -220 -62 211 226 -246 -378 215 619 -34 -677 -22 902
5193 902 296 -829 -299 960 580 -680 -484 810 771 -577 -631 543 806 -321 -618 225 576 -104
$$ packed form
5054B77k84l34o7L08M39j84o55J35O92L5q76r3J013L14j161n71J200P26r85p65
5074h36R05Q37q41q75P73R19o15q58L90Q06l07p15L19O00l88l70K37L41l41j46
5094a65L84K9m99MO16j76n68J13P37l01o67J69P37k11o86K06N95l36n18M47N09
5115D19m55n65N66N74o81n35Q06M92q07o03Q49P47r14p64Q52R03q17q54P43Q87
5135H43n82r55M39R97l59p82K18M80l8k77JJ13j74K99P1m49k63O63M44q91p20
5156i22J077R07j149j057J055J183j055j287Q29J553o69j562M14J457j74j322
5172g22jJ088K08q83l20O17L45k88l19N5J58K73J5m72j32N93M04o53o43O55R24
5193I02o06j125N30J259l80j260J96J294l9j348n4J174K63j127k97Q43L51o80
$$ plain form
5211 -104 -395 97 279 -94 -237 -29 25 -80 59 -20 -192 -211 78 160 -338 -344 221 166 -248 -373 199 243 -301
5234 -301 -342 115 275 -202 -304 186 277 -148 -261 191 225 -252 -150 371 345 -228 -245 422 365 -225 -247 437
5256 437 418 -288 -311 341 468 -96 -293 182 403 41 -215 -85 236 101 -116 -201 -83 206 141 -265 -314 23
5278 23 379 -77 -589 -127 499 108 -599 -457 547 358 -576 -687 278 633 -321 -734 137 763 42 -747
5298 -747 -181 692 262 -459 -366 396 502 -82 -389 1 511 317 -253 -363 307 675 70 -517 -146 690
5318 690 440 -601 -476 544 667 -389 -731 284 726 -115 -772 -65 626 195 -632 -364 410 290 -349
5337 -349 -511 50 326 -64 -438 -218 184 233 -126 -382 -129 327 106 -433 -244 261 303 -321 -401 186 454
5358 454 8 -387 148 519 115 -247 2 358 84 -150 39 262 62 -38 105 208 -35 -68 177 173 -144
$$ packed form
5211a04k91M92J82l73j43K08N4j05J39p9j72j9K89Q2m98oN65n5m14j25N72M4n44
5234c01m1M57J60m77j02M90R1m25j13M52L4m77J02N21k6n73j7O67n7n90k2O84
5256D37j9p06k3O52J27n64j97M75K21l62k56J30L21j35k17q5J18K89o5m06m9L37
5278B3L56m56n12M62O26l91p07J42J004j89r34j11R65L55r54m13Q71O26p21p89
5298g47N66Q73m30p21R3P62J06n84l07L90N10j94n70j10O70L68o05n87L71Q36
5318F90k50j041J25J020J23j056l42J015M42q41o57P07O91m31q27K68P74j20o39
5337c49j62N61K76l90l74K20M02M9l59k56K53M56k21n39J89N05M2o24q0N87K68
5358D54m46l95N35L71m04l62K49L56k74k34J89K23k00j00J43J03k43l3K45ml17
$$ plain form
5379 -144 -107 252 178 -222 -267 258 204 -177 -338 17 148 -113 -155 -75 33 -23 -17 -124 -198 -24 177 -48 -371
5402 -371 -115 397 125 -482 -303 498 466 -413 -514 347 597 -202 -665 259 705 -5 -575 -18 743 277
5422 277 -464 -310 400 429 -148 -288 155 433 175 -218 -287 223 468 -44 -533 -168 568 367 -542 -568 471
5443 471 596 -400 -915 175 807 -157 -965 -111 853 188 -892 -379 620 430 -555 -556 376 372 -267 -448 74
5464 74 332 130 -234 -161 90 351 214 -255 -292 317 528 -93 -511 190 714 3 -683 -49 818 259 -699
5485 -699 -221 721 402 -605 -424 524 471 -366 -385 376 322 -322 -201 156 78 -250 2 176 -153 -234 106
5506 106 144 -371 -327 281 347 -411 -436 177 313 -306 -433 262 319 -315 -322 157 240 -182 -82 287 29 -237 15
5529 15 388 -2 -343 85 553 -77 -591 88 819 121 -688 -72 807 248 -599 -194 648 332 -608 -414
$$ packed form
5379a44L7L59p4m00m5N25n4l81j61L55J31k61m2Q0J08n6Oj07p4J74K01k25l23
5402c71K56N12k72o07J79Q01l2q79j01Q61K50p99m63R24M46p10n70N57P61m66
5422B77p41J54P10K9n77j40M43K78k58l93o9N10K45n12m89L65P36k01r09k6J039
5443D71J25r96n15J090O32r64q08Q54R64o65j080N13R99j90r85jR32mo39j81N22
5464G4K58k02l64P3K51K61j37m69l7O09K11o21m18P01N24p11o86O34Q67n59r58
5485f99M78R42l19j007J81R48n3q37j9P61n4o44J21L57p8l28K52J74l29q1L40
5506A06L8n15M4O08O6p58k5O13J36o19j27O95N7o34pM79Q3m22J00L69k58k66K52
5529A5L73l90l41M28M68o30n14O79P31o98q09O16Q79n59q47M05Q42l16r40J94
$$ plain form
5549 -414 438 444 -220 -298 50 177 -44 -143 -124 62 228 129 -439 -398 222 511 -212 -697 43 656 -26 -857
5571 -857 -110 796 323 -927 -610 646 626 -512 -628 455 737 -298 -798 140 828 181 -565 -267 419
5590 419 374 -88 -138 160 382 125 -271 -255 210 578 11 -462 -151 474 310 -486 -242 528 441 -561 -730
5611 -730 306 691 -153 -717 -69 520 -40 -658 -136 536 205 -625 -472 300 264 -222 -181 187 99 -229 -176
5632 -176 112 174 75 63 -79 -249 23 359 213 -147 -93 311 47 -294 39 603 252 -399 -251 216 174 -179
5654 -179 13 375 24 -322 -119 323 88 -166 118 177 -268 -420 71 522 -18 -535 -59 319 -106 -549
5674 -549 43 641 11 -766 -289 409 217 -362 -143 292 29 -337 -227 134 262 95 -33 -286 -167 277
5694 277 397 -46 -314 226 487 -214 -546 281 932 134 -829 -207 788 312 -578 -223 753 449 -671 -618
$$ packed form
5549d14Q52Oo64p8L48J27k21r9J9J86J66r9n68M1O20K89p23m85P40O13o82q31
5571h57P47R06m73j250L17J256k0j138j16J083K82j035n00R38O88o47p46K98O86
5590D19m5m62n0K98K22k57l96J6M65L68n67m73L11O25j64p96K44P70q7j002j69
5611g30J036L85q44n64O48N89n60o18N22O72l31q30J53P72l6m86M1L68q8l28N3
5632a76K88O2r9j2j42j70K72L36j46l60N4M04k64l41L33N64l51o51J48M67m2l53
5654a79J92L62l51l46K03M42k35k54K84N9m45j52M91M51n40n17M76L78m25m43
5674e49N92N98o30p77M77O98j92n79K19M35k63l66J10L61J28j67j28k53J19M44
5694B77J20m43k68N40K61p01l32Q27O51p98r63O22R95m76q90L55R76l04j120N3
$$ plain form
5714 -618 467 806 -202 -619 11 408 -54 -353 -118 280 217 -142 -422 -232 335 435 -257 -619 -33 474
5734 474 -88 -761 -89 837 181 -871 -487 679 549 -544 -573 418 511 -337 -592 292 604 -68 -492 -79
5754 -79 395 139 -100 -68 143 143 39 -22 -44 129 317 43 -282 -102 348 196 -271 -219 288 250 -375 -308 232
5777 232 361 -261 -389 105 147 -188 -252 134 75 -210 -269 96 38 -152 -102 130 1 -221 -77 188 80 -159
5799 -159 -111 112 81 -119 -54 198 199 -83 -112 84 170 131 -34 -20 106 190 179 -74 -67 175 369 31 -255 90
5823 90 454 65 -480 -6 473 182 -550 -228 477 321 -363 -470 212 412 -176 -496 -30 344 93 -420
5843 -420 -350 196 257 -176 -517 -90 396 129 -419 -331 266 425 -225 -463 82 604 46 -560 -222 648 405
5864 405 -449 -476 394 533 -202 -534 170 677 15 -519 -89 546 334 -242 -198 252 393 55 -323 -83 260
$$ packed form
5714f18J085L39j008m17O30L97m62k99K35L98o3l59k80J90N67J00o92l62N86N07
5734D74n62o73O72R26o56j052L84J166j30j093k9R91R3q48k55Q84L12o72m24M13
5754g9M74k56k39L2K11%j04o1k2J73J88k74l25J80M50j52m67N2N07l8o25O7N40
5777B32J29o22j28M94M2l35o4L86n9k85n9L65n8j90N0K32j29k22J44K65j08k39
5799a59M8K23l1k00O5K52Jk82k9J96Q6l9j65J4J26Q4j1k53PK42J94l38k86L45
5823I0L64l89n45M74M79k91p32L22P05j56o84j07O82K00n88l20M66L74k51n13
5843d20P0N46O1m33l41M27M86k67n48Q8N97J59o50k38N45N22n58o06L38Q70k43
5864D05q54k7Q70J39p35l32P04N07o62n34M30O35k12n76M4M50J41l38l78K40L43
$$ plain form
5885 260 219 -250 -389 32 428 3 -488 -151 396 224 -488 -404 347 327 -324 -560 120 391 -140 -494 -87
5906 -87 245 -33 -355 -63 157 65 -174 -103 84 48 -77 77 13 -40 22 151 34 -87 88 234 22 -164
5928 -164 10 268 130 -52 61 258 -4 -74 116 190 -53 -63 154 104 -174 -87 309 144 -337 -235 319 240
5950 240 -363 -365 271 399 -377 -522 183 420 -254 -532 28 460 -28 -453 -164 305 174 -169 -176 21 197
5971 197 65 -103 -220 84 322 60 -340 -49 519 301 -494 -303 552 537 -368 -503 404 670 -188 -647
5991 -647 171 757 123 -611 -161 594 301 -427 -315 356 350 -221 -396 84 251 25 -251 -237 128 175 -57
6012 -57 -349 -252 237 277 -358 -488 201 500 -220 -667 -31 636 -5 -683 -170 582 292 -600 -308 511 372
6033 372 -368 -267 353 377 -99 -207 198 280 58 -52 60 35 115 75 7 -222 40 313 61 -277 -61 276
$$ packed form
5885B60m1m69j39M21L96m25m91L37N47j72p12Q4P51k0o51k36O80K71n31l54M07
5906h7L32k78l22K92K20r2k39P1J87l6j25J54o4n3O2J29j17j21J75J46k12j86
5928a64J74K58j38j82J13J97k62p0J90P4k43j0K17n0k78Q7L96j65m81J02N54p9
5950B40o03kO36J28p76j45P05K37o74k78N60M32m88m25K89M69j31l43pJ97J76
5971A97j32j68j17L04K38k62m00K91N68k18p95J91Q55j5r05j35R07K66q58m59
5991f47Q18N86o34p34M50P55k93p28J12O71on71j75M80J67k26k76J4L65M7k32
6012e7k92R7M89M0o35j30O89K99p20m47O36O67o41o78N13P52k90q92K92Q19j39
6033C72p40J01O20K4m76j08M05Q2k22j10J12k5Q0m0o8k29K62K73k52l38K16L37
$$ plain form
6055 276 132 -261 -173 225 223 -266 -231 143 202 -211 -254 109 143 -222 -158 200 -26 -159 -84 218 60 -343 -76
6078 -76 371 37 -428 -157 421 91 -508 -99 400 260 -334 -192 301 322 -159 -206 203 281 1 -87 -6 83
6100 83 134 81 -112 -136 175 319 -99 -410 62 440 67 -586 -119 597 267 -656 -448 606 457 -598 -582
6121 -582 376 601 -270 -646 108 605 -24 -615 -128 375 167 -281 -295 79 229 5 -260 -166 161 287 -64
6142 -64 -393 -62 517 290 -474 -327 541 539 -394 -525 360 729 -240 -615 176 707 19 -544 -51 587 92
6163 92 -460 -204 349 256 -217 -168 104 127 -26 -177 -143 -18 109 52 -225 -120 133 152 -233 -332 67 265 -209
6186 -209 -356 -7 383 -43 -455 -117 360 131 -297 -117 268 95 -228 -83 174 135 -161 30 195 36
6206 36 -30 89 257 -19 -175 173 259 -55 -110 124 311 -69 -268 66 280 30 -196 -44 179 93 -74 -99
$$ packed form
6055B76j44l93Q8L98km89L5L74N9m13m3L63L4l65O4L58k26j33P5L02j58m03K67
6078g6M47l34m65K71N78l30n99M09M99j40n94J42M93K1m81m7M09P8k80q8Q1Q9
6100H3N1n3j93k4L11J44m18l11M72L78l73o53M67P16l30r23K08J054j49j055J6
6121e82R58K25q71l76P54M97o29n91M87N03k08m48j4L74J50k24k65R4L27J26l51
6142f4l29L31N79k27p64J47Q68kr33j31Q85L69r69l75P91N31o88n63M93O38m95
6163I2n52K56N53r3m73M9K72K3j53j51L4J25J27n7k77J05K53J9l85r9L99J98m74
6186b09j47L49L90m26m12L38M77k29m28J80L85j73l23J45K57l9k96J91J65j59
6206C6o6J19J68k76j56L48Q6l14n5K34J87l80j99L34K14k50k26J52K23q6j67k5
$$ plain form
6228 -99 -37 68 27 -40 -182 -88 189 55 -251 -223 227 210 -223 -370 146 436 -154 -520 -23 533 121 -519
6250 -519 -261 464 265 -398 -345 343 476 -197 -459 73 464 89 -303 -153 282 307 -120 -412 67 449 243
6271 243 -345 -350 292 481 -189 -471 53 570 19 -614 -264 555 322 -444 -475 332 408 -295 -526 75 462
6292 462 -24 -478 -196 286 206 -280 -300 -32 347 13 -376 -161 222 229 -144 -325 105 375 36 -403 -27
6313 -27 369 114 -242 -195 333 282 -120 -240 174 275 24 -188 67 248 81 -143 -51 134 103 0 -87 -8
6335 -8 -6 73 -62 -49 -29 41 42 -135 -44 32 21 -65 -138 -67 18 -65 -72 -53 12 -29 19 -32 -134 -48 48 124 -112 -193 40 191
6365 191 -3 -182 55 346 -33 -234 -78 324 249 -234 -150 201 309 -151 -263 116 309 74 -264 -85 251
6386 251 229 -78 -186 25 211 17 -358 -100 299 317 -251 -402 66 405 -51 -494 -131 437 104 -553 -305
$$ packed form
6228i9O2J05m1o7j42R4K77j34l06K8M50j7m33j47N16K90n90l66M97N56m12o40
6250e19K58P25j99o63N3O88J33o73k62N32L91l75l92J50M35K5m27k92M79L82k06
6271B43n88nO42J89o70k82N24N17n51o33L50Q19k33p66l1Q07P6p03k31O01L87
6292D62m86m54K82M82q0m86k0K68L79l34l89K15L83Pl73j81M30K70l39m39L76
6313b7L96k55l56M7N28n1m02j20M14J01k51k12K55J81j67k24R2J85l1j03q7P9
6335hKP9j35J3K0P0Jj77R1P6j1q6p3P1Q5q3pJ9O5m1M8n1j02Q6R6P6k36q1K33J51
6365A91j94j79K37K91l79k01J56M02p5m83Q4L51J08m60j12L79J93k35l38J79L36
6386B51k2l07j08K11J86j94l75K58L99J8n68j51M68L39m56m43L63N68l33o57K48
$$ plain form
6407 -305 447 346 -309 -494 157 419 -91 -503 20 396 139 -369 -297 207 329 -63 -265 -131 271 190 -122
6428 -122 -207 214 460 -14 -426 -64 600 256 -361 -211 474 375 -365 -451 349 531 -151 -495 11 397 63
6449 63 -291 -27 216 3 -185 -144 82 117 -33 -153 -140 0 135 50 -205 -172 129 73 -280 -234 209 288 -239
6472 -239 -316 70 175 -58 -193 95 224 1 -164 115 205 18 -63 127 57 -188 -29 312 179 -145 -118 222
6494 222 121 -161 -127 377 209 -177 -273 171 297 -35 -197 74 120 -77 -172 -22 101 73 -47 -129 -93 5 149
6517 149 -63 -245 -72 222 -25 -422 -172 365 231 -445 -474 237 359 -178 -450 159 472 -91 -499 39
6537 39 550 196 -390 -124 301 206 -162 -143 239 252 -49 -285 11 250 263 -14 -239 -46 339 131 -241 -172
6559 -172 307 373 -306 -469 125 486 -96 -581 -182 477 100 -581 -294 419 223 -407 -424 213 320 -235 -298
$$ packed form
6407c05P52j01o55j85O51K62n10m12N23L76k57n08P2N04J22l92k02J34M02q1l12
6428a22q5M21K46m74m12L62O64l44o17J50O85r9p40q6Q00J82o82l44N06L86l34
6449F3l54K64K43k13j88M1K26L5j50j20J3J40J35q5k55L3L01n6l53M6M43P9n27
6472b39p7L86J05k33j35K88J29k23j65K79R0j87q1J90p0k45J59L41j33l24K7L40
6494B22j01k82L4N04j68l86r6M44J26l32j62K71M6j97r5J50J23k8j20q2L6R8J44
6517A49k12j82J73K94k47l97K50N37j34o76k9P11J22n37k72O09L13n63m08N38
6537C9N11l54n86K66M25r5l68J9L82J3l01k36K96K39J3k77k25J93L85k08l72O9
6559a72M79O6o79j63N94L61n82m85L99O59l77o81K87P13j96o30j7O37J07n55o3
$$ plain form
6580 -298 34 212 -22 -298 -70 77 54 -4 -102 -150 70 185 -3 -209 3 334 45 -356 -49 446 146
6601 146 -297 -151 275 330 -179 -136 225 204 -126 -152 173 137 -46 -43 115 122 -116 -77 153 30 -177 -5 192
6624 192 52 -301 -90 259 -27 -294 -172 136 11 -248 -178 82 132 -208 -119 92 76 -50 -57 -96 -88 43 166
6647 166 -17 -145 39 286 -8 -326 -25 407 71 -384 -131 432 293 -387 -348 436 400 -240 -375 189 435
6668 435 -52 -363 25 384 133 -252 -205 223 256 -87 -293 -122 171 151 -145 -275 -27 311 -62 -488 -197
6689 -197 385 160 -469 -405 263 424 -304 -475 178 482 -106 -464 -70 504 68 -365 -134 301 193 -156
6709 -156 -102 126 256 24 -152 -51 140 207 3 -155 55 265 163 -189 -80 210 208 -117 -280 74 382
6730 382 -35 -312 -46 285 15 -288 -164 282 118 -301 -120 9 133 -148 -205 2 -16 -176 -27 48 -11
$$ packed form
6580b98L32J78k34k76K28J47k3n8r8m8K20J15j88k06K12L31k89m01L07M95l00
6601A46m43J46M26N5n09M3L61k1l30k6L25l6j83LJ58Pk38L9K30j23k07J72J97
6624A92j40l53K11L49k86k67J22L08j25k59P0K60N0l40Q9K11j6j26pl9QJ31J23
6647A66j83j28J84K47k94l18L01M32l36m55K53N63j39o80L9P84l6o40j35N64K46
6668D35m87l11L88L59k51l85M7M28L3l43k06J71K93k0k96j30K48L38l73m26K91
6689a97N82k25o29O4O68J61p28j71O53L04n88l58L94N74m36m33K31M35j08l49
6709a56N4K28J30k32j76J01J91O7k04j58K10K10j02l52J09K90kl25j63L54L08
6730C82m17k77K66L31k70l03J24M46j64m19J81J29J24k81n7K07j8j60J49P5n9
$$ plain form
6751 -11 -33 73 12 -105 -81 46 73 -82 -113 80 62 -54 -71 120 126 3 -52 81 49 66 8 26 -85 31 121
6776 121 67 -163 -80 207 194 -110 -157 160 190 -160 -270 112 325 -53 -349 -41 284 90 -346 -203 182 199
6798 199 -149 -239 14 232 41 -233 -125 160 156 -131 -305 -11 280 43 -314 -198 348 292 -207 -290 189 434
6820 434 -22 -343 9 444 216 -360 -230 344 446 -129 -355 153 394 67 -314 -75 364 201 -197 -251
6840 -251 94 330 -8 -342 -147 295 181 -259 -249 156 242 -121 -362 6 267 35 -272 -146 259 163 -242
6861 -242 -232 76 224 -121 -278 -31 165 66 -250 -131 64 141 -7 -135 -21 177 85 -121 -27 108 241 54
6883 54 -98 -5 172 76 -134 -71 133 142 -3 -105 21 95 42 -7 39 2 -68 11 0 -56 -56 108 50 -79 -160 80
6909 80 127 -55 -207 -34 182 -40 -223 -36 161 97 -99 -165 42 50 -37 -101 -60 128 108 -104 -110 87 150 130 -195
$$ packed form
6751a1k2J06o1j17K4J27K7j55l1J93j8j16j7J91Oj23n5J33l2J7n8J8j11J16R0
6776A21n4k30Q3K87j3l04m7L17L0l50j10L82K13l78k96L08L25j94m36J43L85J7
6798A99l48r0K53K18j91k74J08K85mk87j74K94K91k37l57J16N46n6m99q3M79K45
6820D34m56l21L52M35k28n76J30N74J02n75k26N08K41l27l81K39M39j63l98n4
6840b51L45K36l38l34J95M42j14m40J0M05Q6l63k41L68K61k32l07J26M05r6m05
6861b42J0L08J48l45j57K47J96r9l16J19J95P7j48j28J14J98r2k06R4J35J33j87
6883E4j52R3J77r6k10O3K04Rj45j02J26P4n3m9M6l7p0P9j1n6%J64n8j29q1K40
6909H0M7j82j52J73K16k22j83J87J97o4j96o6K07Qq7o4M1J88k0k12oJ97O3k0l25
$$ plain form
6934 -195 -81 232 211 -76 -193 203 362 0 -331 75 395 119 -376 -117 329 250 -260 -294 218 302 -103
6955 -103 -363 96 297 -5 -292 -129 166 164 -129 -331 -46 219 120 -278 -268 134 344 -127 -472 -43 415
6976 415 130 -486 -196 375 296 -427 -322 376 395 -195 -390 153 436 18 -356 -39 265 167 -126 -111 79
6997 79 150 92 -77 -93 92 174 56 -99 3 213 97 -249 -241 276 226 -254 -368 160 238 -152 -335 47 225
7020 225 -131 -345 -49 199 29 -224 6 24 -64 -165 20 147 -78 -27 88 -20 -181 5 320 49 -134
7041 -134 -149 233 81 -162 -20 154 103 -179 -42 155 109 5 9 51 -18 -11 149 119 -132 47 168 48 -222
7064 -222 -11 354 154 -321 -291 249 270 -237 -308 253 216 -281 -406 11 318 -28 -267 -177 177 24 -174 -102
7086 -102 145 150 -105 -211 -60 168 289 -32 -267 -35 223 117 -255 -98 374 268 -334 -346 307 425 -47
$$ packed form
6934a95J14L13k1k87j17L96J59l62l31M06L20k76m95K59M46p9n10l4N12Q4m05
6955a03k60M59K01l02k87J63K95kk93k02K85K65r9l98J0M02K10m71l45M29M58
6976D15k85o16K90N71p9p23J05O98J9n90j95N43K83m18l74L17L04r8k93J5J90
6997G9P1n8j69j6J85Q2j18j55J02K10j16l46QN17n0m80j14N28P8l90j83L82J78
7020B25l56k14K96K48j70k53K30J8q8j01J85J27k25N1J15j08j61J86L15k71j83
7041a34j5L82j52k43J42J74n1k82J37J97m6j04MM2o9PJ60l0k51J79J21j20k70
7064b22K11L65k00m75L0N40K1n07p1N61l7m97j25M17L07l46k39R0L54j53j98P2
7086a02K47Nk55j06J51K28J21l21k35K32K58j06l72J57M72j06o02j2O53J18m72
$$ plain form
7107 -47 -338 103 381 16 -378 -38 464 222 -274 -358 191 312 0 -221 29 148 38 -229 -53 200 161
7128 161 -174 -274 -82 176 108 -126 -144 72 117 -154 -238 23 304 17 -386 -164 70 144 -151 -149 193 190 -155
7151 -155 -290 111 327 104 -182 -85 105 122 -69 36 173 18 -99 6 19 37 180 117 2 -101 -22 163
7173 163 84 -61 31 51 2 -143 -46 154 148 -89 -111 -8 -104 28 -35 -2 -94 -95 -51 -81 -162 30 175 -25 -314 -133
7199 -133 215 170 -238 -171 169 114 -237 -274 213 282 -67 -302 -28 251 75 -186 33 307 205 -100 -96 75
7221 75 194 164 -74 -165 119 238 16 -198 19 277 69 -351 -190 334 252 -236 -371 52 309 -102 -348
7242 -348 72 319 25 -355 -127 167 165 -206 -277 35 169 -58 -218 -26 189 74 -218 -269 17 212 28
7263 28 -227 -91 161 179 -186 -163 165 217 -116 -215 111 293 41 -192 -73 221 72 -129 -142 191 239 -46
$$ packed form
7107d7k91M41K78l65l94L40N02k42m96q4N49J21l12k21K50J19j10k67J76K53l9
7128A61l35j00J92K58o8k34j8K16M5k71q4K61K81k87m03K22K34P4k95KL42ll45
7151a55j35M01K16k23k86R7J90J7j91J05J37j55j17J05J3J8J43o3j15j03P9J85
7173A63p9j45R2K0m9j45R7K00ok37k2J03r6J32o3L3r2jM4l0q1J92J45k00k89J81
7199a33L48m5m08O7L40n5l51l7M87O9l49k35K74K79j76k61K19K74j02l05MJ71
7221G5J19l0k38r1K84J19k22k14K17K58k08m20J61N24q2m88j35M23K57m11k46
7242c48M20K47k94l80K28K94kl71p1L12J34k27j60J92K15j15k92n1K86J95j84
7263B8k55J36K52J8l65K3L28N2l33r9L26J82k52k33J19K94j49k01j3L33M8k85
$$ plain form
7285 -46 -215 8 189 92 -110 -22 57 7 -26 -118 7 63 42 -36 -93 3 77 -6 -172 -94 42 -61 -140 -86 46 85
7311 85 -62 -82 -27 -3 26 28 8 -38 -32 -6 99 4 -16 89 122 -46 -28 89 216 1 -99 45 192 38 -71
7336 -71 7 193 119 -71 -93 112 182 -7 -141 -20 162 123 -94 -194 47 205 -2 -251 -79 213 196 -202
7358 -202 -216 109 198 -144 -341 59 303 -2 -301 -117 194 125 -180 -255 77 270 -41 -273 -25 227 149 -134
7380 -134 -165 109 267 -24 -201 -42 299 192 -196 -181 261 298 -118 -282 90 307 58 -264 -94 329 91
7401 91 -235 -204 155 155 -81 -148 46 125 -21 -140 -110 12 16 -34 -177 -84 51 96 -182 -194 96 208 -102 -202
7425 -202 35 210 -5 -220 -89 113 70 -150 -23 73 62 -53 -64 62 24 -29 17 58 12 22 21 41 20 34 102
7450 102 53 -91 -75 76 132 -60 -92 24 197 30 -104 7 112 7 -82 -70 16 24 -21 -56 -108 -50 31 -41 -173
$$ packed form
7285d6j69K23J81r7k02Q8P9n0l3r2J25N6k1p8n7R6P4q3j66P8J36j03p9N4J32L9
7311H5j47k0N5K4K9Kk0m6OK6J05r5k0J05L3j68J8J17J27k15j00J44J47j54j09
7336g1P8J86p4j90k2K05P0j89j34J21J82l9k17j00K41J58k07k49J72K92j7l98
7358b02j4L25Q9l42j97M00K44l05k99J84L11o9l05p5L32J93l11k32K48K52p8k83
7380a34l1K74J58k91j77J59L41j07l88J5M42L7m16j64L72K17k49l22J70M23k38
7401I1l26L1L59%k36o7J94P9j46j19L0J22Mn0j43R3J35M5k78j2K90J12l10j00
7425b02K37J75k15k15J31K02m3k20J27R6j1j15j1J26l8n3M6M1m6J0jK0k1J4O8
7450A02m9j44J6J51N6j92l2J16J73j67j34J11J05j05q9J2Q6Qm5l5n2N8Q1p2j32
$$ plain form
7475 -173 -149 84 119 -164 -232 130 201 -180 -252 71 315 -6 -317 0 302 115 -275 -108 203 204 -138 -181 130
7498 130 212 73 -130 -80 124 244 -26 -171 -21 259 132 -205 -120 108 214 -103 -286 76 253 -57 -380
7519 -380 -21 368 132 -307 -215 245 266 -311 -275 68 271 -54 -275 -46 218 27 -210 -159 84 140 -49 -195
7541 -195 -66 107 127 -116 -182 57 257 8 -193 -70 234 228 -220 -122 178 252 -129 -164 52 247 6 -88 -28
7564 -28 198 71 -152 -87 87 72 -62 1 44 -1 11 -11 -38 35 -11 30 8 -131 -12 148 28 -120 -106 76 70
7589 70 -128 -51 109 145 -56 -78 43 98 26 -103 17 27 -1 91 65 -39 -59 117 103 -147 -95 158 183 -201 -130
7614 -130 138 255 -44 -211 95 284 45 -274 6 215 36 -177 -156 161 68 -36 -177 42 68 49 -122
7635 -122 -194 -1 133 -25 -170 -49 165 113 -251 -280 152 291 -145 -398 29 307 -9 -383 -111 289 75
$$ packed form
7475a73K4K33L5k83o8L62P1l81p2L23K44l21l11L17L02j87l90J67L11Jl42m3L11
7498A30Q2j39k03N0K04J20k70j45J50K80j27l37Q5K28J06l17j83L62J77l10l23
7519c80L59L89k36m39R2M60K1n77L6L43K03l25k21K29K64j91k37N1K43N6j89j46
7541a95J29J73K0k43o6K39K00k49k01J23L04om48R8L00P4l81l5K16J95k41r4O0
7564b8K26j27k23O5J74j5j34O3M3m5J2k2k7P3m6M1k2j39J19J60j20j48J4J82o
7589G0j98P7J60L6k01k2J21N5p2j29J20J0k8R2k6j04k0J76j4k50N2K53K5l84P1
7614a30K68J17k99j67L06J89k39l19K80K09j79k13K1L17r3j04j41K19K6j9j71
7635a22p2J93J34j58j45J21K14n2l64k9M32J39m36k53M27K78l16l74K72M00k14
$$ plain form
7656 75 -268 -138 227 215 -128 -191 28 226 44 -176 28 108 126 -79 -82 -37 197 79 -106 -178 83 222 -87
7679 -87 -190 58 305 2 -287 -97 309 210 -214 -168 160 139 -169 -197 69 133 -11 -239 -29 112 11 -132
7701 -132 -101 24 -13 -47 -49 -22 -7 117 13 -171 -84 110 123 -31 -83 62 96 -59 -75 137 215 37 -108 50
7725 50 92 92 29 78 83 -44 34 1 -23 -16 85 124 -48 -130 29 164 44 -137 -44 118 -3 -134 -108 163 65 -155
7751 -155 -175 11 126 -2 -174 -27 19 -78 -105 -92 24 158 0 -199 -119 101 150 -1 -197 54 174 49
7773 49 -187 -11 328 135 -212 -100 184 241 -75 -213 94 270 -26 -214 -82 206 203 -81 -128 44 217 17
7795 17 -182 -87 186 100 -175 -214 123 281 -68 -289 -50 198 36 -246 -101 171 88 -173 -257 95 195 -43
7817 -43 -171 -68 51 -13 -114 -72 174 174 -17 -203 -57 149 91 -44 -112 93 101 -145 -162 62 202 78 -254
$$ packed form
7656G5l43J30L65j2l43o3K19J98j82k20K04Q0J8k05lM5K34j18j85p2K61J39l09
7679h7j03K48K47l03k89J90M06r9m24M6L28k1l08k8K66O4j44k28K10J41j01j43
7701a32L1J25l7l4kK7J5J24j04j84Q7J94J3j54n2J45L4j55j6K12P8j78j45J58
7725E0M2%o3M9Nj27P8l3k4PJ01L9j72q2J59J35j20j81R3J62j21j31K6K71r8k20
7751a55k0J86J15j28j72J47M6r7k7J3J16J34j58j99Q0K20M9j51j96K51J20j25
7773D9k36J76L39j93l47J12K84N7l16j38L07J76k96j88J32K88lk84m7J72J73k00
7795A7j99R5K73q6k75l9L37J58l49k21K39K48j62k82J45K72q3k61q4L52J00k38
7817d3j28J03J19o4j01M2K46%j91j86J46K06n8j35o8K05Qk46j7K24J40j24l32
$$ plain form
7840 -254 -27 196 129 -66 21 96 12 -91 -57 73 48 66 -59 -99 -49 34 37 22 -31 31 -13 -40 -78 -16 102 -13
7866 -13 -160 -127 11 -12 -18 -60 -2 3 -59 -76 -17 -21 128 46 -88 -202 60 148 72 -162 10 144 72 -127 -84 186
7892 186 127 -20 -156 52 194 59 -122 43 201 103 -145 -109 133 198 16 -127 -77 146 119 -82 -228 54
7914 54 136 -70 -251 21 224 67 -207 -153 96 80 -129 -172 20 164 -29 -238 -121 206 215 -162 -211 4 203
7937 203 -45 -165 35 268 90 -226 -122 258 212 -85 -178 93 199 -7 -154 46 212 146 -108 -109 93 179
7959 179 51 -127 -21 169 66 -78 -95 84 224 18 -213 -54 169 75 -196 -106 83 32 -161 -168 60 75
7981 75 -114 -171 2 41 -25 -71 -21 -33 -46 -10 -27 -12 -8 66 72 -166 -56 109 106 -33 -38 127 72 -29 33 49 65 -18
8009 -18 -62 20 79 0 -9 58 27 -71 52 88 -27 -88 89 104 -54 -110 32 176 -4 -211 -70 125 29 -217 -86
$$ packed form
7840b54K27K23o7j95Q7P5q4j03L4J30k5J8j25m0N0Q3Lj5n3O2m4k7l8O2J18j15
7866a3j47L3J38k3om2N8No2j7N9mJ49q2j34j14K62Q8p6k34J72J34p2j99M3K70
7892A86n9j47j36K08J42j35j81J65J58r8k48L6K42O5j82j43N0K23k7k01j46K82
7914E4Q2k06j81K72K03j57k74N4K49j6k09m3J92J44j93k09J17L27Rl77m9K15J99
7937B03k48j20K00K33j78l16J04L80m6k97r3K71J06k06j47K00J66o6k54jK02Q6
7959A79j28j78J06J90j03j44j7J79J40k06k31J59K23r4k71R0J89n1j93pK28J5
7981G5j89n7J73L9o6m6N0j2j3L6j7J5MP4Ok38J10J65lj39nJ65n5j01O2J6J6q3
8009a8m4Q2N9p9rO7l1r8J23L6j15o1J77J5j58n6J42J44j80k07J41J95r6k46J31
$$ plain form
8034 -86 157 46 -156 -99 72 129 -28 -123 -14 80 5 -62 -68 -42 112 89 -130 -95 104 144 -26 -197 162 248 37
8059 37 -198 1 289 92 -153 -60 301 159 -142 -176 174 243 -46 -176 58 198 65 -188 -103 96 141 -59
8081 -59 -150 -16 58 62 -112 -134 65 187 -19 -244 -83 163 37 -209 -171 173 138 -197 -190 40 178 -60 -198
8104 -198 46 132 -38 -157 -28 167 122 -49 -134 38 118 71 -13 -42 33 76 50 -48 -43 139 75 -43 -65 69 55
8129 55 -65 -99 -12 90 46 -106 -57 62 -45 -82 -53 46 -27 -99 -22 -22 -79 0 39 17 -118 -66 71 -7 -124 -70 97
8156 97 81 -144 -151 50 64 -24 -103 5 158 -13 -113 -17 118 142 3 -55 15 141 59 -102 24 116 133 21 -77
8181 -77 -26 99 125 -90 -68 148 102 -60 -157 64
$$ packed form
8034h6K43j11k02N7J71N7j57r5J09R4p5o7oK6J54k3k19L5J99M0j70j71L59Q6k11
8059C7k35J99K88j97k45R3L61j42l01l4L50O9k89j30K34J40j33k53Q5J99M5k00
8081e9r1J34P4Mj74k2J99J22k06k25J61K46j26k46L8L44l5l35PK30J38k38j38
8104a98K44Q6j70j19J29J95m5j71q5J72Q0m7q4k9P5M3k6r8NJ82o4j18k2J34j4
8129E5j20l4Q7J02m4j52M9J19j07l7K9R9p3p2P7%n7P9L9k2j35N2J37p8j17N4J67
8156I7j6k25pK01J4q8p9J08J53j71j00R6J35K4j39n8P0J26q2j61J26R2J7j12r8
8181g7N1J25K6k15K2K16m6j62r7K21
8191F4
$$ Imaginary data points
##PAGE= N=2
##DATA TABLE= (X++(I..I)), XYDATA
$$ plain form
0 0 0 0 0 0 0 0 0 0 0 0 0 -8 8 -5 8 -8 8 -11 12 -16 18 -20 21 -27 29 -32 36 -40 46 -50 57 -63 71 -77 84 -92
36 -92 103 -115 125 -139 153 -170 187 -208 233 -258 290 -326 372 -427 494 -581 699 -857 1085 -1437
56 -1437 2028 -3133 5635 -13557 84888 453068 54532 -334333 26130 256095 -146882 -281768
68 -281768 183567 314966 -112185 -234402 75775 107272 -114090 -22534 186513 29301
78 29301 -198449 -70081 113798 29612 -41373 86602 104689 -94230 -164363 18773 142264
89 142264 40541 -63069 -5651 49261 -46984 -118845 21925 167640 36797 -167726 -86756
100 -86756 103607 33843 -103823 30207 161596 -43425 -220040 -13562 176243 14593
110 14593 -103225 61758 91726 -131689 -134766 119996 133669 -81611 -69702 83611 -1126
$$ packed form
0@%%%%%%%%%%%qJ6j3J3j6J6j9K3k8L4l8M1m8N6o1O8p6Q6r6J07j20J34j48J61j76
36i2J95k18K40k64K92l23L57l95M41m91N48o16O98p99R21j075J280j556J942k522
56a437L465n161Q768j9192R8445L68180l98536l88865L60463K29965m02977j34886
68b81768M65335J31399m27151j22217L10177L1497k21362R1556K09047j57212
78B9301k27750J28368J83879q4186p0985J27975J8087j98919p0133J83136J23491
89A42264j01723j03610N7418N4912r6245p1861J40770J45715j30843k04523Q0970
100h6756J90363o9764j37666J34030J31389k05021j76615K06478J89805j61650
110A4593j17818J64983K9968k23415l077K54762J3673k15280J1909J53313q4737
$$ plain form
121 -1126 -129996 21878 167080 9667 -129132 -2546 78201 -42155 -54743 100890 97673
132 97673 -77875 -103066 30138 56731 -19086 -8698 49349 13608 -60338 -48468 22330 54522
144 54522 22270 -26982 -33356 1730 11110 -13576 3102 50391 22162 -58898 -53895 25883 40141
157 40141 -8468 -9599 17154 -10690 -45248 -12842 30059 18654 -5012 -6130 -14528 -23388 3536
170 3536 33453 16309 -15332 -12052 1582 -8100 -13352 13594 37679 13874 -33768 -35348 17443
183 17443 41862 -2762 -30478 16610 41496 -23636 -56466 27198 80346 -6431 -77511 -5280
195 -5280 61479 -3623 -57126 14213 64607 -10748 -68350 -7051 46799 4670 -30860 2582
207 2582 18281 -15625 -18085 18574 14947 -18240 -5794 21165 -9543 -39056 12664 58162 -2636
$$ packed form
121a126j28870J51874J45202j57413j38799J26586Q0747j20356j2588J55633l217
132I7673j75548k5191J33204K6593p5817J0388N8047l5741p3946J1870P0798L2192
144E4522l2252m9252o374L5086R380k4686J6678M7289k8229q1060N003P9778J4258
157D0141m8609j131K6753k7844l4558L2406M2901j1405k3666j118q398q860K6924
170C536K9917j7144l1641L280J3634r682n252K6946K4085k3805m7642j580N2791
183A7443K4419m4624k7716M7088K4886o5132l2830Q3664N3148q6777p1080P2231
195e280O6759o5102n3503P1339N0394p5355n7602O1299N3850m2129l5530L3442
207B582J5699l3906k460L6659l627l3187J2446K6959l0708k9513N1720M5498o0798
$$ plain form
220 -2636 -63343 -2748 62358 -3638 -70544 7221 82243 -3563 -88538 -2928 85032 3046
232 3046 -79115 1013 72047 -9821 -69433 15212 66896 -13983 -54336 17703 39506 -27423
244 -27423 -28706 39492 28879 -37476 -19212 39749 12283 -39318 -1341 47287 2378 -46117
256 -46117 -242 46086 634 -43152 883 40828 -5661 -46129 2274 46349 -1623 -49233
268 -49233 -3684 43313 -3976 -50101 3102 52230 -4833 -56269 2248 52683 -7017 -52890
280 -52890 10089 51405 -13152 -48010 17384 45149 -18376 -37151 22679 30412 -24896 -20053
292 -20053 32108 16492 -32088 -7855 34448 619 -36831 6208 41534 -6900 -41031 9498
304 9498 41843 -10332 -42284 10074 43836 -6253 -42269 4328 42867 518 -40849 -3886
$$ packed form
220b636o0707O0595O5106o5996o6906P7765P5022q5806q4975Q5610Q7960q1986
232C046q2161Q0128P1034q1868n9612Q4645N1684q0879m0353P2039K1803o6929
244b7423j283O8198j0613o6355J8264N8961k7466n1601L7977M8628m4909m8495
256d6117M5875M6328m5452m3786M4035L9945m6489m0468M8403M4075m7972m7610
268d9233M5549M6997m7289m6125N3203M9128n7063n1436N8517N0435n9700m5873
280e2890O2979M1316o4557l4858O5394K7765o3525j8775N9830P733n5308M843
292b0053N2161j5616m8580K4233M2303l3829l7450M3039L5326m8434l4131N0529
304I498L2345n2175l1952N2358L3762n0089l6016M6597L8539m2349m1367L6963
$$ plain form
316 -3886 38432 5899 -36365 -6715 35640 8381 -33787 -10488 26973 4581 -26923 -3252
328 -3252 22206 -3118 -21632 5035 14570 -14938 -15171 18093 10116 -25947 -8990 30855 6541
341 6541 -36447 -5832 40290 5898 -41485 -3377 46065 7397 -42418 -4686 44252 8287
353 8287 -39043 -6209 38877 10370 -31415 -8086 28053 7874 -23166 -5747 19901 4374
365 4374 -16102 -2302 11593 -2870 -10704 6083 8458 -12210 -10191 15761 11081 -19791 -13373
378 -13373 21164 12428 -26191 -14555 29915 18210 -30774 -21068 28148 18644 -29652 -18377 29928
391 29928 17597 -29766 -17053 27395 12858 -28634 -12624 25542 7924 -25295 -4242 25845
403 25845 1520 -26400 -535 24524 -2370 -23035 7388 26947 -4123 -21838 8619 21924
$$ packed form
316c886M2318l2533m2264K9650M2355k7259m2168K3299L7461k2392l1504K3671
328c252K5458k5324j8514K6667R535k9508k33L3264p977l6063J6957L9845k4314
341F541m2988L0615M6122l4392m7383L8108M9442l8668m9815L7732M8938l5965
353H287m7330L2834M5086k8507m1785K3329L6139k0179l1040J7419K5648j5527
365D374k0476J3800J3895j4463p834J6787K375k0668K019K5952m680l0872O418
378a3373L4537q736l8619J1636M4470j1705m8984R706M9216r504m8296J1275M8305
391B9928j2331m7363J2713M4448j4537m1492J6010L8166j7618l3219K1053L0087
403B5845k4325k7920K5865K5059k6894k0665L0423J9559l1070j7715L0457J3305
$$ plain form
415 21924 -9661 -19630 13872 21822 -11602 -16323 17027 16830 -18858 -16131 20032 13550 -23697
428 -23697 -12527 27924 13759 -30759 -17143 27418 11962 -33343 -15555 32418 15649 -32605
440 -32605 -16971 29497 14218 -30658 -16643 25798 14422 -21602 -9220 21290 6895 -19950
452 -19950 -5080 16285 181 -13943 6976 16741 -8814 -15496 13638 15730 -19525 -19878 21565
465 21565 22790 -21602 -22136 25529 25369 -26880 -28879 25097 29664 -22846 -26739 25619 29555 -21735
479 -21735 -26692 20467 23565 -19573 -19725 20011 17830 -17110 -11318 18034 6062 -20697 -5079
492 -5079 18057 -1491 -19821 5519 20911 -10372 -25488 8290 21761 -14134 -24973 14509
504 14509 25302 -15968 -26913 14790 25993 -15345 -26181 14590 25631 -13043 -22669 15307
$$ packed form
415B1924l1585r969L3502P950l3424m721L3350j97l5688K727L6163o482l7247
428b3697J1170M0451j4165m4518J3616M4561j5456m5305J7788M7973j6769m8254
440c2605J5634M6468j5279m4876J4015M2441j1376l6024J2382L0510j4395k6845
452a9950J4870K1365j6104j4124K0919R765k5555o682K9134K092l5255l53M1443
465B1565J225m4392n34M7665j60n2249j999N3976M567n2510l893N2358L936n1290
479b1735m957M7159L098m3138j52L9736k181l4940N792K9352j1972k6759J5618
492e079K3136j9548j8330K5340J5392l1283j5116L3778J3471l5895j0839L9482
504A4509J0793m1270j0945M1703J1203m1338j0836M0771J1041l8674r626L7976
$$ plain form
516 15307 24654 -12101 -21583 12085 19942 -10889 -15486 14456 16612 -12986 -13625 13935 11489 -14853
530 -14853 -9085 16482 7020 -18257 -5226 20708 5170 -20852 -3905 20345 717 -21926
542 -21926 1140 23977 -701 -23255 1223 21366 -3724 -20849 5526 20168 -7764 -21061
554 -21061 7255 19371 -8137 -18493 7810 14800 -12885 -18848 10174 17996 -9261 -17290 7513
567 7513 14410 -9814 -16341 8224 16695 -6018 -15275 5395 15097 -2395 -10369 5398 10760 -4942
581 -4942 -8285 8130 11068 -3388 -3373 8724 1546 -13153 -1301 17818 3975 -17825 -2861
594 -2861 19487 1029 -23905 -2587 25950 2906 -30698 -9385 27937 11077 -25657 -11529
606 -11529 22657 7501 -27457 -12683 24747 15422 -18618 -12910 13910 6128 -15284 -3064 16212
$$ packed form
516A5307R347l6755r482L3668P857l0831m597K9942K156k9598o39K7560k446k6342
530a4853N768K5567r462k5277J3031K5934j5538k6022J6947K4250j9628k2643
542b1926K3066K2837k4678k2554K4478K0143k5090j7125K6375J4642k7932j3297
554b1061K8316J2116k7508j0356K6303O990k7685n963K9022P822k7257q029K4803
567G513O897k4224o527K4565Q471k2713r257K0670R702j7492p974J5767N362j5702
581d942l343J6415K938j4456J5J2097p178j4699J1852J9119j3843k1800J4964
594b861K2348j8458k4934K1318K8537k3044l3604K1313L7322j6860l6734J4128
606a1529L4186j5156l4958J4774L7430r325l4040N708K6820p782k1412J2220J9276
$$ plain form
619 16212 1257 -15339 1754 13585 -6837 -12311 14582 14371 -21658 -20316 22988 23405 -21160
632 -21160 -19362 25875 18395 -31727 -21986 33351 27159 -26592 -22561 24892 18366 -23898 -12604
645 -12604 27897 14385 -25226 -13651 21326 11605 -14707 -2090 16774 -4118 -24101 526
657 526 23853 1926 -19436 725 15113 -11757 -24365 11205 28877 -9568 -31678 4707
669 4707 24684 -11478 -24357 18414 27472 -23531 -33534 20519 31711 -17784 -21400 26000 17093
682 17093 -35209 -18862 38979 23032 -31134 -13643 30482 3504 -34945 2289 41519 2105
694 2105 -36593 -2460 26952 -4259 -20621 14491 23529 -16342 -26435 9616 20129 -5094
706 -5094 -7185 12189 2839 -21554 -9961 20333 15969 -10761 -10550 7868 1330 -17727 -3847
$$ packed form
619A6212j4955j6596J7093J1831k0422n474K6893k11l6029J342M3304M17m4565
632b1160J798M5237p480n0122R741N5337o192n3751M031M7453o526m2264J1294
645a2604M0501j3512l9611J1575L4977r721k6312J2617J8864k0892j9983K4627
657E26K3327k1927k1362K0161J4388k6870j2608L5570J7672l8445k2110L6385
669D707J9977l6162j2879M2771R058n1003j0003N4053J1192m9495l616M7400q907
682A7093n2302J6347N7841j5947n4166J7491M4125k6978l8449L7234L9230l9414
694B105l8698L4133K9412l1211j6362L5112R038l9871j0093L6051J0513k5223
706e094k091J9374r350k4393J1593L0294m364k6730K11J8418o538j9057J3880
$$ plain form
719 -3847 25703 13859 -25016 -22431 15435 16512 -16245 -10852 23622 10265 -33730 -21857 27637
732 27637 23921 -17696 -14486 14801 1426 -23539 -833 27603 8152 -15640 -3025 4826 -10187
745 -10187 -2352 24077 12678 -20158 -11779 15747 4486 -15644 6086 28147 -992 -33022
757 -33022 -10822 24765 15804 -11550 -8323 9175 1717 -18256 -11389 17216 22713 -5670 -24580
770 -24580 -6899 12744 3013 -8035 5312 12507 -7961 -19482 -379 13842 4522 -499 3091
783 3091 -7574 -16743 2510 19601 2709 -12216 3826 8592 -17070 -18619 19014 28190 -9617
796 -9617 -25126 3443 14197 -8783 -9937 17264 17188 -14455 -21157 5651 17255 1463 -4826
809 -4826 6002 3906 -12319 -10157 11927 17592 -1211 -10671 316 2893 -8811 -4370 15777
$$ packed form
719c847K9550j1844l8875K585L7866J077l2757N393L4474j3357m3995J1873M9494
732B7637l716m1617L210K9287j3375k4965K2706K8436j9451k3792J2615P851j5013
745a0187P835K6429j1399l2836Q379K7526j1261k0130K1730K2061k9139l2030
757c3022K2200L5587q961k7354L227J7498p458j9973O867K8605N497k8383j8910
770b4580J7681J9643r731j1048J3347P195k0468j1521J9103J4221r320n021L590
783C091j0665r169J9253J7091j6892j4925J6042M766k5662j549L7633R176l7807
796i617j5509K8569J0754k2980j154K7201p6l1643o702K6808J1604j5792o289
809d826J0828k096j6225K162K2084N665j8803r460J0987K577j1704M441K0147
$$ plain form
822 15777 12867 -12734 -16194 4565 7225 -7422 -1760 13520 229 -20421 -6939 14624 4020
835 4020 -10418 3670 10116 -13627 -19322 12244 22608 -7475 -17320 9358 12290 -16851 -14887
848 -14887 20960 22121 -14912 -21306 10100 16789 -8769 -11637 12403 13426 -11685 -15346 7134
861 7134 14261 -915 -6729 1468 1382 -5514 -923 7477 3058 -3331 1303 2533 -7496 -6357 10929
876 10929 12442 -8825 -13804 7722 13622 -8775 -14267 10445 16775 -10923 -21423 6384 21144
889 21144 -3532 -20308 287 16465 -2594 -19148 -872 17838 3114 -16439 -6521 10905
901 10905 4308 -9183 -3203 8013 2891 -5424 -1146 3444 -164 389 5349 -112 -7287 2315 12297
916 12297 -428 -12759 2509 16727 -1355 -18377 1111 20859 1654 -20049 -2471 19302
$$ packed form
822A5777k910k5601l460K0759K660j4647N662J5280j3291k0650J3482K1563j0604
835D020j4438J4088O446k3743n695L1566J0364l0083r845K6678K932k9141J964
848a4887L5847J161l7033o394L1406O689k5558k868K4040J023k5111l661K2480
861G134P127j5176n814Q197q6o896M591Q400m419o389M634J230j0029J139J7286
876A0929J513k1267m979K1526N900k2397n492K4712O330k7698j0500K7807J4760
889B1144k4676j6776K0595J6178j9059j6554J8276J8710j4724j9553R918J7426
901A0905o597j3491N980J1216n122q315M278M590l608N53M960n461p175R602R982
916A2297j2725j2331J5268J4218j8082j7022J9488J9748j9205k1703J7578K1773
$$ plain form
928 19302 2735 -19255 -4699 17459 5646 -15633 -6922 12761 6174 -12130 -7114 9749 6234
941 6234 -8894 -5841 8053 4431 -8411 -3989 7881 1773 -9084 -304 10021 -1712 -11605
954 -11605 2701 11278 -5844 -12939 7325 12654 -9779 -12698 12000 11968 -14633 -11727 16310 10625
968 10625 -17505 -7969 20867 8302 -20961 -6248 22687 6576 -21359 -4005 23369 5909
980 5909 -20400 -4354 19740 4880 -17447 -4538 15639 5046 -12693 -4619 9857 3027 -9087
993 -9087 -3513 5495 309 -5547 994 4212 -4822 -6397 5536 5482 -10007 -7970 12291 9752 -15238
1008 -15238 -12131 17319 14217 -19455 -16796 20310 18791 -19642 -18380 20595 19035 -19826 -18638
1021 -18638 18569 17597 -16383 -14759 15339 12792 -12896 -9362 10990 5531 -9742 -1598 9975
$$ packed form
928A9302j6567k1990J4556K2158j1813k1279Q711J9683o587j8304N016J6863l515
941F234j5128L053J3894l622j2842M422J1870o108j0857Q780J0325j1733r893
954a1605J4306Q577j7122p095K0264N329k2433k919K4698l2k6601K906K8037n685
968A0625k8130R536K8836j2565k9263J4713K8935j6111k7935J7354K7374j7460
980E909k6309J6046K4094j4860k2327J2909K0177j0593j7739Q074J4476o830j2114
993i087N574R008n186n856O541L218r034j575J1933n4j5489K037K0261k539k4990
1008a5238L107K9450l102l3672K659L7106j519l8433J262L8975j560l8861J188
1021a8638L7207r72l3980J624L0098k547k5688L534K0352n459j5273Q144J1573
$$ plain form
1034 9975 -2 -7864 3577 7680 -6165 -7511 9283 9409 -9629 -9625 11140 11245 -11300 -12459 11302
1049 11302 13626 -11663 -15812 10633 16794 -10298 -18701 7892 17138 -9654 -19510 7663 18608
1062 18608 -7934 -19274 5701 16048 -7259 -15275 7158 13173 -7822 -11088 8736 9582 -8505
1075 -8505 -6304 9681 4107 -9793 92 13539 507 -13095 1448 14014 -2276 -13260 5421
1088 5421 15780 -5128 -16287 5162 16598 -5023 -16384 5070 16093 -5634 -16454 5607
1100 5607 16710 -5251 -16976 4117 15466 -4755 -15149 5229 15281 -5144 -15321 3643
1112 3643 13053 -4459 -12122 4665 10580 -5408 -9987 4721 7043 -6365 -6279 5790 3148 -7417
1126 -7417 -1233 8693 -1032 -11345 1227 12241 -2321 -13313 3926 16081 -3439 -17197 3947
$$ packed form
1034I975r977p862J1441M103j3845j346J6794J26j9038MK0765J05k2545j159K3761
1049A1302K324k5289m149K6445O161k7092q403K6593R246k6792r856K7173J0945
1062A8608k6542j1340K4975J0347k3307q016K2433O015k0995l266J9824Q46j8087
1075h505K201J5985n574j3900R885J3447j3032j3602J4543J2566j6290j0984J8681
1088E421J0359k0908j1159K1449J1436k1621j1361K1454J1023k1727j0820K2061
1100E607J1103k1961j1725K1093J1349k0221j0394K0378J0052k0425j0177J8964
1112C643R410j7512p663J6787N915j5988m579J4708K322j3408Q6J2069k642j0565
1126g417O184R926r725j0313J2572J1014j4562j0992J7239J2155j9520j3758K1144
$$ plain form
1139 3947 19820 -1717 -19561 1862 21625 1522 -19273 -994 19803 2791 -17974 -3018
1151 -3018 17030 4435 -13692 -3728 10965 2201 -9132 -1638 5487 -1376 -4003 3129 1341 -6937
1165 -6937 -1339 8172 -809 -12053 -172 13441 153 -15482 -1407 16116 1979 -17377 -4090
1178 -4090 16919 5682 -15627 -6382 14762 7324 -13549 -8069 11855 8207 -10174 -7389 9428
1191 9428 7235 -8011 -6004 6958 4304 -6242 -1721 7271 1015 -6264 1446 7091 -2535 -6376
1205 -6376 5185 7520 -5506 -6389 8221 7440 -8611 -7115 9328 6629 -9902 -5873 10617 5397
1219 5397 -11591 -6192 10113 4408 -11361 -5518 9804 4276 -10564 -5702 8425 4365 -9399
1232 -9399 -5900 7507 5372 -7089 -5531 6643 5528 -6128 -5515 5529 5297 -4180 -2922 5684
$$ packed form
1139C947J5873k1537j7844K1423J9763k0103k0795J8279K0797j7012k0765J4956
1151c018K0048j2595j8127R964J4693q764j1333P494P125o863k627P132j788q278
1165f937N598R511q981j1244J1881J3613j3288j5635J4075J7523j4137j9356J3287
1178d090K1009j1237k1309R245K1144p438k0873N480J9924l648j8381K785J6817
1191I428k193j5246K007J2962k654j0546M521Q992o256p279P710N645r626l841
1205f376J1561K335j3026q83J4610p81j6051J496J6443k699j6531M029J6490n220
1219E397j6988N399J6305n705j5769N843J5322n528j4840M862J4127m060j3764
1232i399L499J3407k135j2461J558J2174j115j1656O13J1044k32r477J258Q606
$$ plain form
1246 5684 3086 -4931 -1281 5507 488 -4515 2697 6152 -3633 -6155 6048 7364 -7287 -7746 8642
1261 8642 8258 -9657 -8263 11300 9443 -11667 -10571 10846 10575 -10127 -10021 9936 10103 -9079
1275 -9079 -10373 7080 9319 -5834 -8571 4139 6681 -3472 -5686 1684 2766 -2504 -2198 1107
1289 1107 -936 -2226 2572 2459 -5467 -5103 5918 5911 -7748 -7720 9157 10410 -9017 -11912 9214
1304 9214 14093 -7759 -14040 8346 16142 -5712 -14406 6128 15271 -3984 -13080 3694 12229
1317 12229 -1924 -8445 2918 6275 -3662 -4236 4050 1419 -5507 587 6430 -3327 -8790 4241
1331 4241 9567 -6592 -12665 5921 13093 -6289 -13675 6008 12877 -7115 -13955 6207 13184
1344 13184 -5545 -11920 4958 9856 -5377 -8582 5228 6763 -5732 -5644 5725 4356 -5803
$$ packed form
1246E684k598q017L650O788n019n003P212L455r785k522J2203J316j4651m59J6388
1261H642l84j7915J394J9563j857k1110J096K1417k71k0702J06J9957J67j9182
1275i079j294J7453K239j5153k737J2710K542j0153k214P370J082n270L06L305
1289A107k043j290M798j13p926L64J1021pj3659K8J6877J253j9427k895K1126
1304I214M879k1852o281K2386P796k1854q694K0534R143j9255r096J6774Q535
1317A2229j4153o521J1363L357r937n74Q286k631o926O094N843r757n463J3031
1331D241N326j6159o073J8586P172j9382p386J9683O869j9992o840K0162O977
1344A3184j8729o375J6878M898j5233l205J3810J535j2495Q8J1369j369j0159
$$ plain form
1357 -5803 -3017 6161 2015 -6798 -1694 7274 2189 -6141 -745 7089 943 -6782 -29 7887 1129
1372 1129 -6289 1008 7251 -1267 -6733 3391 8224 -3896 -8488 5040 8887 -6104 -8862 7493
1386 7493 8522 -9964 -10844 9109 10101 -9504 -10117 8260 7269 -10332 -8189 8606 6755 -7574
1400 -7574 -5765 5090 2474 -4833 -507 4424 -845 -3321 2315 2420 -3450 -802 6207 1828 -7032
1415 -7032 -2636 7357 4197 -5872 -3415 6680 4685 -6730 -6605 6110 9119 -3423 -9367 2332
1429 2332 9770 -1192 -9842 1090 10760 206 -10682 -1239 10147 2706 -7479 -2063 5231
1442 5231 290 -4659 206 3675 99 -1296 -49 -2848 -3644 3169 5192 -3704 -6928 2537 5831
1457 5831 -4490 -7777 3963 8446 -4037 -10699 959 10200 1544 -8254 -2358 7172 2606 -7283
$$ packed form
1357e803K786R178m146q813N104Q968n085q330N396P834o146p725O753P916o758
1372A129p418P297O243q518n466J0124M833j2120m592J3528L847j4991k758J6355
1386G493J029j8486q80J9953R92j9605o13J8377r91j7601K143J6795j851j4329
1400g574J809J0855k616p307M326M931n269k476N636J05n870K648P009m379q860
1415g032M396R993l160j0069K457J0095j995j1415J25J2715L009j2542n944J1699
1429B332P438j0962q650J0932R670j0554j0888R443J1386p441j0185N416P294
1442E231m941m949M865L469l576j395J247k799p96O813K023q896l224R465L294
1457E831j0321l287J1740M483j2483o662J1658R241q656r798N896R530m566r889
$$ plain form
1471 -7283 -3354 8470 7280 -5233 -7030 3831 6863 -2112 -4311 3852 4913 -2967 -3766 3040
1485 3040 3105 -1871 -132 2563 -2778 -4615 3883 6262 -4075 -6333 4583 5066 -7717 -6916 8501
$$ packed form
1471g283L929J1824j190j2513j797J0861L032q975k199Q163J061p880p99O806
1485C040O5m976J739K695n341j837Q498K379j0337k258J0916M83j2783Q01J5417
$$ [...]
8191B26
##END NTUPLES=NMR FID
##END=
