##TITLE=1H_2PBDP4
 CDCl3, 8 sc, 
 30.7.2019
##JCAMPDX= 6.0         $$ Bruker NMR JCAMP-DX V2.0
##DATA TYPE= NMR FID
##DATA CLASS= NTUPLES
##ORIGIN= UXNMR, Bruker Analytische Messtechnik GmbH
##OWNER= root
$$ XWIN-NMR		Version 3.5
$$ Tue Jul 30 14:05:51 2019 Russian Standard Time (UT+4h)  she@DPX200
##.OBSERVE FREQUENCY= 200.13155
##.OBSERVE NUCLEUS= ^1H
##.DELAY= (6, 6)
##.ACQUISITION MODE= SIMULTANEOUS
##.ACQUISITION SCHEME= undefined
##.AVERAGES= 8
##.DIGITISER RES= 18
##SPECTROMETER/DATA SYSTEM= spect
##.PULSE SEQUENCE= zg30
##.SOLVENT NAME= CDCl3
##.SHIFT REFERENCE= (INTERNAL, CDCl3, 0, 15.7039)
##AUDIT TRAIL= $$ (NUMBER, WHEN, WHO, WHERE, WHAT)
$$ ##TITLE= Audit trail, XWIN-NMR		Version 3.5
$$ ##JCAMPDX= 5.01
$$ ##ORIGIN= Bruker BioSpin GmbH
$$ ##OWNER= she
$$ F:/spectra/data/she/nmr/H-F/1/audita.txt
$$ ##AUDIT TRAIL=  $$ (NUMBER, WHEN, WHO, WHERE, WHAT)
(   1,<2019-07-30 14:04:56.90 +0400>,<she>,<DPX200>,
      <created by zg, POWCHK disabled, PULCHK disabled
       configuration hash MD5:
       00 E9 B6 7A A2 85 ED C7 34 08 36 98 17 FE 4E 26
       data hash MD5: 16K
       21 28 AF E8 34 CA B4 D4 F2 AD 66 9B B1 01 82 4A>)
$$ ##END=
$$ 
$$ hash MD5
$$ 30 07 E4 26 48 F2 56 E9 66 18 CF B6 10 F0 EB 64
##$RELAX= 
##$RELAX= 
##$RELAX= 
##$RELAX= 
##$RELAX= 
##$RELAX= 
$$ Bruker specific parameters
$$ --------------------------
##$DU= <F:/spectra>
##$EXPNO= 1
##$NAME= <H-F>
##$PROCNO= 1
##$TYPE= <nmr>
##$USER= <she>
##$AMP= (0..31)
100 100 100 100 100 100 100 100 100 100 100 100 100 100 100 100 100 100 
100 100 100 100 100 100 100 100 100 100 100 100 100 100 
##$AQSEQ= 0
##$AQ_mod= 1
##$AUNM= <au_zg>
##$AUTOPOS= <>
##$BF1= 200.13
##$BF2= 200.13
##$BF3= 200.13
##$BF4= 200.13
##$BF5= 200.13
##$BF6= 200.13
##$BF7= 200.13
##$BF8= 200.13
##$BYTORDA= 1
##$CFDGTYP= 0
##$CFRGTYP= 5
##$CHEMSTR= <none>
##$CNST= (0..31)
1 1 145 1 1 1 1 1 1 1 1 1 1 1 1 1 1 1 1 1 1 1 1 1 1 1 1 1 1 1 1 1 
##$CPDPRG= <>
##$CPDPRG1= <>
##$CPDPRG2= <>
##$CPDPRG3= <>
##$CPDPRG4= <mlev>
##$CPDPRG5= <mlev>
##$CPDPRG6= <mlev>
##$CPDPRG7= <mlev>
##$CPDPRG8= <mlev>
##$CPDPRGB= <>
##$CPDPRGT= <>
##$D= (0..31)
0 1.2 0 0 0 0 0 0 0 0 0 0.03 0 0 0 0 0 0 0 0 0 0 0 0 0 0 0 0 0 0 0 0 
##$DATE= 1564481096
##$DBL= (0..7)
120 120 120 120 120 120 120 120 
##$DBP= (0..7)
150 150 150 150 150 150 150 150 
##$DBP07= 0
##$DBPNAM0= <>
##$DBPNAM1= <>
##$DBPNAM2= <>
##$DBPNAM3= <>
##$DBPNAM4= <>
##$DBPNAM5= <>
##$DBPNAM6= <>
##$DBPNAM7= <>
##$DBPOAL= (0..7)
0.5 0.5 0.5 0.5 0.5 0.5 0.5 0.5 
##$DBPOFFS= (0..7)
0 0 0 0 0 0 0 0 
##$DE= 6
##$DECBNUC= <off>
##$DECIM= 24
##$DECNUC= <off>
##$DECSTAT= 4
##$DIGMOD= 1
##$DIGTYP= 9
##$DL= (0..7)
0 120 120 120 120 120 120 120 
##$DP= (0..7)
150 150 150 150 150 150 150 150 
##$DP07= 0
##$DPNAME0= <>
##$DPNAME1= <>
##$DPNAME2= <>
##$DPNAME3= <>
##$DPNAME4= <>
##$DPNAME5= <>
##$DPNAME6= <>
##$DPNAME7= <>
##$DPOAL= (0..7)
0.5 0.5 0.5 0.5 0.5 0.5 0.5 0.5 
##$DPOFFS= (0..7)
0 0 0 0 0 0 0 0 
##$DQDMODE= 0
##$DR= 18
##$DS= 0
##$DSLIST= <SSSSSSSSSSSSSSS>
##$DSPFIRM= 0
$$ [...]
##$SUBNAM2= <"">
##$SUBNAM3= <"">
##$SUBNAM4= <"">
##$SUBNAM5= <"">
##$SUBNAM6= <"">
##$SUBNAM7= <"">
##$SUBNAM8= <"">
##$SUBNAM9= <"">
##$SW= 24.9336996594482
##$SWIBOX= (0..15)
0 0 2 0 0 0 0 0 0 0 0 0 0 0 0 0 
##$SW_h= 4990.01996007984
##$TD= 16384
##$TD0= 1
##$TE= 0
##$TE2= 300
##$TE3= 300
##$TEG= 300
##$TL= (0..7)
0 120 120 120 120 120 120 120 
##$TP= (0..7)
150 150 150 150 150 150 150 150 
##$TP07= 0
##$TPNAME0= <>
##$TPNAME1= <>
##$TPNAME2= <>
##$TPNAME3= <>
##$TPNAME4= <>
##$TPNAME5= <>
##$TPNAME6= <>
##$TPNAME7= <>
##$TPOAL= (0..7)
0.5 0.5 0.5 0.5 0.5 0.5 0.5 0.5 
##$TPOFFS= (0..7)
0 0 0 0 0 0 0 0 
##$TUNHIN= 0
##$TUNHOUT= 0
##$TUNXOUT= 0
##$USERA1= <user>
##$USERA2= <user>
##$USERA3= <user>
##$USERA4= <user>
##$USERA5= <user>
##$V9= 5
##$VALIST= <valist>
##$VCLIST= <CCCCCCCCCCCCCCC>
##$VD= 0
##$VDLIST= <DDDDDDDDDDDDDDD>
##$VPLIST= <PPPPPPPPPPPPPPP>
##$VTLIST= <TTTTTTTTTTTTTTT>
##$WBST= 1024
##$WBSW= 4
##$XGAIN= (0..3)
0 0 0 0 
##$XL= 0
##$YL= 0
##$YMAX_a= 58610
##$YMIN_a= -60238
##$ZGOPTNS= <>
##$ZL1= 120
##$ZL2= 120
##$ZL3= 120
##$ZL4= 120
##$ABSF1= 10
##$ABSF2= 0
##$ABSG= 5
##$ABSL= 3
##$ALPHA= 0
##$AQORDER= 0
##$ASSFAC= 0
##$ASSFACI= 0
##$ASSFACX= 0
##$ASSWID= 0
##$AUNMP= <proc_1d>
##$AZFE= 0.1
##$AZFW= 0.1
##$BCFW= 1
##$BC_mod= 2
##$BYTORDP= 1
##$COROFFS= 0
##$CY= 11.3945322036743
##$DATMOD= 1
##$DC= 2
##$DFILT= <>
##$DTYPP= 0
##$F1P= 20.1537800932815
##$F2P= 0.134698688090026
##$FCOR= 0.5
##$FTSIZE= 0
##$FT_mod= 4
##$GAMMA= 1
##$GB= 0.15
##$INTBC= 1
##$INTSCL= 1
##$ISEN= 128
##$LB= 0.24
##$LEV0= 0
##$LPBIN= 0
##$MAXI= 10000
##$MC2= 0
##$MEAN= 0
##$ME_mod= 0
##$MI= 1.114404
##$NCOEF= 0
##$NC_proc= 0
##$NLEV= 6
##$NOISF1= 3.799351
##$NOISF2= 2.8
##$NSP= 1
##$NTH_PI= 0
##$NZP= 0
##$OFFSET= 15.70392
##$PC= 1
##$PHC0= -9375.953
##$PHC1= 11.20097
##$PH_mod= 1
##$PKNL= yes
##$PPARMOD= 0
##$PSCAL= 0
##$PSIGN= 0
##$REVERSE= no
##$SF= 200.130013532006
##$SI= 16384
##$SIGF1= 3
##$SIGF2= 2
##$SINO= 400
##$SIOLD= 16384
##$SREGLST= <1H.CDCl3>
##$SSB= 0
##$STSI= 0
##$STSR= 0
##$SW_p= 3612.71676300578
##$SYMM= 0
##$S_DEV= 0
##$TDeff= 0
##$TDoff= 0
##$TI= <>
##$TILT= no
##$TM1= 0
##$TM2= 0
##$TOPLEV= 0
##$USERP1= <user>
##$USERP2= <user>
##$USERP3= <user>
##$USERP4= <user>
##$USERP5= <user>
##$WDW= 1
##$XDIM= 8192
##$YMAX_p= 0
##$YMIN_p= 0
$$ End of Bruker specific parameters
$$ ---------------------------------
##NTUPLES= NMR FID
##VAR_NAME=  TIME,          FID/REAL,        FID/IMAG
##SYMBOL=    X,             R,               I
##VAR_TYPE=  INDEPENDENT,   DEPENDENT,       DEPENDENT
##VAR_FORM=  AFFN,          ASDF,            ASDF
##VAR_DIM=   8192,          8192,            8192
##UNITS=     SECONDS,       ARBITRARY UNITS, ARBITRARY UNITS
##FACTOR=    0.0002004,     1,               1
##FIRST=     0,             0,               0
##LAST=      1.6414764,     0,               0
##MIN=       0,             -60238,          0
##MAX=       1.6414764,     58610,           0
$$ Real data points
##PAGE= N=1
##DATA TABLE= (X++(R..R)), XYDATA
0 0 0 0 0 0 0 0 0 0 0 0 0 8 -8 8 -8 8 -16 16 -16 24 -24 32 -38 40 -48 56 -64 72 -80 91 -104 116 -128 144
34 144 -162 181 -200 222 -246 274 -304 336 -371 410 -457 506 -563 627 -699 786 -886 1007 -1154
53 -1154 1340 -1583 1916 -2397 3162 -4578 8067 -34956 -28967 35214 -28745 -60238 -3335 28690
67 28690 -37883 -58478 -1949 14333 -39029 -39471 9699 8857 -35128 -26624 8544 -1556 -30469
80 -30469 -14597 9685 -3361 -22346 -7596 8701 -1392 -13676 -3389 8638 1586 -11262
92 -11262 -5683 9414 8500 -5072 -1586 15577 12633 -7490 -5049 15263 12068 -6455 2084 23081
106 23081 13679 -5769 5014 20413 6312 -6162 10680 20842 4425 -794 16137 16964 186
119 186 2443 16798 10641 -1749 6768 16380 6549 917 11463 13010 1627 2341 11243 6202 -1218
134 -1218 7050 12555 1980 -1022 10672 9534 -4969 -2687 11528 6245 -8186 -414 14257 4593
148 4593 -10249 -529 12500 450 -12985 -1020 11670 -281 -11973 516 11614 -1623
160 -1623 -13592 -1627 9153 -3515 -13730 238 11150 -2940 -13810 468 10128 -5835
172 -5835 -15279 2358 12036 -6198 -14678 5249 12896 -8496 -14866 8207 13334 -10946 -14254 11400
186 11400 13268 -12438 -11275 15983 12674 -15120 -9972 17191 9242 -16832 -5039 21460 7871
199 7871 -17200 -1480 20783 1905 -18753 2484 21334 -591 -16192 6916 19001 -5581
211 -5581 -15457 8902 15850 -7715 -11704 10935 12002 -9550 -8966 10508 8135 -9413 -5843 9126
225 9126 4410 -8720 -3632 7432 2818 -6330 -2172 4887 751 -5570 -2320 3341 1313 -3192 -1497
240 -1497 2584 1120 -3264 -2515 1772 1553 -2263 -1533 2550 1663 -2301 -1410 2081 963 -1840 -190
256 -190 2096 651 -653 726 848 -165 710 1100 -939 -330 2621 938 -2820 343 4522 -205
272 -205 -4642 1491 5869 -2053 -6031 3463 6755 -4186 -6546 5572 6412 -6805 -6294 7780 5637
287 5637 -8831 -5125 9693 4241 -10652 -3567 10898 2342 -11747 -1686 11941 515 -12391
300 -12391 14 12062 -1278 -12497 1806 12241 -2819 -12304 3259 11862 -4524 -12267 4635
313 4635 11331 -6020 -11696 6051 10640 -7664 -11219 7156 9354 -9415 -10496 8496 8307 -10769
327 -10769 -9262 9564 6311 -12519 -8064 10316 4505 -13199 -5912 11186 2599 -13830 -4093
340 -4093 11112 165 -13713 -1532 11299 -1448 -12749 721 10449 -3423 -11475 2792 9500
353 9500 -4571 -9457 4645 8304 -5169 -7125 5905 6567 -5663 -5073 6354 4983 -5112 -2447
367 -2447 6959 3786 -4505 -869 5954 1915 -3821 811 5745 1410 -2267 1907 4169 -223 -1902
382 -1902 2151 3000 -497 -276 2798 1691 -1120 425 2359 -133 -1528 1411 2128 -1321 -1330 2571 1707
399 1707 -2573 -1211 3229 705 -4002 -694 4199 271 -4422 491 4905 -1170 -5763 1039 5082
414 5082 -2450 -5730 2848 5863 -3573 -6067 3811 5130 -5508 -6111 5197 5060 -6442 -5237 6683
429 6683 4222 -8155 -4863 7365 2869 -9239 -3612 8387 1768 -9924 -2198 8773 -183 -10925
443 -10925 -1208 8741 -1697 -10664 767 9055 -3066 -10562 1830 8168 -4734 -10052 3472
456 3472 7959 -5422 -8678 4948 7081 -6670 -7977 5759 6167 -7066 -6128 7186 5597 -7226
470 -7226 -4610 7644 4150 -7682 -3305 7910 3187 -7071 -1271 8335 2033 -6896 -359 7617
484 7617 617 -6340 1169 7439 -52 -5311 2087 6155 -1468 -4849 2465 5101 -1865 -3494 3140
499 3140 4064 -2341 -2840 2838 2506 -2767 -2099 2650 1685 -2390 -1045 2378 702 -2402 -622 1543
515 1543 -193 -1891 191 1421 -688 -1121 820 547 -1490 -792 1141 -258 -1732 620 1969 -947
531 -947 -1940 1411 1727 -2445 -2084 2670 1846 -3200 -1345 4035 1047 -4578 -884 4640 -109 -5276
547 -5276 529 5410 -1367 -5681 1753 5343 -2947 -5786 3019 4951 -4343 -5249 4422 4365 -5298 -4271
563 -4271 5131 3124 -6273 -3463 5630 2328 -6269 -2103 6129 1418 -6402 -1406 5916 574 -6164
578 -6164 -265 6357 391 -5794 300 6063 -440 -5707 1209 6303 -631 -5257 2109 6266 -1442
593 -1442 -5220 2674 6028 -2041 -4895 3541 5765 -2884 -4399 4302 5049 -3537 -3778 4612 3937 -4242
609 -4242 -2937 5080 3134 -4494 -2005 5022 1732 -4897 -1275 4759 770 -4516 -236 4429 -213
624 -213 -4320 322 3618 -1052 -3601 1142 3064 -1464 -2780 1462 2142 -1854 -1943 1808 1537 -1678
640 -1678 -879 1851 715 -1530 -73 1706 209 -1101 534 1301 -292 -514 1113 1021 -578 -96 1330
657 1330 369 -960 298 1454 2 -975 725 1535 -570 -1460 1005 1534 -1182 -1493 1611 1761 -1820
674 -1820 -1757 2029 1544 -2787 -1813 2993 1477 -3720 -1542 3864 773 -4824 -744 4785 -117 -5471
690 -5471 362 5317 -1362 -5850 1879 5487 -2851 -5536 3270 4908 -4148 -4493 4661 3808 -5061 -3146
706 -3146 5250 2402 -5523 -1796 5301 932 -5265 -482 4970 -81 -4655 185 3949 -692 -3918
721 -3918 489 3296 -789 -3370 309 2692 -713 -3111 21 2754 -427 -3266 -72 2903 -440
736 -440 -3590 192 3353 -858 -3915 952 3756 -1590 -3805 1952 3528 -2533 -3220 3007 2974 -3197
752 -3197 -2189 3797 1956 -3442 -794 4071 822 -3242 406 3703 -158 -2481 1383 2801 -847
767 -847 -1490 1820 1695 -1071 -397 1635 602 -829 331 1196 -83 -379 623 440 -526 -90 675 22
785 22 -635 43 391 -304 -588 132 408 -366 -718 -157 342 -319 -928 -190 759 -261 -1436 -127 1174
804 1174 -611 -1975 353 1596 -1150 -2207 1117 1888 -1951 -2152 2114 1747 -2760 -1703 3020 1194
820 1194 -3502 -956 3634 384 -3862 14 3905 -669 -3993 957 3752 -1558 -3641 1928 3304
835 3304 -2316 -3184 2366 2705 -2763 -2550 2787 2105 -3089 -1998 2868 1525 -3090 -1443 2978 1079
851 1079 -3135 -1068 2929 697 -3013 -560 2921 463 -2860 -278 2939 122 -2745 144 2877
866 2877 -122 -2527 598 2720 -377 -2244 901 2588 -628 -2023 1222 2242 -870 -1657 1406
881 1406 1994 -1054 -1384 1499 1611 -1219 -1135 1613 1143 -1363 -825 1540 858 -1464 -497 1490 282
898 282 -1548 -284 1369 -34 -1480 20 1119 -528 -1318 463 873 -786 -879 628 374 -1020 -488
915 -488 847 2 -1000 139 769 -489 -940 543 714 -772 -507 996 404 -1151 -221 1259 132
932 132 -1141 323 1439 -316 -1359 633 1445 -613 -1211 1059 1408 -1039 -1291 1141 1202 -1284 -1037
949 -1037 1570 1071 -1666 -976 1594 680 -1877 -699 1902 521 -2148 -492 1912 78 -2341 -111
965 -111 2155 -229 -2405 211 2187 -647 -2399 798 2230 -1007 -2122 1158 1992 -1488 -1857 1632
981 1632 1848 -1606 -1458 1898 1369 -1838 -1075 2067 1114 -1837 -649 2086 585 -1867 -213 2088
997 2088 422 -1735 8 1811 -28 -1707 170 1719 -191 -1487 345 1387 -467 -1407 472
1012 472 1252 -577 -1189 515 1011 -770 -1046 630 797 -776 -830 696 630 -907 -642 788 422 -819
1030 -819 -385 761 282 -851 -209 819 115 -625 120 666 -145 -471 384 551 -213 -252 543 319 -392
1049 -392 -47 645 146 -418 243 677 -199 -489 459 555 -463 -387 687 356 -824 -293 804 200 -959
1068 -959 -82 980 -143 -1145 94 1066 -432 -1177 465 1037 -778 -1156 681 932 -1009 -1018 970
1085 970 905 -1178 -814 1200 727 -1260 -577 1388 529 -1400 -384 1462 281 -1434 -76 1609 139
1102 139 -1522 44 1516 -128 -1471 352 1540 -360 -1453 609 1482 -615 -1399 763 1266 -919
1118 -919 -1303 933 1153 -1050 -1105 1080 875 -1249 -907 1110 621 -1320 -635 1244 423 -1355 -446 1167
1136 1167 61 -1299 -125 1179 -70 -1210 102 1023 -324 -1014 363 967 -458 -805 507 765
1152 765 -465 -593 606 558 -493 -401 676 432 -496 -175 642 281 -446 -95 544 136 -449 39 476
1171 476 -41 -399 110 337 -197 -314 229 217 -319 -148 356 99 -459 -99 389 -100 -545 57 476 -296
1191 -296 -546 250 289 -522 -457 540 199 -654 -259 660 115 -740 -113 805 -58 -745 136 802 -156 -781 398
1212 398 810 -294 -673 527 738 -494 -690 689 710 -583 -612 774 581 -675 -482 851 482 -787
1230 -787 -368 867 399 -955 -343 912 231 -946 -78 990 61 -1169 -42 987 -219 -1122 209
1247 209 1002 -398 -1022 387 879 -508 -945 469 758 -594 -778 599 644 -709 -613 768 545 -747
1265 -747 -436 781 424 -748 -233 802 248 -740 -150 778 162 -637 27 749 -25 -681 142 650 -168
1284 -168 -602 237 457 -314 -444 310 335 -424 -382 341 180 -489 -231 320 9 -450 -136 312 -143 -469 67
1305 67 197 -288 -297 169 78 -204 -107 260 -18 -348 -41 246 -103 -245 140 290 -131 -254 178 241 -192 -166
1327 -166 286 219 -310 -103 375 164 -409 -17 418 45 -458 74 456 -61 -496 55 489 -171 -510 106
1347 106 463 -187 -538 263 427 -363 -457 323 376 -416 -406 438 348 -566 -388 470 276 -617 -229 601 266
1368 266 -533 -163 562 88 -516 -84 610 74 -595 54 646 -30 -524 190 685 -73 -563 225 662 -127
1388 -127 -542 365 599 -326 -423 461 550 -458 -383 487 366 -464 -216 518 163 -487 -111 534 38 -499 24
1409 24 395 -39 -513 95 407 -118 -371 146 300 -127 -290 152 202 -165 -177 185 164 -212 -107 219 138 -240
1431 -240 -45 261 101 -200 -17 253 -29 -200 128 241 -53 -159 243 216 -212 -71 233 15 -242 78
1451 78 335 -90 -241 139 277 -225 -242 251 324 -288 -175 330 117 -434 -93 415 22 -426 -10 422 -26
1472 -26 -469 48 431 -192 -305 165 307 -216 -285 177 293 -187 -283 185 307 -153 -238 190 262 -184 -262 265
1494 265 359 -232 -298 361 304 -421 -280 446 282 -399 -223 522 172 -586 -128 569 55 -634 8 504 -148
1515 -148 -593 127 515 -192 -484 233 373 -345 -454 313 327 -378 -332 283 160 -378 -227 304 139 -324 -159
1536 -159 280 48 -331 -121 288 91 -341 -62 346 37 -267 27 312 57 -285 84 265 -88 -249 143
1556 143 221 -121 -183 171 243 -216 -184 182 131 -255 -14 227 -13 -234 51 239 -104 -201 150 145 -204 -169 177
1579 177 55 -224 -53 209 33 -230 6 209 -112 -261 129 103 -151 -111 224 110 -175 -136 264 59 -252
1600 -252 -39 290 -10 -286 54 289 15 -186 21 285 -91 -299 63 262 -53 -249 122 158 -210 -304 138
1621 138 224 -170 -212 167 195 -233 -268 182 186 -325 -245 277 128 -334 -133 291 63 -356 -107 188 53 -380
1643 -380 -30 344 27 -364 -24 311 -44 -368 101 352 -50 -339 129 350 -178 -296 134 287 -174 -217
1663 -217 277 209 -226 -186 227 124 -274 -57 300 103 -307 -38 262 32 -264 -21 193 -72 -189 66 182
1684 182 -34 -165 23 180 -164 -165 84 136 -149 -145 115 74 -125 -11 73 -9 -149 -21 110 -3 -101 87 98
1707 98 -66 -55 101 89 -122 -71 140 -36 -101 30 138 -78 -134 79 180 -64 -193 142 177 -199 -92 200
1729 200 163 -184 -69 157 69 -216 -4 264 37 -193 -7 264 -50 -267 -13 280 -73 -327 51 238 -102
1750 -102 -219 112 229 -187 -238 168 211 -250 -211 186 194 -225 -176 151 242 -241 -150 308 114 -272 -103 314 112
1773 112 -275 5 269 22 -332 4 300 -50 -315 57 301 -68 -331 88 252 -152 -236 110 241 -227
1793 -227 -244 170 205 -208 -193 180 187 -198 -147 172 84 -183 -72 152 20 -219 -39 110 -31 -255 42 142
1815 142 -12 -121 6 190 -43 -107 83 106 -217 -160 168 78 -57 25 110 81 -116 -53 162 -44 -87 112 126
1838 126 -84 -99 84 48 -142 -73 133 52 -153 -52 96 29 -203 -3 144 -62 -132 30 129 -141 -154 73 104
1861 104 -155 -113 97 103 -94 -73 97 99 -159 -50 196 66 -174 -30 207 48 -160 4 273 9 -204 99
1883 99 264 -1 -209 85 256 -97 -201 177 254 -160 -148 188 227 -231 -166 214 127 -301 -186 248 98 -242
1905 -242 -106 316 30 -271 -68 258 -20 -263 -9 302 19 -289 17 239 -45 -211 81 183 -101 -175
1925 -175 111 224 -117 -144 157 159 -170 -175 177 160 -147 -119 162 79 -197 -39 231 62 -199 26 183 -2 -147
1948 -147 93 206 -63 -152 82 40 -27 -86 67 26 -59 -84 71 55 -88 -39 71 -14 -156 -76 54 -44 -77 -2 10
1973 10 -82 -68 45 21 -112 -36 91 -15 -76 -102 152 1 -36 2 147 -24 -104 53 132 -91 -66 96 127 -127
1997 -127 -110 117 111 -88 -112 136 44 -210 -35 248 35 -212 7 227 10 -234 -37 303 -97 -222 91 163
2019 163 -72 -236 64 178 -217 -251 106 132 -190 -192 204 130 -162 -161 163 68 -230 -117 198 137 -239 9 233
2042 233 64 -242 -45 226 48 -178 42 256 -29 -199 104 175 -39 -150 62 153 -83 -137 113 103 -105
2063 -105 -129 127 100 -136 -82 134 4 -113 -56 151 4 -153 -16 127 4 -117 -33 94 -71 -118 44 86
2085 86 -55 -67 92 82 -63 -40 42 -6 -33 -41 105 13 -77 53 130 8 -65 93 131 -26 -20 48 31 -93 -71 119
2111 119 35 -49 31 55 5 -56 34 41 -44 -53 60 74 -27 -115 27 113 -55 -135 35 116 -98 -96 92 82 -163 -147 65
2138 65 139 -180 -117 227 24 -149 -72 170 72 -253 -12 245 -42 -173 97 290 -29 -242 127 184 -78 -161
2160 -161 128 151 -135 -158 149 179 -151 -108 132 147 -210 -75 163 73 -154 -81 198 45 -151 -17 148 -10
2182 -10 -176 -40 169 36 -140 31 158 -101 -140 33 158 -57 -137 84 178 -81 -233 101 166 -65 -73 108
2204 108 56 -112 -48 120 -42 -118 5 129 15 -139 22 120 -84 -142 1 99 -112 -53 95 0 -94 -47 80
2227 80 -15 -101 46 29 -49 -95 1 60 -35 -38 59 -9 -22 -38 16 0 -47 -30 29 -36 -5 -20 71 32 -85 -60 53 21 -49
2256 -49 26 107 -16 -125 42 129 -20 -117 97 179 -14 -136 60 181 -58 -90 151 157 -139 -138 196 -15 -135 -15
2280 -15 176 96 -131 -58 192 -8 -191 46 211 -96 -167 13 174 -54 -119 134 99 -144 -183 115 111 -161 -142
2303 -142 78 34 -168 -91 99 40 -129 -40 156 24 -125 50 191 16 -149 52 146 6 -132 49 178 -12
2325 -12 -94 62 111 -69 -103 59 114 -72 -48 124 64 -138 -137 116 41 -83 -32 104 -15 -147 10 60 -9 -90 -6
2350 -6 40 -115 -18 -14 13 -62 -89 47 23 -82 -59 43 -2 -93 41 138 -44 -108 92 35 -82 -52 64 15 -63 -8 78
2377 78 68 -80 -28 72 26 -65 37 109 -2 -95 53 131 15 -66 70 126 -10 -87 -31 102 -56 -137 58 139 -72
2402 -72 -92 19 62 -115 -42 82 89 -114 -116 149 26 -149 -72 124 -2 -135 -114 196 -10 -120 -20 106 -61
2425 -61 -148 50 142 -33 -155 82 175 -15 -69 56 155 -67 -154 134 136 -112 -68 182 26 -56 -92 94 47 -96
2449 -96 -64 37 28 -105 -23 75 -22 -111 -1 81 -73 -101 34 66 -60 -88 48 58 -49 -53 68 52 -114 -53 83 42
2475 42 -106 -99 50 3 -125 5 107 35 -62 35 81 -13 -125 68 78 -20 -43 91 27 -72 3 50 -8 -61 24 70 23
2502 23 -61 -31 54 -65 -32 63 95 -20 -101 83 32 -129 -44 21 -7 -52 -36 109 11 -156 -31 87 -41 -92 15
2527 15 116 -107 -85 32 55 -70 -113 74 148 -45 -57 121 33 -120 -72 114 4 -101 -68 80 51 -73 -22 196
2551 196 -61 -101 -46 114 44 -16 8 102 25 -126 52 113 -52 -41 77 103 0 -80 74 115 -95 -88 13 65 -94
2576 -94 -15 50 20 -168 -93 141 -22 -129 -4 80 -15 -113 -1 25 -20 -51 44 129 -38 -84 -6 19 -65 -68 1 58 -48
2603 -48 18 45 73 -28 4 57 79 -19 37 123 23 15 29 41 -43 -59 70 135 -24 -30 26 50 -67 9 79 76 -114 -26 97
2632 97 -10 -83 3 48 -38 -69 24 65 -81 -67 -3 34 -21 2 48 104 -69 -30 82 71 -72 -33 115 -4 -95 86
2658 86 119 -17 -78 28 145 4 -112 -32 103 -36 -65 23 110 -14 -89 12 76 -9 -22 93 94 -46 -67 92 -32
2683 -32 -91 -74 44 -4 -69 -6 113 16 -151 -42 106 -116 -101 66 91 -70 -54 44 63 -71 -35 122 69 -48 -96
2708 -96 41 82 -85 15 95 70 -127 -4 69 -28 -120 -65 112 35 -28 50 43 -39 -42 9 95 -25 -44 -13 89 -23 -50
2735 -50 55 -6 -118 -47 0 -12 -75 -21 42 -31 -113 -42 -11 -30 -57 63 2 -55 -70 45 -16 -74 -43 54 66 -16 -57 71
2763 71 5 -123 56 16 5 -59 9 36 -44 -56 69 55 -32 -68 48 6 -83 -59 77 51 6 -39 31 30 -17 -2 12 -13
2791 -13 -59 3 76 -27 -61 74 10 -19 -76 -8 74 -44 -99 -3 28 -67 -81 84 7 -68 5 117 -10 -57 -67 95 2
2818 2 -114 -87 74 -6 -121 71 69 -86 -56 55 106 -27 -40 45 61 -112 -105 72 130 19 33 40 93 -16 -33 37 101
2845 101 -80 -29 135 23 -86 22 101 -102 -100 25 36 4 -101 -60 86 -44 -66 -4 59 -40 -22 69 -24 -70 -64 31
2871 31 -7 -10 -29 33 2 -37 -3 138 -11 -22 79 25 -1 -79 73 35 3 -52 51 5 8 34 5 72 -53 5 69 24
2899 24 -45 9 47 25 -81 45 94 -14 -50 -1 43 -52 -69 3 56 -55 -38 37 -10 -94 -13 61 19 -118 -28 57 -35 -63
2927 -63 11 70 -29 -102 44 52 -62 -79 36 26 -63 -61 80 48 -68 -9 111 40 -87 -38 73 -23 -64 -25 67 23 -82
2954 -82 9 73 -26 -33 63 82 -22 -121 47 41 -91 -131 33 67 -120 -90 36 28 8 -63 62 -5 -48 -5 38 -43 -29 -30 55
2983 55 29 -98 27 57 2 -57 14 47 -75 -5 41 51 36 -86 32 52 16 -19 29 -11 -21 -14 44 -25 -18 31 99 70 -16
3012 -16 48 11 25 -45 31 63 -60 -6 -55 37 -82 24 -5 -20 -41 9 0 -29 -45 27 3 46 -40 29 48 -84 -55 23 60
3041 60 -66 -86 -12 72 -50 -35 37 39 -64 26 25 1 -19 12 107 2 -85 36 87 -38 -78 50 73 -64 -87 16 61
3068 61 -104 -38 49 96 -43 -28 33 33 -80 -45 -4 -26 -137 -11 107 -52 -113 -36 166 33 -145 37 92 -33 -92
3093 -92 -4 130 -25 -93 19 97 -14 -24 71 58 -45 -17 31 31 -98 -55 65 54 -63 0 80 1 -113 -45 47 -45
3119 -45 -3 22 44 27 -72 42 34 -22 -44 18 39 -63 -102 10 34 -29 -82 -42 30 -59 -9 -17 -4 -101 -56 5 -3 -56 46 4
3149 4 -28 -58 -21 17 -42 8 53 -27 -93 -64 63 35 -43 -8 96 18 30 -30 67 -12 -73 -20 27 -16 -42 36 60 -72 -45
3178 -45 -7 79 -32 -39 49 37 -78 27 76 19 -74 -34 32 -22 -4 -2 89 -64 -61 10 65 -82 -153 52 104 -35 -47 104
3206 104 27 -62 -58 64 54 -43 -24 94 80 -32 -10 115 17 -63 -29 51 -7 -76 -39 98 26 -114 0 51 -44 -110 32
3233 32 34 -72 -51 45 -1 -62 -116 73 -6 -51 -120 91 91 -93 -12 68 -33 -79 40 32 16 -32 -1 60 8 -42 -36 37 -14
3262 -14 -83 58 54 -21 -17 -1 37 -38 -29 16 13 38 -87 125 -34 -14 37 -22 12 -21 26 17 -8 -67 46 -7 -25 -14 8 46
3292 46 -14 52 57 46 -80 -14 -2 -2 -25 -27 2 -27 -25 -16 54 -37 -33 27 53 -71 -54 48 81 -79 -92 42 66 -112 -86 66
3322 66 60 -67 -70 114 -17 -55 -27 137 -14 -43 7 122 -2 -67 -26 88 46 -31 -9 97 8 -99 -8 56 -72 -97
3348 -97 67 27 -139 -81 95 35 -67 -52 92 17 -115 -50 41 6 -105 26 40 21 -76 -35 73 40 -38 3 77 23
3374 23 -103 35 122 -1 -19 -14 34 -38 -91 -1 63 -49 -8 39 13 -24 3 39 16 -136 16 72 -17 -46 18 27 -25 -87
3402 -87 45 15 -53 -37 -8 10 -38 -10 -1 19 -38 1 15 -19 -75 -9 74 17 -128 33 -8 -36 -81 19 43 -8 -89 2 15
3431 15 -29 -15 86 52 -9 -40 43 -2 -36 -32 36 -7 -71 38 94 7 -88 85 87 -50 -75 49 51 -38 -26 39 26 -102 -52
3460 -52 126 28 -16 -17 45 16 -39 -29 50 -51 -27 25 50 -16 -85 2 66 3 -94 51 61 -56 -61 35 64 -36 -56 71
3488 71 21 -32 -35 41 -23 -95 -12 90 32 -57 -33 45 14 -67 34 85 28 -45 -18 67 10 -37 -2 54 -2 -79 33 60 -51
3517 -51 -68 -17 -2 19 -66 43 79 -145 -2 41 -31 -54 -10 22 10 -115 4 31 -19 -45 -29 65 -37 -60 23 -15 -66
3544 -66 -27 28 -2 10 -23 15 5 5 -36 -15 -25 -79 3 40 44 -28 32 68 58 -41 19 46 -53 -70 40 57 -61 6 59 36
3574 36 -51 -18 54 37 -60 -14 86 -90 -56 39 133 -15 -48 69 32 -26 -94 0 21 4 -58 22 17 -57 -85 -1 -21 -67 -59
3603 -59 55 52 -167 -59 59 -29 -114 -16 102 -2 -60 29 96 42 -39 57 109 -32 -76 62 88 -51 -28 50 63 -55
3629 -55 -92 48 42 -78 -50 -2 64 -81 -162 94 -23 -87 -52 81 -11 -54 11 76 13 -100 7 28 -12 -87 17 13 -114
3656 -114 -68 14 16 -8 -72 -26 -8 -122 9 1 36 -35 -3 70 -9 -59 33 60 37 -6 19 46 -73 3 43 -18 -36 -13 66
3685 66 -6 -6 66 6 -30 10 32 48 -35 -82 76 81 -22 -86 16 26 -36 -55 35 -8 -52 0 50 19 -44 15 12 36 -106 22
3715 22 94 87 -81 -21 38 -7 -70 -52 6 -15 -77 38 151 7 -10 4 113 1 -52 18 40 -78 -81 72 25 -92 -95
3742 -95 13 -15 -49 -7 69 -17 -60 8 148 11 -75 -44 50 18 -39 36 76 -101 -101 20 81 -61 -157 11 121 -32
3768 -32 -83 33 -7 -71 -26 79 64 -26 -89 137 4 -33 16 88 -29 -26 5 74 27 -60 8 26 -14 -79 37 49 -57
3795 -57 -63 51 22 19 -81 61 52 -48 -58 53 -21 -131 24 6 16 -68 39 52 -60 -90 -4 -24 -74 -41 12 18 -48 -9
3823 -9 -2 9 -61 -25 -10 13 -60 24 82 -35 -36 46 11 11 -43 38 15 -8 11 76 82 -52 46 88 56 0 2 107 84 -55 -27
3854 -27 11 47 -105 15 81 -4 -62 12 62 -16 -90 -14 27 -111 -45 40 73 -55 -69 59 89 -100 -63 17 72 -49 -23
3881 -23 143 26 -34 -9 63 -4 -40 -16 -14 27 -69 9 62 -38 -78 20 66 -95 -85 24 37 -10 -81 13 38 -10 -14 40 3
3910 3 -73 -3 43 -8 -32 -5 18 -47 -27 -49 30 -25 -51 -27 -28 -7 -23 -48 31 -15 -91 -7 52 -22 -34 -21 -26 -42 -83 -9 -41 -76
3942 -76 -30 71 -1 14 12 57 10 -14 -13 -23 -8 -62 13 52 22 -30 36 -60 -30 11 8 88 -75 -22 66 24 -7 -13 52 10 -108
3973 -108 58 50 -51 -45 -13 57 -33 -93 52 5 -97 -18 30 5 -114 -42 41 -12 -87 40 7 24 -63 -25 74 23 -73 5
4001 5 65 -82 -55 -42 54 -26 -47 -24 67 -75 -65 115 24 -29 -88 -36 38 -8 -10 57 11 -3 -60 134 51 -89 -8 63 -12
4030 -12 -105 -38 34 -42 -51 31 36 35 35 -20 -1 -25 -56 34 47 36 -28 67 34 -9 -6 24 -29 -75 -16 26 43 -48 6 -24 30 -101
4062 -101 41 24 -3 -18 15 15 -42 14 -12 16 14 -13 17 47 -51 -26 55 21 -61 -49 73 4 -5 31 61 16 -21 -10 40 19
4092 19 -13 53 44 -30 -55 -31 -13 -28 19 38 -19 -58 15 70 -45 -105 -40 44 4 -38 4 47 -46 -32 24 33 -44 -13 56 18 7
4123 7 -15 51 -9 -39 -24 10 65 -52 13 72 78 35 47 83 31 -51 48 38 7 -99 20 88 2 -8 34 21 4 -111 52
4152 52 45 8 -41 17 86 -70 31 -13 13 12 -26 110 62 -92 -91 97 -37 -116 21 61 35 -56 31 54 -41 -11 68 -26
4180 -26 -32 -72 -28 39 -36 -8 54 14 -15 -5 40 83 -13 -28 17 20 -16 -15 -13 -24 -41 48 62 41 -31 19 -3 -51 -34 28 -22 -7
4212 -7 0 4 43 4 -85 37 8 -40 54 42 6 -71 27 43 -74 -12 13 56 -32 -62 -21 54 -48 -1 38 -20 9 41 76 16
4242 16 -23 -38 48 37 -3 -21 58 41 -9 28 -10 27 -15 89 6 19 -40 11 12 -35 -3 11 45 -61 35 -26 12 -25 -49 -9
4272 -9 -50 -110 36 51 -18 23 -36 34 -42 -82 -8 21 -69 1 2 38 29 14 57 70 1 46 27 39 9 -8 73 36 -85 3 41
4303 41 -39 27 9 49 -18 -41 22 44 5 16 6 49 -92 -6 42 6 -79 43 12 -6 -21 -70 20 26 -34 -18 3 15 -46 10
4333 10 45 46 -28 1 -10 -53 -29 24 5 4 6 14 13 -6 -9 -33 22 -19 -6 -36 -3 -29 14 54 -24 26 48 71 -3 4 24 -16 -13 7
4367 7 23 38 15 -24 50 3 -88 -18 37 19 -73 45 54 -30 -22 -6 21 -38 -38 22 18 -11 -61 -42 29 -24 -9 55 47 -11 -83 -50 51
4400 51 -51 -53 37 104 -37 -23 -4 -7 -40 6 96 -42 -47 30 40 -14 -75 2 44 -34 -101 -12 63 -30 -63 -18 13 -15 -27 14
4430 14 15 -66 -30 36 3 -83 -32 12 15 3 -5 42 2 -29 -22 85 -5 -27 -10 34 -29 -35 15 48 13 7 54 18 -62 -15 4 -23 -51
4463 -51 -34 51 -10 -56 -11 7 26 1 6 21 -13 11 13 -4 7 34 2 7 -10 2 32 -82 -44 20 -6 37 -68 -10 47 -40 22
4494 22 -26 22 56 -26 18 47 -52 -44 60 -10 -4 -23 44 49 -24 -12 59 -22 -31 13 36 -19 -97 37 56 -22 -23 -35 -18 14 -44 88
4526 88 49 -44 -63 4 70 -1 -58 -5 -44 27 -52 12 54 -28 -32 -8 -26 -12 23 25 10 45 -46 87 51 -63 -28 25 -55 -49 39
4557 39 -11 -8 -33 -32 53 -28 10 37 63 -45 -41 87 9 -73 34 29 -6 -33 -63 65 -16 -87 -10 6 -6 -71 1 46 6 -36
4587 -36 7 -36 12 9 27 29 -61 70 -26 -14 -42 -46 -1 -38 -10 -27 -23 -23 -40 29 0 17 -30 31 -7 -41 -50 -36 36 5 14 -9 3
4620 3 2 -32 -6 57 32 -20 12 12 -28 -34 39 -16 -19 54 75 -35 18 39 20 -21 -75 85 -5 -28 -8 18 0 7 -68 40 1 -22
4652 -22 -43 10 14 -88 -63 63 6 -115 67 50 -26 3 -31 69 14 -31 20 -12 -19 -23 26 2 -19 2 37 47 -27 -91 27
4681 27 63 -61 2 32 -29 -60 -2 39 -11 -61 -2 54 -22 -96 31 -34 -21 -9 20 29 -48 -51 3 20 -16 17 43 26 -5 -8 54
4712 54 46 13 -24 20 -88 -65 -41 4 -7 1 31 -16 15 21 43 74 -29 31 74 52 -7 0 87 -27 -16 -12 22 -18 -30 59 3
4743 3 -12 -88 47 73 8 7 63 -21 -29 30 47 40 -36 17 5 -3 -76 -64 55 1 -14 -13 59 -2 -15 32 -1 26 -36 -22 62 -36
4775 -36 -51 2 0 -92 -77 26 10 -38 -88 58 43 -82 -33 30 -15 -22 16 62 -32 -11 4 61 1 -15 19 27 -33 -118 59 -7
4805 -7 14 -63 25 -17 -56 -46 14 42 -40 -21 82 -8 -69 -48 -36 34 6 -20 49 -36 -100 -51 -31 67 -37 15 -10 -79 -16 -7
4835 -7 56 -24 -27 26 39 36 -22 45 26 -6 -20 46 8 -68 2 43 -13 34 -12 -64 30 -60 -73 14 -39 -94 -51 35 11 -23 20 -21
4867 -21 -39 29 -1 7 -43 79 40 -29 -9 36 10 31 12 -7 73 15 13 29 -19 -39 -8 13 1 -76 -37 1 -16 -16 31 -23 -86
4898 -86 -26 -12 -17 7 -40 -16 -6 -48 -19 26 38 21 -91 -46 74 -73 -5 -6 73 -92 -21 41 17 -38 -5 24 73 -16 -17 13
4928 13 61 1 47 9 14 -34 -39 10 36 -58 34 32 -27 12 -24 -8 -24 -47 -12 53 -36 3 -42 46 -19 -3 -33 82 -20 -19 -3
4959 -3 26 -71 -27 -16 34 -30 -29 63 5 -19 29 -3 -25 1 6 -15 5 27 62 33 20 -14 11 -8 -14 -7 -54 -32 -20 -14 -9 -5 56 -19
4993 -19 51 -31 -11 -11 6 15 -56 -1 5 -19 -28 53 21 -85 -21 -19 20 -7 -22 61 -4 -16 -14 28 8 3 37 6 35 -10 76 22 69
5026 69 -37 42 26 -27 17 -46 -24 22 -41 -9 -18 -29 -39 63 -21 13 42 39 -69 -36 -107 -7 -46 -18 74 24 -30 -68 -21
5055 -21 60 -52 -68 40 -43 -57 -4 21 -19 -83 -82 -1 -32 -40 25 16 0 -31 -29 66 -12 -20 -1 11 34 4 45 11 -33 0 -17 25
5087 25 -21 7 47 -14 -26 -41 60 -33 5 12 37 13 -66 -32 28 -36 -42 -3 16 4 -42 18 11 33 -8 -7 24 -76 -64 18 -54
5118 -54 -81 -59 34 49 -27 17 -10 -20 -76 48 3 6 -25 17 -19 -28 -14 33 -16 -45 -20 25 46 -19 32 18 11 -46 -37 -14 29 -66
5150 -66 -50 -28 -69 -29 20 -9 -26 -30 28 -2 -22 -61 -17 -35 -32 -48 3 -34 8 30 47 104 -23 30 35 -70 -41 37 -12 -9 -19
5181 -19 25 64 9 -57 -18 -32 -36 -6 17 17 37 -18 -21 15 -28 -20 -6 23 24 -34 58 107 -24 -47 63 -24 -51 1 80 3 -28 -20
5213 -20 34 -18 2 14 -23 -3 37 6 -9 -51 -14 21 -5 -62 7 11 12 -19 -19 3 -27 5 28 5 5 -15 -1 7 -4 -34 24 58 13
5246 13 -19 39 15 20 -26 -31 39 24 16 -19 -81 -100 -6 17 42 -50 18 -11 7 8 -20 3 -6 -41 52 13 -15 -33 14 -39 -17 -68 15
5279 15 -43 -23 -33 18 -31 -26 11 -29 -40 -23 0 44 35 -60 40 15 -16 -27 -2 -10 -8 -35 15 48 -39 -15 -8 9 8 -66 23 6 -63
5312 -63 -33 21 6 -55 2 46 -69 -55 16 20 20 -28 43 -43 -32 -65 -47 68 -8 -44 -14 50 -69 -18 -5 -59 63 -86 56
5341 56 -51 21 -20 49 7 4 4 29 -27 26 40 15 -3 -49 46 21 -57 1 22 38 -65 -18 7 22 -13 -14 -45 -9 74 -16 -11
5372 -11 19 72 -5 19 -50 -29 9 28 29 -41 8 55 -16 -23 -81 -11 34 -58 -42 59 -74 -16 -15 -55 -34 25 15 3 -25 12 -63
5403 -63 -6 46 20 -18 -58 25 22 -35 18 17 48 -9 15 -21 -5 -45 -35 3 -24 -1 20 30 11 -39 -54 34 -24 9 -35 35 18
5434 18 34 -33 -23 56 -25 9 -66 10 -29 -32 63 -13 -19 -15 -11 -62 -21 -1 -8 22 -46 -112 -13 -6 61 -66 -54 1 -64 23 -56 -42 4
5467 4 -19 50 30 -31 -69 4 -11 2 36 -8 -67 -26 57 -29 -33 22 -15 -3 8 -12 17 8 -52 -45 12 62 16 17 -70 4 14 22 9
5500 9 -32 -22 37 33 47 -14 -77 -26 -4 22 -29 3 14 7 0 32 10 14 50 -36 40 -31 59 23 -26 -9 44 -33 -62 24 -39 -2 14
5533 14 49 19 1 24 56 2 40 12 55 -16 -18 99 0 0 -73 16 7 -44 -21 -26 -30 -38 -16 40 -1 -51 -32 5 -63 16 43 39 4
5566 4 -15 2 72 -24 15 -23 1 -39 -4 10 -31 -30 -17 -14 -23 -26 -48 18 9 51 -14 37 1 -52 82 -13 -17 29 0 -51 -37 -16 -4
5599 -4 -21 8 57 30 21 12 10 31 26 30 15 48 -23 34 -6 12 43 -31 -1 -1 -14 -4 6 -41 -11 -7 -16 10 20 -26 -11 -34 -43 31 -14
5634 -14 22 -52 -88 -44 -34 34 -31 61 41 8 -17 -24 40 39 -48 6 -17 9 -18 4 -8 -41 -25 4 -7 -22 0 -41 -61 8 33
5665 33 -6 -39 16 -36 41 -49 16 -4 -7 -6 86 -17 -22 -53 -20 78 -34 -48 -20 8 -27 -5 16 38 -72 23 69 -36 11 34
5695 34 3 -63 -1 -80 0 -6 6 10 -33 -6 -32 13 -9 -1 -29 -27 31 -4 39 -30 -34 -13 5 64 47 -5 -55 23 11 -39 -30 -1 40
5728 40 -20 6 43 34 -42 -10 -41 -82 42 35 -30 6 46 5 2 -7 -37 41 -1 -36 -19 12 -2 12 -2 -28 22 -25 -48 -8 -35 -3
5760 -3 16 -4 5 -53 15 -2 12 -31 6 -39 -8 -18 49 49 3 -7 60 48 26 -38 21 62 7 -44 8 -12 -26 -27 -29 -8 8 -11 15
5793 15 25 -16 -13 -6 -6 11 -8 12 -6 63 47 -17 -29 59 40 -81 36 -28 53 -10 -45 -23 9 -9 11 11 -49 -56 57 -44 -26
5824 -26 24 55 -34 -28 -29 70 -35 33 -15 -34 -47 -8 36 28 41 -43 -46 -42 31 12 21 14 -11 30 -9 36 18 -11 -44 3 71 -5 2 -41
5858 -41 25 34 -19 1 -8 3 -11 -39 9 -26 -43 4 34 -30 -2 -47 9 17 8 18 24 3 56 -12 3 -29 28 -13 18 5 41 24 -22
5891 -22 -6 38 25 -72 37 -30 -64 42 -82 -5 -76 5 -3 -51 -6 -14 -12 -36 21 -6 -1 -43 -14 -2 -6 -2 -2 -69 12 -9 -53 20
5923 20 0 -22 61 -5 -37 -44 -36 3 29 -28 -1 -15 1 -9 -25 -15 -27 10 26 -27 27 -9 -14 -19 32 48 4 82 -93 52 -57
5954 -57 -13 11 -26 11 -34 4 3 22 6 33 -2 -58 -4 -20 -57 5 -15 4 -22 8 -3 -6 -22 -8 -2 -31 -10 11 18 -34 -4 24
5986 24 -30 42 18 15 17 24 -27 2 -47 50 -33 -17 -8 6 24 4 -12 -19 55 17 32 37 79 -38 32 12 8 -70 -34 7 41 25 -21
6019 -21 -58 -39 -14 51 16 13 6 -5 27 15 85 -6 46 -46 4 -31 -14 85 3 39 7 -3 58 2 12 16 65 18 -26 41 16 -16
6051 -16 5 46 -7 11 25 -17 6 -17 -26 24 22 17 -10 -11 50 0 1 11 14 -8 28 9 -18 -24 -28 -9 20 -16 15 43 75 10 -42 -27
6085 -27 47 -6 -25 -5 42 -6 -6 -2 5 15 -56 -10 -8 -3 -10 -25 -31 34 -33 -43 0 18 -28 -62 -57 -28 20 -42 -8 -8 -30 -51 -43 8 -39
6120 -39 -65 9 -19 20 -25 5 -20 33 8 -28 -3 -18 -17 -40 19 33 -23 13 -50 14 -17 23 23 25 26 16 9 -59 -37 -30 -34 11 -32 -28
6154 -28 -68 -11 15 -7 36 -11 -37 -26 -22 -6 12 5 36 -34 -91 13 -69 30 28 14 -10 -17 18 -21 17 -19 -13 -19 -19 -26 12 -36 12 -5
6188 -5 11 -18 16 -34 18 31 -4 4 9 16 -11 0 5 -5 -1 16 -29 -43 18 4 41 3 13 -47 -17 12 30 -28 -21 -25 -6 37 -16 12
6222 12 -11 24 -13 19 33 34 -43 -25 -10 43 -18 27 28 22 14 36 -4 31 -46 -91 -7 -5 8 2 -60 47 -36 52 19 -43 73 -2
6254 -2 10 49 -38 -17 -28 -18 37 40 -3 7 13 22 21 -36 -31 18 -5 -57 8 -56 -14 -37 -17 22 -5 -76 -68 17 -37 23 -69 17 -52 25
6288 25 60 35 -29 -13 18 -31 -46 2 67 12 -47 -25 29 -1 -9 -13 6 13 34 -4 -32 -28 42 6 -18 -42 -19 42 33 40 -30 10 -10
6321 -10 -10 -27 22 11 -8 43 6 -21 -22 6 1 -8 32 -70 -67 17 -36 -4 -24 18 25 43 16 -12 33 24 1 -5 3 -9 -32 -47 18 4
6355 4 -36 -51 17 51 64 -27 23 -21 31 34 -20 -49 -10 75 22 -13 -28 -13 22 49 33 64 69 12 69 48 25 -32 -12 47 -20 1
6387 1 -8 7 -65 -17 -5 14 65 9 37 -13 6 -39 36 9 3 -54 18 -14 -49 16 6 14 -5 30 -38 -52 -37 8 -4 -3 -24 -20 -11 -15
6421 -15 -24 -41 -11 -12 15 9 2 52 25 -39 18 39 -55 -37 84 5 32 38 13 55 -4 47 54 -23 -12 -12 34 -93 -9 19 8 14 -8
6454 -8 -15 5 -8 -20 -64 73 -68 32 -10 -16 15 -22 41 -32 -39 51 17 -8 -33 29 61 0 4 21 18 25 -12 -7 24 -35 -21 -30 39
6487 39 17 -23 -64 4 -50 5 -33 41 -6 17 -20 -41 -43 -16 31 4 -12 30 41 -38 9 -21 -42 19 29 44 10 -45 50 -36 -34
6518 -34 -32 -10 40 19 33 23 -34 -129 17 77 0 -2 -50 0 -34 -15 -50 39 -65 -5 4 -6 26 -49 9 -3 47 -4 -5 10 -22
6549 -22 26 14 0 -15 -19 17 18 29 -17 -23 10 -11 -91 -15 -12 21 9 -60 47 -6 -14 -31 17 37 -33 -12 -29 -65 -24 0 -16 -4
6581 -4 37 11 -2 -24 19 3 -27 -38 -12 33 -7 14 13 -3 0 -22 11 28 -4 9 2 -23 -22 1 14 -31 -19 -6 22 15 -40 67 -34
6614 -34 -5 37 -26 -26 -1 -85 9 13 -20 -44 19 -12 2 57 -10 -12 -37 -16 24 21 -35 1 2 12 -44 -13 41 -41 -47 -24 -6 -22 -21 -16
6648 -16 -27 64 -21 -48 -21 26 41 -29 38 40 -20 -20 -20 -5 -13 -1 -23 24 2 -12 40 16 -20 -9 -88 12 25 54 -7 -10 -8 -39 -11
6681 -11 32 52 -21 49 -26 34 110 71 -35 42 -47 -24 33 -1 -13 63 43 -2 3 -18 -8 46 -9 48 -55 -13 18 21 67 -25
6711 -25 2 40 -2 -27 -28 22 51 -57 -40 -11 -16 -43 -68 -14 -22 11 12 -20 7 -22 -64 40 -33 51 5 10 -58 2 -23 14 36 34
6743 34 1 -37 6 -45 -9 13 25 -9 -4 -51 14 21 16 8 -26 -58 -25 -6 34 -58 19 10 -73 21 -49 -10 15 -8 -6 -71 46 -15 -2
6776 -2 -48 -7 16 0 -19 22 -23 -40 -18 43 11 35 -43 -76 10 -36 -32 25 -15 -2 -79 12 15 -43 41 32 -20 -26 -45 -12 -41 11 -16
6809 -16 -3 44 -2 31 -8 10 -26 -28 13 15 19 -84 36 -38 -5 -36 -49 33 6 -33 28 16 -30 33 -47 -2 -35 28 -27 31 5
6840 5 33 8 -34 -4 42 -72 -68 20 17 34 0 43 10 2 2 1 -25 -77 -60 29 -22 -22 86 -4 -23 -19 -11 -11 -14 38 -69 -18 -2 22
6874 22 21 -18 4 25 -76 -24 -16 -7 23 -26 -19 -47 1 -9 -36 -53 47 17 -49 -26 29 27 37 -7 26 4 5 44 20 -14 28 -9
6906 -9 -21 -46 -45 17 -30 -42 -29 65 43 20 -46 3 -8 -50 7 43 -3 -30 42 20 50 -12 3 17 -47 -46 -21 -32 -1 15 -54 -17
6938 -17 -30 -25 -16 -34 -49 -28 -51 -10 2 19 36 17 -2 -51 25 14 -25 24 2 14 -31 20 3 -18 2 10 6 -12 -25 -11 4 42
6970 42 -23 23 -22 9 -3 0 2 -44 33 53 -29 -23 -46 -9 -14 -38 -47 -11 13 2 -11 17 -5 -85 26 -21 20 -2 32 -37 -31 -7 55
7003 55 13 30 -18 -28 8 -19 -9 -6 9 -13 -2 44 -50 51 25 -58 -23 -14 22 -2 -48 -4 -4 -65 26 36 5 50 -46 15 19 -11
7035 -11 -57 25 89 -3 -28 53 6 -7 -8 9 3 -21 0 56 -25 -44 -1 15 -12 -7 -1 33 52 -4 -13 -18 41 -11 -20 46 -35 -48 -6 1
7069 1 21 -61 -14 9 22 -1 32 -16 5 -7 -55 -36 -31 20 -47 5 28 -10 -59 11 16 -38 -17 11 -50 -35 -28 50 -26 36 28 18 2
7102 2 -10 -20 -19 -56 -32 -71 -43 -42 21 -14 -63 48 -14 23 9 -12 -39 -31 -8 -35 -32 48 -20 -25 -13 43 11 -31 -7 28 -61 18 19
7135 19 -53 -21 -11 41 -40 -21 -38 -3 4 -59 4 18 -9 21 26 36 -30 -18 1 -19 -29 -45 3 56 3 -7 -10 -54 1 6 -17 -44
7167 -44 -17 31 28 -46 -4 -46 -12 34 -14 26 1 25 31 -11 -11 2 2 -26 29 -17 3 3 30 42 46 -26 49 -1 -90 23 31 -8 -2 -2
7201 -2 11 -2 10 26 20 -20 -12 -63 2 -10 59 -37 -28 -42 -5 36 -60 0 -19 59 14 8 -52 -10 -36 -14 -39 2 72 8 -42 -83 -7
7234 -7 -11 2 -66 -41 35 -30 -13 -44 -12 -23 54 34 55 -33 7 13 34 8 -16 -21 17 50 -50 40 -18 -3 -1 43 -10 -12 -26 -9 -1
7267 -1 -8 37 -32 -36 -27 -7 -15 -18 44 21 -7 16 24 -14 -20 -22 18 -29 -13 -27 -26 43 -31 12 18 -44 8 -56 -19 7 15 -27 -15 -3 -5 -20 7
7304 7 5 -39 -4 -1 13 -19 58 -52 26 -19 41 8 19 -14 4 10 44 30 -39 19 -24 -39 47 -23 -38 14 -18 -3 -72 -44 -38 71
7336 71 -41 -57 18 38 40 35 -20 -69 -48 44 18 -40 -23 -30 46 17 38 -57 2 -15 -14 -39 -36 34 60 -2 60 42 63 5 8 -27 -15
7369 -15 4 -22 67 -12 -80 -46 3 17 -27 -41 31 -46 -3 49 -43 -24 8 15 4 -13 -11 -30 -56 7 -26 -56 -9 -88 -22 -87 -2
7400 -2 -83 -62 -28 -39 38 46 22 7 -4 23 -13 -7 -23 37 5 -5 10 -65 8 0 9 8 8 30 -23 59 14 -17 -13 59 15 7 56 39 60
7435 60 -33 -44 -50 -5 -37 -49 -1 31 17 11 -30 -6 -60 -24 -70 -29 -34 -2 40 -12 56 -82 16 -22 10 -12 -2 9 22 -23 4
7466 4 -17 -2 4 16 11 34 -32 7 58 52 23 27 8 -30 27 -18 -5 -1 -29 -10 23 35 30 -26 19 59 1 -4 19 -28 -35 -13 57 26 -31
7501 -31 36 6 -26 -7 -12 25 85 -3 75 -5 8 -30 16 2 26 -80 21 -35 -21 -31 -16 25 -9 -47 20 26 45 16 -75 -16
7531 -16 91 15 23 5 -22 -2 13 15 -28 22 -5 61 41 -13 81 45 29 2 -62 17 1 -5 -15 -41 61 38 19 16 13 16 2 -6 5
7564 5 -52 0 -27 8 -43 -2 47 -104 -12 -29 15 -10 -34 40 11 4 4 25 -6 49 -9 7 17 0 -80 -35 4 -14 24 52 -73
7595 -73 24 -10 26 -39 25 70 42 8 53 4 12 5 41 20 -41 -8 0 51 -18 -12 -18 -26 20 34 -16 49 22 -21 -30 29 -37 -83 34
7628 34 64 -53 15 -47 23 -36 -1 17 28 -6 -13 17 14 18 26 -10 -46 7 30 67 31 39 -6 -36 -9 -24 9 -9 -11 -26 31 -23 6
7661 6 -9 12 47 77 0 10 -51 -46 -25 -42 -6 17 -77 -16 33 -31 28 -43 33 15 -29 41 -11 33 -6 19 -34 -16 -15 -28 -21 -68
7693 -68 -29 -37 59 -30 71 20 -7 14 8 26 -12 -32 -15 -1 18 19 48 9 -57 16 27 -5 10 102 14 -38 5 4 -45 -21 -10 9
7725 9 47 -63 -32 -65 48 -8 -58 -16 -13 18 -8 -37 -8 -29 -21 -2 17 -24 10 25 16 -25 -12 -43 -35 -27 -27 -17 -32 26 -45 15 30
7758 30 -12 -3 4 -16 -1 30 -15 11 -21 -3 -5 52 -31 -20 62 17 14 -43 -28 -3 -34 5 23 -21 -33 -9 21 -43 0 -39 66 10
7790 10 3 -38 -10 2 -50 -22 -38 -33 44 -50 5 6 -18 -19 -1 -50 -42 58 22 10 -44 14 -19 17 18 24 -16 -23 -70 9 -35 -65 -26 32
7824 32 25 -12 13 18 26 -17 63 69 -6 41 1 -38 2 -28 26 77 -38 -31 62 37 16 -63 -27 -15 11 22 17 -16 -6 22 24 -26 12
7857 12 19 -60 9 -5 13 6 16 -8 -15 13 49 -29 -33 10 -41 46 4 35 -20 -42 12 73 27 -5 4 33 40 12 16 51 52 -69 -13 14
7891 14 -23 -39 -5 9 20 34 0 -20 -24 -51 5 -35 47 16 -65 15 14 8 4 -91 -7 -18 -3 -7 -12 -11 4 -55 -13 -32 -66 8 30 6
7925 6 33 -23 -15 24 -8 -12 -43 -7 -16 -31 86 -24 -44 -16 -6 19 43 32 -37 -35 4 -7 24 -52 0 60 28 3 -37 -7 61 -5
7957 -5 59 -21 21 37 21 -66 9 -43 -54 28 -1 -10 -7 -57 18 12 84 16 10 -3 -12 47 24 -2 17 22 25 -55 22 21 43 43 -11 9 17 3
7993 3 3 -3 -9 73 17 38 -23 8 -31 61 -60 13 -34 57 0 11 -9 -53 28 3 -34 64 -30 -2 74 -16 49 -30 19 -5 -16 -33
8025 -33 36 13 -66 46 -41 -8 8 15 -44 51 16 9 -31 -31 27 35 -19 13 64 -51 -23 33 19 4 -16 -28 0 -30 -20 3 4 35
8057 35 26 13 14 -37 -20 8 33 3 -24 -24 10 22 18 -51 -32 -87 46 -1 8 25 -18 3 -45 13 -33 -23 -18 -10 -63 24 -42 10 -46
8090 -46 -20 29 -24 3 -17 6 7 -29 -44 30 5 26 -16 0 -24 -5 21 35 -45 14 -30 10 51 25 -2 -26 -4 34 -71 30
8120 30 35 20 -40 34 51 -10 -38 -16 11 -41 18 -49 49 -9 -9 -50 -13 34 -6 33 5 -1 57 -26 48 25 17 -24 -42 -18 -21 29 -34
8153 -34 -26 12 -50 2 -10 16 -21 22 -67 -30 10 34 -42 -43 -21 -10 -48 -8 -55 -41 30 22 37 27 13 -29 2 -28 8 29 -33 -67
8185 -67 33 34 3 1 36 30
8191C0
$$ Imaginary data points
##PAGE= N=2
##DATA TABLE= (X++(I..I)), XYDATA
0 0 0 0 0 0 0 0 0 0 0 0 0 0 0 0 0 0 0 0 0 0 0 -2 4 -7 8 -8 8 -8 8 -8 11 -12 14 -16 16 -20 20 -22 27 -28 29 -35 36 -42
44 -42 48 -52 57 -65 75 -84 97 -113 133 -161 199 -256 348 -519 891 -2029 11516 58610 3051
63 3051 -41496 16725 48793 -14432 -40041 22064 41938 -12489 -19779 31545 30947 -16299 -11650
76 -11650 27679 18462 -13359 22 26479 11739 -9868 4117 21261 8607 -6046 3694 15155
89 15155 6022 -6564 -308 13554 10350 -4339 -2992 11318 7260 -12179 -10026 10294 7794 -11783
103 -11783 -6203 12896 3061 -18298 -9059 8031 -4665 -18704 -3185 8006 -9022 -17197 -924
116 -924 1491 -15891 -15411 42 -4364 -17798 -10393 648 -8804 -16633 -6633 -3408 -14701 -15146
130 -15146 -4740 -7434 -15429 -8473 -1772 -11253 -15634 -4662 -3793 -16901 -14864 87 -3354 -17371
144 -17371 -10437 4393 -4290 -19070 -9194 4959 -5634 -18250 -5652 8021 -3471 -15330 -2938
157 -2938 8596 -4041 -15355 -2309 9612 -2068 -11842 1886 12794 -995 -11794 2553
169 2553 13105 -1535 -10628 6665 16651 -1027 -9921 9229 17490 -2990 -9807 12643 18566
182 18566 -4938 -8965 16239 18944 -6723 -7040 19325 16865 -10905 -6790 20823 14408 -12137
195 -12137 -2255 24004 10984 -15259 -942 22571 5168 -16278 3833 23600 1724 -15790
207 -15790 6393 19904 -4213 -15256 9216 17614 -6427 -11997 10977 13296 -9049 -9360 11126
220 11126 9486 -9110 -6144 10000 5822 -8214 -3234 8826 3905 -6337 -2048 5984 1817 -4861
234 -4861 -1021 5100 2379 -2614 -930 3181 1590 -2660 -1524 2954 2518 -1407 -940 2756 1883 -2168
250 -2168 -1412 2291 1269 -1826 -495 2049 415 -1543 -160 487 -762 -371 267 -1146 -1155 1251 159
267 159 -3214 -919 2999 -853 -5424 -12 4546 -2497 -6697 2019 5737 -4511 -7424 4180 5802
282 5802 -6856 -7103 6600 5430 -8970 -5975 8761 4103 -10708 -4371 10380 2665 -11754 -2377
296 -2377 11497 748 -12495 -562 11911 -970 -12585 1298 12116 -2514 -12573 2786
308 2786 11794 -4215 -12321 4334 11467 -5521 -11801 5706 10928 -7221 -11337 7002 9986 -8610
322 -8610 -10189 8813 9263 -9775 -8859 10076 7722 -11141 -7200 11583 6587 -11442 -4789 12626
336 12626 4627 -12141 -2786 13157 2853 -11531 176 13579 1140 -10920 2237 12793
348 12793 -929 -9745 4484 11837 -2319 -8048 6131 10380 -3491 -6317 6885 8119 -4574
361 -4574 -4610 7284 6252 -4479 -2567 7053 3923 -5034 -1689 5832 1889 -4365 -19 5174 587
376 587 -3950 168 3039 -1344 -3338 842 2108 -1736 -2047 1138 358 -2656 -1394 931 -1076 -2742
392 -2742 -21 1113 -2085 -2514 1121 670 -3466 -2340 1997 106 -4345 -1366 3451 -126 -4944 -558
408 -558 4016 -1616 -6197 383 4792 -2246 -5958 2137 5258 -3772 -6650 2996 4995 -5282 -6206
423 -6206 4919 5208 -6353 -5622 5962 4099 -8023 -5135 7091 3341 -8754 -3610 8485 2407
437 2407 -9538 -2427 8937 635 -10130 -786 9719 -194 -9657 1262 9948 -1779 -9770 2513
451 2513 9577 -2972 -8678 4661 9649 -3782 -7697 5817 8513 -5142 -6844 7016 7869 -5518
465 -5518 -5193 8053 6777 -6316 -4244 8240 5131 -6925 -2977 8638 4077 -6735 -1636 8334
479 8334 2159 -7335 -826 7622 781 -6658 635 7131 -442 -6308 1038 5611 -2025 -5800 1719
494 1719 4790 -2321 -4606 2258 3442 -3227 -3997 2029 2177 -3235 -2771 2238 1495 -2917 -1896 1862
510 1862 388 -2873 -1216 1564 -151 -2090 -53 1362 -697 -1529 433 441 -1527 -979 1063 53
526 53 -1611 265 1736 -1013 -2270 811 1488 -2290 -2266 2308 1817 -3160 -1924 3224 730 -4766 -1498
543 -1498 4182 15 -5319 0 5000 -1302 -6014 1169 5019 -2797 -6003 2598 4998 -4056 -5331
558 -5331 4073 4452 -5094 -4632 5022 3502 -5922 -3428 5937 2875 -5894 -2164 6195 1859 -6338 -1410
574 -1410 6291 1248 -5784 -146 6560 518 -5801 176 6139 -189 -5701 955 6251 -723 -5526
589 -5526 1455 5962 -1640 -5709 2066 5708 -2348 -5460 2884 5284 -3207 -5142 3423 4558 -4119
604 -4119 -4612 3837 3678 -4678 -3664 4583 2817 -5014 -2818 4550 1652 -5128 -1650 4743 948 -4673
620 -4673 -469 4464 -35 -4349 246 3974 -505 -3381 1329 3638 -1043 -2726 1708 2709 -1312
635 -1312 -1618 2190 2120 -1308 -840 2196 1229 -1269 -41 1997 553 -1011 529 1619 -58 -704 1047
652 1047 1006 -611 -321 1114 363 -1012 125 1318 -46 -1183 391 1263 -686 -1485 758 1382 -1168
669 -1168 -1644 1294 1557 -1806 -1890 1855 1601 -2497 -1734 2890 1602 -3420 -1627 3711 1135 -4393 -847
686 -847 4782 384 -5214 216 5425 -855 -5564 1685 5731 -2336 -5505 3130 5268 -3740 -4679 4398
702 4398 4171 -4883 -3534 5196 2755 -5404 -2185 5370 1315 -5324 -805 4976 67 -4861 19
717 19 4212 -561 -3988 573 3493 -779 -3392 420 2981 -490 -2853 315 2908 -149 -2907 194
733 194 3185 -72 -3138 496 3642 -255 -3462 1108 4076 -954 -3461 2074 4084 -1889 -3070
748 -3070 3086 3425 -2840 -2364 3864 2450 -3371 -1072 4123 1085 -3458 16 3659 -148 -3022 895
764 895 2706 -1134 -2118 1365 1529 -1538 -1175 1252 386 -1477 -305 792 -539 -1100 53 157 -846
781 -846 -567 312 -286 -987 -226 203 -513 -763 -35 245 -447 -906 -173 281 -223 -773 -120 718 -130 -1222
801 -1222 -19 1268 -295 -1558 484 1782 -737 -1891 1194 2070 -1565 -2001 2113 2049 -2302 -1624
817 -1624 2955 1477 -3212 -1034 3649 701 -3715 -120 3819 -438 -3929 819 3859 -1255 -3751
832 -3751 1659 3423 -2173 -3313 2339 2946 -2570 -2617 2777 2304 -3014 -1989 3013 1775 -2940 -1395
848 -1395 3097 1308 -2946 -973 3086 910 -2889 -579 3083 630 -2765 -184 2968 348 -2659
863 -2659 144 2908 -55 -2592 371 2751 -451 -2450 726 2440 -734 -2294 816 2104 -1072
878 -1072 -1986 1097 1783 -1260 -1739 1220 1329 -1554 -1576 1215 986 -1605 -1220 1251 650 -1721 -906 1268
896 1268 316 -1719 -442 1295 -104 -1605 -44 1100 -465 -1293 437 1089 -634 -910 672 628 -877
913 -877 -413 929 320 -907 71 898 -308 -757 562 910 -545 -579 1013 556 -1073 -284 1259 178
931 178 -1148 103 1369 -269 -1404 400 1380 -531 -1350 870 1323 -1078 -1366 976 1087 -1331 -1177
948 -1177 1362 940 -1739 -1131 1486 788 -1787 -775 1877 641 -2053 -553 2062 247 -2142 -49
964 -49 2315 -43 -2253 275 2285 -411 -2187 835 2393 -823 -2143 1167 2143 -1220 -1800 1674
980 1674 1905 -1448 -1602 1758 1510 -1802 -1137 2027 1158 -1985 -894 1946 603 -1958 -458 1940
996 1940 221 -1935 -204 1690 -92 -1881 46 1638 -276 -1689 159 1378 -507 -1523 377
1011 377 1225 -552 -1360 533 1018 -750 -1070 734 992 -714 -851 721 765 -790 -563 823 646 -776
1029 -776 -294 874 297 -727 -104 879 155 -633 35 642 -43 -514 316 605 -285 -332 391 298 -479 -156
1049 -156 535 46 -575 0 513 -285 -657 282 523 -451 -574 515 298 -869 -360 758 127 -957 -158
1068 -158 923 -129 -1158 73 1065 -317 -1097 422 997 -549 -1095 714 1080 -773 -929 1026 995
1085 995 -997 -777 1239 925 -1150 -595 1412 650 -1397 -449 1551 409 -1382 -182 1491 169
1101 169 -1422 45 1511 -57 -1414 295 1443 -373 -1470 484 1385 -576 -1406 691 1315 -875
1117 -875 -1299 801 1177 -997 -1145 1052 953 -1117 -922 1179 756 -1201 -598 1294 571 -1298 -366 1367
1135 1367 274 -1170 2 1315 53 -1128 205 1193 -151 -949 391 1034 -303 -810 490 846
1151 846 -420 -636 566 565 -517 -469 484 397 -506 -313 579 182 -555 -259 463 15 -489 -137 378 -102
1171 -102 -490 27 319 -244 -428 160 192 -396 -220 299 53 -484 -56 410 -93 -510 71 463 -289 -475
1191 -475 270 396 -422 -332 514 412 -486 -229 696 237 -664 -51 807 90 -692 150 779 -61 -776 253
1211 253 858 -279 -759 399 732 -493 -668 560 694 -615 -732 622 525 -749 -462 776 495 -747
1229 -747 -435 821 403 -896 -378 877 261 -1031 -220 1014 84 -1051 -77 1038 -49 -1019 195
1246 195 1078 -211 -1005 347 1022 -369 -793 529 916 -556 -692 706 810 -598 -575 762 636 -732
1264 -732 -444 796 452 -706 -309 815 234 -731 -218 767 107 -724 -3 672 -87 -770 83 593 -131
1283 -131 -610 154 505 -294 -610 216 440 -378 -400 393 300 -477 -195 393 124 -419 -30 379 -2 -340 84
1304 84 307 -105 -216 169 244 -231 -154 371 111 -217 -16 306 21 -257 133 280 -139 -181 194 223 -169 -235
1326 -235 233 167 -323 -171 350 56 -417 -135 359 -34 -489 -75 415 -61 -532 45 425 -163 -551 90
1346 90 497 -255 -543 200 451 -353 -529 294 364 -432 -357 364 385 -468 -376 470 319 -525 -231 620 234 -493
1368 -493 -124 590 179 -606 -88 614 35 -608 -21 600 -9 -558 73 645 -151 -617 190 584 -301 -605
1388 -605 250 520 -365 -518 315 447 -477 -461 420 322 -566 -323 551 164 -594 -205 490 72 -547 -71 484
1409 484 -47 -499 78 406 -94 -434 125 303 -118 -266 191 262 -160 -166 203 260 -154 -65 294 186 -178 -34
1431 -34 255 122 -218 63 278 32 -235 42 173 -86 -196 170 204 -175 -94 223 97 -308 -2 280 -98
1452 -98 -284 120 316 -165 -309 241 264 -319 -228 340 124 -410 -124 417 77 -366 35 409 -42 -359 92
1473 92 406 -65 -281 177 381 -152 -243 176 380 -122 -201 240 271 -138 -257 248 318 -181 -249 231 248 -233
1495 -233 -291 205 254 -319 -216 415 266 -510 -238 431 195 -520 -214 558 113 -647 -5 525 -88 -581 80
1516 80 607 -194 -490 186 419 -276 -413 313 422 -328 -363 308 230 -347 -211 423 216 -391 -139 440 175
1537 175 -291 -51 335 131 -298 -28 311 97 -250 -53 333 15 -234 8 323 0 -294 90 240 -152
1557 -152 -271 228 177 -175 -163 207 99 -249 -114 246 16 -286 6 203 -96 -250 103 215 -177 -143 176
1578 176 66 -186 -66 215 -30 -190 68 195 -74 -251 129 272 -116 -203 216 107 -221 -118 180 73
1598 73 -233 22 270 94 -243 23 277 -10 -275 23 268 -67 -308 30 233 -183 -242 108 267 -177 -289
1619 -289 152 195 -216 -307 200 203 -197 -266 187 190 -315 -227 284 182 -282 -97 332 3 -343 -103 374 123 -291
1642 -291 -21 399 58 -307 20 330 -31 -256 107 372 -75 -308 124 372 -187 -281 159 258 -158 -236 220
1663 220 144 -248 -237 269 112 -290 -106 217 42 -246 -90 215 43 -275 -14 224 -1 -256 43 173 -114
1684 -114 -139 73 237 -105 -185 93 193 -105 -42 136 32 -157 -56 127 62 -185 37 105 68 -135 44 138
1706 138 -48 -52 144 103 -119 -26 117 -27 -150 -55 161 42 -176 66 153 -102 -188 55 166 -85 -113 151 72
1729 72 -163 -116 219 93 -262 -92 219 18 -264 -28 187 -23 -296 5 233 -48 -293 38 292 -32 -198
1750 -198 125 297 -109 -239 147 255 -179 -203 223 220 -248 -126 206 163 -237 -167 305 133 -268 -109 270 182
1772 182 -330 -51 302 32 -210 15 289 -14 -283 28 275 -63 -257 71 310 -134 -294 170 281 -139
1792 -139 -223 161 186 -203 -175 167 149 -147 -149 205 141 -222 -62 210 17 -266 -23 183 26 -209 46 228
1814 228 -29 -188 35 163 -111 -82 26 161 -102 -104 153 114 -115 -74 121 37 -178 -43 131 -27 -182 39
1836 39 134 -31 -104 47 38 -95 -88 115 46 -184 -71 66 -15 -117 52 131 9 -201 14 129 -105 -134 70 153
1860 153 -148 -179 178 139 -180 -126 120 159 -177 -132 158 1 -236 -49 242 64 -172 -84 280 -25 -222 30
1882 30 263 -53 -314 47 234 -145 -328 152 213 -101 -176 181 214 -181 -219 231 126 -272 -142 199 93 -232
1904 -232 -111 175 18 -304 -19 185 -8 -331 69 262 -71 -194 24 227 -48 -217 41 240 -64 -186
1924 -186 128 194 -92 -223 49 162 -108 -183 112 143 -142 -121 191 79 -190 -104 128 51 -151 -1 110 -15
1946 -15 -172 20 138 1 -88 58 166 -96 -106 58 62 -135 -95 97 37 -79 -12 53 44 -39 -17 66 12 -102 63
1971 63 90 -15 6 42 13 -63 86 83 19 -94 -35 78 50 -16 24 133 -6 -81 35 154 -53 -146 64 145 -94
1996 -94 -134 96 124 -146 -87 172 110 -143 -80 231 39 -232 -33 266 -33 -266 -39 223 -48 -263 -1 224
2018 224 -16 -220 62 257 -90 -218 121 179 -155 -171 204 147 -187 -132 187 164 -167 -97 210 123 -208 -74
2040 -74 258 46 -203 -70 243 -34 -225 14 193 -55 -189 54 200 -107 -269 87 189 -115 -166 155 123
2061 123 -191 -222 44 64 -159 -66 132 22 -156 -62 144 -16 -130 -1 122 -38 -123 -59 146 -31 -57 -14 110
2084 110 -22 -104 105 84 -32 -43 146 -1 -66 -42 126 62 5 11 54 5 -28 43 21 -67 -56 2 17 -76 -50 71 -35
2111 -35 -129 -39 100 -3 -140 -61 62 -24 -58 30 45 -111 -60 50 104 -32 -133 45 99 5 -101 112 100 -176
2135 -176 -136 84 58 -111 -34 210 62 -236 -8 221 36 -239 -11 225 58 -231 24 266 -42 -196 95
2156 95 235 -72 -194 113 176 -145 -226 119 103 -138 -82 133 68 -255 -48 150 44 -147 -39 127 37 -186
2178 -186 -23 126 46 -176 -13 127 12 -228 51 196 37 -130 35 170 -14 -120 101 151 -39 -125 147
2199 147 127 -59 -66 148 53 -100 -46 100 90 -108 -63 154 -8 -145 -13 134 -30 -113 49 83 -13 -85 100 106
2223 106 -125 -43 87 -21 -21 7 -46 -75 -55 70 15 -79 -79 50 27 -55 -34 43 37 -48 -21 50 -56 -51 3 33 11 -41 -20
2252 -20 52 -1 -82 1 74 43 -67 -1 77 -42 -143 63 67 -67 -170 90 113 -113 -147 132 92 -121 -33 133 79
2277 79 -165 -38 198 27 -165 -35 203 -53 -276 8 213 -81 -205 128 101 -85 -240 61 214 -167 -137
2298 -137 104 135 -107 -90 108 61 -141 -74 99 129 -125 -86 186 125 -166 -107 169 86 -126 -95 172 39 -93
2321 -93 70 67 -17 -144 87 146 -84 -131 100 92 -90 -31 65 40 -109 -72 98 -3 -155 -15 161 5 -136 -64
2345 -64 40 -16 -76 7 69 -53 -88 61 45 -64 -71 64 80 -31 -47 120 -40 -15 67 76 64 -94 83 12 -74 -12
2371 -12 24 41 5 -19 93 -8 -110 0 60 7 -85 1 60 26 -126 -40 96 -5 -130 7 85 29 -87 9 39
2396 39 -4 -109 69 88 -149 -142 31 71 -120 -61 99 82 -114 -89 99 64 -108 -17 74 43 -124 2 131 4
2420 4 -193 -56 223 -8 -123 59 160 -124 -140 22 170 -98 -109 76 213 -99 -115 164 84 -164 -53 106
2442 106 41 -93 -33 142 -16 -130 -2 146 27 -132 -65 102 -52 -148 86 63 -26 -156 53 24 -86 -68 12
2465 12 50 -24 -56 30 68 13 17 43 27 -88 -43 107 21 -91 15 81 63 -139 41 105 -20 29 81 131 -24 -19 74
2492 74 73 -52 -30 71 -15 -75 4 26 -37 -39 18 20 -75 -102 72 83 -66 -144 47 4 -124 -62 35 31 -26 -85 59 -78
2520 -78 -121 6 74 -26 -49 45 58 -20 -90 37 89 -22 -149 85 59 -51 -73 47 121 19 -42 55 19 -101 0
2545 0 125 -26 -179 56 141 -21 -107 31 79 -6 -68 -2 130 -20 -152 9 102 -53 -130 -5 77 -94 -120 41
2569 41 91 -82 -78 105 121 -87 -73 12 51 -97 -20 87 1 -38 -39 70 48 -84 63 103 -10 -87 -58 129 -76 -41
2595 -41 47 99 -41 -66 51 71 -23 -7 69 39 5 -61 52 22 -90 25 79 18 -85 -20 38 -52 -48 -3 -17 6 -90 40
2623 40 93 -49 -66 -1 48 -74 -57 85 -42 -60 3 22 14 -46 11 46 -46 -70 71 49 -30 -38 54 33 -40 -59 53 100
2651 100 -69 -22 51 -67 -47 17 88 -41 -83 33 125 -34 -59 80 77 -101 -32 39 91 -76 -92 25 29 -92 10
2676 10 73 16 -106 -78 141 13 -38 -12 88 -12 -60 -33 99 -21 -160 -22 41 -66 -60 1 119 24 -95 108
2700 108 132 -30 -13 61 125 -52 -55 23 78 -30 -31 95 87 -74 28 68 3 -54 -16 152 -35 -30 -20 45 -13 -103 2
2727 2 25 -7 22 -1 52 -49 -73 -22 21 -25 -32 23 -2 -28 21 63 -11 -28 -5 -10 -11 15 -22 57 -50 -56 -16 6 7 -79 47 69
2759 69 11 -48 37 18 -24 -32 -22 -1 -3 4 72 -11 -91 39 42 -35 11 53 44 -57 -40 53 -4 -162 -57 -22 -44 -21 -41 42 -12
2790 -12 -110 -16 37 -65 -92 23 85 -32 -90 42 25 23 -112 -40 33 -130 -38 64 -11 -65 -48 105 58 -74 21 51
2816 51 34 -76 -16 96 6 -57 68 85 -13 -65 -17 131 -7 -56 122 74 -47 -54 46 78 -42 -148 92 36 -49
2841 -49 -46 85 43 -92 -32 73 12 -122 43 103 -23 -138 -56 99 -31 -84 -17 43 -28 -74 9 25 18 -78 27 40
2867 40 -79 -20 -4 57 -79 -4 6 11 -22 2 -23 41 -73 25 8 -38 12 -2 30 -39 -25 45 58 -18 3 80 80 -59 -5
2896 -5 28 10 -33 20 -12 -42 -108 -20 95 -88 -22 78 78 -45 -46 85 -8 -58 -97 16 32 -93 30 64 4 -69 28 70
2924 70 -24 -62 53 39 -23 -67 90 119 -59 -41 42 77 -78 -17 -6 22 -32 5 62 59 -46 -12 46 -12 -29 -17 62 -26
2952 -26 -77 -26 95 -28 -107 40 107 -5 -82 8 6 -29 -83 24 -1 -24 -7 15 57 -54 -77 65 58 -97 -3 63 -7
2979 -7 -47 -32 80 39 -87 -23 82 12 -95 37 72 -38 22 46 52 -15 -73 23 60 -35 -25 55 20 -85 -29 3 -15 -29
3007 -29 -61 -45 48 -79 -48 40 -72 -36 52 67 39 -2 48 39 46 36 21 25 -9 -36 48 40 -17 31 70 18 -52 -8 58 -11 -69
3038 -69 -6 59 -64 -1 88 22 8 -32 21 30 -28 41 7 40 -68 10 35 32 -100 26 72 20 -64 0 33 -50 0 31 -56
3067 -56 -63 -42 -19 42 -83 -70 21 13 -96 -12 34 -30 -73 -27 62 32 -76 33 59 32 -114 41 53 45 -41 50 96 -8
3095 -8 -48 32 42 -19 -47 20 75 -22 -107 82 106 32 11 34 -10 -95 9 101 56 -49 3 92 7 -102 53 -2 39 -63
3123 -63 -13 96 11 -52 42 33 -46 -48 -31 -5 -44 -4 74 88 -87 -72 76 -37 -68 46 -27 -46 -31 -67 13 23 -68 24 4
3152 4 -12 13 30 55 -8 -33 83 -47 -47 -4 82 -66 -85 47 89 28 -74 28 7 -7 -64 -9 5 -92 -88 84 4 -72
3180 -72 -70 90 1 -10 -30 38 -31 -131 26 34 -87 -35 -37 38 -5 -113 33 64 29 -82 -9 86 4 -85 33 20 -53 -66
3208 -66 101 89 -90 -11 46 9 -35 -58 117 44 -10 19 95 4 -58 38 121 36 -162 23 49 -20 -100 7 100 -135 -91
3235 -91 17 1 -5 -101 77 -2 -10 -59 55 33 -51 -60 73 18 -62 -28 26 30 -103 -10 121 38 -78 -27 61 27 -46 39 61
3264 61 -5 -39 105 89 -55 -5 78 62 -25 -23 58 -31 -67 5 46 -46 -43 -40 -4 -23 -48 48 48 -37 -38 21 20 -22 -68 73 -2 -30
3296 -30 -42 -8 -8 -59 22 127 -10 -37 1 -14 -39 -62 30 48 -83 -8 55 71 -39 -65 65 2 -27 -50 36 40 -109 -4
3324 -4 90 74 -84 18 80 45 -44 53 38 -14 -72 12 96 -9 -87 24 96 -20 -84 60 32 -104 -97 52 16 -106 -51
3351 -51 -7 9 -92 -93 65 74 -44 14 41 32 -67 -41 28 -42 -56 -19 83 20 -32 20 61 -7 -46 -12 51 -76 -80 39 84
3380 84 -22 -84 62 21 -35 -28 4 16 -88 -12 78 3 -72 -25 139 20 -7 54 144 -28 -60 34 67 3 -27 91 -7
3407 -7 -55 19 40 16 41 7 84 31 -41 -25 96 -2 1 48 32 35 -31 23 -24 -63 -40 57 56 -79 -15 48 30 -35 -14 -2 -34
3438 -34 -38 31 20 0 -69 45 40 35 -60 16 63 -10 -36 -24 51 -4 -23 25 0 -95 -77 20 26 -48 -55 36 38 -110 -91 77 24 -94
3470 -94 -37 95 -68 -61 8 88 -7 -61 -42 80 -15 -67 43 32 -30 -16 51 61 -75 -18 39 94 -40 -48 60 -3 -42 -34
3498 -34 99 24 -48 49 34 0 -124 -7 40 -10 -92 -36 38 -77 -55 -60 32 -36 -32 17 52 26 -96 41 20 -105 17
3525 17 63 -6 -52 -11 49 40 -107 43 38 21 -18 -21 72 -33 -5 -18 36 -61 -61 104 -23 -11 -34 -34 6 -50 48 99 -21 -9
3555 -9 32 78 -79 11 22 50 -18 -21 47 21 -24 -16 38 24 -22 -19 22 54 -79 34 29 -14 -93 -33 106 -31 -53 77 51 -43
3585 -43 -78 -47 86 -32 4 101 11 -93 -112 77 45 -53 -88 27 89 -28 -12 82 24 -84 -30 84 26 -101 -6 79
3611 79 5 -58 53 71 -41 -83 -46 31 -52 -78 41 48 11 -30 57 82 -42 -6 23 68 -82 -15 78 -33 -52 -31 81
3638 81 32 -7 -117 48 21 -84 -49 27 5 -88 9 43 21 -89 -16 41 -30 7 58 -25 -63 -29 17 14 -73 83 50 35
3666 35 -17 -25 61 -17 -148 -1 46 27 -54 48 24 -2 32 47 -28 -118 -50 -3 11 -52 -8 35 -44 -45 -14 -5 -13 -62 98 78
3696 78 9 1 -9 33 38 -72 42 121 -87 -1 54 73 -42 -32 106 54 -69 90 127 52 -21 3 89 54 -49 -18 133
3723 133 2 -82 -42 56 -2 -92 44 60 -26 -16 37 72 -97 -62 43 -10 -32 -19 71 17 -80 31 36 29 -68 -24 31 55
3751 55 -8 -8 70 -37 -85 7 48 9 -61 8 73 -46 -72 -18 24 -23 -9 51 5 -25 -15 25 72 -55 -51 29 28 -94 -56 50
3781 50 9 -39 30 103 -14 -43 24 65 -71 -16 -52 103 -36 -51 -15 -12 -7 -54 26 5 -73 -18 0 10 -22 -36 -15 -1 -42
3810 -42 -11 39 -73 -36 34 52 2 -33 100 77 15 -9 49 48 -7 19 34 -15 21 -33 87 55 -54 -3 63 -21 -33 -9 68
3839 68 -13 -33 68 93 8 -119 61 42 -33 -13 97 68 -53 -9 84 13 -13 -47 108 -22 11 23 19 -37 -78 -40 38
3866 38 -28 -23 0 36 -21 -54 12 50 -82 -62 78 62 0 -49 59 52 -61 76 73 -9 -66 -48 7 -44 -6 -81 103 -20
3894 -20 -21 52 53 -31 -109 69 106 -10 -34 50 70 -63 -56 35 -30 -25 -20 29 46 -31 -72 34 42 -37 -58 98 -41 -114 19 81
3924 81 -27 -41 27 69 -44 -53 42 18 -43 -6 -10 23 -7 -50 17 39 -11 39 83 38 -22 45 103 -71 5 27 55 53 -73 37
3954 37 34 1 -39 79 45 -34 -76 95 58 -68 5 70 -12 -64 -14 30 -1 -75 -41 -9 -99 -103 52 8 30 -42 20 34 -82
3983 -82 -84 79 3 -72 -23 75 27 -43 -32 40 4 -45 5 107 39 -64 -31 58 -52 -31 -7 24 -7 -40 34 22 16 -18 -34
4012 -34 43 -2 -16 41 84 -74 -48 16 -8 -37 29 84 24 -58 -15 53 -13 -80 32 15 -36 -31 12 52 26 -87 10 18 7 -65
4042 -65 18 9 -5 -9 -9 14 -67 -16 27 32 -26 -1 54 36 -56 38 -15 -27 -42 6 86 -12 -72 19 17 -48 -32 54 -1 -4 -31 78 37
4075 37 20 -9 58 44 -54 18 25 -47 -60 -31 102 40 22 26 97 -46 -31 76 15 -83 -5 -27 2 5 -61 54 19 -8 -18 70
4105 70 -1 -20 42 22 26 -27 37 111 -7 -30 60 28 1 -42 64 60 -7 -9 42 65 -54 34 63 66 -99 25 66 0 -46 -87
4135 -87 13 -33 -23 -71 66 -5 -98 37 37 -44 -20 -27 59 -2 -21 54 64 -59 -104 77 50 -53 -29 36 52 -62 -11 16
4163 16 23 -23 -17 81 -9 -33 -12 71 9 -48 -19 57 -25 -30 42 23 -16 -53 104 57 13 -29 46 17 23 -14 31 46 -61 -75 19
4194 19 2 23 30 26 7 -110 20 20 -19 -60 57 71 -28 1 73 7 -20 48 16 19 -26 47 52 4 -29 26 4 0 54 8 39 10
4226 10 8 40 70 -18 -70 49 67 -21 -5 60 29 -67 -21 -13 10 -79 -31 57 13 -102 -89 96 -10 -94 -13 57 -29 -20 37 -9
4256 -9 -24 -35 2 3 0 -62 24 -23 -66 -90 43 19 -80 -27 5 -27 -64 8 10 -11 -68 -2 -12 8 1 -30 23 1 -34 -52 59 23
4288 23 -83 51 -41 -1 1 38 62 -73 -27 24 80 -71 -51 73 34 -90 57 31 -4 -41 12 -48 -38 -13 83 6 -67
4315 -67 -66 -16 55 -64 -46 34 33 -49 -28 114 51 -44 56 6 -8 -5 -2 59 84 -22 -12 19 -6 -21 -42 14 -41 27 -29 36
4345 36 9 -61 21 -21 -22 45 17 44 -36 0 55 -35 28 -3 14 35 -50 12 14 -40 -104 48 104 -27 34 -28 19 -44 -53 -14 20
4376 20 -46 -59 15 -28 -72 3 0 -59 -61 18 36 17 -32 27 33 -52 -53 24 40 -28 0 26 -28 -46 -60 23 48 3 -27 12 34 -82
4408 -82 -43 40 4 -3 -32 34 30 -71 35 70 -55 -56 -1 26 10 -9 36 39 -6 -35 -5 -41 -21 -42 53 22 -54 38 19 -34 -81
4439 -81 -42 34 -11 -21 -51 3 33 4 -27 -7 3 -36 -32 27 -32 26 -10 -12 1 -11 43 -10 27 -4 15 -39 -98 -3 47 29 22 -7
4471 -7 24 -23 0 27 -15 14 35 41 21 7 -14 31 19 4 -39 5 59 7 -9 54 -5 -27 22 27 20 -40 76 57 0 -11 6 -37
4503 -37 -36 -29 34 -13 -107 -26 -13 -19 46 -23 -34 -7 -41 21 99 -16 -62 19 37 -24 -12 67 55 -38 -58 13 -36 -4 -28 42 34 -24
4535 -24 -47 -30 -44 6 -27 48 18 -68 9 74 -48 -37 -11 57 54 12 88 -6 41 -74 -55 41 46 -17 38 65 31 -4 8 25
4565 25 -52 63 59 11 -26 -63 102 97 -44 -6 81 11 -28 23 64 23 -9 -38 48 -32 38 25 56 -67 7 20 17 -10 -78 -12
4595 -12 76 53 62 63 32 2 -32 30 21 -59 2 27 32 -40 54 16 -8 30 -6 29 -3 13 -32 33 -39 6 11 -21 21 2 -38 11 19
4628 19 -11 18 0 -38 35 -34 -31 -10 1 12 -83 -47 -4 -7 -14 -6 12 -16 -4 -22 -9 -30 -14 -55 -14 50 -71 37 30 -67 -62 4
4660 4 29 27 -73 -42 -28 -39 -72 29 41 -34 -32 22 46 16 -25 39 56 -56 -6 -26 90 38 12 32 -13 -74 -46 14 -40 16
4690 16 -51 85 16 -16 8 100 -29 -35 -2 52 -10 -61 -32 38 -84 -11 36 -69 -22 19 29 1 -48 30 13 -22 12 -29 29
4719 29 -26 14 -27 31 -13 -17 9 63 -73 -7 -17 -10 6 18 47 47 -36 2 89 -28 -45 -27 48 21 -45 7 45 10 -5 99
4749 99 -26 -26 -41 120 -7 -24 10 62 22 -30 17 27 -23 -19 31 -29 -28 -53 -59 34 -9 -34 38 118 4 -35 2 31 -20 -10
4779 -10 13 34 -28 -77 40 -26 38 -5 35 -51 -21 -15 35 -54 -12 26 25 -51 -71 6 1 0 -10 51 40 18 -15 19 27 -64 -35 68
4811 68 82 -31 38 19 43 9 28 68 -15 -21 -13 -2 -1 -23 -53 87 12 -89 -30 45 -49 -46 7 -13 -25 -38 -5 -9 26 -48 39
4842 39 55 -113 18 95 43 -5 -8 19 15 -21 26 76 14 -8 12 63 10 -49 -15 -18 -10 50 36 -9 -28 40 -8 33 -37 -23 24
4873 24 -12 -23 10 -13 -48 -22 -24 12 51 14 11 14 -56 10 -36 20 -11 -13 71 6 -12 -10 90 30 -15 -21 30 34 -53 43 7 -48 -8
4906 -8 -9 61 -38 -92 20 20 13 -33 70 62 -62 4 -7 -11 -35 32 1 7 -22 33 19 1 -15 -12 103 -22 -49 15 75 -17 -39 57
4938 57 47 36 -84 -21 -9 -58 -36 40 14 -21 9 22 25 -19 12 38 26 -65 -9 83 -21 -18 34 22 19 -33 -29 31 -26 -46 8
4969 8 10 -31 -18 36 15 4 -52 -20 -26 -48 -108 -27 -8 -18 -61 -50 -32 52 -22 18 -48 -28 -19 53 24 11 -71 -15 -15 10 9 16 17 -50
5003 -50 13 43 -1 15 -43 50 -2 -29 50 2 -16 21 -6 -16 -16 5 31 21 22 60 31 -10 9 39 83 -23 -7 60 46 -46 -2
5034 -2 -6 22 -11 -63 30 0 -53 19 -15 16 -62 -85 3 15 -66 -16 26 -46 3 -80 52 -5 -10 74 -16 16 -54 -1 54 -19 1
5065 1 68 27 -91 -19 26 18 -54 -28 109 -17 -66 46 -6 -10 -23 35 31 -72 -17 -12 39 0 -36 10 38 -7 -24 42 -48 27
5095 27 -26 -2 19 42 70 75 32 -42 48 0 21 3 -57 20 29 -18 68 31 -28 2 -27 -28 14 15 26 75 -90 -30 -11 -44 19 63
5127 63 47 -14 -15 25 -1 37 -33 33 18 -14 -16 96 -32 -68 3 6 -26 1 36 44 -9 -23 -16 -33 -13 -9 0 40 63 1 54 1 -7
5160 -7 10 -28 -6 -3 -10 73 16 -27 21 -2 -18 -75 -25 33 58 -30 -7 -1 36 5 -27 56 30 -7 23 52 6 26 4 5 -33 -12 16
5193 16 47 -80 7 41 -18 -55 -3 65 50 17 -42 20 -20 -24 -20 2 -50 -71 -31 -20 21 23 -3 -4 -26 16 4 40 26 -6 21 74
5225 74 -8 -40 -2 21 -14 -46 54 17 -22 43 37 -7 -76 -28 18 34 18 -8 -58 40 -60 9 72 -4 30 31 16 -24 -3 22
5255 22 -24 4 -9 44 57 -9 -3 10 -26 8 -7 11 25 -6 28 -39 -49 5 69 -67 -29 -23 31 33 -39 9 -27 49 -6 38 11
5286 11 -47 37 -6 25 -48 37 25 99 17 30 119 -75 -10 -27 -43 -72 -80 30 124 47 -65 -42 -36 3 -34 -31 -13 32 28 -3 44
5317 44 3 -67 14 61 52 -22 70 -33 -49 -7 -32 39 19 37 7 -22 -9 -65 2 11 -29 13 86 11 9 5 48 12 -5 30 16 3
5349 3 -74 -20 37 -11 5 43 -12 -70 -34 24 49 23 -26 26 -40 -64 -15 46 49 38 8 28 66 -6 -30 7 19 32 44 65 -38
5380 -38 -32 -17 46 25 34 93 -4 18 -10 70 -17 -22 30 -24 2 -3 59 7 -10 -18 18 61 -43 -44 55 -20 26 -51 11 -28 -20 4 33
5413 33 30 -55 -42 46 21 -20 -3 6 -16 21 62 48 -31 20 4 -10 -33 -29 -7 -68 -3 -1 5 15 23 -21 -30 -16 -29 -70 39 -8 -34
5446 -34 -11 42 4 -30 -4 36 42 15 -8 76 39 3 54 -6 -33 -24 -26 -35 4 -33 77 -24 8 28 12 17 -32 -2 -4 -14 5 -27
5478 -27 4 32 -48 -18 15 -7 -35 36 67 -3 11 15 8 -23 -24 3 -36 6 32 -10 -42 0 -22 46 -17 0 -13 23 16 -34 -13 9
5510 9 5 -39 27 38 28 -28 -6 47 -14 -33 51 36 11 50 -44 -53 -8 2 7 14 -18 -13 -34 -17 -27 -45 -38 69 -28 20 -16 27 -26
5543 -26 -14 1 -36 6 16 56 27 13 64 -12 -27 -26 4 -15 -9 -8 23 -52 35 -82 31 15 -1 -15 -13 1 -32 -6 65 53 -4
5574 -4 -32 31 -9 16 20 -7 -61 -51 34 14 -31 57 88 2 14 -18 -30 57 -30 -25 3 -49 0 19 15 3 -14 -34 8 -4 -17 17
5606 17 20 -7 -22 -44 -14 -84 -14 48 -20 -16 -1 13 8 22 9 59 -5 13 47 -3 15 4 -38 7 -20 60 35 10 -19 -12 -28 25
5638 25 -44 23 27 8 -25 13 2 -7 -90 -36 -14 1 -24 -24 -37 -34 12 51 -77 14 -21 -59 13 -4 -18 -23 17 -5 14 18 -28 -44 3
5671 3 17 -16 16 27 -5 -5 27 63 -4 8 -52 8 -25 -17 33 77 -15 19 -1 -17 39 -26 -17 54 -36 -19 -39 22 5 -60 45 -26
5703 -26 29 -15 -10 15 -15 10 -7 35 -12 -13 62 30 -24 34 -21 -21 -8 11 -1 21 -53 45 -23 45 -7 -23 23 -29 66 -2 -6 -7 17
5736 17 28 -22 8 -48 7 69 -7 -7 86 53 16 -22 4 1 9 42 0 -19 2 5 -32 10 32 14 46 -107 -19 6 -31 -32 74 18
5768 18 -46 -15 -21 -40 -44 79 -25 25 -45 3 17 -30 9 12 -27 31 -18 14 13 0 -31 22 21 60 -33 52 4 -46 11 -13 -3 47
5800 47 -5 -32 41 6 13 -20 11 47 57 8 -7 16 33 8 -6 -22 21 12 2 -5 24 13 56 5 6 -10 -6 -57 11 32 -13 -69 -17
5833 -17 -16 -3 -15 -4 -13 -44 -43 19 76 10 48 23 5 4 5 -1 22 -14 9 8 -10 45 -12 -23 -63 76 45 28 14 35 12 -18 85
5866 85 -58 38 49 -4 -30 -19 31 3 -40 47 -13 13 38 2 13 4 -39 68 19 -12 -13 -6 -21 9 69 -5 -4 30 -62 39 29
5897 29 67 65 -13 19 13 18 7 -12 -16 -31 36 -25 -19 12 27 -47 21 29 33 10 46 -18 6 51 40 40 -36 -1 12 -13 -62 7 41 6
5931 6 -67 6 43 15 -1 27 47 -36 -5 -16 21 4 1 -34 -3 27 16 59 42 26 -16 81 4 18 11 -37 16 4 16 3 14 14
5963 14 -25 90 25 -52 -35 16 -20 39 18 -30 -32 -46 26 18 33 -34 31 3 -46 60 21 -1 19 42 98 -11 -28 7 8 63
5993 63 0 27 -33 -41 21 -25 66 33 -8 26 -31 3 -26 -25 21 69 60 18 27 62 40 -33 4 24 58 3 44 14 48 -4 -2 41 -4
6026 -4 96 -8 15 -5 22 -1 18 -5 64 -3 -62 29 -49 45 44 28 35 37 -19 59 13 10 34 0 14 18 24 56 8 -55 -3 -3 24
6059 24 15 13 34 30 15 24 -16 43 61 11 16 -4 -26 -13 23 -4 -2 5 53 -4 -31 45 2 34 19 18 12 -11 42 42 58 41 22 -34 -29 15
6095 15 41 -1 -26 16 -52 12 7 12 36 46 38 9 38 -13 7 59 28 10 -32 34 66 48 59 11 19 29 9 74 -11 -23 -44 15
6127 15 -29 -49 9 3 -12 36 -53 -2 -28 -12 -15 39 86 -53 24 -25 -5 -14 37 -21 -16 10 59 8 16 34 8 30 10 6 46 -17 -34
6160 -34 27 -28 67 11 28 12 -65 -55 -7 -9 25 -35 -12 44 -15 -80 27 52 -4 -21 19 16 -17 42 -1 41 51 42 46 35 -28 8
6192 8 30 23 -11 27 -22 53 33 -13 27 19 25 -22 -63 34 2 -25 -5 -24 44 14 35 31 33 -4 -48 1 30 18 88 19 17 -2 -29 5
6226 5 -8 -9 81 42 -43 -49 -29 24 30 -10 65 53 88 -5 -17 29 30 -27 7 10 -8 -9 47 -17 -15 -7 -34 -32 -5 -51 0 0 -31 16 44 54
6262 54 -2 -23 3 1 56 -9 -6 -16 -6 28 3 -37 -49 -3 21 -62 -14 -9 40 35 -27 65 -8 -13 57 18 -58 32 54 0 -6 -30 49
6295 49 -15 -15 -7 -34 -24 -13 -27 3 14 -47 -31 -36 -50 10 1 -53 -22 -8 22 32 1 32 6 -63 18 -43 -55 3 5 1 60 27 25 25
6329 25 -2 30 30 -33 55 7 13 1 37 35 27 -50 -11 37 37 48 -38 -4 32 2 12 -11 -17 -5 63 76 25 -34 6 -3 -56 -38 -28 -63
6363 -63 -13 12 -6 -1 -13 53 50 -10 -67 46 -34 -21 -1 8 42 -42 -19 18 -5 -65 3 -28 -47 42 -6 -11 -18 19 34 -29 4 25
6395 25 0 -50 66 31 -12 -11 10 17 5 33 -12 20 38 -14 -6 -10 -10 62 -2 24 22 -18 -52 -36 18 40 27 -40 -9 72 -25 -70 19
6428 19 9 -13 62 22 17 -21 9 -15 16 6 74 -7 -3 -39 -35 -8 10 -29 16 -15 1 -5 -8 -19 -34 19 10 -9 18 24 17 -6 -31 -9
6462 -9 -3 -43 16 -30 -4 -16 -78 65 -56 70 23 -28 -3 32 -40 15 18 -16 41 -50 -8 -63 1 11 8 -8 9 2 -1 -5 -12 -17 35
6495 35 42 10 -6 5 1 -3 14 15 2 -30 -4 -29 -3 12 2 11 -3 -8 -27 3 35 84 17 23 42 59 7 25 3 -51 24 -16 31 -3
6529 -3 3 14 87 9 -43 -32 15 7 2 -1 -5 14 7 -63 -28 -26 25 -73 61 -38 -38 -32 39 80 22 -3 -27 -23 -50 -17 -3 -53 -43 12 -10
6564 -10 9 45 -10 -45 51 47 48 -6 7 41 16 -23 23 41 14 7 25 62 -4 -46 39 -5 -24 -14 -4 80 -19 37 50 -32 -4 -39
6596 -39 -48 -10 12 -48 -14 55 -2 84 1 19 -4 38 -34 -34 -46 9 -44 4 16 -24 -72 22 57 -21 -46 -61 31 -68 21 -7 28
6627 28 -17 30 14 -9 -16 -7 -4 -16 -20 -11 -13 10 34 -36 58 8 -36 23 7 -4 -62 -46 28 22 -23 1 30 14 -43 16 -34 65 -7 -48
6661 -48 -37 36 6 -46 54 -55 34 -43 -36 -19 -50 27 18 47 1 12 16 19 -4 -7 35 35 14 -24 3 38 5 -1 -57 30 -20 19 6
6694 6 -38 32 -32 20 5 -5 -22 -1 25 -62 10 60 26 -15 24 -39 26 -61 18 18 0 35 21 80 -48 64 10 -40 -32 -28 26
6725 26 -14 63 -22 -55 -24 25 -10 102 1 3 45 -17 48 -35 -40 -37 -5 39 24 36 20 5 58 -3 11 28 21 29 8 -6 -12 29
6757 29 -89 15 -3 -26 -45 44 13 23 -10 6 73 -28 -24 18 -33 -95 24 26 -35 14 59 -92 10 -25 7 2 -5 69 -24
6786 -24 39 -27 19 15 33 13 1 -16 -11 25 -46 12 -4 -9 27 -35 35 41 81 -20 29 -23 -11 31 -1 80 -31 -25 1 26 28 45
6818 45 -7 -10 -34 -24 17 -19 31 27 -46 -21 -3 23 -45 44 35 -34 -29 -9 -36 13 -58 -15 22 -33 -2 6 -43 -24 36 20 -40 14 0
6851 0 74 37 11 29 -31 0 -2 -16 -46 41 28 14 -36 8 -37 -4 -2 -17 10 44 9 18 -27 -45 -11 20 -34 -2 -15 0 7 -4 -24
6884 -24 -4 10 -8 1 -1 -32 -38 -30 -46 9 18 -20 13 68 -46 -42 -36 17 -28 24 42 1 -35 -5 -4 15 -3 -47 -15 1 -66 -35 63 38
6918 38 1 -33 -1 21 -74 -8 21 49 -38 -11 24 -20 30 16 -52 -22 6 11 22 -45 -9 0 29 27 -75 12 8 -4 -49 7 -64 -36
6950 -36 47 11 -47 -35 27 -20 -8 8 93 -17 12 -3 8 -5 -38 -2 14 23 -19 10 -6 68 101 -4 11 37 8 46 49 36
6980 36 59 -26 23 -73 -43 23 6 -56 -31 -12 -33 5 -59 21 -41 16 15 19 8 -13 -64 38 25 -9 -29 5 -34 10 -10 35 5
7011 5 -13 -47 -60 -66 -18 28 34 -14 69 -9 43 51 14 -15 33 -5 18 -33 3 -40 -8 46 -14 -11 -19 -23 -44 22 -32 -3 -34 -33 -65 1
7045 1 -11 -41 1 25 -40 -7 31 -8 -11 -12 -37 27 -29 9 -3 -38 -20 -6 -72 -9 -22 -15 7 -17 24 32 -1 -65 26 18 -28 -35 4 50
7079 50 18 -37 -45 55 31 -42 -26 32 26 -16 -11 -29 2 -37 -24 38 -31 -17 -19 59 -70 -38 56 16 -12 16 -2 -24 -37 -4 -62
7110 -62 -6 4 36 -1 -35 -2 38 -11 5 40 26 -33 -22 -10 1 -49 2 34 -25 2 -20 -34 -24 -8 67 -13 -21 52 -13 13 -21
7141 -21 13 -13 11 24 12 -21 -2 23 -17 -52 -66 -39 -45 -6 11 -5 17 15 -24 40 -68 2 9 -21 -79 -11 -5 1 -62 26 22 -19 -13
7174 -13 -23 30 26 -42 2 -12 -35 3 85 91 37 -49 -10 8 -3 -30 9 34 -19 56 69 -28 -17 22 32 24 29 -6 -45 -19 -10 -32 -40
7207 -40 -39 -16 -14 36 15 -57 25 -1 -9 -54 -25 -19 29 -4 -37 11 -27 39 14 -14 -32 -7 41 -30 -26 -15 107 9 31 -23 -8 28
7239 28 -8 -15 -56 -12 38 16 1 -11 50 20 6 35 -47 21 17 -60 -20 -38 21 -4 -29 57 -9 33 -20 45 1 27 5 -50 19
7270 19 -58 67 -53 -33 -2 42 67 -4 -7 24 -6 -1 -30 -1 15 12 -36 10 44 37 -23 12 -9 2 25 -6 -55 -26 5 -73 -6
7301 -6 -4 -26 27 -31 20 26 -61 -18 12 46 -60 -1 -34 6 42 2 20 37 -16 -25 -21 -57 16 66 -25 -4 -9 -42 31 -53 31 -28 -27
7334 -27 -29 14 -11 16 53 -77 -12 28 -10 -33 63 21 14 54 12 -36 -13 15 17 -2 14 17 -26 -21 10 27 -15 -42 60 7 -19 18
7366 18 -38 23 -35 -41 17 49 -38 54 1 11 -28 0 24 15 -65 16 -22 28 0 -46 4 12 -5 1 -4 -23 22 -43 -18 3 13 -86 -9
7399 -9 8 2 29 0 -13 1 -18 8 -24 -15 15 38 31 -22 25 -9 19 77 -38 -14 -31 53 -10 38 -14 28 -13 0 2 3 14 53 36
7432 36 21 -40 -3 30 17 -1 -61 -6 34 -14 -7 -124 7 -19 -6 44 5 31 -14 0 10 11 -37 12 -7 -38 -26 5 52 -12
7462 -12 21 -30 -8 -17 11 -18 39 40 17 -7 39 -4 -32 -17 -2 -62 -34 -38 24 53 11 43 37 41 60 24 -5 -39 -7 -20 -6 -20 68
7495 68 6 5 -35 16 21 -44 -77 10 19 -25 -14 -2 3 -43 -18 8 -4 2 -30 28 3 -10 1 -31 36 37 6 -19 17 -46 16 49 -1
7528 -1 -27 20 -17 13 -48 26 -4 -34 -10 -9 -9 31 26 74 4 10 -63 -17 0 26 -44 -46 17 34 15 3 9 -35 42 -8 -2 -4 -64 -28 -13
7563 -13 -26 -79 -97 21 42 -15 -49 -65 15 -16 3 -38 -2 104 24 0 35 37 -33 12 -13 2 39 19 10 -47 -4 -6 -9 -17 10 44
7595 44 26 -2 36 -27 -13 5 53 27 3 -54 -1 -34 -44 24 27 24 14 -1 -22 -14 1 -56 -10 -16 -36 -37 12 -18 1 23 -24 -21 30
7628 30 -47 19 -34 -2 13 39 -52 32 1 -4 28 -13 -14 -33 -47 -14 30 7 23 56 12 -2 17 -20 7 65 18 -28 -73 2 38
7659 38 -4 -26 -51 -26 -41 0 20 31 -24 -11 -41 -17 -29 -26 6 -28 -22 -13 -13 -12 88 24 -74 4 10 28 14 1 23 15 -13 0 -7 13
7693 13 4 -30 11 -15 39 25 -30 93 -8 10 -3 7 4 3 -39 22 -3 19 -9 -47 56 38 17 32 -19 17 -1 11 11 4 33
7724 33 37 45 -42 3 26 -4 -96 33 -34 -12 -58 10 -46 -25 21 4 -11 26 -21 31 35 -39 35 57 -2 5 -15 16 -14 54 1 16
7756 16 39 -56 31 6 -47 -30 13 38 41 54 8 -4 20 4 65 48 20 8 -16 -13 -20 -42 -4 -42 8 -2 -26 -6 -9 6 53 -36
7788 -36 -7 27 -7 52 34 23 50 37 -15 27 -27 16 -41 -16 1 16 2 -77 -16 10 9 -25 21 50 -8 1 25 72 25 -46 -21
7819 -21 -3 37 21 16 46 43 8 68 -15 28 -38 -58 -17 -38 -26 13 41 -37 31 -36 25 -11 47 -2 37 -53 -32 3 48 -38 -64
7850 -64 37 32 -39 -25 40 14 15 -64 1 -14 -12 52 3 -3 18 -53 -24 -2 18 14 14 3 23 11 52 24 8 -11 -36 59 5 -15 16
7883 16 8 4 -11 41 -3 11 -49 18 45 38 29 63 36 -33 11 -1 -21 -29 -32 -28 -8 -104 -75 4 37 56 16 13 -21 -47 19 -37 -17 2
7917 2 -19 32 42 17 -43 26 22 66 29 -26 -16 37 -51 -7 67 31 -10 30 -54 -43 36 -30 35 -21 12 22 25 6 45 34 -56 29
7949 29 -20 1 -20 -37 -30 -53 -55 -43 -44 25 46 22 -19 -4 -12 44 47 12 8 2 20 2 7 0 -21 20 3 -16 25 -52 20 -34 -29 -53 -8
7984 -8 -9 -17 -16 -9 62 -46 26 -52 11 -36 31 48 39 28 5 6 26 44 47 64 -41 55 46 15 -25 39 -46 -17 30 6 -24 24 14 -41
8018 -41 -2 38 -2 7 -23 6 -11 7 7 39 35 -6 9 -12 -33 -49 7 42 -5 12 59 7 10 35 -23 -10 33 39 -28 14 29 -59 18
8051 18 60 -20 -8 59 15 4 -26 34 39 40 2 -6 -32 -4 7 -3 -6 -32 -30 42 0 -23 32 25 -5 -6 -11 3 -55 11 1 36 25 -55
8085 -55 17 18 28 -39 -10 27 -37 -43 15 -10 -47 33 2 39 -13 -61 12 29 24 43 44 23 -56 -53 -16 -18 -12 -21 33 31 -14 21 -28 6 13
8120 13 14 -13 -22 -5 -6 6 0 -25 -2 13 -18 20 60 38 -7 -28 6 -21 -18 45 41 2 36 36 -3 47 3 -31 9 -23 -8 -10 -10 -32 -14
8155 -14 27 -36 -34 -7 39 51 -20 -1 -22 -26 -21 18 36 -6 -54 -16 -17 -20 -14 11 -45 48 10 11 62 6 -20 34 -5 -21 22 59 31 6
8189 6 27 54
8191E4
##END NTUPLES=NMR FID
##END=
