##TITLE=1H_2PBDP3
 CDCl3, 8 sc, 
 30.7.2019
##JCAMPDX= 6.0         $$ Bruker NMR JCAMP-DX V2.0
##DATA TYPE= NMR FID
##DATA CLASS= NTUPLES
##ORIGIN= UXNMR, Bruker Analytische Messtechnik GmbH
##OWNER= root
$$ XWIN-NMR		Version 3.5
$$ Tue Jul 30 14:13:20 2019 Russian Standard Time (UT+4h)  she@DPX200
##.OBSERVE FREQUENCY= 200.13155
##.OBSERVE NUCLEUS= ^1H
##.DELAY= (6, 6)
##.ACQUISITION MODE= SIMULTANEOUS
##.ACQUISITION SCHEME= undefined
##.AVERAGES= 8
##.DIGITISER RES= 18
##SPECTROMETER/DATA SYSTEM= spect
##.PULSE SEQUENCE= zg30
##.SOLVENT NAME= CDCl3
##.SHIFT REFERENCE= (INTERNAL, CDCl3, 0, 15.7039)
##AUDIT TRAIL= $$ (NUMBER, WHEN, WHO, WHERE, WHAT)
$$ ##TITLE= Audit trail, XWIN-NMR		Version 3.5
$$ ##JCAMPDX= 5.01
$$ ##ORIGIN= Bruker BioSpin GmbH
$$ ##OWNER= she
$$ F:/spectra/data/she/nmr/H-F/1/audita.txt
$$ ##AUDIT TRAIL=  $$ (NUMBER, WHEN, WHO, WHERE, WHAT)
(   1,<2019-07-30 14:12:32.03 +0400>,<she>,<DPX200>,
      <created by zg, POWCHK disabled, PULCHK disabled
       configuration hash MD5:
       00 E9 B6 7A A2 85 ED C7 34 08 36 98 17 FE 4E 26
       data hash MD5: 16K
       80 47 81 E6 E6 D3 83 4F 12 2B 0A 9B DD A6 09 26>)
$$ ##END=
$$ 
$$ hash MD5
$$ F1 DA 63 F8 25 E8 7A 00 CA EE 0E 5B DB F2 26 27
##$RELAX= 
##$RELAX= 
##$RELAX= 
##$RELAX= 
##$RELAX= 
##$RELAX= 
$$ Bruker specific parameters
$$ --------------------------
##$DU= <F:/spectra>
##$EXPNO= 1
##$NAME= <H-F>
##$PROCNO= 1
##$TYPE= <nmr>
##$USER= <she>
##$AMP= (0..31)
100 100 100 100 100 100 100 100 100 100 100 100 100 100 100 100 100 100 
100 100 100 100 100 100 100 100 100 100 100 100 100 100 
##$AQSEQ= 0
##$AQ_mod= 1
##$AUNM= <au_zg>
##$AUTOPOS= <>
##$BF1= 200.13
##$BF2= 200.13
##$BF3= 200.13
##$BF4= 200.13
##$BF5= 200.13
##$BF6= 200.13
##$BF7= 200.13
##$BF8= 200.13
##$BYTORDA= 1
##$CFDGTYP= 0
##$CFRGTYP= 5
##$CHEMSTR= <none>
##$CNST= (0..31)
1 1 145 1 1 1 1 1 1 1 1 1 1 1 1 1 1 1 1 1 1 1 1 1 1 1 1 1 1 1 1 1 
##$CPDPRG= <>
##$CPDPRG1= <>
##$CPDPRG2= <>
##$CPDPRG3= <>
##$CPDPRG4= <mlev>
##$CPDPRG5= <mlev>
##$CPDPRG6= <mlev>
##$CPDPRG7= <mlev>
##$CPDPRG8= <mlev>
##$CPDPRGB= <>
##$CPDPRGT= <>
##$D= (0..31)
0 1.2 0 0 0 0 0 0 0 0 0 0.03 0 0 0 0 0 0 0 0 0 0 0 0 0 0 0 0 0 0 0 0 
##$DATE= 1564481551
##$DBL= (0..7)
120 120 120 120 120 120 120 120 
##$DBP= (0..7)
150 150 150 150 150 150 150 150 
##$DBP07= 0
##$DBPNAM0= <>
##$DBPNAM1= <>
##$DBPNAM2= <>
##$DBPNAM3= <>
##$DBPNAM4= <>
##$DBPNAM5= <>
##$DBPNAM6= <>
##$DBPNAM7= <>
##$DBPOAL= (0..7)
0.5 0.5 0.5 0.5 0.5 0.5 0.5 0.5 
##$DBPOFFS= (0..7)
0 0 0 0 0 0 0 0 
##$DE= 6
##$DECBNUC= <off>
##$DECIM= 24
##$DECNUC= <off>
##$DECSTAT= 4
##$DIGMOD= 1
##$DIGTYP= 9
##$DL= (0..7)
0 120 120 120 120 120 120 120 
##$DP= (0..7)
150 150 150 150 150 150 150 150 
##$DP07= 0
##$DPNAME0= <>
##$DPNAME1= <>
##$DPNAME2= <>
##$DPNAME3= <>
##$DPNAME4= <>
##$DPNAME5= <>
##$DPNAME6= <>
##$DPNAME7= <>
##$DPOAL= (0..7)
0.5 0.5 0.5 0.5 0.5 0.5 0.5 0.5 
##$DPOFFS= (0..7)
0 0 0 0 0 0 0 0 
##$DQDMODE= 0
##$DR= 18
##$DS= 0
##$DSLIST= <SSSSSSSSSSSSSSS>
##$DSPFIRM= 0
$$ [...]
##$SUBNAM2= <"">
##$SUBNAM3= <"">
##$SUBNAM4= <"">
##$SUBNAM5= <"">
##$SUBNAM6= <"">
##$SUBNAM7= <"">
##$SUBNAM8= <"">
##$SUBNAM9= <"">
##$SW= 24.9336996594482
##$SWIBOX= (0..15)
0 0 2 0 0 0 0 0 0 0 0 0 0 0 0 0 
##$SW_h= 4990.01996007984
##$TD= 16384
##$TD0= 1
##$TE= 0
##$TE2= 300
##$TE3= 300
##$TEG= 300
##$TL= (0..7)
0 120 120 120 120 120 120 120 
##$TP= (0..7)
150 150 150 150 150 150 150 150 
##$TP07= 0
##$TPNAME0= <>
##$TPNAME1= <>
##$TPNAME2= <>
##$TPNAME3= <>
##$TPNAME4= <>
##$TPNAME5= <>
##$TPNAME6= <>
##$TPNAME7= <>
##$TPOAL= (0..7)
0.5 0.5 0.5 0.5 0.5 0.5 0.5 0.5 
##$TPOFFS= (0..7)
0 0 0 0 0 0 0 0 
##$TUNHIN= 0
##$TUNHOUT= 0
##$TUNXOUT= 0
##$USERA1= <user>
##$USERA2= <user>
##$USERA3= <user>
##$USERA4= <user>
##$USERA5= <user>
##$V9= 5
##$VALIST= <valist>
##$VCLIST= <CCCCCCCCCCCCCCC>
##$VD= 0
##$VDLIST= <DDDDDDDDDDDDDDD>
##$VPLIST= <PPPPPPPPPPPPPPP>
##$VTLIST= <TTTTTTTTTTTTTTT>
##$WBST= 1024
##$WBSW= 4
##$XGAIN= (0..3)
0 0 0 0 
##$XL= 0
##$YL= 0
##$YMAX_a= 274633
##$YMIN_a= -244198
##$ZGOPTNS= <>
##$ZL1= 120
##$ZL2= 120
##$ZL3= 120
##$ZL4= 120
##$ABSF1= 10
##$ABSF2= 0
##$ABSG= 5
##$ABSL= 3
##$ALPHA= 0
##$AQORDER= 0
##$ASSFAC= 0
##$ASSFACI= 0
##$ASSFACX= 0
##$ASSWID= 0
##$AUNMP= <proc_1d>
##$AZFE= 0.1
##$AZFW= 0.1
##$BCFW= 1
##$BC_mod= 2
##$BYTORDP= 1
##$COROFFS= 0
##$CY= 11.3945322036743
##$DATMOD= 1
##$DC= 2
##$DFILT= <>
##$DTYPP= 0
##$F1P= 20.1537800932815
##$F2P= 0.134698688090026
##$FCOR= 0.5
##$FTSIZE= 0
##$FT_mod= 4
##$GAMMA= 1
##$GB= 0.15
##$INTBC= 1
##$INTSCL= 1
##$ISEN= 128
##$LB= 0.24
##$LEV0= 0
##$LPBIN= 0
##$MAXI= 10000
##$MC2= 0
##$MEAN= 0
##$ME_mod= 0
##$MI= 1.114404
##$NCOEF= 0
##$NC_proc= 0
##$NLEV= 6
##$NOISF1= 3.799351
##$NOISF2= 2.8
##$NSP= 1
##$NTH_PI= 0
##$NZP= 0
##$OFFSET= 15.70392
##$PC= 1
##$PHC0= -9380.174
##$PHC1= 17.40097
##$PH_mod= 1
##$PKNL= yes
##$PPARMOD= 0
##$PSCAL= 0
##$PSIGN= 0
##$REVERSE= no
##$SF= 200.130013532006
##$SI= 16384
##$SIGF1= 3
##$SIGF2= 2
##$SINO= 400
##$SIOLD= 16384
##$SREGLST= <1H.CDCl3>
##$SSB= 0
##$STSI= 0
##$STSR= 0
##$SW_p= 3612.71676300578
##$SYMM= 0
##$S_DEV= 0
##$TDeff= 0
##$TDoff= 0
##$TI= <>
##$TILT= no
##$TM1= 0
##$TM2= 0
##$TOPLEV= 0
##$USERP1= <user>
##$USERP2= <user>
##$USERP3= <user>
##$USERP4= <user>
##$USERP5= <user>
##$WDW= 1
##$XDIM= 8192
##$YMAX_p= 0
##$YMIN_p= 0
$$ End of Bruker specific parameters
$$ ---------------------------------
##NTUPLES= NMR FID
##VAR_NAME=  TIME,          FID/REAL,        FID/IMAG
##SYMBOL=    X,             R,               I
##VAR_TYPE=  INDEPENDENT,   DEPENDENT,       DEPENDENT
##VAR_FORM=  AFFN,          ASDF,            ASDF
##VAR_DIM=   8192,          8192,            8192
##UNITS=     SECONDS,       ARBITRARY UNITS, ARBITRARY UNITS
##FACTOR=    0.0002004,     1,               1
##FIRST=     0,             0,               0
##LAST=      1.6414764,     0,               0
##MIN=       0,             -244198,         0
##MAX=       1.6414764,     274633,          0
$$ Real data points
##PAGE= N=1
##DATA TABLE= (X++(R..R)), XYDATA
0@%%%%pJ5qQj6K4l2L2m0N6o4P2r6J20j36J60j92K24k56K96l44L93m48N11n82O60
30C50p41Q32r35J048j172J307j457J618j794J992k208K443k703K992l316L677
46A933m080M536n061N669o377P218q242R516j1145J3322j6402K1116k9288M7355
60C0070j52158Q5096L03130l05433j75786K84696J78357l27010j45789K77144
70E2317J20816k71751o4308K59049O7822k38627m9134J95258L6796j85472l3189
81a10423J63018M9468j46054n2738J37165P2501j37027q7443J35944R8606j55171
92c2154j13225J70688J27660j83333j20498K08998J15197k39101j14485K49738
102F9485R4525k62939o4450K83788M6823k87374k4378K77895r879k75266L4251
$$ y = [0, 0, 0, 0, 0, -7, 8, 0, 8, -8, 16, -16, 16, -24, 32, -32, 40, -56, 64, -72, 88, -104, 120, -136, 160, -184, 209, -239, 272, -310, 350, -391, 441, -494, 554, -618, 689, -768, 850, -944, 1048, -1160, 1283, -1420, 1572, -1744, 1933, -2147, 2389, -2672, 2997, -3380, 3838, -4404, 5112, -6033, 7289, -9113, 12003, -17285, 30070, -122088, -36992, 266138, -39295, -215081, 69615, 247972, -79038, -224827, 52317, 173133, -98618, -162926, 96123, 163945, -74682, -123816, 71442, 108238, -77234, -110423, 52595, 102063, -43991, -96729, 40436, 112937, -24090, -111533, 24411, 123017, -32154, -145379, 25309, 152969, -30364, -150862, 58136, 173333, -65768, -180253, 69485, 164010, -98929, -163379, 120409, 167232, -120142, -144520, 133375, 123496, -151770, -117519]
113a17519K66509m8504k43722O7102K23643p9693k06332P9893J84190p8198j65628
124a18259P2878J54448n9590j43607M7210J39685l5766j44399K1027J49982j1510
135G2099j58626J0363J75379r176j90965J2618K01178k7719k14425M5390K25538
146A41654o2811k27132Q6242K24080j12396k19846J33394K07273j52694j89413
156a71649J70454J70673j81487j49682J86135J26399j87470j06177J82176Q7739
166A27111j72019p1572J60537O1279j46225n5619J30463N2789j17764n4820J07948
177B2108O2261r9459o9794R6363P8406r9331q8670J05221R7014j14327j01563
188a11771J28555J04132j43913j03172J59162R6994j74525q7095J88399P4557
$$ y = [-117519, 148990, 100486, -143236, -76134, 147509, 67816, -138516, -58623, 125567, 47369, -118259, -45381, 109067, 49477, -94130, -46920, 92765, 56999, -87400, -66373, 83609, 72099, -86527, -76164, 99215, 90039, -100926, -88308, 112870, 85151, -129274, -83884, 141654, 78843, -148289, -62047, 162033, 49637, -170209, -36815, 170458, 17764, -171649, -1195, 169478, -12009, -161691, 24444, 150843, -36627, -142804, 39372, 127111, -44908, -116480, 44057, 105336, -40889, -96508, 33955, 86744, -31020, -85840, 22108, 84369, -15090, -84884, 11479, 89885, -9446, -98116, 7105, 104119, -10208, -111771, 16784, 120916, -22997, -126169, 32993, 129987, -44538, -131633, 56766, 131323]
198A31323j98544n8461K05411M0739k08404k3180K06393N272k00778J0805J92187
209A02763k3744j80576L3922J67278m0909j54484M3599J41962m2943j30895M0224
220d3803J22947l5233j18193K8482J16123k2458j17479J7181J22065j3312j28515
231g2195J1936J35970j3486j44225J7718J51962k4807j57930L4370J62152m5640
242E5825j63446N8047J61789p0837j57565Q3204J50434r3992j40753J03434J29838
253A15978j10310j18135J14599J06092j16308r4627J15954Q4934j13371p6861
263i2055J09262P0821j04435o7228R9314O5816r4845o6226R1204O8066q9238p1087
275h0631Q8900P3989r0632p6944R4086P8793r9180p9628J05649P8457j13028p5657
$$ y = [131323, -67221, -125682, 79729, 120468, -87936, -111116, 95277, 100549, -100229, -89424, 102763, 79019, -101557, -67635, 99643, 58734, -95750, -52151, 89811, 46868, -84027, -43803, 79144, 43911, -74282, -45800, 70323, 47865, -69614, -52433, 69632, 56320, -72195, -60259, 75711, 62225, -82000, -64282, 87680, 62873, -95057, -60687, 101465, 55825, -107621, -49574, 112215, 41378, -116187, -32983, 117451, 23459, -117294, -13860, 115978, 5668, -112467, 2132, 108224, -8084, -102711, 13243, 98177, -15194, -92055, 17207, 88028, -16407, -83635, 15679, 81495, -13350, -79576, 11628, 79694, -9544, -80631, 8269, 82258, -8374, -85318, 8768, 87561, -11619, -91247, 14402, 92859, -20169, -95826]
287i5826J20444P0806j27594o4320J33930N6598j38902m7742J42306L8421j43703
298e5582k8971J43644K0226j41545j1971J38161N173j33579N26J28631m443j23266
310f2996P264J18155q708j13597R422J09939r264j07466Q774J06057q533j05948
322e6901Q563J06758r437j08308J0923J10182j3606j12541J7051J14487k1641
333D5530j16092K6553J16880l2314j16923L8061J15935m4045j13888M9525J11064
344H0286n4649j07363N9157J03110o2816r8323O5932R3482o7933q8736O9668Q4454
356G6269p0586q0325P1321P6925p1469p4182P1970P2112p2406p0318P3032O9162
368G1505p4021o8164P5431O7152p6956o6239P8874O4905q1064o3473Q3310O1214
$$ y = [-95826, 24618, 95424, -32170, -96490, 37440, 94038, -44864, -92606, 49700, 88121, -55582, -84553, 59091, 79317, -62228, -74199, 63962, 69135, -64444, -63918, 64713, 60270, -62996, -55732, 62423, 53715, -59882, -50460, 59479, 50215, -57251, -48477, 57580, 49047, -56901, -48338, 58420, 48983, -59325, -48402, 61780, 48174, -64367, -47316, 67171, 45530, -70562, -44009, 72871, 40557, -76366, -38305, 77630, 33585, -80303, -30778, 80286, 25637, -81726, -22569, 80541, 17725, -80598, -14666, 78816, 10883, -77853, -8185, 76269, 5683, -74642, -3321, 73604, 2135, -72047, -77, 72035, -371, -70689, 2343, 71505, -2516, -70680, 4751, 71903, -5053, -71292, 7582, 72487, -8577, -72050, 11260, 72474]
380G2474q5717n8593Q7718N5403q9891n2078R1590M8084r3147m4016R4234L9695
392F5756r5009l5510R5319L1407r5444k7489R5302K4004r5074k0596R4520J7699
404E4885r3917j4801R3403J2469r2867r896R2399P647r1832n113R1407K905r0874
417d4185m47R0618k068r0245M888Q9611p641q9039J0517Q8415j3500q7732J6396
430c4412Q6811j9209q5911K1933Q4786k4621q3814K7106Q2666k9602q1575L1690
442b4152Q0377l3917p9245L5893P7961l7920p6753L9852P5492m1893p4139M4047
454a4397P2554m6001p0888M8339O8955n0536o6888N2840O4665n4912o2126N6883
466a512N9520n8622n6786O0348N4003o1714n1108O2691M8575o3468m5828O3884
$$ y = [72474, -13243, -71836, 15882, 71285, -18606, -70684, 20906, 68990, -24157, -68173, 26061, 65756, -29253, -64763, 30556, 61963, -33481, -60970, 34332, 58336, -36738, -57334, 37186, 54885, -39032, -53833, 39570, 52039, -40828, -50724, 41675, 49322, -42510, -47623, 43784, 46689, -44185, -44632, 45986, 43918, -46327, -41439, 48172, 40531, -48508, -37991, 50424, 36924, -50808, -34412, 52399, 33190, -52721, -30788, 53998, 29377, -54437, -27331, 55335, 25733, -55842, -24152, 56225, 22308, -56937, -21044, 56917, 18997, -57756, -17904, 57588, 15695, -58444, -14397, 58157, 12156, -58732, -10393, 58562, 8026, -58862, -6022, 58643, 3731, -58395, -1512, 58008, -614, -57400, 2948, 56951, -4763, -55871, 6820, 55395, -8073, -53901, 9983]
478I983M3491o4147m1179O4254L9052o4225l7191O4063L5412o4113l3906O4273
490A5767L2364o4709l1043O5376K9356o6144k7917O7317K5989o8508k3955O9825
502B3718K1685p1399j9194P2681J6389p3852j3461P4641J0236p5038p091P5264
514C4579L701p4885m57P4191k629p2919N535P1540q049o9894J0361O8115j2175
527B7014o6247J3639O4649j4834o3164J5959O1922j6635o1012J7335O0590j8063
539B1153o0322J9055O0380k0111o0633K1533O0893k3283o1250K5381O1219k7800
551A6215o1040L0343O0438l3264n9394L5991N7936l8894n5841M1351N3301m3637
563C505n0543M5492M7442m6961m4376M7901M1106m8350l8172M8319L5711m8166
$$ y = [9983, 53474, -10673, -51852, 12402, 51454, -12771, -49962, 14101, 49513, -14600, -48506, 15767, 48131, -16578, -47621, 17755, 47111, -19033, -46950, 20367, 46356, -22152, -46107, 23718, 45403, -25996, -45190, 27491, 43880, -29972, -43433, 31208, 41444, -33594, -40685, 34579, 38280, -36605, -37062, 37129, 34500, -38419, -32884, 38656, 30607, -39287, -28926, 39189, 27014, -39233, -25594, 39055, 24221, -38943, -22984, 38938, 22303, -38709, -21374, 39216, 21153, -39169, -20114, 40266, 20155, -40478, -18945, 41948, 18665, -42585, -17204, 44015, 16215, -44825, -14482, 45956, 12692, -46702, -10711, 47225, 8331, -47510, -6159, 47142, 3505, -47038, -1546, 45896, -1065, -45441, 2460, 43566, -4784, -42956, 5363, 41074, -7092]
575g092l3432M7620L1750m6796l0520M6219K9921m5635k9536M5484K9646m5603
587g974k9685M6235K9932m7269k9919M8787K9697n0666k8954N2885K7724n5212
599a4419k5865N7489K3531n9801k0483O1583J7087o3005j3549O3753R593o3952
611b8038n768O3281K058o2195J099O0363l931n8304O082N5972p675n3576Q601
624b2031N1221q961m9229Q902M7816q587m6751Q124M6334p568m6438P388M7161
637B7381p428m8173Q124M9615r299n0867J1284N2128j3654n2877J6451N3473j9711
650A6447n3228K3047N2441k6488n0896K9597M8732l2393m6260L4681M3121l6385
662B416l9930L7267L6625l7533l3647L7083L0827l6289k8642L4939K7077l3692
$$ y = [-7092, -40524, 7096, 38846, -7950, -38470, 7749, 37670, -7965, -37501, 7983, 37629, -7974, -37659, 8576, 38508, -8761, -38680, 10107, 39804, -10862, -39816, 13069, 40793, -14419, -40284, 17205, 40736, -19065, -39548, 22035, 39122, -23883, -37432, 26321, 35914, -28038, -33806, 29475, 31533, -30662, -29563, 30800, 26869, -31435, -25353, 30619, 22944, -30632, -22031, 29190, 20229, -29000, -20098, 27718, 19131, -27620, -19496, 26838, 19270, -27168, -19780, 27381, 19953, -28220, -20096, 29519, 20220, -30647, -19363, 32765, 19111, -33766, -17315, 36158, 16447, -36781, -13734, 38707, 12219, -38677, -9080, 39652, 7259, -39001, -4320, 38801, 2416, -37514, -247, 36378, -1155, -34802, 2281, 33108, -3181, -31823, 3116, 30193, -3499]
674c499k6140L2272K5893l1242k6129L0459K7003l0393k7963L0804K9266l1974
686a643l0338L3785L1135l5972l1331L8778L1013m1532k9848M4416K8072m7170
698a0635k5386M9461K2202n1043j8539N2065J4688n2345j0814N1877P112n0707
710b2064l805M8924J009m6777J002M4350k304m2150K930L9890k955l8182K395
723a7737L6805j590l6169O16L6103P8l6534p40L7642Q23l9000l77M0563o44m2258
738b2419K418M3624m624m4666P326M5284j0400m5159J3704M4485j6781m3086J9706
751a0588M1158k2116l8695K4066L6004k5284l3168K5768L0498k5675k7960K4984
763a008K5938k3937k4458K2543K3632k1165k3467K0004K3656j9069k4594J8698
$$ y = [-3499, -29639, 2633, 28526, -2716, -28845, 1614, 28617, -1776, -29739, 1065, 30331, -1643, -31981, 1804, 32939, -3033, -34364, 4414, 35427, -6105, -35953, 8463, 36535, -10635, -36021, 13440, 35642, -15401, -33940, 18125, 32813, -19532, -30346, 21531, 28643, -22064, -25869, 23055, 24064, -22713, -21711, 22639, 20335, -21815, -18885, 21005, 18050, -20132, -17737, 19068, 17478, -18691, -18075, 18028, 18106, -18428, -19168, 18474, 19297, -19703, -20080, 20483, 19839, -22419, -20001, 23623, 18999, -25667, -18341, 26943, 16543, -28616, -14912, 29573, 12792, -30294, -10588, 30570, 8454, -30241, -6175, 29829, 4545, -28623, -2855, 27643, 1968, -25992, -1008, 24930, 993, -23465, -922, 22710, 1545, -21922, -1918, 21738, 2669, -21925, -3227]
775c227K5679j8871k7007J9738K8126k1242k9084K3316K9465k5686k9493K8501
787B15K8686l1201k7435L3968K5302l6216k2722L8034J9719l9237j6460L9689
799A2342J3203l9407j0052L8606P158l7189m708L5405K945l3407j644L1316J113
812A5681k9468j032K7934J565k6898k333K6462L201k6454m066K7054M832k8292
825a1814n039K9746M855l1429m158L3050L001l4701j259L6023j090l6808L581
838a6042L7089o379l6906R122L6103j1742l4761J3938L2897j5708l0788J6924
850f253K8578j7630k6540J7954K4455j7679k2714J6876K1627j6026k0765J5135
862b982K0491j4260k0567J3589K1174j3273k1927J3445K2944j4132k3720J5179
$$ y = [-3227, 22452, 3581, -23426, -3688, 24438, 3196, -25888, -2572, 26893, 1207, -28286, 215, 28901, -2300, -29735, 4233, 29535, -6681, -29403, 8631, 28350, -10887, -27347, 12342, 25545, -13862, -23914, 14692, 21850, -15339, -20047, 15358, 18303, -15104, -16748, 14568, 15681, -13787, -14819, 13115, 14680, -12218, -14551, 11911, 15112, -11342, -15408, 11646, 16478, -11814, -16853, 12893, 17748, -13681, -17839, 15211, 18212, -16489, -17748, 18275, 17185, -19623, -16042, 21047, 14668, -22238, -13116, 22987, 11245, -23516, -9578, 23319, 7611, -23177, -6253, 22325, 4695, -21845, -3891, 20564, 2885, -19829, -2953, 18674, 2648, -18117, -2982, 17509, 3249, -17318, -3729, 17445, 4172, -17755, -4310, 18634, 4502, -19218, -4039]
874d039K4420j6543k4878J8501K4795k0405k4329K2359K3401k4371k1886K6085
886C110J9992k7527j7907K8464J5652k9090j3288K9016J1076k8769r095K7985
898I619P411k7001o236K5929N191k4620m923K3554M855k2656n102K2196N470k1976
912h289o021K2225O475k2873o685K3904O670k5025o193K6266N428k7446m164K8544
926A2816K776k9392r44K9954j066k9885K885K9727m911k9023O753K7923q240k6708
940a7335R446K5224j0329k3711J0810K2186j1040k0917J0871J9724j0479j8992
952a4542R964J8555r600j8402R209J8479q991j8919Q987J9496r463j9861R972
965e116K0447j0922k0701J2037K0932j3380k0751J4805K0412j6232j9557J7581
$$ y = [-4039, 20381, 3838, -21040, -2539, 22256, 1851, -22478, -119, 23282, -1089, -22975, 3110, 23102, -4425, -22332, 6132, 21784, -7306, -20594, 8422, 19498, -9271, -18366, 9619, 17030, -9971, -16207, 9722, 14913, -9707, -14630, 8924, 13779, -8877, -13979, 8217, 13687, -8289, -14310, 7915, 14390, -8483, -15168, 8736, 15406, -9619, -15812, 10454, 15882, -11564, -15728, 12816, 15592, -13800, -14744, 15210, 14144, -15741, -12856, 16871, 11960, -17063, -10310, 17613, 9373, -17335, -7889, 17335, 7006, -16705, -5895, 16291, 5251, -15666, -4795, 14929, 4450, -14542, -4578, 13977, 4377, -14025, -4816, 13663, 4672, -14247, -5260, 14236, 4773, -15088, -5116, 15331, 4409, -16292, -4255, 16677, 3297, -17454, -2649, 17763, 1531, -18026, -445]
977d45J8631j8787j7320J9698J6025k0470j4379K0825J2875k0784j1518K0734
989E085J0081k0280r003J9784Q201j9306p592J8665P209j8208p064J7736P160
1002A2468j7670p345J7729P334j7915p541J8522P403j9071p222J9672O738k0353
1015g251o093K1049N250k1700m258K2246K902k2369j625K2497L38k2364J054K1906
1029A1582k168k1259L148K0597l919j9825M717J8920n059j8077N270J7389n383
1042E933j6831N477J6357n441j6037N461J5812n361j5933N466J6039n732j6193
1055a0983O123J6273o600j6466P145J6613p957j6553Q651J6474r722j6083J0532
1068b553J5629j1343j5060J2086J4289j2761j3470J3291J2620j3636j1749J3930
$$ y = [-445, 18186, -601, -17921, 1777, 17802, -2668, -17047, 3778, 16653, -4131, -15649, 5085, 15166, -5114, -14117, 5667, 13868, -5438, -13030, 5635, 12844, -5364, -12428, 5308, 12468, -5202, -12547, 5182, 12516, -5399, -12940, 5582, 12985, -6086, -13308, 6364, 13102, -7251, -13344, 7705, 12955, -8745, -13003, 9243, 12145, -10224, -11849, 10648, 10986, -11378, -10324, 11582, 9414, -11845, -8697, 11900, 7981, -11844, -7127, 11793, 6734, -11343, -6073, 11316, 5933, -10898, -5421, 10936, 5495, -10542, -5081, 10731, 5370, -10563, -5097, 10942, 5210, -10983, -4860, 11413, 4813, -11653, -4508, 12105, 4148, -12405, -3754, 12720, 2998, -13085, -2553, 13076, 1733, -13327, -1241, 13048, 287, -13183, 108, 12728, -908, -12657, 1273]
1080A273J0927j4068j0149J4134R350j3893q814J3896Q227j3677p787J3487P546
1093A0452j3471p167J3410O946j3308o857J3525O596j3695o307J3905O051j4203
1106d123n699J4450N332j4818m869J5119M217j5287l701J5459L133j5665k369
1119h821J5645J583j5571r66J5459L07j5366L62J5096j012j4791J533J4587k079
1133E966j4187K401J3949k870j3566L208J3346l501j3043L764J2805l981j2689
1146h398M361J2475m581j2254M777J2173n062j2068N396J1959n737j1840O244
1159b555J1666o523j1595O909J1417p412j1134P787J0925q278j0597Q767J0122
1172I499r132r785R462R268r769q739J0021Q222j0309p691J0488P035j0463o665
$$ y = [1273, 12200, -1868, -12017, 2117, 11467, -2426, -11240, 2656, 10883, -2794, -10581, 2906, 10452, -3019, -10186, 3224, 10170, -3138, -9995, 3530, 10126, -3569, -9876, 4029, 10080, -4123, -9822, 4628, 9960, -4858, -9727, 5392, 9609, -5678, -9379, 6080, 9213, -6452, -8821, 6824, 8407, -7164, -8130, 7329, 7636, -7730, -7368, 7728, 6716, -8075, -6542, 8045, 5966, -8221, -5820, 8129, 5259, -8307, -5099, 8247, 4746, -8297, -4533, 8272, 4291, -8398, -4037, 8438, 3857, -8397, -3620, 8553, 3491, -8577, -3181, 8778, 3041, -8799, -2555, 9111, 2588, -9007, -2098, 9319, 1907, -9227, -1440, 9485, 1207, -9390, -623, 9499, 367, -9418, 44, 9312, -457, -9196, 825, 9047, -1262, -8953, 1535, 8570, -1893, -8558]
1186h558J0587O107j0562n628J0450N253j0288m963J0245M646j0203m324J0118
1199B880M269j0164l971J0089L904j0198l705J0377L537j0490l391J0828L078
1212G043j1050k791J1239K483j1579k036J1889J418j1990r04J2136J72j2108M85
1226e593J2037j101j1858J683J1598k353j1349K930J0888l370j0390L570R977
1239F669l798r603L928R226m008q837L948Q600l922q415L805Q401l749q378L756
1254b377Q505l891q525M027Q725m280q854M761Q823n209q808N728Q730o255q481
1269g381O775Q254p290p771P688P222q105o634Q305O020q441n339Q405M748q289
1284a833m285Q161L734p965l397P713L146p474k910P069K948o871l050O762L136
$$ y = [-8558, 2029, 8136, -2426, -8054, 2396, 7649, -2639, -7602, 2643, 7289, -2914, -7238, 2880, 7149, -3015, -6986, 3103, 7007, -3191, -6896, 3481, 7018, -3472, -6863, 3965, 7043, -4007, -6798, 4441, 6924, -4655, -6691, 5198, 6616, -5374, -6278, 5858, 6030, -6078, -5593, 6444, 5343, -6515, -4832, 6766, 4413, -6936, -4006, 6882, 3512, -6878, -3308, 6669, 2871, -6732, -2804, 6422, 2414, -6423, -2475, 6125, 2203, -6212, -2407, 5994, 2245, -6133, -2377, 6128, 2237, -6288, -2261, 6464, 2184, -6670, -1909, 6914, 1705, -7103, -1375, 7355, 1100, -7381, -606, 7648, 358, -7413, 275, 7497, -608, -7242, 1063, 7083, -1358, -6697, 1708, 6456, -1833, -6118, 2043, 5777, -2188, -5585, 2128, 5274, -2200, -5110, 1959, 4907, -1964, -5014, 1748, 4884]
1299D884o766l158O766L336o943l456P318L370p574l322Q037L051q393k734Q806
1314C222K324r157j715R373J104r443m49R489k31r406R31R118j528q667J944Q292
1330E201k403p768K633P251k807o653K709O338k677o007K460N743k300n672K131
1345a821N625j934n761J837N953j787o222J892O469k181o705K578O853k972o939
1360e115L375O992l939o855M532O566n046o168N493N757n867n220O166M615o261
1375i75m046O347L383o122k941N962K534n708k186N399J979n052j963M850J890
1390C351m506k112M429K208m396k386M303K656m468k809M772K770n012k910N507
1405A397K789n946k500O239K125o532j684O774J126o889o16O988L0o864M57O682
$$ y = [4884, -1882, -5040, 1726, 5062, -1881, -5337, 1981, 5351, -2223, -5545, 2492, 5543, -2850, -5584, 3222, 5546, -3611, -5326, 4047, 5151, -4292, -4741, 4748, 4517, -4889, -3958, 5160, 3632, -5035, -3091, 5201, 2798, -4970, -2337, 4914, 2107, -4546, -1837, 4501, 1824, -4183, -1723, 4020, 1720, -3952, -1821, 3804, 1870, -3891, -2054, 3899, 2112, -4110, -2218, 4251, 2070, -4635, -2057, 4796, 1824, -5115, -1740, 5252, 1313, -5542, -1010, 5556, 510, -5658, -165, 5592, -275, -5495, 671, 5286, -975, -5021, 1326, 4709, -1413, -4354, 1608, 4142, -1566, -3752, 1647, 3626, -1426, -3389, 1461, 3351, -1155, -3267, 1162, 3370, -1026, -3412, 891, 3547, -921, -3730, 1042, 3812, -1200, -4110, 1397, 4186, -1760, -4260, 1979, 4104, -2428, -4112, 2662, 3788, -3101, -3717, 3271, 3301, -3563, -3106, 3576]
1421C576r81o304J432N905j646n470J849N002j893m695J960M340j823m030J587
1436a191L895j406l744J177L722r68l916R32M038r29m197R36M468j040m766J367
1452a622M904j700n009K070N042k517n053K898M988l495m572L746M295m150l802
1467c977M336L451m547k913M530K404m381k099M294J744m057j364L675J369l494
1482a029j250L220J218l020j205K828J463k790j573K687J889k926j979L129J986
1497B648l269k099L597K014l817j950M183J597m438j321M646J036m811n87M806
1512B235J89m839K76M642o68m390R42M113j195l837J377L512j434l231J484K993
1528B169j396k843J312K604j148k495R19K541q10k520P15K628o21k872P02L028
$$ y = [3576, 2595, -3709, -2277, 3628, 1982, -3488, -1639, 3363, 1470, -3225, -1265, 3075, 1252, -2778, -1191, 2704, 1298, -2446, -1269, 2453, 1485, -2431, -1499, 2539, 1610, -2587, -1651, 2817, 1777, -2989, -1622, 3282, 1582, -3427, -1357, 3685, 1168, -3885, -987, 4001, 506, -4066, -320, 3975, -175, -3977, 359, 3810, -737, -3650, 880, 3284, -1097, -3196, 1098, 2842, -1215, -2579, 1096, 2465, -1029, -2279, 941, 2159, -861, -2066, 762, 2225, -565, -2138, 549, 2438, -488, -2467, 662, 2648, -621, -2720, 877, 2891, -926, -2876, 1307, 2904, -1534, -2855, 1791, 2827, -1984, -2571, 2235, 2424, -2415, -2139, 2503, 1835, -2555, -1613, 2500, 1305, -2532, -1155, 2357, 923, -2308, -824, 2169, 773, -2070, -758, 1846, 698, -1797, -878, 1663, 853, -1667, -952, 1676, 1055, -1817, -1115, 1913]
1544A913p59l229R28L386j083l521J335L626j740l508J976L506k354l349K667
1559b06L149k914k868L095K420l144k212L391J753l275j473L116J257l023r86
1574a920K801Q52k561q39K406Q03k320p50K063Q78j928j166K083J187k114j215
1590a740K134J428k284j432K504J328k664j228K787J235l031r76L196P03l317
1605a357m58L335K46l415Q9L322l68l201O37L034p22k911Q66K644r43k437R42
1622f97K258j008k101R91J954q67j850P86J777p09j817O56J889n97j912N26K055
1639A334n79k190O87K276p81k363Q59K522j172k385J289K309j404k278J700K099
1655A923j929j898J970J748k028j553K146J296k084j139K068R31j894q95J923
$$ y = [1913, 1154, -2075, -1147, 2239, 1156, -2365, -1030, 2596, 856, -2652, -676, 2830, 476, -2873, -206, 2943, 29, -2839, 256, 2676, -468, -2680, 711, 2464, -811, -2284, 832, 2089, -934, -1920, 881, 1733, -828, -1667, 739, 1542, -778, -1528, 535, 1413, -515, -1681, 402, 1589, -525, -1740, 394, 1822, -462, -1894, 610, 1938, -726, -1954, 833, 2068, -963, -1939, 1257, 1960, -1357, -1815, 1520, 1766, -1649, -1560, 1762, 1394, -1807, -1170, 1864, 1142, -1769, -903, 1741, 798, -1639, -697, 1561, 553, -1548, -557, 1397, 530, -1320, -534, 1243, 534, -1283, -627, 1262, 665, -1247, -721, 1334, 755, -1435, -748, 1528, 747, -1616, -757, 1765, 593, -1792, -503, 1806, 402, -1876, -176, 1923, -6, -1904, 66, 1814, -214, -1767, 379, 1675, -409, -1548, 520, 1451, -443, -1338, 585]
1670E85O41j755o40J667N88j524o44J442P02j403o70J365O74j370p88J469Q62
1687A201j632q32J632R38j820q22J857P55k071n46K115N06k203k90K174J10k178
1704a106P3K196j90k152L87J994n79j816O32J709o74j544O89J450o45j419O66
1721c29J317o50j265N68J237n48j205N67J175m47j295M68J328n69j320N88J322
1738I42o25j405Q19J338q30j348Q97J360j032j302J121J236j330j040J311J027
1754A139j369r10J404P75j330p21J325O24j350m27J273M44j311l55J232L35j220
1771d42k70J110L31j138k55J097L52j146l01J141K09j156k58J277K29j371j29
1788g20J364P2j386K1J324m9j260k4J414k46j325K93J287k75j254L00J277n25
$$ y = [585, 1226, -529, -1169, 498, 1086, -438, -1082, 360, 1062, -341, -1011, 354, 1028, -342, -1130, 339, 1201, -431, -1263, 369, 1307, -513, -1335, 522, 1277, -794, -1340, 775, 1281, -922, -1212, 962, 1072, -1106, -1033, 1163, 973, -1179, -792, 1202, 623, -1193, -561, 1148, 474, -1070, -381, 1069, 424, -995, -329, 988, 338, -927, -359, 878, 330, -875, -308, 867, 420, -875, -407, 921, 352, -968, -380, 942, 317, -1088, -269, 1069, 239, -1109, -212, 1148, 116, -1186, -65, 1171, -159, -1199, 112, 1139, -230, -1140, 264, 1039, -291, -1012, 313, 937, -413, -840, 433, 877, -434, -789, 443, 778, -442, -712, 398, 729, -409, -664, 433, 785, -361, -662, 479, 688, -468, -726, 551, 780, -591, -720, 644, 716, -670, -649, 675, 626, -634, -658, 756, 510, -815, -522, 765, 490, -764, -464, 813, 288]
1806B88j113N45J075n80j054O49J019o60r82O26R08n65r51P07Q34o55q08O69P88
1825G40p32p86P79Q20q42p68Q44P40q06p82R49O29r50o46J026N22r45n19R49M53
1845F75r65m09R44M34r97m50J096K72r80k30R65K65j000k11R86K16j100q8J018
1864D41J33j055j28J157j9j069M5J035l4j046P8J085k41r88K37J063l00j016L15
1883c07R82n09q36M29R39m67q52M81P67l37r41N08P88n32p67N45P05n24p58N95
1903i1Q00o48p24N91P71p29p14P21P97q49o67P79O87r14n23R23M98r75m23R96
1923C06L94j057l12R78K96r70k06R44J20q79j44R23O4q25j34Q41J82q90o9P93
1943C55J05q27m8Q08J34r65o4R55N2r82n6J041Qj135J53J133k29j109K58J078
$$ y = [288, -825, -280, 795, 215, -839, -190, 829, 169, -813, -187, 721, 156, -795, -88, 746, 91, -717, -48, 740, 8, -778, 1, 821, -21, -789, 55, 795, -11, -793, 156, 785, -165, -811, 215, 737, -208, -727, 222, 675, -290, -699, 245, 679, -318, -768, 328, 600, -380, -610, 355, 620, -380, -591, 395, 611, -489, -577, 441, 574, -481, -609, 548, 529, -540, -495, 540, 506, -540, -462, 623, 382, -606, -369, 694, 394, -622, -307, 675, 166, -670, -241, 698, 231, -621, -140, 627, 290, -651, -143, 645, 113, -654, -109, 596, 72, -686, -91, 709, 61, -663, -72, 699, -30, -744, -23, 774, -75, -742, 37, 724, -190, -713, 210, 708, -267, -690, 306, 700, -357, -669, 309, 605, -365, -571, 373, 493, -386, -530, 393, 457, -368, -502, 339, 521, -369, -438, 355, 460, -367, -415, 393, 527, -438, -502, 453, 505, -477, -533, 508, 516, -619, -466, 667, 438, -671, -413, 665]
1963F65l06j115L99J082m94j075O06R66o01q68O38Q59p06p74O89P52p87n94P11
1982D7N60o43n54O42N83o50n53N64N67n18o44O29O73p30o35O98O38o83p45Q45
2002I1O71r17o67J038O44j163m95J113M65j202l79J295K37j247j27J204N7j236
2020f18N0J144j02j062J48R44j05r50K13Q04p2q76M7Q83j25p36J9Q38jr23K1R14
2042D55P8j025o6J158r5j155K17J215l56j201L88J222n25j190O39J176p23j195
2060i83Q81R85q57r64R80P52r56o45J014N13r21n08R04M85q33m75P04M31o71l49
2080e13N81N37p40m78O35N51o49n97P14O94p87p16Q34P63r62o70J049O53j144
2099b45o52J405L95j358m30J453K58j441j47J453k0j458K13J348k99j235L20J157
$$ y = [665, 359, -756, -357, 725, 231, -844, -238, 728, 127, -741, -103, 756, 50, -724, -35, 717, -70, -664, 47, 607, -36, -590, 52, 635, -15, -568, -4, 563, 45, -599, 30, 703, -27, -662, 36, 674, -9, -754, 91, 762, -155, -822, 216, 860, -303, -798, 315, 780, -422, -801, 494, 731, -516, -643, 561, 618, -618, -568, 576, 474, -588, -440, 504, 399, -551, -338, 466, 394, -482, -435, 448, 323, -413, -394, 444, 443, -480, -459, 455, 533, -492, -558, 600, 505, -650, -433, 782, 426, -775, -387, 835, 310, -880, -241, 935, 212, -983, -102, 883, 26, -938, 42, 794, -162, -807, 207, 720, -201, -709, 195, 680, -153, -628, 76, 507, -164, -513, 68, 605, -135, -613, 22, 573, -76, -673, 41, 735, -52, -768, 66, 829, -133, -803, 246, 899, -245, -897, 508, 903, -455, -885, 568, 826, -615, -762, 691, 671, -787, -574, 774, 475, -760, -440, 717]
2117G17l87j010L85R14m11q17K83Q74k81p82J35Q55j95q04J10Q50m0r35M1J025
2137E27l6j168J72J236k56j242L72J350n89j383O74J305p17j307Q89J234j106
2154d5r87J105R98j192q33J186O67j114o38J174M53j025l84R19L43q68l63R20
2172C16K66p47m15O81N16p82n21P66O19p95o03P66P13q86q14J056P87j251n94
2191i22J180P14j470m69J543L36j568k00J572N2j609J75J523k99j450L72J389
2208H69m58j255N03J122m99j074N07R10l16q65K95Q52k42q65J96Q58j57r25J64
2227c80R41j61r84J15J216k48j297K53J441m27j415M96J458p26j354P49J420r78
2245A19j174J031J110j131j097J278R29j186r29J281O22j156n04J060M75j026
$$ y = [717, 330, -680, -295, 619, 208, -609, -326, 548, 267, -515, -380, 475, 280, -524, -414, 436, 396, -539, -498, 527, 491, -677, -505, 731, 475, -767, -395, 955, 366, -1017, -343, 962, 245, -1062, -173, 1061, -45, -1032, 73, 1071, -121, -954, 232, 899, -215, -853, 321, 774, -251, -635, 284, 627, -241, -604, 316, 582, -165, -580, 101, 617, -165, -686, 80, 699, -96, -699, 67, 780, -106, -920, 136, 923, -328, -922, 258, 972, -498, -967, 576, 912, -656, -856, 716, 768, -841, -666, 857, 558, -892, -520, 869, 411, -844, -341, 781, 282, -792, -285, 625, 309, -556, -261, 591, 349, -516, -320, 538, 381, -544, -380, 561, 400, -584, -469, 747, 499, -798, -545, 896, 469, -946, -450, 1008, 282, -1072, -323, 1097, 119, -1055, -24, 1086, -45, -1142, 136, 1065, -121, -1050, 231, 853, -303, -807, 253, 728, -298]
2261b98l99R86M19r56l91P79N29p92n53Q25N26p28o70Q65O04q49p44R25P88j076
2281b10p69J269O66j315o25J410N54j560l89J623K00j600m4J516q7j505K22J450
2299H06l19j365L64J287m21j198M78J078m49r17M10Q50l34q24K45Q34k18q01J10
2318c84R62j11r90Q9J022m0j127R2J237k12j336L40J328m51j357O26J325o77j407
2337a071Q77J223r63j111J030J081j241q49J138Q11j123p07J208N22j078n61J131
2354C17L75r95l94Q88M45q85m34Q26M91p89m81P07N42p54n69P94P24r56o38J006
2374B20O37j104o71J281N79j340m85J447L26j502j41J365K03j460o5J439j56j269
2392f96J80J351l51j249L62J081l98r43K77R99l42r77M02Q47k45q44J60R09j68
$$ y = [-298, -697, 289, 708, -248, -639, 140, 669, -123, -676, 149, 675, -53, -723, 142, 746, -103, -847, 78, 866, -210, -979, 290, 956, -359, -984, 426, 980, -580, -969, 654, 854, -746, -790, 726, 639, -866, -644, 806, 487, -878, -514, 773, 352, -846, -368, 710, 261, -656, -246, 604, 270, -554, -309, 525, 307, -494, -384, 578, 467, -523, -434, 588, 548, -579, -487, 750, 538, -798, -458, 870, 419, -938, -312, 1013, 336, -1071, -194, 1029, 66, -1045, -15, 1066, -175, -1024, 114, 925, -198, -905, 303, 825, -253, -814, 317, 692, -303, -697, 191, 636, -249, -683, 143, 634, -155, -636, 71, 613, -141, -710, 84, 808, -148, -786, 220, 857, -247, -918, 363, 942, -398, -883, 564, 890, -612, -753, 612, 815, -645, -710, 729, 573, -696, -516, 835, 484, -765, -403, 678, 280, -663, -386, 613, 271, -706, -304, 543, 298, -546, -386, 523, 355]
2411C55r52J08J079k27j026K18J118k56j086K87J135l75j229M91J219n07j265
2428i13O58J246p89j134Q89J037r62r79R95R18j055p90J053O56j040n33R90N11
2446G58j062m21R28M96r60m10Q55M50q01m42P21N43q27n18P97O02r38n50R24N96
2466G41r80n69J038N86j184m81J269M09j286l54J279L40j315k26J345J03j351
2483f36QJ307n0j231J20J149k64j024K47R71j90j018L06R13k31r09J44J034l62
2502B84q15J81R26k02r91K03J043j97j095K61J117l26j139L64J139m38j114M72
2520c27J150n62j146O71J089p18j003O75J035q63q74Q42Q33q55p14P97O73p75
2538g2o60Q59N80p99o71Q63N97p38n92P20N56p12n96Q41N36p90o47Q72O11r35
$$ y = [355, -597, -489, 590, 363, -663, -445, 673, 417, -669, -382, 753, 378, -851, -360, 859, 352, -913, -255, 991, 202, -932, -43, 994, 32, -947, 48, 966, -89, -879, 174, 830, -210, -743, 247, 758, -304, -725, 203, 699, -261, -671, 184, 634, -167, -609, 112, 655, -172, -690, 107, 709, -229, -779, 145, 741, -239, -808, 230, 816, -368, -849, 420, 829, -457, -811, 468, 808, -507, -733, 612, 715, -636, -628, 679, 629, -602, -482, 667, 403, -621, -374, 597, 407, -611, -305, 608, 377, -532, -388, 646, 284, -531, -350, 576, 374, -617, -414, 629, 432, -663, -402, 715, 389, -750, -386, 753, 315, -799, -327, 823, 261, -885, -214, 875, 157, -846, -171, 864, 1, -873, -31, 802, -53, -767, 30, 703, -72, -732, 127, 707, -92, -763, 100, 697, -41, -633, 87, 643, -69, -665, 176, 712, -78, -725, 147, 758, -177]
2558a77n80Q69O72r75n10Q97N79j082n04J120L95j111l11J093K99j134k16J058
2576C82K02j072o7J065Lr51j11J039J9j048J03R12J1r49l4R98m3r00L0R15l8r73
2598e07L7J021j04r64Q5J009j61r83K09R94k42r84K82R90l37r87L39R88m38r39
2618f92N18Q19m63q22M99Q37n93p83M86Q14m98p56M90P51n58o87N64O68n82o99
2638f87O69O36o51o30P11N54n69p28Q11N40p42n64P55N59p41o10Q32M93p93m96
2658f51Q39M35q65l83Q62L08p93k85Q11L23q88k42Q30J61q01j25P65J70q50o2
2678d41P44J34p57j61Q43J25q06j18P87R1q63J3P88N1q84M6Q86r2r16J66P84j05
2700C15q14J77Q41k23p85K42P94k73p82K85P06k40p29K77O88k91o98L79O48l72
$$ y = [-177, -757, 112, 784, -191, -701, 196, 775, -307, -811, 309, 704, -407, -718, 375, 674, -460, -676, 382, 584, -488, -555, 510, 513, -438, -549, 490, 509, -539, -436, 476, 487, -462, -496, 502, 459, -441, -411, 504, 466, -507, -470, 551, 447, -517, -432, 577, 416, -567, -358, 636, 394, -590, -308, 682, 345, -642, -303, 685, 247, -692, -174, 645, 182, -640, -141, 696, 103, -680, -194, 620, 122, -634, -144, 607, 49, -638, -74, 594, 12, -687, -18, 618, -33, -663, 48, 602, 33, -695, 116, 656, -86, -650, 105, 664, -77, -687, 145, 638, -155, -651, 188, 623, -242, -625, 237, 545, -248, -533, 278, 601, -287, -529, 301, 462, -339, -464, 301, 471, -379, -441, 303, 437, -320, -481, 362, 487, -319, -437, 350, 441, -422, -409, 379, 430, -454, -408, 478, 386, -530, -364, 420, 315, -499, -322, 519, 296, -489, -247, 547, 274, -508, -223, 483, 243, -486, -209, 479, 188, -510, -131, 517, 145]
2720A45o24L66O06l28p38N41N52l91o82M47O46l98o90M05O71m95n98M79O80n53
2740D1o68N85N99o88n07O65N43o62m29N94M78o48m38P78K84o85l30O61K39o37
2760b25j67O71J73o66k42O90K21o43k12O03K28o10k52O67K60o89k71O96K29p04
2780b43k27P85J85p62k10Q23N0q95M9Q44j4q03P2P97j54p33R6P03j17p21L04N85
2802D14k47o27K55N68j50n58K11N27j53n69J33N83j92o05J85O04j60o61J95O67
2822D20k64n85K40O02j95o99L57O26l44o56L76O82m12o63N24N18m98n66O26M28
2842E17o13l54N52L66o61k46N59L15n81j76M26K70m44k93M46K93m95k71M29L79
2862D18n31l01M53L47m61l75N85K77n49k93N84K39n18m09P90J74o58j25N91J44
$$ y = [145, -479, -113, 493, 165, -573, -32, 520, 129, -553, -106, 540, 142, -548, -143, 528, 33, -565, -86, 594, 41, -627, -42, 557, -131, -638, 27, 570, -92, -521, 73, 551, -97, -535, 243, 527, -158, -488, 173, 412, -225, -392, 279, 452, -214, -456, 234, 455, -188, -400, 203, 431, -179, -431, 236, 496, -193, -464, 232, 461, -243, -470, 315, 500, -262, -472, 351, 401, -494, -445, 399, 385, -418, -346, 451, 297, -436, -340, 363, 246, -475, -171, 414, 167, -460, -205, 363, 213, -345, -134, 393, 240, -329, -196, 387, 195, -410, -225, 379, 219, -442, -247, 420, 156, -429, -189, 413, 218, -481, -124, 502, 158, -498, -122, 560, 148, -515, 9, 527, 29, -537, 89, 517, -96, -450, 102, 468, -193, -439, 120, 435, -146, -322, 104, 374, -70, -363, 83, 376, -119, -390, 39, 418, -113, -414, 39, 386, -75, -450, 135, 412, -137, -430, 154, 393, -125, -534, 256, 430, -228, -353, 238, 382]
2882C82o45j59P40N1p21N0O77n3o28P8N98j96m75J23M17l6n11J37M75q8m39k0
2904b43N01l9n14M6M84rm80M8M71j0o18J50N64j01o19J49N95j17o75J98N99k56
2926A24n60K90N65k89n87L96N08l69m23L55M12m36l38L76L67l97l15L56K97l78
2946d6k44L36K61k80l00K86K72l30k45L06K84k89l46L12L18l08l67L55L45m49
2966a29k72M89K62m62l29N59K16n10k13O01J17n77m8M50J36n56J7M36J6m32L8
2987a91M49m5l69nL44J2l85N4L76p6k83n6L28O5l76n8M13m8l44m0M62M6n26J7
3011b36M96p3m61N6M67m9n11J59N23k53m84K67L92k37l78K92L15k27m16L80L15
3032C37l68k31K91K16k75j70K08K38k65j34J63J67j19k00J08K30j52k50K61J99
$$ y = [382, -263, -422, 318, 369, -352, -302, 375, 322, -306, -228, 370, 174, -301, -178, 239, 203, -308, -171, 304, 216, -223, -243, 258, 219, -295, -249, 235, 226, -254, -206, 265, 255, -363, -213, 351, 250, -369, -220, 375, 258, -417, -219, 380, 124, -436, -146, 419, 130, -457, -61, 447, 78, -345, 10, 422, -14, -352, 24, 391, -6, -321, 35, 332, -46, -290, 46, 307, 27, -273, 13, 285, -45, -290, 16, 300, 11, -335, -23, 295, -13, -380, -25, 320, -129, -401, 88, 350, -112, -441, 118, 334, -176, -389, 212, 329, -248, -296, 154, 290, -266, -249, 187, 203, -229, -191, 258, 213, -156, -161, 183, 195, -190, -136, 240, 164, -119, -175, 153, 218, -158, -216, 197, 149, -195, -235, 227, 273, -253, -236, 260, 187, -274, -218, 249, 200, -311, -152, 371, 118, -366, -99, 293, 56, -322, -30, 285, 58, -358, 22, 337, -31, -262, 29, 245, -30, -200, 8, 246, -19, -153, 10, 177, 58, -142, -34, 196, 44, -206, 55, 254]
3052B54k27k61J95L13k43k94L20K32l61k32L76K67m40j91L79K12m24j83M32J47
3072B71m00j34M53Jl90k3L45J34m86k2M43l8l53L7L51m5k48k8K86kk71N8J62Q7
3096A88l28k0L35O6l80l3L53k3l44O7L26l9l95P4M23j21l53O2L83j52l61J96L05
3119B29k10l09K61K23j93l36L31K24k49k27K99J96k61j62J10K37j85j71J51K31
3139A89k11j71J46K48k20k50K47K20j94j95J92K23k09l46L62K41l16k30L06J56
3159A88k44j66K87K47l82j33L40P2l33p5L56k4k29j23L03R4l00NK37L9k41q4K57
3182I1l1j67J7J45M6k43NK42M2k48l0K50O6k84o3L37l2k80K2L08r2k70K5L20k8
3207A48l19Q5K87j65k43J67K75j34l04J92K36j59k31J33K31j73k28J50K27j55
$$ y = [254, 27, -234, -39, 274, 31, -263, 57, 289, -72, -304, 72, 339, -101, -292, 87, 299, -125, -308, 124, 271, -129, -263, 190, 191, -199, -222, 123, 257, -229, -251, 192, 154, -199, -162, 189, 144, -104, -132, 154, 152, -119, -61, 101, 188, -140, -160, 175, 241, -139, -172, 181, 158, -186, -119, 207, 168, -227, -153, 270, 149, -204, -142, 241, 89, -272, -76, 229, 19, -290, -29, 194, 1, -335, -4, 220, -29, -256, 43, 239, -22, -184, -74, 163, -22, -193, -42, 189, -22, -193, -47, 201, -19, -269, -22, 198, 4, -191, 1, 224, 15, -331, 31, 272, -44, -274, 32, 188, -56, -222, 65, 312, -70, -203, 137, 209, -124, -199, 157, 133, -96, -219, 84, 178, -122, -117, 120, 159, -82, -166, 91, 60, -107, -90, 55, 101, -142, -137, 105, 147, -101, -131, 119, 185, -99, -162, 175, 143, -137, -115, 193, 101, -169, -144, 176, 148, -171, -86, 201, 36, -207, -40, 235, 101, -203, -11, 225, 66, -165, -32, 199, 26, -202, -52, 175, 20]
3227B0k13J25K07j55j93K23J28j06j91J41J85j94j14J21J81j72j61J68K14k14
3247@j96J67K11k49j19K17J12k71m1K13P6j37j41K45O2k32q6K25L1j23j10K09
3269F3Q0j55q2J86M0j91n3J93qj31k2J81k1j61j5J50L6j86K4J61j5j55m9K46k2
3294I4k07M9J35J2j90N9J70q6k01J9K18Nj81R0J11q4j37J10J54j51o9j5K08o2
3318E1j31K9R3n4p8J19K9m5j20J49O9j13p3R8R0j04r3J04J28j14j30J50K8q2j29
3343a29J59Q8j56j01J67P4j47r5J62Q9j99k0J68O1j88o3J85K1j55J0J31K7j72
3366h3j6J13K7k01N7J61j6j62M2J94j06J9n6J13n5j59R5J23m8j32Q8P8j3j30R7
3391C0J27j16j16PJ48n8q9mJ87r7j77J27P0m0j04J48J3o2k6J6J07q8r4J85j8r4
$$ y = [20, -193, -68, 139, -16, -209, 14, 142, 36, -155, -14, 171, -23, -137, -16, 165, -7, -168, 0, 214, 0, -196, -29, 182, -67, -186, 31, 143, -128, -169, 44, 120, -17, -158, 87, 149, -83, -169, 56, 87, -36, -146, 63, 143, -12, -94, 92, 132, -59, -112, 81, 73, -58, -80, 101, 80, -81, -96, 54, 90, -96, -72, 89, 74, -81, -130, 116, 94, -113, -64, 71, 83, -107, -48, 122, 36, -165, -146, 72, 77, -104, -14, 97, 13, -124, -14, 140, -11, -80, -95, 113, 51, -80, -51, 42, -12, -90, 29, 58, 13, -107, 42, 111, -2, -75, 23, 113, 9, -84, 20, 148, 34, -96, 54, 82, 0, -129, 30, 118, -38, -139, 28, 102, -45, -140, 22, 111, -88, -108, 60, 121, -67, -130, 55, 76, -79, -69, 62, 89, -83, -99, 14, 41, -160, -103, 58, 42, -120, -78, 116, 10, 29, -27, 86, 31, -128, -33, 90, 42, -90, -2, 76, 63, -67, 30, 157, 41, -75, -68, 80, 22, -67, -71, 116, 19, -158, -31, 39, -1, -105, 43, 56, -6, -32, -16, 91, 3, -91, 94, 76, -18]
3417a8j14J54K2l3r6R9R9j55n7J32O4j18k7J10j8j16J9P9L9m4o7N1J30j83k0J25
3443E7O2k00N1L6N4k3m8N7K6j03lQ7rp9K4P0Qj27P7O0k9q9K9L9J0j35O9J62j24
3472Ij12O4J07n8p2M3N9r6M6qJ01j04l7K0Q2Pp4P3K0j06m8K07l4j13k2Q3L4o7
3500Dj26J71j4o3o3J13K3j13QJ70l3q4J3O8Pp2p2J19p0r6Q2L2O4j19k9J24jj74
3528a31J51K9L3r5j7rQ0j28L0J28q5o7J0P0Rqo0R6K7j42N5J61r2j10NR4L5j53
3556h4J46Q2j09r0P3P1r2p2K9J81j25n4P7M1o5j06J21K6k7j12J12J2o9jO4Nn3
3583a9N9j9P9j20l5K0J23j46l2J12K8o5l5P1O5j71L3J35l3o5l9Q3j2r3M2J14l3
3610D7m6n1J70o5j21R4M2o0j12J12Q3q8m7N1J09r5j60J07P6r8j7L0Q2k3j19O0
$$ y = [-18, -132, 22, 44, 11, -85, 14, 113, -42, -99, 33, 97, -21, -48, 62, 44, -72, -53, 26, 65, 21, -46, 5, 135, -48, -68, 57, 119, -81, -30, 6, 60, 37, -11, 46, 72, -31, -34, 53, 44, -35, -11, 59, 67, -60, 17, 77, 48, -41, -12, 27, 37, -98, -29, 133, 9, -103, -39, 68, 10, -62, -19, 40, -56, -10, -18, 83, -21, -58, -38, 44, 51, -23, 50, 70, -36, -84, 123, 89, -24, -46, 37, 71, 4, -122, 49, 35, -28, -91, 22, 45, -68, -60, 110, 77, -7, 6, 74, 81, 9, -63, 56, -14, -110, -28, 4, 68, -51, -80, 44, 43, -131, 20, 49, 82, -13, -30, -39, 41, -87, -57, 71, -14, -81, -71, -1, 8, 0, -60, 36, 63, -79, -24, 137, 45, -65, -60, 34, 69, -84, 62, 144, 35, -55, 18, 89, -3, -75, -46, 135, 10, -44, 33, 74, 9, -97, 24, 50, 23, -89, 23, 35, -34, -35, 29, 34, -19, 40, 21, 100, -20, -55, -35, 88, -58, -90, 22, 50, -15, -50, 21, 86, -85, -52, 83, 50, -15, -54, 29, 17, -76, -34, 80, 47, 1, -50, 120, 55, -66, 28, 70, 10, -102, 10, 93, 5, -42, 9, 118, 23, -137, -30, 46, -52, -69, -39, 43, 20, -99, -39]
3636c9J00l1q5N2R3p3j06R5R2r2r1J43K1o8j24R8J15j16J8J4P0j43K7L6P0j66
3662i0K1R3Q1j75qJ16K5r6l1Q1K7o0k0M1K8j22K8J14j0j18j5J32L4j09o6J58n3
3689Fj0l1R3j4q3m1J53n9j32L3K24j47j02Q8P1j1j40J16N8n4j20R3J02n5r5R1
3715C4J0mj08R3J6J5n1k6P3p5M0l9J28j04k0M8R1j28p2R6Q1j33m4J58Qq2q7J62
3743H0J3q7q6J30L7r7n0J68n6o4m7J10Nq8m1J24k5q6O4O6l4j02QR6K9r5J7L0n
3772A4o7m2J31M3q0l4N5k2K9j26J95n9q5QQ7M6j98J22P4n4j63N8J50m5j06J08
3798C9lm8m7N0P1q8j03Q8J52j09%K0K2j12J0R2L9m8Jl3P3l7n8N5M4r4q2J05J30
3827A29j79kQ3Q1p7o1L4J1m7n0O6R2j11n0J00Mp7J4J44Kj74l9J78k3j06L0J05
$$ y = [-39, 61, 30, -55, -3, 90, 17, -89, 6, 98, 6, -85, 58, 79, 11, -113, -15, 100, -16, 2, 16, 86, -57, -30, 6, 76, -90, -69, 24, 105, -70, -78, 38, 63, -33, -64, 17, 44, -16, -36, 5, 33, -89, -61, 53, 43, -75, -90, 42, 76, -33, -99, 59, 6, -4, -35, 58, 44, -39, -80, 73, 14, -118, -85, 139, -8, -110, -22, 49, 38, -102, 14, 72, 18, -102, -9, 93, 38, -57, 34, 44, 40, -68, 25, 41, 56, 5, -21, 52, -23, 17, -22, 106, 2, -18, 30, 121, -7, -79, 17, 98, -35, -79, 79, 87, 5, -82, 80, 93, 6, -80, 50, 87, -10, -60, 108, 52, -12, -59, 51, 56, -32, -73, 51, 26, -60, 4, 70, 36, -66, -58, 38, 67, -28, -11, 19, 14, -53, -95, 36, 79, -1, -35, 20, -2, 27, -99, 96, 37, -48, -40, 47, 93, -105, 17, 91, 37, -126, -68, 82, 37, -69, 39, 36, -12, -59, -9, 62, -26, -129, -41, 111, 2, 2, 22, 44, -68, -58, 34, 73, 25, 26, -7, 66, 29, -29, 26, 70, -24, -106, -1, 129, -50, -52, 31, 112, 35, -26, 8, 19, -28, -78, -12, 80, -31, -81, 19, 23, -54, -40, 104, 106, -68, -107, 71, 48, -58, -28, 77]
3854G7Mj29M2L4L0j04OP8Mr6L7M0M5j50J7J20n7kj02R1M6r6M4M9N3j92N9J13k6
3883C5j06L6P7j9j03R0N7o3n6K6R1q0o1P3J30j70j04J50R8q9q8LJ73j65o1R1P4
3910C9m1q7R0L6o1J6LJ58j26j55J29J21j03q3P0Rk0n7Q5P8j49RM8Q3j25j0O5L5
3938E7j44M6M8N5r9l2J24j5q4j4Q8J08j36n1N0P2q5j12J67K3q8PmJ13j50kJ40
3965H2o9j2k1O6p4k3P2R8p6q1K6Q5k4r4L9J09j45o9N5J01j0o8j4R2l8p3Q3Q7n6
3994D8r0qQ4Nq9O4O8p9n0N3L4r2j9R2J02j12j18J03J22q4r8J00J4p5k0JO9o0j1
4023d6J02Q3j51p6J42L7q3m6O8O4r2o2J4Q4p4m1J15Nj06QJ29m3q4MR0L0j33j5
4051g7J38J0r1RR4Lj21k5J38k3j08oJ40r9j9k6J20mp0J7L4k5r7j3R6N3j05nJ43
$$ y = [77, 81, -48, -6, 28, 58, -46, -40, 38, 42, -54, -17, 23, 68, -82, -65, 55, -2, -4, -106, -15, 31, -65, -21, 28, 81, -111, -52, 61, 35, -71, -35, 42, 23, -80, 10, 67, 4, -52, -26, 65, -15, -76, -3, 127, -43, -147, 3, 101, 12, -76, -73, 100, -65, -126, -35, 39, -2, -89, 1, 37, -24, -8, -5, 153, 27, -128, 1, 122, 19, -64, 6, 15, -5, -62, 23, 101, -48, -39, 9, 92, -33, -43, 22, 57, -87, -41, 7, 62, -37, -69, 55, 40, -44, -58, 30, 138, 2, -49, 1, 73, -12, -124, 43, 66, -22, -15, -19, 94, -56, -58, 82, 13, 1, -20, 46, -28, -51, 21, 119, 43, -38, -12, 73, 49, -45, -6, 103, -42, -111, -56, 45, 35, -33, -47, 45, 7, -66, 17, 104, 48, -42, -50, 34, 39, -50, 14, 82, 3, -47, 6, 40, -52, -71, 21, 123, 11, -107, -4, 118, 34, -64, 36, 50, -25, -45, -44, 25, -35, -46, 56, 139, -12, -88, 54, 91, 8, -38, 30, 94, 2, -60, -46, 38, -36, -77, 38, 43, -63, -55, 74, 31, -53, -49, 41, 71, -62, -77, 61, 71, -20, -11, 83, 86, -35, -60, 78, 55, -53, -59, 81, -18, -37, -63, 57, 53, -17, 0, 34, 9, -88, -101, -5, 48, -57, -62, 81]
4080H1o3j0k4R6p0n9JJ08J6j34J8P9k7q8J20N4lj27N5J34j05j12O6Kj5o6R7J32
4108A56j80n6Q0J33r2j09N5L0n7o4J14ML1j27P2Q7k6q3KP4o1r9J41P1j00r5J28
4135B9M5r5j5P2N9j13j01J53J4n4j16J69L4j38MJ04M1j77J9J13K5j19m6J41l7
4160A1p7R0L2k6q9QM8J49j79jN9K5j16M4Q4Qj68M7J35m8p1k2J12J5r0n5J70o1
4188C4j37P7L3k7m7Q2Q4r6l8J1N2l9o3J22K1n6j14J20K0J2j27O8R3n2m7L8N6o2
4216A8k2m1J13n2j27J77M8q9n6L3J15r2j31J49M4j32m8R5M8k2j70J61Mp4o5J24
4242HMq4J7Q3Jj09OJ24k2p5j6R9l1o2K7O0O6j40J7nP1j18PQ6J09j70J8L9Q5j13
4272a8j15J76oo0M5L2P1j88O7O2Mj53N3k8O7n2N1K0K8ol1O0o3r1Q7K1n3L3p1J47
$$ y = [81, 18, 8, -16, 80, 10, -49, -48, 60, 76, -58, -40, 39, 12, -76, 44, 98, 95, -32, 23, 157, 52, -60, 6, 8, -7, -73, 24, 156, -24, -80, 0, 133, 41, -68, -13, 17, -40, -104, 10, 14, 45, -82, -10, 77, 51, -32, -30, 44, -17, -116, 25, 96, -4, -99, 29, 74, -21, -36, 36, 95, -18, -119, 34, 48, -6, -122, 47, 81, -57, -53, 51, 92, -85, -66, 47, 72, -47, -93, 48, 11, -66, 24, 56, 30, -59, -51, -3, 146, -33, -34, 25, 50, -66, -22, 62, 70, -98, -51, 84, 36, -35, -57, 55, 70, -20, -75, 95, 34, -103, -26, 7, -20, -67, 15, 99, 3, -35, -24, 28, -11, -74, 48, 69, 13, -101, 19, 39, 51, -76, -8, 85, 33, -14, 24, 80, 18, -4, -45, 68, 16, -111, 66, 114, 25, -31, 2, 117, 25, -106, 43, 87, -45, -93, 2, 50, 28, -142, 19, 23, -51, -116, 8, 12, -72, -55, 28, 29, -80, -74, 50, 28, -47, -63, 36, 5, -57, -30, 30, 96, -44, -27, -32, 39, -79, -72, 14, 123, -47, -29, 10, 95, -18, -133, 43, 37, -23, 22, 54, 125, -63, 4, 66, 70, -83, -30, -58, 9, -43, 8, 28, 56, 50, 19, 79, 16, -75, 12, 33, -20, 13, -58, 89]
4302H9j22j7R0m0pm2O2L5k1r9L6J00q5n5P2Q6j14m8Q0O7m5j17K1J48k8j78J68
4329C6O7j05m4J32l5m2q5J50Pj32l8J24k0j06K9J00M0j59M0O3j9m7NL6L1q3M0
4356a5n5L1L6p4Q2j6l9J1R3o1n4J3R1N7j29n1Q0K8j00M6N9J0j24M7J45q4m2L3
4384A8L8o7p1L5J31l1j42J23l1Jn7Q6J0m9o5N3O1m4m9N0P1o3j09L1Q8n7o3N6J30
4413H4q3n9L5J32j40n0R1K9m3q1R2P2q5n0O0M4n3j09J06M2l1k0O1Oj69J13K7K9
4441E0j36J6J48p0p6N0O5l5m4kN9N3j18m2J15K9j07L1K8N2l2j06R4M7j79M9Q1
4468B0pq5n2J79k0j07K2O1J0n8q4K19r8r6O0R1p4k0P7K5r9l0N7O7j17M2J0P4m7
4497B0n6M3N9r4K4l6R6o0j7j5M1L4q4O2P3k4j02O5N2p3o4R0L0k8q7O8Rp5M2Q0
$$ y = [89, -33, -50, 40, 0, -7, -49, 13, 48, 27, -72, -36, 64, -21, -76, -4, 82, -32, -80, 0, 67, 22, -95, -74, 74, 46, -132, 36, 103, -2, -46, 86, 51, 9, -76, 74, 81, -51, -89, 35, 15, -91, -62, 38, 78, -81, -41, 22, 3, -44, -39, -3, 28, -55, -15, -70, -39, -3, -77, 5, -11, -50, -39, 54, -7, -61, -48, 43, 100, -29, -80, 0, 28, -72, -26, 33, 43, -81, -34, 111, 27, -15, 18, 56, -11, -82, -47, 84, 53, -89, 34, 3, 4, -53, 33, 43, -6, -71, -18, 43, -1, -50, 0, 71, 8, -101, -70, 18, -39, -102, -46, 84, 1, -58, -23, 109, -31, -81, 10, 39, -4, -85, 7, 79, -6, -56, 4, 48, -5, -114, -8, 34, 3, -17, 44, 50, -119, -6, 21, 50, -86, -70, 78, 8, -68, -18, 47, 12, -32, -34, 25, 78, -40, -82, 33, 62, -45, -14, 14, 66, 34, -72, 22, 69, -110, -61, 20, 13, -72, -124, 55, 35, -72, -50, 11, 21, -37, -121, 98, 0, -96, -36, 55, -19, -39, 38, 63, -36, -66, -9, 58, -59, -17, -7, 67, 20, -36, 7, 66, -28, -4, -40, 56, -4, -21, -36, 5, 39, -45, 17, 90, 66, -36, 29, 81, 8, -56, 34, 64, 36, -51, 17, 26, -49, -7, 73]
4527G3m9m7n9J25j0p6l1N2M0j05R0K6j6p2J3O8jk8KN0J1o0l4O1J00j17p1P6Jn0
4557c8lK4M4r0O8m%rn2Q0K8j37K5R8l3q3J09K5l9j9p4J59o4j15J05PL9j02K9N0
4587B8n8L1k3P1m9k5k4O3n7n4O7J07m7o0KR7o1k4O9Mo3p3P1J15j27j3jJ09r9K7
4617CJ13r5n4rJ6M9j3m9O1n4QN4pj5m6J4J0N0p2PQ4k9n9j9N7K9k6j4p9J00m3l4
4649f2R3m4p8L6P4K3p5QO6L6p2j08P2L7l1MN7m6n6M5Q0r9PO0K1k1m4K3R0q4q1
4680f9K5R1n9j0O1J9p7m0M2M6k1o8P3k6L3m4qM9l4j05J56k5m2M6O0Lq3o4O8N7
4710E4j12N4l7K5j7k2J18K4j69K4M6O8j08N0K6J3m3o3Q6M0p5N8LN8j07k5R3n5
4738Gn0m6J22J8q8l8Q8l5N2o7O2J8p5KO7k3j7j6m6L4l7L7P6k3o7J9J12r3J9RK3
$$ y = [73, 24, -23, -82, 43, 33, -43, -74, -22, 18, -87, 3, 29, 13, -59, -46, 22, 21, -7, -5, 45, 56, -4, -38, 23, 123, 6, -65, 11, 12, -38, -41, -17, 27, -63, 5, 1, 1, -8, -60, 20, 48, -89, -64, 34, 1, -82, 27, 52, 13, -6, -80, 79, 15, -100, 5, 12, 51, -51, -22, 28, -30, 1, -22, 49, 0, -25, -49, 14, -43, -97, -30, 77, 30, -30, -28, 69, 8, -16, 53, 57, -6, -79, -8, 107, -20, -33, -34, 75, -24, 3, 116, 21, -33, -42, -26, 23, 10, -39, 22, -32, -24, 30, 23, 8, -38, -24, -14, 36, -36, -29, 55, 26, -33, -52, 5, 34, 8, -6, -85, 15, -28, -62, 31, -13, -91, -55, 19, 42, -33, -25, 41, 77, 5, -103, -31, 6, -25, -21, 36, -10, -66, -21, 59, -40, -33, 27, 48, 27, -17, 6, 96, 12, -69, -44, 47, -12, -22, 39, 58, -19, -59, -17, 29, 8, -60, 13, -13, 20, -24, -32, 17, -17, -122, 34, 9, -33, 13, 73, 76, -7, -71, -3, 54, -58, -4, -41, -16, -33, -55, 63, 87, -82, -58, -12, 56, -52, -2, 24, 37, -6, -69, 17, 57, -18, 40, 43, 101, -6, -31, 62, 7, -43, -89, 33, 51, -37, -75, 13, -22, 30, -37, 25, 43, -32, -30, 37, 14, -3, -19, -65, -31, -68, -31, 45, 22, -45, -26, 86, -7, 12, 21, 44]
4769D4k4o7L5K8M0j58J54j8k3j05J15J7p1PL0N7n0j3L1l7M3q8N2N7l8m4nN0n5
4798c6o3N2Q6m6kN0J5o6nJ0N2p3j5J4J50j85L0Q9n5o0KR4l4o1J2L7L1m0%O9K9
4829H1q3l1J15j0r1k0NJ07n1N%N6q6l6Q2j1q8J6J33r7m9j8N6K1l2J2L6k7MJ1K9
4860C9Rl1n6O7J9o2J1N5o4o1P3J1m7n6N9P9o8m3Q0J10k09K7N3O1q9J1L1Q7q9L4
4890D1K1Rj00l9P3jl1q4J50q6R2n2k6P3j2n2J5Q6r3L4M1l6p6M6L4qp3M7M0l2j4
4921a3m5J54r5l2k3J03l4o3l1R7l3q0L6L6K6pK6J2l4o0MO8Nql8N4q9K5O2l3K8
4952A8l9j6K4P5o8J5M3j7K2q6N2p4K0O1qj9q0Q5Mjm5L8ol2kJ9J05j03l5N8j9L3
4984B2n8J04l6l6k3JOk1K0K5K6n0j3L5M6k9m0L7M5k4n1N0Jn5PJ5R7j51m2J12O
$$ y = [44, 20, -47, -12, 16, 56, -102, 52, 34, 11, -94, 21, 38, -33, -26, 4, 61, 11, -2, 29, -8, 35, -53, -1, 56, 18, -26, -31, 19, -36, -99, -47, 39, -7, -9, 41, 56, -10, -15, -5, 47, -26, -41, -27, 123, -62, -32, 57, 2, -58, -56, 38, 4, -57, -45, -8, 23, -17, -17, 52, 81, -2, -33, 82, 72, -19, -39, -34, 73, 22, 27, 27, 83, -3, -39, 43, 32, -56, -40, 93, -4, -53, -71, -15, 6, -26, -14, 22, -5, -1, 10, 39, 48, 17, -39, 28, 47, -15, -4, 51, -13, -74, -1, 10, -37, -93, -34, 45, -23, -66, 14, 124, -85, -58, -5, 56, -33, -22, 9, 96, 7, 41, 62, 71, -29, -68, 5, 4, -27, -111, 39, -47, 45, -7, -33, 40, 28, -24, -9, 77, -16, 18, 59, 23, -53, -7, 27, 19, -54, -7, 33, 1, -13, -58, 96, 1, -31, -54, 49, 15, -48, -79, 18, -15, -95, -59, -23, 3, -4, 22, 34, 0, -60, -56, 12, 17, 9, -29, 25, -64, -39, 23, -10, 18, -21, -37, -13, 62, -6, 9, 52, 35, 57, -29, 23, -51, -31, 30, 22, 3, -77, 8, 12, 11, -34, 4, -2, -34, -36, -17, 88, -15, -50, 8, -11, 22, -36, 68, 32, -4, -27, -26, -20, -41, -21, 4, 30, -20, -33, 2, 48, 19, -21, 16, 61, 37, -14, 36, 37, -18, -11, 4, 101, -50, -92, 20, 26]
5015B6j7o4J06Nq0K8L1kr9L8M0K0l7l6R3m7j0m9J63j67R0k6J5K4r8N2N2j11kQ5
5045B3QJ1m1k9K3m5J6K4K9k5n8P0P0r3j5L8L9n2p1J6P4n6m3Q6qL0p0M7L7m7n8
5076g0O8Q4r7Ml5R3k0n3K0P1m2k6j0M2m8k0L9K1n8OlM8%k0N5j8o1J1QO8o9M5j7
5109A6K6k7NnLp6J8Q0Kj11P2R7q0j6n5L1nJ9pP3q4jj3N4%p5l7R8L5j6k2KJ0m1
5143c0%O1n0o5J10m7l2K2k5P7j0j9n5L5%LK2J05j27L6l3Q1l5l9K8m1N5q0J18k3
5173D2p5O2l1J2j9Jo0K4k6P4j2Ml2m9J03j4kJ1l5j2J5QL4J0j09O4K2J6j9o1Q7
5204C3m6l1P1J5J1q0PM8n3%M2k2k5k6K3K7nol5O1l9L0l3R4j09L5K3N9m1K3q2M0
5236IM2l3j5K4j7j7NN3N9j29J6K6K2r7NN2m3n2J4P4l1oJ9J08l7j20O5M7r4R5Q
$$ y = [26, 9, -55, 51, 56, -24, 4, 35, 33, -66, -28, 12, 32, -5, -41, 52, 5, -5, -54, 109, -58, 32, 6, 21, 45, -53, -1, 51, -60, -62, 23, 31, 42, 1, -28, -5, -50, -34, -10, 19, -6, -64, 6, 76, -17, -32, 6, 45, -7, -78, -62, 12, -44, -87, -1, -9, 21, -49, -2, 35, -12, -70, -2, 82, -15, -11, -46, 47, 27, -26, -6, 65, 23, -3, -13, 29, -19, -39, 0, 21, -37, -31, -34, 14, 14, -6, 49, 31, -30, -19, -11, 57, -12, 33, 16, 42, 15, 20, 15, 18, -58, -40, 40, 42, -69, 3, 100, 20, 4, -51, -20, -25, -6, -13, 60, -24, -25, -38, 16, 16, -59, -96, 2, 37, 21, -1, 1, 11, -30, -30, 31, -19, -84, 26, -21, -53, -31, -56, 21, 11, -8, -63, -28, -28, -25, -3, 102, -25, 11, -22, 59, 24, -15, 13, -28, 27, -53, 65, 42, -33, 29, -2, 10, -9, -8, -68, -44, -70, 4, -8, -4, -36, -85, 18, 4, 2, 13, -22, -34, -19, -11, 23, 33, -76, -12, 10, 26, 7, -54, 33, -13, -44, 27, 42, 53, -27, -20, 28, -25, -25, 17, -5, -30, -56, -33, -6, -11, -17, -52, 9, -30, 0, -33, 61, -48, -13, 10, 69, 28, 51, -31, 9, 51, 18, 3, 27, 10, -7, -2, 51, 110, -19, -3, 23, 45, -52, -47, 5, -38, -90, -76, -2, -33, -39, -20, 88, 51, -69, -4, 43, -51, 44, 52]
5267E2j17R0K9q6M1orn7Q0K7r5Q4j0q2Q5o2OrJ3LJ2Ln2Q5j3j7m6L3K5M4n2n7O1
5300Cp8K9N9J4n3l3Q9ll6m9N8L1m2j4Q4j01o3P6j0N4q5M5J8O0m6m1O4L2q8Q6L5
5331I5o9l2m8L9L8l5n4L8K5l8j1J17p4k3KL0J3j08Q7R2l0m2r5N5mo0N3J10l6m9
5361a4k5N6j6l2K0M5r4N1QN5j09jJ6P3l2r5L4P2Lkk1RJ0p8Q7O7j02n8O5P1q9L3
5393GO5J8p3j5j5jM9o7N5J5q6M1k8mj3p0J63rp3P1jPq8J9N1m5m2J5N6qRk5L2M5
5427E5j0q2N2Nk7j4O9J5j02L9n4O9j3oM5j7r9R0k0P2p0M2j5j7o2P0om4pj7J34
5458G5n7n6O3N4r8l1R5m3Lj4K2roj9j2M2j9o1R2L7r8M6jJ3k1n4M7Om9K4M4j1O
5491A0m5N1L9k1o6J3O1q5o2J14J0Pn1QJ6m%J2poj2L3Qj3j3M1K2p8o2J42p4o1O3
$$ y = [52, -65, 25, 54, -32, 9, 3, -6, -63, 17, 44, -51, 33, 23, -59, 26, -36, -30, -39, -26, -23, -11, -8, -60, 25, 12, -5, -51, -18, 7, 51, -1, -58, 3, -75, -46, 13, 27, -26, -59, 30, 27, -9, -58, 0, 31, -11, -25, 59, -42, -105, -29, -39, 15, -70, -25, -7, 53, 7, -34, 30, 62, -26, 60, 95, 26, -6, -54, -15, 23, -12, -66, -28, -3, -41, -52, 65, -9, -32, -30, 0, 13, -95, -8, 84, 54, 12, -83, -28, -32, -92, -39, 71, 35, -14, -39, 17, 1, -31, -11, 34, -60, -9, -1, 54, -55, -56, -40, 33, 1, -94, -60, 12, 15, 13, -8, 1, 11, -67, 20, 87, -15, -73, -8, 63, -26, 7, 72, 90, 17, 2, -13, -14, 35, -32, 23, 38, -48, -7, -35, -39, -52, -122, 41, 32, -41, 30, 29, 36, -52, -33, 18, -27, -69, -54, 2, -6, 3, -22, 10, 55, 45, -37, 15, 20, -7, -21, 48, 63, -39, 0, -54, 15, 2, -4, 41, 24, -75, 15, -5, 67, -3, 39, 24, 7, -55, 15, 9, -35, -42, -59, 75, 18, -38, 25, 79, -19, -50, 45, 2, 5, -9, 13, 4, -2, -21, -33, 9, -10, -71, 21, 58, -40, 6, 5, 18, -3, -57, -10, -4, -53, -29, 15, 4, 10, -35, 16, 55, 34, -32, -19, 42, -43, -105, 9, 19, 26, -25, -17, -1, -5, -5, 7, 0, -6, -18, 15, 23, 10, -3, 38, 60, -18, -80, 62, -12, -73, -10]
5524a0K4l5l6N0N2l1km3M3p4P2k6L3Nk8n8O3p6M5PO9rm8J6M8m7o8L9J7jJ5QP4
5557H8j45K4L9M4k3o2M8L1n3rL0%k5lJ8M5m1LK6j9j6k1l7J02r4J6N5j8K7m2J0
5588bmLm4njN2m4Q8l3O0j21M2M4n2k7P0K1j17J07No2J3k8J7N9p7J3M0k7KKL7m4
5621a3k1N5k7P1j43R4o7Q6p7M3K4Nq0O1K4o6L7l9P9k7krj5L0l3pN1n0n1M5j8L1
5653in5K8Q1k8n9J29q9J9KkP8r9j0K2JqJ6l7JJ8l8N1k1J9J6k2Pl6j8KN3ro4N4
5687gjlpL7Q7q5m9K2J4j3k3P9j7o4k2N6nn9M5lL4q6M2jM9J3p0M6m6J6L5l2L0n5
5721d3N3moNl3L7j4n9O3J7Nq4L0P6j9n4M6k8L7p1N2qL6p6k4P2m8MJ6NK4k2L2m6
5755b9l1M8n9J58r2l%M5p9m6J00k6M1p5M2KK1J7K6p8j8j4N7O1k2m3m3N7Mk3P8
$$ y = [-10, 14, -21, -57, -7, 45, 14, 12, -31, 12, -62, 10, -16, 17, 22, -6, -64, -1, -77, -32, -25, 44, 35, -13, 3, 51, 4, -64, -25, -8, -9, 6, 14, 88, -57, -33, 6, 50, 27, -35, 13, 44, -9, -18, 12, 12, -13, -16, 2, 47, 6, 9, 35, 16, 0, -21, -58, 44, -50, -34, 21, 3, 30, -12, -2, -6, -3, -47, -52, -53, -1, -45, 43, 10, 70, -51, -9, 35, -17, -44, 26, 47, -70, 37, 42, -20, -7, -35, -18, 41, -36, -23, 17, -10, -8, -6, 31, -13, -34, 21, -6, 65, -78, 16, -51, 35, -42, 1, 25, 30, -50, 11, 35, -31, 6, -33, 46, 19, 17, 8, -7, 23, -10, -17, 34, -16, -67, -22, -40, -9, -64, -36, 45, 17, -42, 87, -2, 17, 19, 17, 95, -4, -14, 8, 9, 1, 17, -20, -19, -1, -39, 12, -9, 10, 26, 4, 11, -25, -43, -41, 12, 3, -61, -7, -8, -11, -18, 19, 106, 21, -28, -6, 8, -5, -28, 51, 34, -30, -52, 4, -1, -60, -15, -18, 16, -70, -28, -29, 20, 33, -37, 9, -37, -21, 14, -18, 12, -43, 10, 6, 0, 5, -28, 9, -5, -64, -1, 16, 21, -63, -33, 43, 24, -30, 16, -12, 25, -46, 6, -2, 34, -42, -66, 6, -42, -38, -22, -17, 7, -15, 17, -29, -60, -12, -71, 87, -5, -8, -8, 37, -42, -88, 12, -14, 27, -48, -6, -4, 17, 34, 60, -18, -36, -50, 7, 68, 46, 3, -40, 17, 21, -2, 76]
5786G6n0K7j8m6M5q2lJ12K9j44J8M3J3kkl2L4l9j1K8JJ4n4N7Ro1O1l1J3n3RJ6
5818b3J4LNmJ6o1rJ22j39O1Lj7K3jL4l9J25q0n3N1Ql3J6lJ6n5O1q3K5L2rqP0o5
5852Cj6Q4o7lrN5o0K6m9K8k9P9m8M6q3k5R5n4m6Q2J3jkp4J07r4KoR8jn7J4l4J3
5886a3N3m7l7O8K4q2J3M0l1J2L2l3N3p8J9j1L8l8N7j1%l7%L1j3l8M9P5j07J8l7
5917c1O5p6RN3Kk4K1J5Ro5qK6L6q3O0K%k4n1J44j19R9o2L6nj0k0rJK5m5N7k6M5
5951D7n3JO8n3m6N2M3n6N3q0J01o2M2j5q2K9j8N5n7ORP3o5m2M5M2o7L5n0J00q1
5982b6kK3qJ3rk2L6O5j47M9P2j0p7M6k2J5k7MM0k2J3L3o9N6m3J4L9k6J6k5J9L
6014B1n9O5M0p4LK9k4J1NK4K2j02J3N1P8n8r2O4%J2l2k6P0j7n2K5J5RQl2k6M1
$$ y = [76, 26, 53, 35, -11, 34, -48, -51, 61, 90, -54, -36, 7, 20, 18, 16, -16, 18, -21, -32, -4, -3, 11, -43, 14, 23, -38, 23, -8, 5, -48, -39, -23, -9, -6, -1, -5, 11, -50, -59, 63, -76, -15, -12, -29, -6, -7, 27, -12, 113, 33, -20, 31, 39, 6, 22, 19, 35, -20, 41, -42, -17, 15, 6, -2, 68, 3, -13, 71, 4, 1, -8, 47, -13, 13, -36, -8, -37, 42, -6, 40, -43, -68, 27, -27, -73, 9, 22, 21, 19, -55, 52, -42, -40, -46, 52, 51, -6, 8, -26, -13, 40, -7, -44, 24, 48, -34, -21, 19, -12, 0, 32, -1, 52, -26, -7, -18, 20, -18, 39, 28, 28, -9, -9, 22, 9, -29, 20, 95, -12, 6, -31, 34, -42, -33, 20, 22, -2, 19, 34, 43, -22, -30, -4, 32, -51, 9, 11, 11, -13, -64, 80, -39, 60, -2, 34, 29, 19, -1, -10, -9, 16, -29, 28, 2, 47, -6, -5, 63, 10, -36, 16, 59, 3, 56, -24, 77, 15, 57, 42, -40, -11, -29, 26, -31, -25, -16, 57, -8, -50, -5, 37, -30, 5, -45, 55, -26, -28, -5, -13, 0, -9, -31, 5, 70, -77, -28, 44, 34, -43, 3, -19, -4, -31, -27, 13, -9, 4, 37, -32, 24, -19, -5, 34, 8, 24, -1, 18, 21, -38, 27, 67, -7, -4, 25, 1, 12, 17, 41, 63, -39, -26, 25, 103, 45, -47, 17, 17, 29, -3, -29, 41, 24, -28, -3, 12, 21, 29, -3, -29, 12]
6046A2L3q5L3m8K4M0k8M3q5L2K4J9m8L1RNL8K6k4m9M9l6J2M5q5J9ml0K4L6k5k6
6078a9J1J2l8P1k0%n1j7Q7j18J09q3O0l0j3J4J1K1l7J4l5O2rM0k4k0k4O0j7%k4
6109gK3j6M1m2o4M6q1J12m4Q6l9n9M1L1Kk6K4pOKl3M0j5o5mO0J5nm1L3K5q5N1
6142EK9o4L6L4q0K7Rk6N3k2J9rJ2qno9J14k6j1m8LK8%Q2k7j5p1l3R5n7l6R7l8
6175bK4k4Jlj1K0j3JJ3Nm0M4j4l5O1j7k0m1J6K9j0J0K2l8O1%Jq8R9j1l5K1MJl4
6210ckk4M9K5m8k0L7M4o4l6O3l9M5m6MJ7j1K2%K3nl5QmlJ7J6nj8k2nKRNJrk9j0
6248e1L3O2r3Q3q7P8k4JL4o2O4k2m9%k8N3j4nL4J4l2K6J4k5m5N6j01N4L5l8Nl
6280c3P1o8K6r0N1M9%n1K3P6n6m8J5M4J1o0QM6n7L1J8Lj2L3lK0J3q1k0L5m0O5
$$ y = [12, 45, -40, -7, -55, -31, 9, -19, 24, -61, -29, -5, 14, -34, -3, 6, 11, 49, 75, 51, 2, 51, 15, 27, 72, -13, 6, 2, -28, -4, 32, 7, -19, -8, 4, -34, 37, 17, 17, -34, -51, 36, -82, 27, -56, 4, -26, -39, -25, -14, 7, -30, -16, -51, 11, 2, 42, 18, -2, -26, 34, 17, 17, -7, 16, 0, 41, -1, -65, -19, -100, 12, -32, 54, 15, -44, -3, 28, 30, 4, 28, 21, 27, 29, -4, 36, 21, -44, -48, 12, 27, 22, -19, 14, 39, -46, 5, 34, -30, 6, 40, -40, -13, -4, -30, 23, 1, 20, 11, 23, 15, 10, -59, 55, 29, 18, -30, -27, 1, 1, 83, 56, 41, -30, -63, 32, -25, -61, 36, -2, 22, -2, -1, -4, -15, 5, -8, -7, 6, 11, -29, 15, 1, -34, 27, 10, -10, -51, -35, -6, -16, -6, 16, -22, 39, 39, 40, -48, 51, 40, 5, 26, 30, 31, -3, -5, -29, 20, 45, -3, -23, 14, 58, -6, -42, 21, -18, 27, -19, -15, 2, -9, 13, 13, 36, 31, -4, 4, 0, -3, 14, 30, 25, 7, -15, -20, -18, -9, -4, -3, -12, -41, -51, -18, 44, -49, 34, -53, 25, 1, 2, 36, -26, 38, 16, -33, -33, -61, -8, -22, -27, 7, 21, -11, 15, 29, 4, -41, 15, -86, -32, 3, -35, -30, -33, 38, -30, -4, -94, -43, 6, 6, -45, -22, 54, -2, -50, -35, 9, 20, -40, -32, 14, -43, -12, 6, 9, -3, 30, 27, 47, 60, -21, -41, -6, -46, 19]
6312A9mk4J5J8o9P0m8l9O3Rk1Mj9RJ7l8L2lK9n0N3K6o7j1O2K0j03N7n7Q6Nl1J4
6345B4m0j4K6j6J3k3KO8o5j4lN9m4lM9k8L9l0K3j4Qj9LJRo1L3J1K0l7J3M1l4J4
6379A1K6l2J6m9L7j3j0O7n6J5KrJ3J5l8j2L4k3j8L8m6nJ1j9N3j6n3N7J2%k2K8
6411A4k5K6k9mN2K5o9nN9p3K7J1rj5j1P0m5oJk4L8l7K6lM5Jk2l0jM1Lj0j0l4K1
6446bJ5j7L7l6lK9k7K5n8nL5NMqj9NqP9o0o6Q9n3rK6M9l3l0M7j0m3mP1k8NQj4
6482dJ2j8L0l1RJ3o8K2M9n7N2q1J09p5J13r1L5k9l4M2L5n8J1K2J6j7M1j05L4L2
6512Ik4LRLN8n1j9j3L7RL5p5QK4nP2j01M5J1k7Rm1N9l3J7l3J6RQnM3n9k6L6j7
6547iRRL7p0NnKJ6k2mm3JN2QMpK1k1KKJ9K6lj7l9k8L8K8n3J0O3k6j8L6m6J3J7
$$ y = [19, 15, -9, 6, 24, -45, 25, -23, -62, 1, 10, -11, -7, -26, -17, 0, -38, -6, -9, 20, -30, 23, 49, -18, -29, 33, 53, -50, 7, -50, 36, 41, 10, 24, -16, -30, -4, -20, -7, -30, -28, 40, -25, -39, -42, 17, -27, -30, 19, -9, 30, 0, 23, 9, 17, -2, 1, 2, 11, -50, -17, -6, 14, -23, -10, 31, -3, 11, 37, 5, 21, -28, 9, -4, -14, 53, -3, 12, 14, 5, 18, 33, -5, -17, 17, -6, -24, 14, -32, -37, -26, -45, 8, -8, -61, -4, 8, 8, -14, 14, -11, 15, -14, -18, 34, 59, -10, -15, 44, -29, -2, 9, 0, -15, -26, 44, -1, -7, -6, -30, 8, -29, -3, -6, 39, 40, 18, -12, -13, 28, 31, 21, 11, -23, -2, 13, -4, 33, -3, -6, 23, -4, 21, -37, -42, -7, -2, 2, -6, -25, -20, -28, 51, -9, -75, 14, -39, -48, -22, 27, -6, -36, 11, 1, -42, -46, 25, -3, 2, 10, -4, 8, -10, 20, -11, -2, 11, -57, -35, 14, -43, 9, -72, 37, -38, 75, -16, 19, -10, -44, -2, 33, -25, -14, 8, 24, 7, 48, -57, -23, 9, -15, -12, -3, 0, 58, 7, -12, -25, 12, 21, 56, -19, -11, 13, 8, 80, -21, 24, 35, 8, 17, -24, 35, 2, 19, -14, 2, 11, 19, 14, 57, -2, -28, 8, -9, 0, 9, 46, -24, -19, -24, -22, -6, -28, -32, -75, -74, -22, -14, -10, -17, 4, -17, -15, -13, 6, 32, 29, 12, -27, -55, -17, 11, -42, -32, 31, 5, -13, 23, -23, -10, 7]
6584Gpj8K3j5K6mK2j0q1P5j8L1K3k2k7l3L9l0M8q0L3M6l2K8j2J7k6mj6l2rN9k1
6617b0L7J3n4nJ2Q1r6L3p0Q4K6n4j8OJ9m9K9m7O1J3Rl8m3R7j16N5lRJ4M2j38L9
6649g2Q3k7pLJJ5o6%J20l8j8pM3ok6M1L5k4n1K2Jn0o4J26j7jp3N6O0q0l1N8K8
6682C4om0OJ8l1M0j2L0o5O6o7Q0n2M5k6j5l6K1j5Pk0L8k0K5N8r7J4pkMJM2J4n4
6716b2M3l3K4J3kn9K5J4L0l1J9J2m6N4K0l7k5%Jk6N6m4qN1n1J9K6J7k2M0k4k4
6748A0o2N1O6j28J01rn7k9P3m3L2m4J5P3q9lJ5K8LNqK3l1n8L3L2l6K6j1n6J16
6779C8l0J8pk8K2%jj19J83k5j4M9q2op5J6O0k2J5j1PN4n1K4ko1j8L3k8O3Rl6m
6812b9p0J17Qk7km1O9j6p2O2n0J0J9K9J9pk2LJ9k4J8k3O1n6n3L6N2p6O7lLn4N8
$$ y = [7, 0, -18, 5, -10, 16, 12, 34, 24, -57, 18, 0, 31, 54, 32, 5, -28, 11, -19, 29, -51, -18, 28, -4, 24, 12, 29, 3, -1, -17, -49, -58, 1, -20, 17, 30, -24, -29, -17, 64, -32, 1, -69, 15, 41, -13, -31, -25, -6, -55, -26, -73, -12, 1, 10, -28, -71, 26, -90, -35, -38, -29, -15, 27, -111, -72, 11, -16, -23, -20, -19, -4, -70, -70, 50, 12, -6, -13, 30, 24, -2, 39, 74, 50, -1, 21, 22, -28, -92, 34, 17, 16, -57, -1, 59, -21, -52, 6, 34, 28, -12, -6, 12, -19, 21, 9, 39, -26, 40, -27, 53, 1, 46, 20, 5, -31, -10, -25, -18, -38, 0, -20, 5, 63, -34, -20, -27, -29, -25, -24, 18, 32, -22, 21, -12, 12, 25, 23, -36, -11, 3, 33, 2, 21, 33, -13, 41, 61, 24, -1, -1, 0, -26, 30, -14, -22, 29, -22, -3, 23, 40, 18, 58, 34, 10, -52, -1, 65, -63, 38, 29, -28, -57, 16, -27, 5, -39, -24, 49, -40, -43, -28, 0, 3, 8, 0, 23, -8, -66, -33, -1, -37, -11, -22, -78, 38, 8, 26, 19, -9, 13, 13, 12, -107, 76, 51, 37, 86, 4, -2, -77, -61, -1, -23, -8, -19, -12, 42, -9, 15, 13, -48, -66, -33, -61, 2, 11, -25, -29, -99, 18, 26, -1, -3, -44, 25, 9, -63, -1, -51, -41, -22, 7, 26, 19, -3, 0, 19, -5, 13, -10, 51, -5, -58, -22, 30, -46, 21, 18, 21, -33, 25]
6845B5Ol0k2j5K0j1O6j1J8%k5m9k0N5m1M6rJ2k2j6J1L9mo8P1m1L0J7r1N4MK2l5
6878a4J4j5J2nK2oll3O2k2r8Q9pO4p8L8l4N5m9K6k6j8K8oL7p1R4m7%n4K8K3J6
6911B2l0k2P4k4rk2l4PN5pj9Q3n2rqK5%m3m4P7j4l9M8k4mL9j7K0Lq9P1n5J3P2
6945D4l6Jl0M1q1M8N7n9N7o6k7P1k6N7p4QK3J0j0lj5L3J3J9n8P0o7L8l6l2P2n5
6977a3M3o2J45q9o4kK7m0N5J0L1o8k1P6l7J3Qn5M3N4qp9K3j1J2N9r0j1J19l7n8
7008b7QK4j7Oo0L6L2pj2j7m8L2O7m6JJ07p4l7O3j0l6L0m0mK8mm9O1n7M1J9k7O3
7041D6j02L0j4M1n4O6roJ9j7M0m9K5l3J9J1M2L7q5j7KP9j16J8rJ02m2m6P5j5q4
7072d6Q7m2J7qN9q6j6M5J5q2P5J4k7Mp3N0k9J3K3L6r8R3k6ojOm5M7j4J7%l7N7
$$ y = [25, 31, 1, -21, -36, -16, -27, 39, 28, 46, 46, 21, -28, -48, 7, -34, 12, 3, 15, -7, -23, -12, 27, 23, -45, 26, -15, 15, 32, -59, -5, -1, 21, -14, 0, -15, -3, -8, 14, 8, 5, -28, 34, 12, -86, 3, -4, 60, -18, 20, -14, 41, -8, 18, -8, -26, 2, -4, 33, -38, 56, 9, 9, -45, -17, 6, 22, -8, -30, 44, 20, 11, -11, -45, -38, 17, 10, -9, 74, 22, 13, 5, 30, 30, -13, -57, 20, 6, -33, 15, -9, -13, 26, 9, 29, 32, -57, 14, -41, -28, 44, 8, 9, -21, 20, -61, -13, 44, -15, 42, -24, -51, 20, -6, 51, -23, -15, 8, 18, 8, 5, -10, 23, 36, 55, -3, 67, 0, 38, 2, -30, 42, -13, 30, -32, 113, 24, -40, -42, -15, -55, 0, 10, 41, -27, -48, 28, -9, 4, 12, -43, 0, 54, 46, -33, -10, -21, -9, 50, -40, -51, 68, 31, -27, -19, 5, -12, -6, -66, -30, 2, -5, -17, -34, -82, -50, 17, -29, -28, 79, 5, -32, 31, 21, -15, 15, -25, -29, -1, -5, -54, 7, -50, -9, 10, -17, 46, -56, -26, -40, 1, -53, 13, 4, -2, 17, 0, 40, -9, 16, -17, 2, 13, 55, 92, 7, -10, -8, 71, -45, -27, -36, 66, 24, -22, 53, 38, -46, 41, -1, 16, 8, 67, -19, -35, 10, 25, -57, 18, 32, 5, 9, -64, -14, -43, -30, -7, 29, -69, 24, -2, -8, -9, -3, -48, -1, -15, 2, 2, -35, 22]
7105B2M0r1K9n%LnL7n1n4R9q0N4l3L9K5m1k5J04j06M6l9M9j4l9L7J2j4J2m7J6
7136b0L6o1P2j9kK7k6Ol0J5Ql3L0p0K8Ql5O1J0qPj8k0M4K7n4J8n1J4J1J6Ml2N3
7170A6m7qL6J1j6p7R9M0o3j1m0O6n0RN7J0n1QJ7N3q9O9K3m1l5M5lj6J9l7O0K5
7202G9p5l4j2Qj3M0QJ0j6K0o5P9qm4K4k3j5k4M7lK2n7K5J2J4L6k0j4M0o1l2K5
7234b7J26r1MJr7Q8K2J5o1Q4p7L7j09O3L1rM4m0L3m5k1M0k7L8l7k2L8j4M1m1K5
7265A2j00J13nk1l5oN1K0o2M3J6l7K2mRp6kR4p2Q9l2n0K3k6M7j5O8j04L6j3L0
7296A3K1m1o9M0J10r0P4K1l8n7jN8k9m4L2k7JM4L0o5O1qm9M1k3l2j2j0L5K4m1
7327c1L0j6J5J7j8k1J4k5L6%J0NK2m0o4O3j2L9p9L4rO7p6k6R3n6j8R4p4lL5j0
$$ y = [22, 62, -29, 0, -5, -5, -2, -7, 30, -21, -75, 24, -56, -2, -35, 4, 29, -12, -37, 67, -39, 7, -32, 17, 3, -36, 1, 13, -1, 11, -36, -20, 16, -45, 27, 8, 6, 33, 7, 13, -17, -2, 6, -27, 3, -67, -39, -31, -66, -5, 5, -3, 4, -14, -34, 10, 37, -17, 1, -50, -36, -25, -9, -5, -37, 16, -31, -39, -3, 8, -8, -85, 14, 54, -9, -20, -60, 6, -44, -35, 22, 32, -19, -11, 6, 59, -30, 39, 62, 21, -14, 31, 28, 12, 31, -6, 54, 79, 4, -30, -42, -34, -47, -7, 1, 11, -5, 15, -50, 29, 21, -23, 1, -22, -37, -61, -14, -17, 5, -52, -27, -15, -1, 35, 15, 1, 41, -20, -52, -27, 99, 8, 12, 13, -84, 4, 26, 41, -20, 64, -13, 24, -85, -22, 9, 0, 44, 4, 37, -8, -29, 11, -16, 22, -15, -37, 1, -13, 28, -13, 12, -88, 25, 20, -1, -36, -42, 9, 29, -33, 10, 26, -11, 11, 7, 16, -60, -62, 32, -40, 49, 17, -33, -10, -36, 11, -4, 64, -40, -4, -17, 13, 34, -7, -76, -36, 74, -16, 58, 79, 41, -16, -17, 41, 12, -32, 0, -27, -26, 18, 48, -17, 44, 36, -13, 28, 5, -27, -39, -49, -14, 10, -31, -1, -17, -2, 15, -3, -24, -10, -35, 1, 1, 11, 16, 38, -2, -66, -3, -15, 24, -55, -21, -30, 37, -39, -65, 28, -28, -46, 48, -26, -29, 6, -4]
7359dj8k5k2P2k1k0M5k4K7o8R5l5m6J10j38Q2J2m0K4j3OK8kn7M5n6J2L8J4Opn0
7391c0R4m2qnm7Rklk2L9n3N0oqMO7K4q2K2L3Mr7P7o8R0r3J19q6k1M6p5K1O9j5
7425En6P5m6N1n6Q1o6MK9k1j9J6nj6N0p2L0k2Q1q4J9R7j00k2O9n3L5m0k7J5RJ5
7457b4k2qOO2k9M3k4l2Q9r7L5l5rjk8P8j4M0p3N2K1o0L2l6KN9k4Rn9k9J01l3n
7490a3K1k6JMJ6Ok9LkM6o5oKK6J9L8K0q3L3k9o3Q7m6mrK3R0o8j5M6l0J8l3m0P0
7525Hn5N6k3M3M3q2l7j3L5rM5N5j10N4L9o3L1Qo4M3l6j0O8l4L2j7j5K8Qp2J6k2
7557e0O0l3l1R2L2p7Kl4J0L0OLrl6l5R4r0J1L4j2J4J7j3J2O2n2J4n6j9J5O3l8
7589a4J4mj8O2n5N7m5p1N3kL6j9o3N1J10j22K2J5K1Jk4M4n4n5Q4k1k8MM4j9L5
$$ y = [-4, -22, -47, -69, 3, -18, -38, 7, -17, 10, -58, 37, 2, -44, 66, -72, 10, 22, -18, 6, -7, -1, 27, 25, -32, 13, -43, -31, 7, 21, 27, 20, -30, 64, 22, 14, 9, -38, -29, -31, -34, -56, -17, -70, -20, -26, -34, -30, 37, 61, -21, 1, 34, 38, -59, 18, -50, 40, -53, 66, -20, -41, 5, -70, -49, 20, 5, -51, 24, -22, 29, -27, 54, -12, -8, 21, 0, -19, -3, -8, -24, 26, -46, -16, -38, 43, -41, -22, 75, -25, -47, 22, -31, 4, -36, -63, -48, -39, -24, -46, -54, -48, 14, -15, 28, 4, -28, 61, -36, -1, -36, -45, -46, -74, 4, -10, 30, -43, 9, 30, -30, 2, -34, -32, 27, 3, 12, -47, -76, 25, -8, -13, 8, -18, -17, -13, 3, 9, -20, -17, -19, 27, -38, -44, -42, -16, 3, 41, 61, -22, 11, -18, -81, 6, -40, -44, -53, -30, 60, -8, -23, 23, -7, 11, -22, -62, 8, -47, 9, -14, 29, 72, -10, -47, -60, -25, -34, 11, 66, -44, 10, 49, -14, 17, 25, -39, 4, -32, -42, 26, -8, 24, 7, -8, 20, 28, -44, -28, -50, 10, -23, -54, 38, 70, -7, -5, -39, -29, 1, 7, 10, 1, -35, -70, 24, -66, -55, -21, -33, -19, -2, -15, -3, 59, 7, 21, -35, -54, -39, 24, -14, 0, -4, -22, 40, -15, 42, -3, -74, -21, -23, 13, -6, -69, -18, 92, -30, -8, 7, 28, 29, 5, 49, -5, -60, 24, 3, -25, -21, 23, 4, 39]
7620C9J8p9JK0N7Lj12O8k1L9l4K2N9j03N8m0J3j3N4o8O5l8j2k9k1K9M1l6Oj7J
7651c0L1j4k1M5k5kl4LQ3m9J6L2j8K0p5L0j9K0l2K6nO3l6K7k4j7j5j0N4K1l7J0
7683A8K1q0JL8l1j3P7k4K4jm1J6o3M4Po3O4Qj4M2rm8M6k4N3m8J9J7n2j5L3O8O
7716G6j50O5O8o5Kjk8qK6k6Q1m3L3M3p4J3n8Q0j6k4J8j4mJ6%J1l4k8M9ML1k5l2
7749a4K0J3L3p8NL8l6M9l9K4n8LL2Q0r2P2l2o7J43j13N0j9jM3j0po5m1K6K0L7
7780A6J2l1QJ3l3J6j8j6Q3j10KO7J9M6m5l0kj1K1L6q3M5lj1pl6P6j10R6O1q7J9
7812Cl5K3k1M5j4j7%jJ9m4L5l8j0Q7l0K9p1K0LL3k5O1n5Pk6KN9m5lP0q4mJK9k5
7847b2jP6l6m5k4J18o5m3MN2k8J3Olk8P8r5M3Pn5M0qJ2QLL2p3L5jMNJk6Mj8j3
$$ y = [39, 57, -22, -21, -1, 56, 59, -53, 15, -6, 33, -1, 21, 80, -23, 35, -5, 8, -5, 49, -19, 46, 8, -4, -33, -54, -25, 16, -20, -14, -31, -30, 1, -13, -34, 11, -14, -16, -50, -47, 36, -13, 3, 35, 17, 37, -38, -8, -27, -7, -39, -13, -18, 45, 9, 36, 12, -5, -20, -30, 24, 45, 8, 18, 39, -41, -40, -2, -33, -46, 31, 7, 31, 30, -11, 5, -58, -14, -7, -70, -6, 2, -12, 30, 21, -27, 19, -5, 48, 0, 19, 36, -16, -31, 2, 70, 76, -74, -9, 59, -6, -4, -5, -33, -41, -15, -41, 40, -3, 30, 73, -1, 12, -46, 34, 18, -6, 12, -2, -6, 10, 10, 21, -13, -41, 8, 12, 43, 18, -14, 6, 19, 52, -26, -21, 17, -19, 30, -9, 15, -43, -40, -8, 72, -20, 52, 20, -47, 96, -17, 33, 14, 13, 56, 46, 39, -26, -67, -41, -21, 16, 28, -3, 5, 18, -15, 1, -17, -33, 50, -60, -58, 9, 28, 74, 29, -1, -3, -14, 7, 43, -40, 5, 2, -9, -16, -52, 24, -86, 10, 71, -16, 3, -32, -9, -30, 15, 1, -16, -16, -17, 2, -42, -7, -45, -55, 32, 2, 31, -40, -20, -17, 16, -9, 52, -3, 4, -22, -20, 39, -6, -9, 61, -23, -27, -26, 3, -22, -23, 53, 17, -28, -52, 66, 1, -42, -38, 14, -14, -1, 5, 2, -26, 52, -43, 0, 7, -48, -8, -16, -4, 4, 7, 39, -34, 1, 0, 4, 9, 10, -16, -12, -30, -43]
7883d3K3j6Rk0N7n0Q7k7qQNk0j8mk4M7L5l6j2L5J4q8ML8L5j5o5L4LJ7k4Q5q4m0
7917e8R0m3PK3Nk7K8m3J6K6k0kJ5o8J5m7R5J0n5N8Lo3P1o0Lk6K4J4ojK5l6R0m5
7951A8j3O6j36O1kP5j01J5KKj8MLL7o7Q8p4M6m4lP0l6L7r2R6Jp9N6m8k0J01J0
7983E5po9N5q4L5K2%J1p4M8L0J9q2N5M0j39R2qj9M0k7mM0m%J3qn7l3K7K5j0L3
8016A5Ll6K7m2j0M3m1M2k1K5jm6P9q6M7K4m9M8j8l2Q8n5l8O2l0K2p0K6K5L9m5
8047epq1J03N7l6k4l6k3k1N3O7n2ok1M1k8KJ0J9Mk6L5p0O2L7p1K5j5Lm7J18q2
8079a5K4n0P7l5n5L1pJk4o7J23L8m6ql4J8M1J8q0M4nM3k6l9M0mL6p1k8R1pj3j4
8112cNj7M4n8PJ0N3JM7j17L6jK8Ql1j5l4O2n1k7O0k6K1q2R7L6m0Kjmnnk6j3kO2
$$ y = [-43, -20, -36, -27, -47, 10, -40, 47, 20, 12, 20, 25, 5, -13, -17, -41, 6, 41, 5, -7, 28, 42, -46, -42, -4, 31, 16, -49, -15, -12, 5, -19, 66, -18, -58, 32, -11, -4, 19, 24, -3, 25, -18, -2, 24, 4, 2, 17, -51, -36, -83, 12, 22, -33, 25, 28, -35, 36, -24, -21, -47, -23, -9, -15, -16, 9, -27, 63, 18, 5, 71, -65, -4, -6, 69, -32, -17, -15, -13, -31, -27, -24, 13, -54, 34, -40, 6, -38, -41, 29, -7, 30, -62, 34, 35, -44, 12, -36, -56, 45, 55, 48, -21, 34, -50, -15, 7, 7, 18, -56, -8, 22, 41, -41, 14, 54, -85, 7, -1, -20, 20, -7, -11, 29, 25, 25, 38, 30, -27, -60, -33, -8, -18, 15, 18, -18, 9, -33, -43, 0, -41, 1, -20, 5, 4, -42, 37, -49, -2, 22, -27, 21, 3, -29, 59, 4, -34, 28, -2, 20, -50, -24, 1, 40, -5, -12, -93, 10, 67, 31, 7, -29, -52, -73, -20, 47, -5, -11, -32, 9, -19, -17, -7, 12, 16, -10, 25, -45, 17, 54, -17, 8, -7, -4, -51, 67, -15, 9, -41, 36, 1, -54, -23, -30, -29, -53, -120, 3, 41, -5, -13, -47, -29, 12, 30, -50, -6, -11, 32, 6, -33, 7, 3, 39, -32, -60, 31, 24, 11, -3, 2, -15, 29, -29, -22, -12, 41, 42, 89, -28, 8, 7, 35, 43, 12, -3, -37, 25, -26, -53, 7, -19, 2, -80, 17, 53, 13, 15, 14, 10, 5, 0, -26, -39, -41, 21]
8148B1n2MJ2O9m9nK9k2K7l4jNJ7n1N7k2%m3Q7m7l8J3k1N6k5j3J0JL2l6j1j3L6
8181gPK1Jl3J3J9l4j5L5j0
$$ y = [21, -31, -27, -15, 54, 5, 0, 29, 7, 34, 0, -1, 4, 21, -30, 27, 5, 5, -38, 49, 2, -36, -23, -44, 12, -13, -26, -16, -15, 17, -19, -30, -43, -7, 0, 21, 22, -11, 2, 21, -13, -28, 7, -3]
8191c
$$ Imaginary data points
##PAGE= N=2
##DATA TABLE= (X++(I..I)), XYDATA
0@%%%%%%%%%%%mQmMj2J6j6J6j7K1k5K9l3L7m1M4n1N8o4P1q0R1r8J08j24J36j47
38g7J62j82K02k20K44k73L02l32L71m21M80n45O24p30Q67j050J306j689K307l410
58b064N740j2407O2066K21298k71804k30627K85820J74084l14304j62000L03939
69E9741J38878k70724q7418K66083O3781k53355o0657K14228M2024j89132l1666
80a08217J75347M2104j53733n0648J39598O1133j37833q1284J34530R3066j44057
91b9994j04667J64160J22660j76428j25955J93803J16154k25894j15802K46080
101F4117J07441k54460p8636K73896N4428k88420l7767K82482P549k75743K4389
112a20724K73087m1264k55893N7544K32789p5109k15396Q0670J95689p8959j73792
$$ y = [0, 0, 0, 0, 0, 0, 0, 0, 0, 0, 0, 0, -4, 4, 0, 4, -8, 8, -8, 8, -9, 12, -13, 16, -17, 20, -21, 23, -28, 30, -34, 37, -43, 48, -50, 58, -66, 70, -77, 85, -97, 105, -115, 129, -144, 158, -174, 197, -224, 256, -289, 335, -395, 472, -578, 728, -961, 1346, -2064, 3676, -8731, 53335, 274633, 2829, -227798, 58022, 232106, -82198, -244198, 59741, 198619, -72105, -159523, 106560, 170341, -83014, -143671, 70557, 112581, -76551, -108217, 67130, 109234, -44499, -95147, 44451, 105584, -32249, -113533, 20997, 114063, -29994, -134661, 29499, 152159, -24269, -150224, 43579, 159733, -66161, -181963, 64117, 171558, -82902, -161538, 112358, 166786, -121634, -159401, 123081, 130630, -145113, -120724, 152363, 111099, -144794, -87250, 145539, 70430, -144966, -64296, 131393, 52434, -121358]
123a21358P6539J59617o6966j48902N2825J40174m1879j41485K8479J47338j5022
134F9360j53270J0447J66346r960j83946R556J96051j9053k07336L6764K20934
145A35893n3716k27463P3533K25607r9716k22467J23462K14743j42805j98545
155a71474J62172J80325j77015j60586J84393J38000j87369j15754J85797R6934
165A35423j77456p9079J66491O5613j53771n8022J38275N3877j23458n2924J12789
176B7758N8286j03204o6150R7118P3829r7270q3499J01963R3384j09251r9657
187a06693J21007J02891j36337j04338J51509J00570j66911r2380J81884Q1166
197A32368j93978o6867K02278M9718k07657l1913K07939J4094k03965L017J96923
$$ y = [-121358, -44819, 114798, 47832, -101070, -48245, 91929, 50050, -91435, -62956, 84382, 69360, -83910, -73463, 92883, 82923, -101023, -91467, 104584, 85531, -121805, -85041, 135893, 82177, -145286, -71753, 153854, 54138, -168329, -44867, 169876, 27071, -171474, -9302, 171023, -5992, -166578, 17815, 155815, -31554, -147308, 38489, 135423, -42033, -121112, 45379, 110992, -42779, -100801, 37474, 91351, -32107, -85031, 27758, 86044, -17160, -83310, 13808, 87637, -9633, -93132, 8831, 102215, -7036, -106693, 14314, 117205, -19132, -123470, 28039, 128609, -38302, -130682, 51202, 132368, -61610, -128477, 73801, 123519, -84138, -116051, 91888, 105982, -97983, -94966, 101957]
208A01957j7691j86853K9147J73855l7879j60837M2827J48155m3571j36117M1854
219d5153J26481l8068j20175L1984J16790k5354j16358J9739J19449j5094j25115
230g0874J2323J32034j2278j40183J5340J48229k0815j55078K9290J60406l9761
241E8633j63219N1742J63039o4385j59964P7145J54311q8814j45761R8900J35390
252A17017j07221j24076J12799J12092j15736j00268J16412Q9481j14976q0619
262i5095J11314P3512j06875o8707J01895O6247r7092o5792R2764O6897q9952
273a0884o9470Q8729P2506q9431p5657R2145P8105r6420p9223J02314P9204j09220
285a7302p7265J16806P3597j24044o7748J30980O0664j36569n2275J40848M3228
$$ y = [101957, 84266, -102587, -73440, 100415, 62536, -98301, -55474, 92681, 49110, -87007, -45153, 81328, 43260, -76915, -44931, 71859, 46505, -69853, -50114, 69335, 54241, -70874, -58551, 73483, 61205, -78978, -63638, 84591, 63776, -91302, -62012, 98394, 58633, -104586, -52844, 110195, 45810, -114154, -37009, 117302, 28488, -117273, -18373, 117017, 9796, -114280, -1481, 110611, -5125, -105393, 11019, 100500, -14476, -95095, 16219, 89731, -17144, -85851, 16044, 82291, -14801, -80593, 12171, 79068, -10884, -80354, 8375, 80881, -8550, -84207, 7938, 86043, -10377, -89600, 12714, 91918, -17302, -94567, 22239, 95836, -28208, -95956, 35024, 95688, -40881, -93156, 47692, 90920]
296I0920j43262l3603J43967K4518j42818j5961J40022Q355j36088k115J31233
307F5168k687j26069O109J20522q225j15836R168J11546r395j08601Q889J06601
319E7190q737j05912Q380J06297q942j07561J0053J09210j2163j11417J5234J13580
331F5212j9187j15366K4043J16631k9368j16963L5256J16621m1112j14971M6866
342c2338J12643n2047j09289N6973J05421o1043j00746O4549R5886o6947r1115
353g8053O8983Q6564p0169q2294P0926P8562p1438p5531P1726P3022p2244p1180
365g1126P2691O9553p3542o8629P4530O7675p6157o6860P7909O5639q0036o4313
377g2666Q2229O2250q4433o0016Q6728N7118q8803n3852R0762N0108r2311m6063
$$ y = [90920, -52342, -85945, 58022, 82540, -60278, -76239, 63783, 72138, -63950, -66065, 65168, 62481, -63588, -57479, 63043, 54818, -61018, -51850, 59696, 50301, -58300, -49411, 57190, 48453, -57459, -49079, 57218, 48276, -59285, -49232, 59978, 47815, -63602, -48368, 65212, 46025, -69341, -45298, 71333, 41965, -74998, -39742, 76879, 35767, -79204, -32338, 80305, 28258, -81031, -24058, 81363, 20320, -80426, -15877, 80009, 13062, -78053, -9070, 77494, 7325, -74969, -4043, 74519, 3081, -72450, -724, 72298, 54, -71126, 1565, 71118, -2424, -71053, 3477, 71152, -5005, -71865, 6044, 71683, -8353, -72666, 9563, 71813, -12620, -72636, 14092, 71210, -17593, -71445, 19317, 69425, -22886, -68949]
389f8949R3707M1913r4613l7533R5273L3454r5361k9439R5546K5795r5097k2245
401e7549R4779J9188r4203j6247R3665J3638r3116j1144R2585Q835r2112o441
413d8122R1542M114r1222j674R0771q68r0420L410Q9922o343q9422R080Q8674
426D9442j2038q8129J4978Q7191j7905q6443K0640Q5366k3381q4311K5940Q3260
438E4610k8360q2128L0749Q0936l2793p9807L4974P8605l6869p7426L8934P6202
450E7627m0886p4837M2957P3459m4995p1812M7290P0001m9404o7881N1703O5794
462E9016n3891o3384N5902O0865n7831n8115N9505N5382o1073n2599O2164M9823
474E5764o3116m7188O3686M4647o4127m2246O4144M0139o4195l8188O4127L6298
$$ y = [-68949, 24758, 66671, -27942, -65475, 29798, 63252, -32109, -61548, 33998, 59793, -35304, -57549, 37230, 56418, -37785, -54032, 39633, 53271, -39845, -50989, 41596, 50431, -41681, -48122, 43420, 47534, -43688, -45362, 45409, 44541, -45879, -42469, 47453, 41110, -48312, -39232, 49442, 37404, -50725, -35747, 51444, 33539, -52904, -32264, 53102, 29721, -54590, -28650, 54610, 26250, -55878, -25129, 55807, 23014, -56793, -21819, 56786, 19917, -57509, -18575, 57627, 16741, -58096, -15139, 58320, 13325, -58487, -11197, 58804, 9400, -58481, -6778, 59016, 5125, -58259, -2357, 58508, 677, -57438, 2067, 57449, -3624, -56223, 5941, 55764, -7352, -54540, 9146, 53793, -10334, -52580, 11564, 51703, -12492, -50680, 13447, 49745]
486D9745o4142l4765O4280L3150o4508l1732O4929L0205o5682k8649O6725K6917
498D6473o7858k5066O9309K2833p0630k0362P1986J7821p3236j4959P4319J1944
510D2574p4961q674P5317N369p5177k032P4646j125p3588M035P2394o775p0755
523c8752R277O9009j1228o7245J2994O5344j4312o3779J5427O2441j6302o1549
535c8675J6988O0774j7768o0420J8496O0286j9582o0487K0843O0679k2388o1059
547d2313K4223O1262k6487o1312K8994O0790l1773o0008L4622N8618l7432n6921
559d7737M0114N4649m2416n2040M4561M9162m6292m5862M7510M2814m8171l9704
571d3412M8493L6952m8296l4419M7817L2631m7161l1215M6653L0157m5884k9791
$$ y = [49745, -14397, -49162, 15118, 48268, -16240, -47972, 16957, 47162, -18520, -47169, 19556, 46473, -21385, -46451, 22858, 45691, -24939, -45301, 26685, 44506, -28730, -43689, 30630, 42574, -32387, -41061, 34256, 39625, -35552, -37584, 37062, 35937, -37651, -33616, 38778, 32003, -38752, -29475, 39534, 28306, -38939, -25945, 39399, 25087, -38692, -23265, 39176, 22874, -38675, -21687, 39087, 21319, -39101, -20605, 39681, 20099, -40388, -19545, 41134, 18746, -42313, -18090, 43172, 16685, -44627, -15633, 45157, 13384, -46624, -12002, 46616, 9184, -47737, -7623, 47026, 4610, -47430, -2869, 46293, 1, -45861, 1649, 44463, -3708, -43412, 5081, 42033, -6263, -40682, 7135, 39766, -7395, -38610, 8043, 38200, -7684, -37475]
583c7475M5697K9520m5532k9565M5859K9791m6682l0023M7972K9893m9728k9440
595c9713N1683K8365n4113k6891N6431K4717n8797k2026O0588J8925o2306j5403
607c8540O3409J1525o3883p712O3777L905o2800m70O1373k531n9437N061N7214
620C0891o924n4699Q127N2490q783n0133R017M8462q686m7109Q374M6464p712
633A9779m6370P437M6774p296m7720P748M8761q641n0205J0152N1499j2387n2584
646c3053J4913N3279j8106n3436K1308N2920k4849n1760K8049M9876l1067m7687
658c9613L3603M4732l5651m1588L6864L8292l7498l5074L7417L2154l6721k9694
670c2777L5713K7809l4312k6474L2972K6008l1689k5916L0813K6549l0319k7433
$$ y = [-37475, 8222, 37742, -7790, -37355, 8504, 38295, -8387, -38410, 9562, 39455, -10273, -39713, 11970, 40335, -13778, -40669, 15762, 40479, -18318, -40344, 20244, 39169, -23137, -38540, 24869, 36394, -27489, -35201, 28576, 32481, -30319, -30789, 30584, 28053, -31384, -26323, 30891, 23967, -30732, -22605, 29885, 21102, -29031, -20014, 28448, 19762, -27347, -18973, 27491, 19779, -26591, -19154, 27620, 20324, -27396, -19648, 29113, 20472, -29733, -19581, 31918, 19531, -33053, -18140, 35139, 17033, -36403, -15095, 37825, 12976, -38784, -10735, 39141, 8074, -39613, -6010, 38722, 3071, -38517, -1653, 36639, -859, -35933, 1484, 33638, -3083, -32777, 2936, 30745, -3567, -30041, 2931, 28939, -2750, -28666, 2147, 28696, -1623, -29056]
682b9056L0495K8680l1286k9803L2743L0868l4864l1281L7361L1302m0204l0408
694c5453M2955K9088m5897k6848M8313K3873n0346k0438N1632J6650n2422j2693
706c1586N2158Q842n1367n466M9975K307m7966O3M5703j810m3314K700M1043l096
720A8186l8931K752L7454k010l6518J239L6040k33l6283m16L7072Q41l8214o26
734a9647L9830p1m1366J499M2971l478m4264O062M4968q773m5371J2035M5003
747B9398j5296m3839J8257M2171k0933l9990K3056L7451k4771l4563K5526L1770
759B8237k5772k9179K5326K6899k4533k5166K3241K3926k1902k3354K0503K3475
771B1701j9394k4232J8882K5110j8768k6318J9210K7599k0409k8674K2248K9414
$$ y = [-29056, 1439, 30119, -1167, -30970, 1773, 32641, -2223, -33504, 3857, 35159, -5045, -35453, 7502, 36590, -9307, -36155, 12158, 36031, -14315, -34753, 16879, 33529, -18893, -31586, 20572, 29414, -21953, -27419, 22556, 24863, -23103, -23040, 22663, 20853, -22461, -19761, 21282, 18186, -20745, -17993, 19461, 17451, -19067, -17828, 18212, 17979, -18304, -18720, 18352, 19193, -19021, -19647, 20183, 20112, -21254, -19755, 23216, 19738, -24526, -18464, 26504, 17731, -27640, -15605, 29398, 14102, -29737, -11480, 30691, 9758, -30232, -7176, 30275, 5504, -29059, -3533, 28237, 2465, -26714, -1388, 25511, 978, -24188, -947, 22979, 1077, -22277, -1774, 21701, 2307, -21925, -3043, 22067, 3299, -23019, -3809, 23790, 3381, -25293, -3045, 26369]
783B6369k4564k9521K7133K9124k9889k8063L2635K6427l5134k4077L7216K1242
795B8898l8655j8177L9520J4892l9633j1533L9079Q559l8010n915L6427L737l4393
808a5204k198L2337J274l0354j018K8633J242k7426j792K6579K729k6460l564
821a5222K6702M417k7700m924K8946M993l0483m719L2282L652l3964k133L5387
834A7234R3l6469K272L7081m976l7086P717L6610j0511l5422J2925L3900j4909
847H459l1842J6449K9740j7362k7594J7912K5523j7845k3602J7335K2193j6477
859B889k1197J5720K0572j4655k0560J3974K0843j3439k1533J3361K2371j3611
871D735k3418J4558K4096j5788k4755J7485K4807j9310k4667K1331K3899k3441
$$ y = [26369, 1805, -27716, -583, 28541, -1348, -29411, 3224, 29651, -5483, -29560, 7656, 28898, -9757, -27934, 11586, 26478, -13155, -24688, 14391, 22950, -15060, -20975, 15452, 19189, -15204, -17402, 14935, 16209, -14145, -15163, 13470, 14712, -12714, -14506, 12073, 14802, -11658, -15222, 11480, 15897, -11803, -16727, 12219, 17212, -13271, -17990, 14292, 17944, -16020, -18153, 17234, 17327, -19142, -16870, 20211, 15235, -21851, -14134, 22476, 11965, -23457, -10532, 23368, 8459, -23383, -6934, 22806, 5444, -22150, -4238, 21285, 3440, -20162, -2827, 19366, 2889, -18308, -2588, 17984, 3329, -17231, -3257, 17586, 4147, -17386, -4025, 18346, 4735, -18683, -4125, 19971, 4183, -20572, -3087, 21720, 2410, -22257, -926, 22973, -468]
883d68k2711K5190K0973k6788j9068K8062J6815k8934j4430K9213J2087k8897
895h956j0083K8360Q279k7606o675K6450N614k5170n020K4073M863k3079m868
908a3818K2359N326k2044n735K2105O286k2518o562K3334O683k4374o459K5555
921A0138N864k6739m994K8031L501k8940j957K9614N3l0026J960K9943m047k9381
935a6980N801K8482p518k7358Q924K5906j0020k4385J0556K3004j1041k1529J0933
948e225K0352j0678j9407J0350J8767r868j8400R376J8492r111j8676R070J9173
961A4215r151j9690R685K0180j0415k0639J1541K0909j2750k0945J4151K0601
973A7692j5435k0011J6889J9234j8322j7939J9273J6595k0167j5105K0637J3570
$$ y = [-468, -23179, 2011, 22984, -3804, -22872, 5190, 22005, -6929, -21359, 7854, 19941, -8956, -19039, 9321, 17600, -10006, -16681, 9769, 15383, -9787, -14807, 9266, 14129, -8950, -13818, 8541, 13867, -8177, -13912, 8193, 14479, -8039, -14601, 8733, 15416, -8958, -15417, 10138, 16002, -10737, -15731, 12300, 15801, -13139, -15096, 14518, 14571, -15455, -13495, 16448, 12401, -16980, -11179, 17303, 9785, -17573, -8649, 17257, 7237, -17148, -6592, 16412, 5371, -16158, -5225, 15127, 4449, -14958, -4608, 14159, 4291, -14109, -4733, 13759, 4648, -14028, -4958, 14215, 5064, -14626, -4941, 15239, 4824, -15815, -4274, 16635, 3885, -17060, -2909, 17692, 2257, -17754, -865, 18369, 47, -17892, 1381, 17976, -2191, -17296, 3341, 16911]
985A6911k0871j2178K0788J0766k0539r597K0079Q550j9517p858J8911P341j8371
998e585p129J7960P097j7676p259J7650P334j7858p381J8170P500j8693p425J9450
1012F155P005k0055o501K0886N754k1490m702K2030L505k2285k261K2464R51k2317
1026a0861K82K2126j522k1625K604K1010l599k0224M346J9434m886j8588N238
1039f265J7730n428j7093N478J6505n424j6223N391J5915n433j5904N511J5893
1052A0653n547j6169N884J6257o276j6447O912J6465p492j6620Q396J6490r179
1065C327j6275J0028J5887j0855j5340J1730J4698j2433j3959J3110J3075j3485
1077d92j2245J3871J1349j4051j0445J4069R791j4036r094J3972Q471j3770q058
$$ y = [16911, -3960, -16138, 4650, 15416, -5123, -14720, 5359, 13909, -5608, -13466, 5445, 12786, -5585, -12714, 5246, 12343, -5333, -12592, 5058, 12392, -5466, -12847, 5323, 12823, -5870, -13295, 6155, 13160, -6895, -13396, 7490, 13244, -8246, -12948, 9082, 12587, -9698, -11959, 10505, 11456, -10861, -10579, 11547, 10025, -11600, -8996, 12014, 8415, -11809, -7463, 11971, 7085, -11503, -6265, 11465, 6037, -11056, -5578, 10927, 5503, -10720, -5329, 10586, 5153, -10751, -5240, 10653, 5106, -11063, -5179, 11078, 4802, -11645, -4733, 11732, 4240, -12380, -3984, 12506, 3327, -12948, -2920, 12967, 2112, -13228, -1498, 13200, 767, -13192, -82, 12993, -492, -12737, 1134, 12483, -1568, -12013, 2056, 11847, -2189, -11283, 2689, 11160, -2610, -10668]
1090a0668J3592P653j3473p362J3449P051j3389o978J3540O658j3573o509J3805
1103C796O203j4076n855J4266N549j4625n172J4889M635j5195m018J5389L341
1116I127j5490k740J5581K092j5617j293J5487O86j5384k6J5261p18j4930J405
1130f559J4586j839j4359K238J4082k656j3698L010J3506l298j3221L618J2982
1143H392l874j2721M106J2635m467j2384M720J2199m934j2160N257J1994n618
1156C145j1944N973J1757o331j1709O827J1465p242j1222P607J0984q118j0621
1169i429Q453J0258q849r940R354R474r651r036R994Q465j0246p908J0317P453
1183H709j0473o854J0514O460j0570n889J0559N450j0415n058J0307M784j0204
$$ y = [-10668, 2924, 10577, -2896, -10258, 3191, 10242, -3147, -10125, 3415, 10073, -3500, -10009, 3796, 9999, -4077, -9932, 4334, 9883, -4742, -9914, 4975, 9610, -5585, -9603, 5786, 9127, -6363, -9103, 6478, 8570, -7047, -8340, 7147, 7833, -7551, -7577, 7684, 6966, -7964, -6559, 8027, 6188, -8171, -5933, 8149, 5493, -8205, -5195, 8311, 5013, -8208, -4590, 8392, 4518, -8203, -4097, 8538, 4071, -8313, -3593, 8606, 3672, -8488, -3231, 8763, 3145, -8799, -2826, 8931, 2600, -9109, -2282, 9183, 1941, -9281, -1674, 9310, 1192, -9429, -976, 9282, 433, -9507, -153, 9321, -330, -9366, 628, 9093, -1153, -9061, 1256, 8709, -1764, -8618, 1896, 8356, -2214, -8103, 2456, 7906, -2509, -7567, 2740, 7524, -2680]
1196b680m569J0211M281j0089m172J0153L932j0116l818J0211L707j0452l483
1209f884J0622L326j1011k925J1166K624j1486k232J1720J663j1875j283J2152
1222E577N36j2127J9J2138p83j1994J457J1696j957j1439K512J1109l090j0632
1236f978L539J0208l729r800L878R433l923r090M049Q727l953q523L957Q372l772
1251B395q384L778Q397l851q448L939Q589m151q821M572Q852m939q891N396Q866
1266G299o026q612O451Q367p025p999P493P527p911o922Q203O248q364n769Q542
1281A502N068q477m437Q167M130q099l582P838L193p487l032P249K979p080k866
1296d934O862K953o719l083O759L213o883l360P116L440p406l288P768L145q222
$$ y = [-2680, -7249, 2962, 7243, -2846, -7018, 3135, 7067, -3049, -6867, 3344, 7051, -3401, -6884, 3738, 7064, -3947, -6872, 4294, 6918, -4568, -6800, 4920, 6583, -5292, -6575, 5577, 6113, -6014, -5995, 6143, 5360, -6634, -5177, 6519, 4562, -6877, -4365, 6744, 3654, -6978, -3439, 6769, 3040, -6760, -2882, 6551, 2628, -6462, -2413, 6314, 2361, -6162, -2205, 6167, 2395, -5989, -2211, 6186, 2335, -6113, -2174, 6415, 2264, -6557, -1985, 6867, 1928, -6963, -1567, 7299, 1273, -7339, -888, 7479, 454, -7545, -52, 7475, -436, -7358, 845, 7093, -1271, -7040, 1502, 6570, -1907, -6344, 1823, 5953, -2146, -5728, 2110, 5303, -2184, -5216, 2033, 5012, -2068, -4934, 1928, 4881, -1838, -4921, 1838, 5051, -1832, -5192, 1924, 5364, -2042, -5330, 2438, 5583, -2639]
1311b639k877Q653K482r032j900R201J412r494o66R495kr430O38R228j283q895
1327e109J759Q481k177q027K461P533k746o987K798O481k720o164K647N877k438
1342A669n742K263N648k050n711J883N858j814o045J813O402k055o510K220O878
1357D707k707o992L228O947l668o865M267O775m878o401N289N931n600n539O065
1372E59M849o179m372O409L685o272l215O084K742n881k338N547K134n270k028
1387c546M983J928m714j971M475K142m416k323M364K577m486k746M657K906m998
1402a168k902N277K899n738k642O131K355o417j985O769J461o938q18O935L05
1417C524o945L01O697q11o438J259O064j483n686J757N340j954m782J838M493
$$ y = [-2639, -5516, 3137, 5619, -3413, -5313, 3888, 5300, -4194, -4860, 4635, 4633, -4797, -4159, 5069, 3786, -5109, -3350, 5131, 2954, -5073, -2612, 4921, 2175, -4812, -2014, 4467, 1747, -4417, -1770, 4107, 1669, -4073, -1810, 3838, 1788, -3923, -2040, 3818, 2004, -4041, -2228, 4174, 2119, -4391, -2171, 4707, 2000, -4992, -1764, 5183, 1515, -5350, -1083, 5692, 814, -5587, -298, 5633, 33, -5506, 559, 5408, -771, -5143, 1266, 4951, -1321, -4536, 1548, 4290, -1591, -3929, 1618, 3752, -1518, -3546, 1437, 3365, -1349, -3320, 1155, 3297, -1119, -3442, 922, 3499, -987, -3733, 924, 3830, -1168, -4070, 1207, 4106, -1632, -4274, 1857, 4212, -2205, -4190, 2579, 4040, -2898, -3716, 3219, 3524, -3421, -3120, 3577, 2766, -3672, -2413, 3651, 2168, -3518, -1761, 3579, 1625, -3157, -1319, 3174]
1432C174j899m157J756L846j513l726J330L641j139l780J019L900r28m089Q95
1447a670M378j017m659J250M872j595m943J839N050k259n017K665M956l140m782
1462d072L673M411l998l998M224L606m354l178M504K704m461k257M394J801m136
1477a137j579L917J375l636j283L401J240l192j241K960J378k771j599K856J662
1492B351k840j943L038J936l145k111L482K083l841j947M052J730m344j385M541
1507A657J170m759q38M860L17m796Q4M746m77m484P75M298j097m066J333L685
1523B408j368l424J453L181j439k843J357K606j185k551J045K527p92k620P58
1538h87K631p52k694O31K988p68l102P96L329r53l480J217L529j580l550J849
$$ y = [3174, 1275, -2882, -1126, 2720, 1207, -2519, -1189, 2452, 1313, -2467, -1448, 2452, 1524, -2565, -1670, 2708, 1691, -2968, -1718, 3154, 1559, -3384, -1545, 3505, 1246, -3771, -1106, 3850, 710, -4072, -399, 4012, 14, -3984, 240, 3846, -508, -3686, 818, 3522, -939, -3196, 1198, 2999, -1137, -2716, 1201, 2576, -1060, -2343, 1058, 2298, -894, -2135, 825, 2203, -568, -2167, 689, 2351, -489, -2432, 606, 2542, -603, -2714, 768, 2851, -990, -2937, 1115, 2845, -1499, -2884, 1657, 2827, -1932, -2770, 2090, 2407, -2389, -2305, 2441, 1964, -2520, -1745, 2553, 1456, -2610, -1277, 2408, 1040, -2384, -931, 2250, 811, -2032, -675, 1931, 746, -1805, -760, 1767, 975, -1645, -887, 1744, 992, -1702, -1071, 1917, 1149, -1953, -1157, 2172, 1219, -2261, -1044, 2485, 905, -2645, -796]
1554g96L609k244l415K481L188k770k955L035K626l190k304L274J958l276j633
1569b412L239J335k990j192K918Q94k672q24K502Q28k325q86K212Q63k052r88
1585a550K052J085j959j272K077J318k139j369K217J491k580j301K721J244k901
1600h66j112L098R51l303o39L314L68l388l4L272j96l246M03L184o22l071Q86
1617a001K759r65k564J048K261r52k107R08K017q74j872P32J840o40j843N60J919
1634A226n07k006N66K022n29k174O48K239p10k377R00K451j063k437J279K339
1650A867j468k245J568K241j764k123J986J794k042j573K088J367k049j252K129
1665E24R87k073q08J940O80j826o23J641O49j590n65J456O58j464o51J445O46
$$ y = [-796, 2813, 569, -2846, -365, 2823, 53, -2902, 133, 2759, -431, -2735, 539, 2497, -779, -2412, 827, 2162, -828, -2020, 898, 1792, -880, -1704, 798, 1626, -699, -1585, 627, 1490, -562, -1550, 502, 1587, -372, -1644, 433, 1751, -388, -1757, 460, 1951, -629, -1930, 791, 2035, -866, -1978, 1120, 2071, -1232, -1871, 1443, 1811, -1577, -1611, 1661, 1465, -1781, -1378, 1806, 1184, -1887, -1001, 1758, 793, -1771, -723, 1538, 586, -1521, -613, 1404, 530, -1342, -610, 1230, 590, -1253, -693, 1226, 719, -1287, -721, 1301, 772, -1402, -754, 1485, 775, -1602, -702, 1749, 686, -1751, -472, 1867, 399, -1846, -278, 1963, 199, -1924, 62, 1856, -186, -1759, 329, 1696, -353, -1605, 524, 1511, -562, -1370, 570, 1250, -576, -1199, 442, 1091, -499, -1064, 392, 1050, -414, -1065, 380, 1026]
1682A026j367p80J416Q64j548p91J572Q59j718q65J853P58j937o43K040M50k057
1699h68l54K224Q7k106J6K143k00k108L33J985l68j990N84J821o56j734P16J608
1717A133p91j407O93J385o76j262N96J256n63j247M81J222n09j191M28J309m74
1734C83j387O60J315n73j468P83J384p75j449R18J353r44j361J049J308j192j176
1751a172J249J097j367r45J367Q52j337p14J347N59j335m71J306M62j313l53J231
1768D63L25j172l41J170K64j081l36J066L20j059l62J123L50j199l24J285K72
1785G64j283k59J350Q6j334m2J369m4j357Q9J380j28j415L44J213k84j264L78
1803d37J262m68j174N03J155n30j109N33J071n84j102P41R38o61r53P53Q59p16
$$ y = [1026, -341, -1121, 295, 1159, -389, -1180, 392, 1251, -467, -1332, 521, 1279, -658, -1301, 739, 1189, -868, -1222, 1002, 1089, -1017, -1001, 1142, 942, -1166, -833, 1152, 784, -1206, -622, 1199, 543, -1191, -475, 1133, 342, -1065, -372, 1013, 337, -925, -329, 927, 364, -883, -402, 820, 311, -880, -452, 857, 383, -1004, -344, 971, 398, -1070, -287, 1097, 322, -1127, -209, 1144, 200, -1161, -112, 1196, 4, -1172, 77, 1174, -193, -1138, 229, 1081, -256, -970, 377, 936, -399, -870, 436, 898, -415, -768, 463, 788, -384, -725, 445, 709, -372, -708, 358, 678, -381, -743, 380, 730, -469, -793, 492, 764, -519, -778, 572, 658, -676, -718, 651, 607, -750, -661, 719, 591, -824, -480, 733, 449, -815, -437, 825, 357, -817, -314, 841, 311, -798, -265, 806, 222, -880, -139, 799, 138, -815, -62, 797, 81]
1821H1q47P19Q32p52p86P08Q65p89p85P54P49q27p64R32O86r01o61R40N76r37
1841b07n38R30N22j055l97R82M11r85m04J086L51j026l49J073L19j133j93R95
1859C82K38j097j04J061J92j158m6J039J9j040M8J042q0j113J31J110j65j111
1877f52K95J030l03j006K94J040l92j039M52R17m52q58M21R20n22p83M79P95m74
1896A62q56N08P94m90p74N32Q04o17p77O42P72o47q03O60Q81q42o92Q64O94r96
1916a81o48R93O23r85n18R92M08r82l57R93K86j009k17R94K00r92j15R11J21r11
1936c94j29R08O3q20j23Q84J12r27r7R38Q8r20j36J002P2r77j25J080n7j028Q3
1957e03J122j26j184J80J184k70j140M01J141n41r98N52R83o58r43P32Q50p35
$$ y = [81, -766, -47, 785, 33, -753, -45, 820, 31, -754, 0, 749, -78, -842, 90, 776, -125, -786, 154, 730, -207, -745, 185, 707, -348, -745, 237, 648, -337, -741, 345, 696, -330, -679, 394, 713, -420, -613, 382, 620, -477, -581, 480, 672, -486, -532, 507, 526, -514, -466, 576, 496, -617, -486, 624, 459, -652, -357, 673, 370, -636, -342, 698, 306, -733, -281, 636, 184, -674, -253, 667, 145, -638, -159, 636, 162, -694, -186, 608, 118, -656, -124, 680, 63, -714, -72, 700, 53, -750, -90, 791, -51, -743, 121, 815, -181, -829, 164, 787, -198, -716, 276, 684, -298, -655, 338, 624, -385, -602, 392, 592, -400, -515, 396, 517, -394, -523, 385, 448, -372, -495, 389, 501, -426, -523, 415, 503, -417, -553, 449, 521, -456, -581, 499, 442, -586, -503, 619, 493, -691, -511, 673, 403, -737, -336, 805, 264, -734, -182, 801, 143, -800, -68, 782, 47]
1975D7p78P49P08o71o97O43O50p21n60N98N79n52n93N86O34o23o24N68O58n83
1995A8p22O79P16p56o75Q45O76q68p12R60O74j135n29J097N16j188l86J201K93
2014G04j157k22J191Q3j212P3J175j52j010J26R34j35r23J13Q91n2q78J28Q18
2033D95j27p90OQ50mq66rR07O0r72QJ021j09j083J50J166k69j186K98J308m73
2054C81j242N51J210o87j203Q05J108r21r61R43R29j016p23J021O57j075n48R11
2072A40N02q69m09Q10L96p27l57O18M74o76n05O47N30n95n53O64N89p26o88Q59
2092A24O40r34o76J019P24j190n48J197N36j347m43J441K89j472j56J415N4j335
2110f62N1J302j36j338L37J175l21j117L93R71m71q36L69Q13k55p68J83P96j65
$$ y = [47, -731, 18, 726, 55, -642, 1, 651, -70, -630, -32, 547, -5, -598, -12, 622, -1, -625, -57, 601, 18, -704, -25, 691, -65, -740, 105, 781, -87, -799, 161, 835, -300, -829, 268, 784, -404, -790, 411, 704, -453, -675, 516, 599, -613, -540, 635, 483, -527, -401, 533, 398, -525, -412, 479, 427, -451, -323, 495, 368, -422, -416, 434, 430, -436, -445, 462, 522, -450, -442, 579, 470, -613, -463, 703, 434, -752, -454, 854, 381, -861, -310, 900, 213, -990, -185, 923, 2, -959, -16, 913, -103, -826, 195, 852, -223, -771, 140, 642, -227, -636, 174, 570, -157, -514, 104, 578, -98, -603, 44, 574, -21, -574, 90, 679, -47, -735, 124, 764, -170, -846, 173, 897, -293, -841, 356, 892, -455, -898, 543, 832, -640, -796, 619, 673, -662, -611, 691, 555, -783, -446, 729, 408, -709, -316, 655, 184, -652, -283, 530, 275, -493, -310, 486, 321]
2129C21p97J00Q03K1r46J10Q93L8j187R7J203j40j260L22J295m34j371O06J367
2148A041p43j266Q15J157r48j074J001J037j126q81J124P91j237n91J220M24j082
2165c38l93J001L59r56k56P71L55p71l73P65M23o62n35O32O52p88n90P99P51r36
2185i0p62J032O99j078p72J254P15j389n64J496M27j563l35J681J48j658KJ575
2203H18j40j483L02J347l55j324M78J184n38j080N18J063n27q58M52P53l67p95
2221e52K32Q68k00q76J06R48n3j087P1J219j45j307K57J315k69j375L83J466o08
2240C93j426P42J404r02j317J035J206j154j085J157J030j241q26J296O50j286
2256c24n20J201M34j009n02R61M25r74k49P16N16p93n19P62N58p34o98Q16P19
$$ y = [321, -476, -376, 427, 448, -498, -388, 505, 543, -644, -547, 656, 516, -744, -422, 873, 439, -932, -326, 1041, 298, -968, -153, 1004, 56, -1018, -17, 1020, -106, -987, 137, 928, -309, -900, 320, 744, -338, -731, 270, 629, -327, -583, 188, 543, -228, -601, 164, 587, -75, -610, 22, 674, -114, -704, 95, 846, -90, -852, 180, 879, -199, -971, 283, 998, -391, -955, 541, 968, -595, -930, 751, 899, -759, -757, 818, 678, -805, -503, 844, 489, -835, -357, 827, 289, -791, -273, 790, 263, -595, -143, 610, 243, -552, -320, 548, 348, -528, -422, 526, 473, -614, -543, 676, 531, -776, -519, 796, 527, -848, -465, 1001, 393, -1033, -291, 1113, 211, -1106, -71, 1135, -19, -1104, 53, 1083, -158, -984, 312, 962, -324, -844, 357, 791, -218, -720, 241, 666, -308, -557, 159, 675, -118, -637, 125, 683, -51, -749, 67, 786]
2275G86r17p30R23Q01j053p18J073Q26j334p04J396O30j524m47J598L07j637j65
2293h89J601O6j556N8J490j49j476L73J328m70j165M85J089m57j025M45R85m70
2311B63q91L68Q17k29q78J64Q70l4r89R5J046j49j031J35J081j47j250K33J370
2330H44l74j359N10J340o66j328P87J271r53j172J027J108j144r03J180Q26j186
2347a92o71J059O94j153n29J084M17j003l93R63L76q50m49Q48L61o74n19P47O16
2366G32q29o06Q03O81r30o02Q94P01j043o76J181O01j302m98J393L68j367l24
2384h23J416J89j417r3J410j22j359K08J279k54j152K45J201l36j069L80R44l63
2402B84q85K75R02k83r16K87R21k42q82K09Q99j89r65J01J157j57j196K26J202
$$ y = [786, -131, -861, 62, 863, -190, -908, 165, 991, -343, -1047, 349, 979, -545, -992, 606, 913, -724, -889, 712, 778, -778, -720, 770, 621, -855, -482, 846, 376, -789, -304, 785, 328, -697, -252, 733, 263, -628, -260, 557, 328, -550, -386, 484, 450, -539, -444, 602, 453, -578, -443, 638, 491, -759, -526, 844, 470, -889, -379, 961, 295, -1033, -246, 1025, 72, -1100, -73, 1035, -109, -1012, 168, 994, -192, -863, 196, 890, -263, -792, 292, 709, -294, -687, 276, 652, -198, -647, 201, 562, -112, -631, 116, 732, -97, -703, 100, 781, -149, -751, 143, 844, -199, -875, 306, 907, -395, -893, 500, 868, -499, -823, 593, 782, -635, -728, 682, 560, -799, -591, 688, 434, -718, -473, 728, 392, -677, -297, 647, 284, -601, -326, 576, 293, -623, -336, 585, 343, -539, -330, 569, 380, -585, -484, 673, 516, -680, -454, 748]
2421G48l55j170L90J208m58j273N72J288p37j171P99J132r18j018R55R85j027
2438e0q85J081P07j076o33J064N25r36n12Q95M85r61l64Q68M64q66m81Q57M29
2457F11p54n55Q22N51q44n46Q89N57r41n75J032N54j053n12J122M76j282l67J301
2476D86L27j389j19J250J56j285r1J355l9j253O8J209j74j136K45J084k70j039
2494f15K26R74k04r52K10Q92j92r39K04R03j64r73K55R33j98j081K48J076j94
2513D09j116K70J209m07j071M33J077n26j069N66J075o85r61O72R61p46r36Q26
2531a9Q41q57p91R11O82q12p17Q62O36p46p27Q33O30q17n89P58N88p35o76Q33
2551H8O24q26n80P74O41q95n30Q56N33q89n39R28N42r77n07J011M24j026l28J019
$$ y = [748, 393, -777, -387, 821, 363, -910, -338, 950, 213, -958, -159, 973, 55, -963, -8, 977, -50, -935, 146, 853, -223, -856, 208, 733, -203, -715, 180, 665, -296, -660, 208, 672, -194, -675, 182, 611, -143, -698, 124, 675, -169, -715, 174, 731, -210, -785, 247, 801, -252, -764, 358, 834, -448, -815, 486, 813, -576, -695, 555, 711, -574, -665, 690, 651, -602, -534, 675, 501, -635, -390, 694, 424, -615, -389, 585, 381, -571, -361, 531, 339, -600, -396, 507, 343, -630, -375, 558, 360, -721, -473, 603, 409, -707, -437, 772, 365, -706, -273, 804, 278, -791, -225, 850, 165, -796, -124, 837, 91, -845, -19, 822, -35, -826, 85, 767, -45, -762, 100, 736, -10, -737, 96, 726, -91, -680, 78, 666, -69, -745, 88, 712, -114, -694, 80, 721, -174, -704, 152, 685, -204, -743, 185, 727, -250, -757, 254, 678, -348, -676, 343]
2571C43L69j157j91J024K59j103k21J160L8r97m7R70R2j037M3R22j3q97m3R54
2591D68M7j048K0J002o8r24J5R71m7j001J44R59j45j015J65J081k41r78K14J005
2611F24k97r91L77R48l77r77M63Q86m69r08N66P77n29p45N46P25n86o77N03P82
2631F41o06o11M78P54o17o65O01O14n26p10O01P06o46n92N87O50o85n89P25N98
2651G08q01n46P75N27p88n08P93M06p82m23Q95L05q38k73Q13L01q30k99R19J08
2671D62q08j88Q53J65q59j14P47J91p51k47R01J05q23j10Q39Q1q55m9R26j26p62
2692d22M3Q64o5q51M2Q97j26q17J17Q52j95q55K35P80k59p99L02Q31l53p21L11
2713a89O49l04o04L26O02l01o61K81O67l03o62L22O65l32p22L77O89l66o36L58
$$ y = [343, 712, -445, -636, 388, 647, -456, -677, 483, 521, -476, -523, 447, 539, -498, -455, 467, 454, -443, -486, 468, 515, -533, -513, 489, 421, -503, -488, 483, 436, -565, -421, 538, 393, -622, -457, 624, 383, -595, -381, 624, 327, -664, -287, 661, 284, -693, -230, 656, 187, -721, -155, 622, 93, -652, -106, 619, 33, -644, -141, 641, 35, -576, -98, 656, 39, -626, -25, 589, 63, -647, -46, 660, 14, -578, 9, 659, -26, -615, 110, 708, -93, -639, 136, 663, -125, -633, 160, 566, -216, -639, 256, 561, -277, -550, 263, 564, -266, -565, 354, 462, -346, -534, 319, 484, -375, -489, 258, 449, -302, -549, 352, 457, -366, -476, 363, 444, -411, -460, 466, 340, -422, -379, 485, 420, -431, -389, 508, 382, -435, -318, 534, 339, -516, -281, 499, 240, -559, -257, 574, 221, -500, -189, 460, 156, -448, -122, 480, 179, -482, -201, 466, 163, -499, -177, 488, 156, -566, -189, 500, 134, -502, -144]
2733a44P72n83n87M75O53o03o22N79O50n88n38N67N95p43m25O66M34o98m33P53
2753A80L32o63k76O10K88o99k47O70L35p09k79O70K15n86l00O52K14n78k13O09
2773B25K21p19j97O98J80o91j71P01J65p01j54P61J27q04l2P33O0q53J02P82j39
2794B94p53J83P31k27o73J59P15j89o42J57O64k21n81K33N24k06n22J42N86j02
2814B72o51J56O32k14n52J76O36j94o77K57O04k87o22K69O76l62o35L76O33m56
2834C7o49N43N61n13n35N38M64m70m47N57L71n42l94N83K88m79k82M85K52m42
2854g4l22M46L72m98l35M91K94m40l59M88L63m71m35N88L24n76k80N84L05o45
2874a80k57O24L04p43j41N56K77p25j69P72k3n72o5O59no87J06N69q3m83N1M98
$$ y = [-144, 628, 45, -542, -67, 586, -17, -639, -60, 590, 2, -536, 31, 626, -117, -542, 124, 558, -140, -573, 180, 512, -151, -427, 183, 471, -228, -475, 195, 530, -179, -458, 212, 427, -159, -459, 193, 407, -171, -384, 225, 446, -273, -470, 228, 408, -283, -454, 247, 412, -289, -443, 318, 445, -359, -391, 342, 402, -451, -349, 433, 294, -459, -276, 455, 228, -445, -286, 429, 240, -402, -245, 419, 198, -383, -150, 374, 168, -354, -212, 374, 272, -379, -223, 409, 195, -357, -181, 455, 261, -416, -159, 445, 158, -464, -195, 481, 119, -516, -140, 493, 37, -612, -69, 492, -21, -556, -18, 446, -24, -471, 86, 457, -85, -479, 104, 392, -87, -369, 116, 368, -74, -396, 50, 422, -76, -411, 80, 374, -66, -425, 63, 426, -45, -480, 108, 432, -144, -424, 160, 465, -180, -437, 187, 491, -252, -393, 163, 440, -285, -454, 318, 295, -277, -342, 317, 312, -375, -269, 300, 217, -266, -215, 283]
2896B83r4n17J13N03q6m52J0M85n4m58K6N09j8n60P6M74M1n93P5N27p3n09J02
2919a90N64j63n90K36N88k45n62J90O81l99n11L24M65l65l77L09M22l51l82L65
2939IL74l77l40L88K31l53k13K98K67l31j73K33K78l08k84L19K55l01l75L60L74
2960C31l27l87M23L10m26l49N03K91m84l08N67K46n68j42M26K68o38p1N29J22
2980C16m95m4N15q6m44P3L50j4l79K3L73k0l50K2L36J7l90J9L53Jl71l9M22K2
3004B10l73n5L70P3m71o7N17%m53lN68j08n20J78M81j88n17K12M76k58l94K52
3026g0L85l02l37K60L22k39l10L43K30l64j74K05K58k60j27K26J69j68l06K06
3046e3K27j17k39J71K55k47k61K01K99k41k58K59K65k94l25M23K32l73k85M27
$$ y = [283, 189, -328, -215, 288, 202, -250, -240, 245, 191, -267, -241, 268, 250, -310, -234, 240, 281, -312, -237, 290, 217, -292, -190, 374, 211, -379, -143, 445, 200, -362, -172, 509, 110, -401, -77, 388, 23, -354, -45, 377, 26, -356, 9, 383, 6, -334, 54, 285, -68, -281, 17, 284, -47, -220, 13, 291, -17, -301, 18, 273, -28, -403, -43, 331, 4, -383, 40, 350, -76, -425, 78, 369, -115, -423, 144, 390, -178, -320, 106, 374, -264, -335, 194, 316, -179, -223, 292, 206, -238, -165, 185, 171, -208, -185, 188, 168, -182, -160, 176, 193, -197, -178, 175, 176, -195, -234, 188, 210, -163, -218, 152, 225, -246, -313, 204, 204, -249, -252, 316, 208, -312, -134, 347, 159, -358, -146, 330, 72, -322, -70, 315, 13, -324, -64, 258, 19, -291, 52, 282, -82, -256, -51, 207, -53, -180, 46, 215, 47, -259, -53, 174, 57, -182, -11, 244, -3, -264, -63, 236, -5, -263, -4, 261, -33, -358, 65, 297, -76, -361, 66]
3066F6J81l91j62L82J57m34r0M59L5m19l1L88J6l50J6L89n9l44R5K41M2l19oK94
3090A56j7k92J0L20o1k50n1L38J9k89n6L76O5m69NL61Ql75O8L76n8n01J73M01
$$ y = [66, 247, -144, -306, 76, 233, -201, -291, 168, 203, -216, -247, 141, 157, -193, -177, 212, 153, -191, -96, 145, 187, -132, -138, 156, 139, -153, -143, 177, 116, -134, -185, 153, 172, -117, -173, 203, 268, -201, -196, 165, 173, -202, -134, 242, 184, -317, -144, 257]
$$ [...]
8191i
##END NTUPLES=NMR FID
##END=
