##TITLE=1H_2PBDP2910
 CDCl3, 8 sc, 
 30.10.2020
##JCAMPDX= 6.0         $$ Bruker NMR JCAMP-DX V2.0
##DATA TYPE= NMR FID
##DATA CLASS= NTUPLES
##ORIGIN= UXNMR, Bruker Analytische Messtechnik GmbH
##OWNER= root
$$ XWIN-NMR		Version 3.5
$$ Fri Oct 30 10:41:50 2020 Russian Standard Time (UT+4h)  she@DPX200
##.OBSERVE FREQUENCY= 200.1315066352
##.OBSERVE NUCLEUS= ^1H
##.DELAY= (6, 6)
##.ACQUISITION MODE= SIMULTANEOUS
##.ACQUISITION SCHEME= undefined
##.AVERAGES= 8
##.DIGITISER RES= 18
##SPECTROMETER/DATA SYSTEM= spect
##.PULSE SEQUENCE= zg30
##.SOLVENT NAME= CDCl3
##.SHIFT REFERENCE= (INTERNAL, CDCl3, 0, 15.7039)
##AUDIT TRAIL= $$ (NUMBER, WHEN, WHO, WHERE, WHAT)
$$ ##TITLE= Audit trail, XWIN-NMR		Version 3.5
$$ ##JCAMPDX= 5.01
$$ ##ORIGIN= Bruker BioSpin GmbH
$$ ##OWNER= she
$$ F:/spectra/data/she/nmr/H-F/1/audita.txt
$$ ##AUDIT TRAIL=  $$ (NUMBER, WHEN, WHO, WHERE, WHAT)
(   1,<2020-10-30 10:40:24.50 +0400>,<she>,<DPX200>,
      <created by zg, POWCHK disabled, PULCHK disabled
       configuration hash MD5:
       00 E9 B6 7A A2 85 ED C7 34 08 36 98 17 FE 4E 26
       data hash MD5: 16K
       3D D2 21 16 A2 2D 8F 69 2E 8D 55 81 A9 DC FF 62>)
$$ ##END=
$$ 
$$ hash MD5
$$ A8 D2 C1 13 E2 57 CE 34 97 E0 7C 79 40 A8 24 7C
##$RELAX= 
##$RELAX= 
##$RELAX= 
##$RELAX= 
##$RELAX= 
##$RELAX= 
$$ Bruker specific parameters
$$ --------------------------
##$DU= <F:/spectra>
##$EXPNO= 1
##$NAME= <H-F>
##$PROCNO= 1
##$TYPE= <nmr>
##$USER= <she>
##$AMP= (0..31)
100 100 100 100 100 100 100 100 100 100 100 100 100 100 100 100 100 100 
100 100 100 100 100 100 100 100 100 100 100 100 100 100 
##$AQSEQ= 0
##$AQ_mod= 1
##$AUNM= <au_zg>
##$AUTOPOS= <>
##$BF1= 200.13
##$BF2= 200.13
##$BF3= 200.13
##$BF4= 200.13
##$BF5= 200.13
##$BF6= 200.13
##$BF7= 200.13
##$BF8= 200.13
##$BYTORDA= 1
##$CFDGTYP= 0
##$CFRGTYP= 5
##$CHEMSTR= <none>
##$CNST= (0..31)
1 1 145 1 1 1 1 1 1 1 1 1 1 1 1 1 1 1 1 1 1 1 1 1 1 1 1 1 1 1 1 1 
##$CPDPRG= <>
##$CPDPRG1= <>
##$CPDPRG2= <>
##$CPDPRG3= <>
##$CPDPRG4= <mlev>
##$CPDPRG5= <mlev>
##$CPDPRG6= <mlev>
##$CPDPRG7= <mlev>
##$CPDPRG8= <mlev>
##$CPDPRGB= <>
##$CPDPRGT= <>
##$D= (0..31)
0 1.2 0 0 0 0 0 0 0 0.06 0 0.03 0 0 0 0 0.0002 0 0 0 0 0 0 0 0 0 0 0 0 
0 0 0 
##$DATE= 1604040023
##$DBL= (0..7)
120 120 120 120 120 120 120 120 
##$DBP= (0..7)
150 150 150 150 150 150 150 150 
##$DBP07= 0
##$DBPNAM0= <>
##$DBPNAM1= <>
##$DBPNAM2= <>
##$DBPNAM3= <>
##$DBPNAM4= <>
##$DBPNAM5= <>
##$DBPNAM6= <>
##$DBPNAM7= <>
##$DBPOAL= (0..7)
0.5 0.5 0.5 0.5 0.5 0.5 0.5 0.5 
##$DBPOFFS= (0..7)
0 0 0 0 0 0 0 0 
##$DE= 6
##$DECBNUC= <off>
##$DECIM= 32
##$DECNUC= <off>
##$DECSTAT= 4
##$DIGMOD= 1
##$DIGTYP= 9
##$DL= (0..7)
0 120 120 120 120 120 120 120 
##$DP= (0..7)
150 150 150 150 150 150 150 150 
##$DP07= 0
##$DPNAME0= <>
##$DPNAME1= <>
##$DPNAME2= <>
##$DPNAME3= <>
##$DPNAME4= <>
##$DPNAME5= <>
##$DPNAME6= <>
##$DPNAME7= <>
##$DPOAL= (0..7)
0.5 0.5 0.5 0.5 0.5 0.5 0.5 0.5 
##$DPOFFS= (0..7)
0 0 0 0 0 0 0 0 
##$DQDMODE= 0
##$DR= 18
##$DS= 0
##$DSLIST= <SSSSSSSSSSSSSSS>
$$ [...]
##$SUBNAM2= <"">
##$SUBNAM3= <"">
##$SUBNAM4= <"">
##$SUBNAM5= <"">
##$SUBNAM6= <"">
##$SUBNAM7= <"">
##$SUBNAM8= <"">
##$SUBNAM9= <"">
##$SW= 16.880792210976
##$SWIBOX= (0..15)
0 0 2 0 0 0 0 0 0 0 0 0 0 0 0 0 
##$SW_h= 3378.37837837838
##$TD= 16384
##$TD0= 1
##$TE= 0
##$TE2= 300
##$TE3= 300
##$TEG= 300
##$TL= (0..7)
0 120 120 120 120 120 120 120 
##$TP= (0..7)
150 150 150 150 150 150 150 150 
##$TP07= 0
##$TPNAME0= <>
##$TPNAME1= <>
##$TPNAME2= <>
##$TPNAME3= <>
##$TPNAME4= <>
##$TPNAME5= <>
##$TPNAME6= <>
##$TPNAME7= <>
##$TPOAL= (0..7)
0.5 0.5 0.5 0.5 0.5 0.5 0.5 0.5 
##$TPOFFS= (0..7)
0 0 0 0 0 0 0 0 
##$TUNHIN= 0
##$TUNHOUT= 0
##$TUNXOUT= 0
##$USERA1= <user>
##$USERA2= <user>
##$USERA3= <user>
##$USERA4= <user>
##$USERA5= <user>
##$V9= 5
##$VALIST= <valist>
##$VCLIST= <CCCCCCCCCCCCCCC>
##$VD= 0
##$VDLIST= <DDDDDDDDDDDDDDD>
##$VPLIST= <PPPPPPPPPPPPPPP>
##$VTLIST= <TTTTTTTTTTTTTTT>
##$WBST= 1024
##$WBSW= 4
##$XGAIN= (0..3)
0 0 0 0 
##$XL= 0
##$YL= 0
##$YMAX_a= 345562
##$YMIN_a= -340066
##$ZGOPTNS= <>
##$ZL1= 120
##$ZL2= 120
##$ZL3= 120
##$ZL4= 120
##$ABSF1= 10
##$ABSF2= 0
##$ABSG= 5
##$ABSL= 3
##$ALPHA= 0
##$AQORDER= 0
##$ASSFAC= 0
##$ASSFACI= 0
##$ASSFACX= 0
##$ASSWID= 0
##$AUNMP= <proc_1d>
##$AZFE= 0.1
##$AZFW= 0.1
##$BCFW= 1
##$BC_mod= 2
##$BYTORDP= 1
##$COROFFS= 0
##$CY= 11.3945322036743
##$DATMOD= 1
##$DC= 2
##$DFILT= <>
##$DTYPP= 0
##$F1P= 15.9154993809931
##$F2P= -4.1035820241983
##$FCOR= 0.5
##$FTSIZE= 0
##$FT_mod= 4
##$GAMMA= 1
##$GB= 0.15
##$INTBC= 1
##$INTSCL= 1
##$ISEN= 128
##$LB= 0.24
##$LEV0= 0
##$LPBIN= 0
##$MAXI= 10000
##$MC2= 0
##$MEAN= 0
##$ME_mod= 0
##$MI= 1.114404
##$NCOEF= 0
##$NC_proc= 0
##$NLEV= 6
##$NOISF1= 3.799351
##$NOISF2= 2.8
##$NSP= 1
##$NTH_PI= 0
##$NZP= 0
##$OFFSET= 15.70392
##$PC= 1
##$PHC0= -10845.09
##$PHC1= 10.60088
##$PH_mod= 1
##$PKNL= yes
##$PPARMOD= 0
##$PSCAL= 0
##$PSIGN= 0
##$REVERSE= no
##$SF= 200.130013532006
##$SI= 16384
##$SIGF1= 3
##$SIGF2= 2
##$SINO= 400
##$SIOLD= 16384
##$SREGLST= <1H.CDCl3>
##$SSB= 0
##$STSI= 0
##$STSR= 0
##$SW_p= 3612.71676300578
##$SYMM= 0
##$S_DEV= 0
##$TDeff= 0
##$TDoff= 0
##$TI= <>
##$TILT= no
##$TM1= 0
##$TM2= 0
##$TOPLEV= 0
##$USERP1= <user>
##$USERP2= <user>
##$USERP3= <user>
##$USERP4= <user>
##$USERP5= <user>
##$WDW= 1
##$XDIM= 8192
##$YMAX_p= 0
##$YMIN_p= 0
$$ End of Bruker specific parameters
$$ ---------------------------------
##NTUPLES= NMR FID
##VAR_NAME=  TIME,          FID/REAL,        FID/IMAG
##SYMBOL=    X,             R,               I
##VAR_TYPE=  INDEPENDENT,   DEPENDENT,       DEPENDENT
##VAR_FORM=  AFFN,          ASDF,            ASDF
##VAR_DIM=   8192,          8192,            8192
##UNITS=     SECONDS,       ARBITRARY UNITS, ARBITRARY UNITS
##FACTOR=    0.000296,      1,               1
##FIRST=     0,             0,               0
##LAST=      2.424536,      0,               0
##MIN=       0,             -340066,         0
##MAX=       2.424536,      345562,          0
$$ Real data points
##PAGE= N=1
##DATA TABLE= (X++(R..R)), XYDATA
0 0 0 0 0 0 0 0 0 0 0 8 -8 8 -8 16 -16 24 -24 32 -40 48 -64 72 -88 104 -120 143 -166 192 -222 256 -294 334
32 334 -381 434 -490 553 -623 697 -783 874 -973 1084 -1202 1334 -1477 1632 -1802 1987
48 1987 -2191 2413 -2660 2927 -3224 3556 -3923 4335 -4802 5331 -5941 6653 -7494 8506
62 8506 -9753 11334 -13413 16289 -20571 27767 -43308 155870 -59277 204841 224866 -70589
74 -70589 345562 32338 127460 225416 62468 126209 43713 107932 99024 16672 106471 -5299
86 -5299 80712 41642 -17550 44453 -16119 28056 -47493 -43144 53376 -81235 12480 -33534
98 -33534 -101452 44506 -101100 -88417 14201 -92161 -23716 -60215 -102180 -29058 -71368
109 -71368 -73461 -71866 -55129 -42127 -73465 -53202 -67616 -40348 -42047 -68492 -26534 -50385 -30251
122 -30251 -32976 -61734 1253 -33162 -41612 -8620 -37969 -8429 -18492 -34834 -5129 -13556 -13988
135 -13988 -25243 -21773 1593 -20521 -22450 -9818 -17687 -8103 -14742 -28404 -10663 -2052 -21268
148 -21268 -21740 -514 -19416 -20243 -3238 -35568 -5365 3535 -46618 -3187 -8528 -34939 -4020
161 -4020 -27951 -14130 -5262 -26219 -18683 -30990 1292 -15458 -42383 12332 -25783 -25730 9589
174 9589 -44252 -7139 11421 -36173 -11915 1034 -15044 -14981 1861 -14715 -15400 16798 -27695
187 -27695 -16323 21467 -23023 -3818 6552 -15682 4298 -2216 -9200 -3906 7687 2005 -18016
200 -18016 10255 3055 -14975 12954 -3953 -8931 18950 -5605 -14009 17581 -15 -11321 13255
213 13255 -2629 -6394 13441 -5910 -5963 14039 -1374 -5568 5425 1377 -188 218 1846 932
227 932 506 5823 -4372 -2293 12701 -5058 -5464 11081 -4223 -86 8426 -7001 4174 9615
241 9615 -8181 577 5218 -2780 2103 -2210 874 3838 -3717 2462 -2332 -1897 8764 -7985 -3756
256 -3756 12859 -8780 -1665 10376 -13986 5176 10515 -18912 8179 9385 -14317 9686 845
269 845 -8400 9252 -3474 -4379 4134 2883 646 -5706 5391 2662 -8665 8918 429 -7668
283 -7668 16369 -1938 -8976 19366 -2745 -7016 18317 -6585 -2662 17806 -8967 390 14780
296 14780 -6488 1681 6879 -4635 3012 4008 -1869 653 2214 2053 -5150 -249 7695 -6624 1007
311 1007 8884 -10514 4811 8298 -14643 9683 7029 -15048 11482 1617 -12452 12688 -1916
324 -1916 -9960 9480 -3759 -6363 4237 -3928 -422 2008 -4122 1 -776 118 1158 -5752 5265
339 5265 3687 -9394 8120 2105 -7770 13406 -2328 -7156 16174 -5795 -4435 14216 -8602
352 -8602 2259 10566 -11057 4753 6516 -6257 4378 -34 907 4551 -3774 3902 1470 -539
366 -539 6679 -4324 1153 10407 -6380 -27 10560 -7297 3824 8736 -12545 7954 7121 -13017
380 -13017 8213 225 -6529 7626 -6236 -1111 2650 -2537 1977 -6416 4250 1913 -8828 6765
394 6765 -1877 -3980 6945 -4264 -2498 6264 -983 -5596 5729 1862 -8145 8055 -2124 -6832
408 -6832 12067 -7809 -2529 8394 -8472 3828 -689 -3927 5737 -6893 4373 632 -6885
421 -6885 11780 -7007 -2670 12819 -10678 1868 8553 -8618 4530 4264 -6641 4916 5465
434 5465 -5496 2199 7175 -3640 1240 4719 -3637 4455 3392 -3008 4101 2487 2546 -705 1108
449 1108 8124 -4979 3719 6448 -8421 12731 1087 -10652 15876 -2365 -4973 9062 -4883
462 -4883 3177 5350 -4270 -1559 5024 2685 -7243 3037 3176 -3509 3678 -3740 -1835 3121 -491
477 -491 -4041 -3751 9398 -6314 -4731 9657 -11919 6706 2791 -16580 14258 -1517 -8369 6674
491 6674 -6767 5958 162 -7490 4201 -807 4534 -3704 -5119 7878 607 -2757 -2977 3574
505 3574 1640 -924 2407 -8703 10030 4518 -15644 12777 -1450 -4164 11946 -15055 7375
518 7375 8910 -13755 7888 -3593 2579 7521 -15157 7797 3786 -5786 5328 -10169 4147
531 4147 8343 -9882 -2688 2115 3856 -4742 -3756 257 -3437 8602 -9265 -8759 13409 -8052
545 -8052 -3510 1080 -7259 7536 -5221 -6085 1290 -1093 3633 -12667 327 8098 -10313 2558
559 2558 -4220 -3873 9596 -8232 -7086 3467 4155 -4708 -7034 5430 -4207 3200 591 -14855
573 -14855 12832 1934 -11446 5628 -2970 3016 257 -5439 2982 -437 5510 -6627 -3248 12925
587 12925 -7973 -642 4869 -4685 7945 -1101 -6481 4764 6144 -3298 -5380 7166 -108 1129
601 1129 2092 -9010 10041 4016 -8962 4385 -793 4271 1038 -7159 6829 -497 -130 1368
615 1368 -6991 8001 1597 -8008 4692 7 -1315 1833 -5757 933 5230 -4255 -3687 1408 1151
630 1151 -788 -3924 -2234 2894 504 -4384 -1896 1136 1164 -200 -5605 322 5193 -6167 177
645 177 2457 -4531 6927 -3013 -6239 9631 -2458 -2776 4909 -2073 2731 1358 -2465 2166 2902
660 2902 1803 -2696 1638 5710 -1746 129 3638 -332 2493 3332 -4566 2789 8352 -6871 1337
675 1337 7999 -7071 5203 3330 -8103 9271 602 -7084 6109 370 -1719 1272 -245 -301
689 -301 433 1260 -4397 198 5376 -4882 -2700 3596 -1710 -2009 1631 -3098 -2057 6235 -6290 -5614
705 -5614 9532 -5830 -3790 5810 -8154 2189 4080 -9317 3019 2876 -4286 157 -1619 635
719 635 769 -979 -372 -1346 3027 -78 -4033 2795 2440 -1397 -105 803 420 1615 1368 -2800 2624
736 2624 4086 -4371 1711 2727 -682 3567 -1846 69 3466 -902 1845 -872 993 4737 -3962
751 -3962 702 3561 -2709 3248 279 -3768 4676 662 -4351 2994 1185 -2243 1679 -1346 -1488
766 -1488 2430 -781 -2219 301 1173 -1539 -2639 2099 -987 -2164 3257 -4208 -1772 5287 -5587
781 -5587 -1807 5071 -5385 -626 3665 -6361 1431 4557 -7010 737 3417 -5412 1776 1276 -3941
796 -3941 2968 283 -2647 415 1165 824 -2321 1990 1179 -3164 4314 -729 -3269 6605 -1690 -3293
812 -3293 5909 -1582 -1306 5391 -2369 -1292 5922 -2741 -1804 5847 -2142 198 3831 -3201 1508 2811
828 2811 -1966 479 973 1085 -639 -733 2260 -1603 716 1753 -4084 2001 2255 -4534 1510 1630 -3343
845 -3343 1810 -92 -3530 2360 215 -3116 1169 -265 -1101 524 -2062 400 166 -1712 1005 -2720
861 -2720 459 2905 -5649 1640 2750 -5983 3706 -480 -5034 6031 -2429 -3122 4341 -2540 -149
876 -149 1029 -1613 938 -262 1071 -900 -904 3455 -1959 -1287 3227 -1245 -1069 3294 -1189 -1831 5654
893 5654 -2767 -2949 7623 -4520 -1343 7006 -5807 1728 4766 -5595 2366 2080 -2465 932 765
908 765 160 -1321 1673 91 -2939 2878 -426 -2954 2429 -354 -2603 1500 971 -3697 856 2087
924 2087 -5602 2746 1589 -6804 5350 -782 -5951 5173 -3081 -2102 3390 -3808 279 556 -1612
939 -1612 17 -1473 1941 -1559 -1805 2629 -2265 102 1336 -1740 493 1726 -865 -2499 4138
954 4138 11 -3172 5386 -3633 486 6297 -7005 3634 3201 -3478 4736 -3372 2186 3559 -3407
969 -3407 4446 -2255 1881 4176 -5744 4747 1847 -2099 3259 -1503 1546 1417 743 -1210 -198
984 -198 6043 -5032 446 4390 -5051 5870 -2185 -4569 7199 -2812 -454 -361 -776 4048 -4811
999 -4811 801 -71 -2042 4946 -5795 -1415 4629 -3519 -1263 -113 -585 -636 355 -2132 -3116 5465
1015 5465 -3072 -4711 4843 -3146 307 626 -4175 3674 99 -1746 -1773 11 4992 -4643 -524 3781
1031 3781 -3599 4267 -1624 -4793 7201 -484 -3401 2093 798 828 370 8 -922 2999 1587 -4209
1047 -4209 2453 2931 -1007 -53 -290 2423 -276 188 248 -2417 6668 -2191 -5867 7699 -2501 -1413
1063 -1413 3668 -6050 3598 2856 -5701 871 1077 840 -1806 -1946 1999 -1787 1424 -1499 -3379 4742
1079 4742 -1386 -3403 1195 508 -169 -1810 315 -1074 784 1957 -6147 2621 3839 -6104 2274
1094 2274 -229 -1829 4239 -3289 -1744 3205 222 -1314 -1460 2181 815 -1154 870 -1306 1551
1109 1551 2136 -2821 -73 2968 -108 -2103 1783 836 -938 2642 -2449 -515 4808 -3225 -930
1124 -930 3121 -1228 1283 -514 -1613 2368 218 -1037 -867 575 2061 -2105 -1350 2194 -1087 -505
1140 -505 767 -2882 1455 1915 -4803 819 2521 -4039 903 172 -3353 3130 -1395 -3736 2701 -771
1156 -771 -1686 -427 -1377 1430 -1511 -1454 564 -1959 2033 -1066 -4042 3944 -400 -3822 2661 -1067
1172 -1067 -1515 3253 -2859 -1978 4917 -2138 -2698 3867 -1510 -339 2565 -3147 1462 2774 -2260 196
1188 196 1099 1582 -181 -1100 2636 -458 675 2085 -3334 2830 3370 -4496 1920 2866 -2438 2239
1204 2239 530 -2750 3667 979 -3958 2500 1565 -2024 1061 -463 -364 1589 -780 -1323 130 1490
1220 1490 -693 -2561 1588 53 -1942 1106 -1940 -811 2646 -2835 -2284 2783 -1272 -1910 977
1235 977 -1898 91 1307 -3178 -321 1639 -1453 -626 -764 186 638 -1604 288 -543 -183 1836 -2611
1252 -2611 -279 2844 -2231 -150 1420 -1677 1619 762 -2481 1521 1888 -1607 219 1208 -356 824
1268 824 155 -619 1209 924 -106 -528 961 1364 -1495 796 1294 -1778 2538 47 -2809 3745 -268
1285 -268 -2385 3026 -912 -885 2319 -1737 -730 2202 -548 -1375 1051 215 -1280 721 -81 -1262
1301 -1262 1005 204 -1840 118 1312 -1968 -414 1793 -2682 441 1703 -3902 1476 1666 -3655
1316 -3655 1629 305 -2152 1655 -456 -1427 936 571 -1172 -462 1137 -552 -248 1268 -1000 64
1332 64 1598 -1077 -525 1909 132 -923 1743 -226 -849 2746 -998 -748 3302 -1045 -415 2087
1348 2087 -842 1026 1210 -734 1054 755 644 -201 88 2100 -294 32 1441 -845 931 1463 -1532
1365 -1532 562 2154 -1275 -420 1684 -1433 741 1498 -2666 1299 847 -1931 1076 -738 309 355
1381 355 -1580 1120 -1600 225 1442 -3525 1979 612 -3511 2195 -932 -1806 2187 -1247 -1778 1598
1397 1598 -143 -2174 1458 -118 -1734 2348 -1436 -1104 2252 -1319 859 -132 -246 1709 -1882 2117
1413 2117 -161 -1745 4374 -2491 -288 3688 -3280 1906 1825 -2707 2219 995 -1211 627 1123 -637
1429 -637 186 1774 -1960 897 1696 -2573 1573 198 -943 1390 -1691 766 -8 -1085 1439 -2605
1445 -2605 1058 1306 -3828 1812 -373 -2157 2238 -2381 -1381 2129 -1684 -1335 621 -702 -457 229
1461 229 -1594 -724 1246 -1466 -652 281 -683 787 -1867 -221 1065 -2033 1355 -1124 -1357 3141
1477 3141 -2879 -625 2535 -2290 1147 -73 -1840 2153 -71 -1088 209 759 628 -734 -108 389
1493 389 798 357 -560 23 913 1339 -1577 -34 2762 -1731 768 1029 -2148 3355 -382 -2410 3103
1510 3103 -286 -448 667 -705 1260 284 -298 -607 461 1870 -1834 -577 1446 -397 187 -691
1526 -691 -513 713 540 -1204 -1768 2252 -290 -2442 1699 -1557 -231 2000 -3672 533 1995 -2585
1542 -2585 225 -331 -537 872 -1347 -427 227 195 47 -1804 735 1312 -1605 -4 686 -350 932
1559 932 -20 -1548 1787 1373 -2238 1344 1256 -927 1973 -670 -329 2834 -889 172 1158 31 1591
1576 1591 -812 450 1891 -835 1334 -62 -419 2697 -1085 -826 2310 -531 -261 695 -815 780
1592 780 939 -1572 -415 1437 -755 -678 -23 -520 645 -880 -1079 194 -281 214 -1571 -817 1487
1609 1487 -1967 -898 519 -1564 879 -604 -2429 1190 198 -1946 -308 83 -524 -8 -829 -1213
1625 -1213 1083 204 -1802 -4 477 -196 -350 -654 504 213 112 -537 -761 1892 -162 -1512 1501
1642 1501 -56 -230 1033 -1409 526 1755 -1310 -190 1164 38 72 46 -53 767 354 -598 -233 683
1660 683 714 -945 -326 1219 -467 -287 464 -1108 980 521 -2320 890 876 -1543 419 -292 -661 915
1678 915 -923 -1092 805 -14 -868 -630 78 388 -737 -577 105 -378 447 -556 -1602 1799 178 -2174
1696 -2174 1309 -234 -672 1628 -1782 -124 2325 -1465 -398 976 -45 736 -250 -301 869 689
1712 689 111 -513 605 1541 -375 -580 1235 355 246 934 -974 797 2037 -1877 292 1915 -923
1729 -923 1073 58 -1091 2083 90 -1117 816 338 532 -175 -663 906 209 -77 -83 -657 1009 371
1747 371 -1515 550 789 -1055 562 -395 -1036 1653 -777 -1550 1348 -492 -649 562 -1194 402
1763 402 570 -1307 -93 -24 16 -127 -1108 458 74 -918 453 -733 -346 1191 -1284 -602 1285 -924
1781 -924 -349 882 -1294 363 1080 -1742 537 917 -1142 661 -140 -555 947 -406 -77 225 -40
1798 -40 688 -833 285 881 -931 842 169 -962 1356 -26 -1039 1183 206 -848 977 -110
1814 -110 -783 1432 -375 -899 1304 -470 -246 540 -619 385 -4 -161 -47 -469 991 -554 -728
1831 -728 1173 -900 -39 794 -1404 413 701 -1171 36 567 -633 -90 324 -721 110 526 -898
1848 -898 -49 430 -369 -99 -89 205 -191 -59 414 -905 744 590 -1457 1000 282 -831 1217 -384
1866 -384 -361 1258 -234 -193 486 420 -23 187 559 -314 637 590 -434 621 369 60 113 432 444 -528 985
1887 985 39 -817 1755 -821 -528 1790 -1307 249 896 -1249 644 218 -695 145 35 -37 -392 10
1905 10 -185 -503 319 -249 -589 -53 118 -638 -379 496 -1285 219 654 -1992 999 173 -1656 1364
1923 1364 -820 -899 1243 -995 -75 347 -405 151 -300 404 -57 -328 621 -393 63 766 -573 8
1941 8 987 -231 -296 957 -294 33 1201 -1029 127 1525 -926 320 615 -551 855 30 -367
1958 -367 455 341 256 -488 260 750 -647 316 191 -595 717 -125 -914 724 376 -1035 158 406 -748
1977 -748 451 -194 -1277 1234 -76 -1485 627 -276 -141 74 -1039 251 -72 -131 -227 -1115 1212 -125
1995 -125 -1516 1110 -528 -442 1217 -1574 -88 1604 -1255 -399 1002 -588 163 470 -1019 725
2011 725 718 -913 173 424 427 10 -591 838 171 -117 711 -1173 832 1323 -1798 733 1021 -995 981
2030 981 -24 -854 1461 65 -1035 856 371 -543 314 -37 -211 634 -347 -302 334 117 -19 -651 327
2049 327 371 -926 402 -96 -777 1160 -887 -988 1400 -767 -858 761 -734 -239 479 -986 -272 753
2067 753 -738 -525 501 -337 -173 -3 -376 200 -48 -111 -236 -47 849 -806 -253 1236 -877 296
2085 296 625 -1219 1198 484 -1301 978 448 -364 476 -41 173 543 138 -217 308 771 -193 -310 707
2104 707 156 -220 499 -137 -79 1063 -535 -620 1381 -353 -592 929 -569 255 632 -1049 249 661
2122 661 -478 -336 22 258 -113 -296 -5 -281 295 70 -1031 392 671 -1129 -179 513 -703 297
2140 297 12 -1233 939 358 -1444 406 337 -529 350 -489 -267 720 -143 -543 -44 682 34 -750 380
2159 380 338 -122 431 -419 -175 1362 -329 -892 1197 232 -462 752 -463 78 1380 -982 -407 1254
2177 1254 -78 -137 65 -21 500 110 -186 -207 442 642 -988 -159 1097 -568 -52 253 -842 862 370
2196 370 -1463 493 786 -880 101 36 -489 697 -182 -915 524 215 -455 -315 -33 333 -469 -143 -3
2215 -3 -485 729 -465 -1165 1129 -157 -968 718 -465 -284 826 -1028 -346 978 -554 -420 499
2232 499 -199 102 94 -458 227 257 -20 -264 -186 833 -226 -490 945 -361 95 791 -996 619 1052
2251 1052 -1119 389 682 -638 667 141 -598 879 267 -650 425 253 -112 163 -173 173 265 -63
2269 -63 14 -406 477 353 -1057 532 279 -895 765 -454 -748 1301 -728 -716 850 -593 -155 343
2287 343 -762 -82 334 -515 -371 156 -7 -222 -208 -40 -106 -62 127 -446 -216 795 -727 -249 879 -842
2307 -842 351 509 -1105 762 466 -789 497 177 -143 413 50 -111 328 410 -129 -75 492 226 26
2326 26 255 244 -119 573 271 -646 841 316 -857 979 -97 -438 1201 -639 -228 900 -504 -65
2344 -65 334 -172 107 -24 -40 -80 32 313 -472 -128 499 -465 -249 377 -521 -34 583 -951 -128 770 -1018
2365 -1018 115 340 -958 553 82 -848 402 -75 -297 7 -276 97 -168 8 115 -567 436 24
2383 24 -647 558 -1 -499 592 -72 -500 723 -39 -523 819 1 -435 734 -238 -70 694 -341
2401 -341 29 406 20 137 -98 257 189 -59 499 -308 3 741 -495 -13 492 -359 125 380 -583 82
2421 82 572 -654 3 363 -571 146 30 -600 296 -130 -350 28 -186 190 -500 -154 362 -655 171 14
2441 14 -825 717 -197 -909 676 -179 -328 418 -537 -35 541 -335 -324 192 129 -24 -119 54 97 31 255
2462 255 -238 15 620 -381 -137 767 -309 -54 609 -649 435 671 -882 456 558 -421 404 -20
2480 -20 -154 547 -20 -215 77 364 80 -345 128 110 -145 108 -155 -267 364 82 -676 336 301 -667 423
2501 423 -136 -597 753 -517 -534 705 -384 -260 134 -284 57 -90 -289 -74 8 81 -289 -114 324 -104
2521 -104 -367 161 -116 -218 455 -493 -161 799 -621 -74 516 -569 308 133 -504 473 -1 -199 106
2540 106 -16 231 -296 -13 334 -258 230 22 -295 418 112 -447 301 299 -302 308 120 -318 548 -36 -507
2561 -507 614 -48 -232 297 -71 229 81 -208 169 -17 258 -98 -319 536 -164 -336 462 -310 -117 403
2581 403 -583 -117 604 -573 -236 512 -495 23 247 -689 313 159 -600 238 -54 -100 75 -415 256
2600 256 -30 -232 291 -520 251 334 -805 321 440 -604 336 61 -410 738 -111 -613 815 40 -395
2619 -395 480 -187 211 481 -499 183 350 7 174 -275 380 447 -429 255 116 -55 658 -441 -99 901
2639 901 -291 -241 466 -192 180 214 -572 285 524 -384 -158 93 13 133 -382 -114 212 -48 -120 -416 68
2660 68 456 -595 -273 275 -335 147 -128 -528 519 105 -708 -10 159 -77 -68 -202 -27 316 -57 -388
2680 -388 -16 434 107 -396 127 177 -46 182 -234 -112 740 -192 -387 590 41 6 214 -310 321 427 -350
2701 -350 -8 392 206 -46 -116 287 153 135 26 -254 372 301 -471 18 449 -246 61 8 -381 476 75
2722 75 -649 351 176 -332 150 -218 -41 218 -327 -112 59 73 -96 -402 58 80 -317 0 -245 -141 319
2743 319 -336 -368 375 -129 -272 158 -296 -67 322 -472 -63 358 -288 45 10 -72 245 -34 -27 136 30 240
2765 240 -193 -60 420 -143 14 279 -138 185 326 -329 163 387 -330 192 222 -304 398 107 -358 396
2785 396 66 -136 191 -154 158 -19 -57 208 -313 263 84 -456 420 -27 -380 428 -220 -339 400 -290
2805 -290 -292 369 -287 -222 317 -340 -108 218 -306 -77 9 -99 -92 -259 77 -57 -239 228 -481 -87 386 -572
2827 -572 76 290 -475 206 115 -428 302 124 -341 197 107 -171 187 97 -156 247 17 -26 93 50 208 -95
2849 -95 99 252 -210 260 199 -335 484 43 -384 503 -60 -191 478 -226 -113 485 -209 -115 234 -191 105
2870 105 67 -219 74 15 0 -16 -262 196 11 -383 367 -244 -252 468 -565 -68 417 -615 92 161 -548 234
2892 234 -37 -327 214 -112 -129 -61 -48 97 -184 -70 107 -122 136 26 -307 236 180 -306 230 62 -259
2913 -259 453 -10 -305 521 2 -231 363 -122 90 300 -82 33 179 172 -92 63 345 -66 77 223 -154
2934 -154 154 194 -206 31 373 -108 -163 351 -187 -1 299 -462 51 409 -434 77 110 -236 168 -91 -192
2955 -192 52 52 -8 -265 64 121 -285 91 51 -268 156 -89 -365 247 19 -484 237 62 -378 285 -195 -270
2977 -270 434 -262 -181 225 -52 47 -139 17 95 -100 162 -229 -122 495 -300 -55 375 -233 80 251 -274
2998 -274 201 319 -234 45 331 -74 78 177 -85 244 129 -96 82 168 136 -209 52 293 -225 156 95
3019 95 -362 449 4 -502 339 -29 -254 248 -148 -151 230 -169 -195 189 -116 -122 2 -56 -40 -140 -49 -62 -282
3042 -282 172 -127 -324 405 -276 -307 513 -482 -60 360 -474 90 214 -428 142 131 -275 127 -12 -111 79
3063 79 22 43 78 5 127 -96 27 338 -252 138 439 -351 281 261 -449 506 171 -547 530 66 -174 419
3085 419 -178 -29 366 -121 -92 151 118 16 -87 93 28 -52 129 -202 -86 359 -222 -320 347 -172 -259 248
3107 248 -413 -70 407 -524 -156 410 -389 -58 -17 -318 184 -25 -366 -17 178 -63 -341 -10 155 -84
3127 -84 -27 -43 -175 263 19 -444 208 297 -220 83 95 -175 373 -63 -338 429 164 -287 25 46 218 106
3149 106 -61 50 175 278 -164 -166 414 102 -169 179 -28 145 264 -288 -33 476 -77 -247 207 -4 84
3170 84 121 -312 50 290 -126 -272 -8 258 -162 -195 84 -151 112 30 -521 169 310 -543 56 103 -263 225
3192 225 -123 -434 340 80 -438 61 115 -179 92 -200 -93 173 41 -180 -96 281 119 -315 228 -10 -146
3213 -146 424 -337 -195 616 -276 -133 454 -249 92 238 -252 119 351 -307 17 302 -109 76 34 -49 179
3234 179 38 65 10 91 283 -253 48 335 -326 237 193 -368 381 114 -294 283 62 -192 188 -50 -206
3255 -206 209 -40 -205 136 -22 -90 -2 35 57 -153 -27 -34 -267 169 -134 -285 277 -151 -217 251 -204 -92
3277 -92 264 -193 -72 174 -158 -53 169 -32 -123 130 15 -163 39 65 -62 32 174 -128 30 300 -225
3298 -225 114 358 -355 209 286 -414 284 165 -282 293 59 -114 205 16 -4 42 42 1 -84 188 2 -207
3320 -207 272 -32 -215 289 -119 -196 475 -175 -281 423 -238 -130 308 -396 -8 235 -359 -25 79 -112
3340 -112 50 -131 18 -66 -117 34 -233 23 144 -304 42 110 -293 68 73 -343 138 67 -348 133 113 -194
3362 -194 290 -5 -158 249 -13 -162 156 -25 54 -35 -30 120 -52 144 42 -165 285 3 -194 298 12
3383 12 -145 290 -82 -178 328 -147 -167 338 -173 -20 252 -188 137 31 -173 66 -58 120 -25 -223 294
3404 294 -164 -111 260 -381 46 222 -518 119 217 -315 134 33 -304 201 61 -322 104 25 -166 29 -86
3425 -86 10 -42 -51 -70 -148 116 47 -397 269 42 -305 351 -226 -180 376 -240 -107 306 -40 -18 131 -100 54
3448 54 221 -35 -20 248 89 -84 88 6 112 -3 92 -68 43 275 -213 20 352 -250 72 193 -273
3469 -273 265 141 -273 200 122 -124 47 39 -31 120 -12 -168 98 62 -74 -136 -17 120 -133 19 6 -194
3491 -194 236 -20 -307 303 -88 -257 231 -278 -48 245 -182 -66 128 -70 -45 20 -15 -74 -11 39 -52 0 150
3514 150 -55 0 243 -63 -11 180 -224 31 305 -249 83 262 -168 198 111 -144 193 68 -40 20 24 26 24
3537 24 85 81 -38 150 15 -137 137 20 -63 100 -84 -77 152 -48 -235 249 -69 -193 137 -147 -84 113 -100
3560 -100 -81 79 -67 -119 -66 65 -39 -183 61 -141 -48 140 -312 -2 158 -260 -56 70 -240 71 39 -225
3582 -225 94 135 -161 52 18 -38 86 -28 -19 102 41 17 -93 126 200 -108 97 164 -124 221 -82 -175 370
3605 370 -38 -142 265 21 28 158 -129 30 153 -13 -77 87 102 50 -73 15 143 -50 53 -120 -16 243
3627 243 -232 -168 285 -100 7 74 -308 195 141 -306 63 77 -106 38 -97 -89 102 -73 -162 -43 57 13 -146
3650 -146 -163 194 -56 -73 20 -172 236 55 -368 131 104 -139 116 -175 -36 300 -127 -185 160 15 3 -36
3672 -36 -11 115 23 -100 45 86 171 23 -127 232 116 -164 195 -77 -31 291 -256 -36 339 -206 70 61 -125
3695 -125 233 -21 -166 62 35 -8 -74 -74 118 -79 -54 -7 -102 12 45 -178 -24 130 -223 41 39 -253 140 -111
3719 -111 -289 257 -56 -129 105 -149 -28 64 -102 -25 2 -12 -7 -67 39 -58 -100 17 -50 -16 157 -64 -86 208
3743 208 -66 -83 216 -152 71 230 -165 157 163 -131 120 -51 -30 71 -41 77 69 5 148 -66 46 98 -117
3766 -117 71 113 -114 109 93 -133 108 83 -141 116 -51 -138 139 -90 -90 39 -62 54 -104 -109 12 -118 52
3789 52 -46 -187 136 1 -121 120 -114 -13 64 -156 -85 173 -94 -69 72 -31 -60 17 -95 24 94 -28 -3
3812 -3 -25 125 -22 -17 94 -97 69 165 -212 78 189 -202 125 113 -82 207 -36 -159 224 93 -124 105
3834 105 34 -41 118 -42 69 95 59 79 -40 103 108 -141 196 24 -138 231 -137 -31 257 -194 -56 113
3856 113 -148 71 65 -200 31 63 -91 -18 -87 -23 22 -36 -98 -5 -48 38 -134 -85 172 -125 -83 81 -158 96 37
3881 37 -246 95 3 -77 43 2 16 59 -60 26 46 34 -11 -30 81 39 -21 30 10 4 80 41 -75 136 95 -150 153
3908 153 -23 -57 246 -75 -55 195 -76 28 79 -49 41 -42 16 34 38 86 -50 59 140 -65 -77 113 -92 -4
3932 -4 73 -232 2 175 -244 -17 57 -234 25 -76 -251 137 -76 -160 -29 -92 47 -34 -90 42 -53 16 0 -143
3956 -143 134 -9 -167 69 21 -60 120 -100 -125 216 -80 -153 169 -7 4 158 -100 88 182 -40 21 18 56
3979 56 65 -80 22 62 -6 134 -78 -1 212 -73 -18 114 -8 -6 85 -94 53 114 -97 -7 49 -44 18 -28 -44 58
4005 58 -49 8 -117 -68 4 -161 -53 37 -90 48 -60 -209 133 -22 -155 40 -60 -96 62 -125 -82 55
4027 55 15 -111 3 15 -27 18 20 -7 -3 123 -90 -20 106 -27 -33 113 -136 23 194 -168 40 157 -102 43
4051 43 88 -20 56 26 -19 100 139 27 -27 91 84 -61 43 -19 -18 133 58 -142 91 162 -134 65 -14 -140 211
4076 211 -116 -163 193 -6 -30 74 -76 58 104 -62 -58 53 50 -80 -89 67 -21 -84 -1 -57 -32 122 -197 -116 154
4101 154 -136 -96 111 -119 64 10 -238 71 95 -88 -17 5 -30 24 -68 16 2 7 60 -120 68 101 -74 9 69
4126 69 -37 149 49 -90 148 89 -107 76 0 -73 87 -94 -8 131 -10 -36 -41 45 3 -44 6 -24 -7 128 -145
4151 -145 -20 142 -73 -84 76 -38 -3 82 -162 -16 118 -98 -59 118 -55 6 -4 -78 3 18 -61 -110 -2 141
4175 141 -135 9 80 -129 50 10 -171 96 -41 -185 80 31 -102 49 8 -139 111 6 -81 96 20 -27
4197 -27 -1 6 97 35 32 30 -20 219 12 -96 183 -51 -36 165 -87 33 133 -84 18 145 -88 -14 108 -33
4221 -33 64 37 -26 33 3 -18 -12 -70 24 -52 -33 32 -156 26 37 -195 81 -14 -160 152 -14 -90 63 13 -147 -16
4247 -16 -7 -99 51 -2 -132 15 -14 -117 -21 -52 21 -51 -9 -61 -86 117 -44 -92 125 -52 -45 126 -95 -7 87 -129
4273 -129 -3 95 34 -5 26 -6 -8 78 13 9 71 97 20 33 129 -13 41 82 -143 93 143 -192 95 56 -65 65 23
4300 23 -78 145 -36 -61 -39 -28 -4 -7 51 -35 -12 -15 -33 -79 81 -24 -108 52 30 -102 50 -77 -139 124 -125 -135
4326 -135 190 -93 -69 42 -94 69 44 -84 -68 39 15 -65 -35 -7 -42 52 -58 -17 56 61 -64 9 116 -55 16
4351 16 96 -107 144 99 -173 114 101 -96 107 -40 23 122 8 -16 -5 52 8 -43 90 77 -13 85 22 -44 122
4376 122 -32 -94 70 7 -86 34 -76 -3 76 -143 -70 61 -37 -15 -77 12 -23 -87 24 -48 14 134 -194 -47 48
4401 48 -97 -32 -37 -60 74 28 -89 -15 49 -104 -36 -27 -52 36 -24 -114 -22 24 -29 -30 -23 53 -83 55 45 -26 85 4 -59
4430 -59 135 -2 -108 101 -12 -27 210 -12 -51 106 14 -43 87 -39 28 124 -7 29 35 31 -30 -39 53 46 -77 73
4456 73 -113 20 125 -156 30 48 -164 81 7 -135 73 -46 -136 95 -3 -62 2 -24 11 47 11 -19 -34 96
4480 96 20 -117 58 28 -72 78 -51 -53 145 -42 -79 125 -58 32 51 -85 14 73 -74 21 31 -21 21 15 66 41
4506 41 29 47 -52 77 75 -92 32 119 -33 35 119 -88 101 62 -103 38 69 -42 95 24 -68 15 6 16 -29 3
4532 3 28 -83 3 -8 -53 17 -64 -99 84 -10 -120 75 -19 -60 79 -92 -64 113 -88 -42 6 -44 23 18 -25 12 -40
4559 -40 9 -29 -69 132 -79 20 89 -74 -11 64 -109 55 92 -113 11 76 -98 44 31 -127 86 28 -146 111
4583 111 6 15 -15 -42 38 12 -22 32 -57 6 104 -56 78 76 -32 89 6 -57 97 -21 -60 64 61 -32 25 -92 8
4610 8 89 -47 -24 -19 -20 -4 -55 -14 -48 -47 -18 -57 -30 83 -109 -78 85 -50 -46 32 -66 6 78 -88 -40 -1 -18 1 -23 29
4640 29 4 -12 -20 47 43 6 -73 -18 75 -96 9 19 -104 116 -9 -71 125 -79 -68 17 41 -42 60 15 -36 94 -21
4667 -21 2 30 13 6 30 24 6 -6 70 -10 -4 104 -61 -7 88 -105 49 116 -68 70 -19 -10 19 21 -29 -6 -3 -33 -32 23 -26
4698 -26 -43 -5 -1 -30 -62 -39 -89 -34 29 -81 66 32 -70 23 -60 -96 130 -93 -64 -1 -56 1 11 -30 -5 10 7 -24 -29
4727 -29 67 34 -4 61 52 -29 75 0 -34 115 -17 -20 121 -6 54 54 -83 92 53 -38 105 -40 57 -34 0 62 21
4754 21 52 54 -84 48 44 -34 39 69 -30 39 20 -88 19 81 -89 42 -18 -77 98 -116 -9 86 -33 -23 4 -2 30
4781 30 -70 -37 -85 -49 46 -40 -41 -18 23 -57 37 5 -23 84 -87 -54 60 -34 -8 60 32 54 31 -39 75 35 36 -17 -37
4810 -37 66 -4 -37 24 -43 24 55 -58 44 38 -90 18 9 -41 90 45 -32 33 34 -39 73 -25 14 -3 -30 17 -46 17
4838 17 -29 -30 64 -18 -17 42 -85 -13 42 -15 -1 82 -49 -37 4 22 37 20 -81 -21 36 -6 -33 42 -26 -34 -41 -50 -29 -2 -21
4869 -21 -70 -52 26 -76 -9 47 -51 -6 3 -11 77 78 -47 -18 20 35 13 34 -8 39 38 -18 -1 26 66 9 -17 32 -50 58
4899 58 8 -82 82 21 -50 64 -91 9 -3 -82 14 42 5 -19 -10 15 -24 -36 27 -14 -31 48 -79 15 56 -59 -36 45
4927 45 -68 -2 22 -60 50 19 -69 36 8 -41 26 -48 -34 22 -37 -55 -13 -41 39 -35 -7 -1 -25 26 -94 13 28 -23
4955 -23 -46 37 10 -22 44 -10 70 91 9 -6 67 -38 34 15 12 54 22 -47 52 -11 53 6 28 35 -24 21 60 -90 42 39
4985 39 -75 26 50 -41 -13 -19 -69 -39 -19 -53 -2 -26 33 -18 -4 0 4 -32 -10 -40 68 -34 -50 10 -44 8 57 -73 -95
5014 -95 18 -81 -18 -3 -23 -15 -38 -60 -30 25 29 -8 23 -18 42 -29 30 34 -17 132 -19 32 120 18 9 55 -41 36 43 -72
5044 -72 43 54 -48 -19 26 -7 10 -16 34 25 19 28 -36 -12 8 19 -35 53 -25 16 -29 -102 24 16 -45 35 -2 -40 40 -48 19
5075 19 22 18 -4 15 24 -7 -16 -18 -35 34 -30 7 -32 33 17 -27 -39 -89 -53 -29 -30 -53 27 -92 34 -6 -27 39 -50 -61 -6 5
5107 5 -62 2 6 6 51 -3 19 -6 67 -32 -12 -6 110 15 12 -11 -62 28 6 -70 89 0 -22 8 -45 5 -3 -38 -9 -1 -35 -46 14
5140 14 19 -2 -15 -2 -8 -26 -10 -22 -49 46 -24 -61 146 -38 44 37 -44 -2 19 -4 40 -75 41 -3 -53 37 21 -15 -37 -50
5170 -50 -2 62 -50 10 -21 -37 15 44 -52 25 25 -57 49 -28 14 98 -10 42 59 43 1 -22 40 10 35 26 18 40 20 -14
5200 -14 17 79 -87 39 49 -19 11 8 -60 7 139 -59 -10 -4 -27 85 6 -77 -34 36 -2 12 -41 -9 -53 6 -12 -71 -42
5229 -42 -24 -42 46 1 -98 5 -10 -43 58 31 -49 7 -19 -43 -10 -35 -24 50 -51 -50 -29 26 9 -111 2 52 -12 80
5257 80 -6 -18 43 -39 -10 -12 -27 25 13 4 41 -12 -3 -2 38 31 21 -12 23 -9 40 38 -37 34 105 -23 26 48 -51 48 -49 -40 91
5290 91 74 -105 116 2 -31 10 -44 -21 -8 3 -1 28 34 -15 -42 -14 -31 -49 -39 -39 -46 41 -28 -50 53 -9 -56 14 -49 29
5320 29 26 -40 -44 56 -36 29 20 -25 18 12 23 -4 33 -4 -55 10 66 -26 -13 4 13 -16 20 -8 -6 70 -34 76 -19 10 91 -40
5352 -40 -6 79 30 56 -14 41 -7 -9 -11 -3 7 84 16 -40 37 -40 -24 34 -22 -21 11 -90 -33 55 -16 -74 -17 -78 -23 27 -27 -26
5384 -26 2 -6 -6 -70 44 17 -18 -33 -25 53 -8 -43 -10 22 -41 37 38 -66 74 10 -41 45 26 -16 21 12 -15 75 22 -11 67
5415 67 40 3 -24 -2 -8 -63 0 5 35 41 -31 -37 79 -52 -9 65 12 -27 97 -83 -15 39 6 27 72 -12 48 -15 -19 -59 -38
5446 -38 8 -54 -8 -42 -53 -27 -2 -68 24 -24 -111 -16 -33 -53 -10 -53 -47 52 -5 -20 27 39 -17 -13 -22 -20 -9 -24 -46 -47 45 -22 -21
5479 -21 51 29 -26 30 -10 22 21 10 -53 -21 -8 0 45 -23 22 24 -3 -35 -38 13 10 -10 16 -83 -12 15 -77 -14 37 -55 23 -8 7
5512 7 75 -6 -40 27 1 -52 21 30 -9 48 -38 -28 50 43 -46 42 -28 -83 -54 -29 -23 -45 -23 -52 -52 2 2 -44 -6 -24 -12 43 -61
5545 -61 -50 -7 -16 -35 -10 -25 -15 -82 5 -5 45 -3 -36 75 21 4 -8 91 30 -3 31 4 70 52 -32 26 8 -32 33 -73
5575 -73 43 1 22 -31 -58 33 -3 -57 -4 -38 -5 43 -33 -8 29 3 -12 21 8 -10 16 -41 -70 72 -36 -9 89 -64
5603 -64 37 17 -56 19 12 -20 -2 37 51 -55 -16 52 -33 -41 -7 -55 -11 -9 -75 7 -15 -10 -28 -41 -38 29 -4 -35 11 41 -13 25
5635 25 11 54 17 26 32 -26 49 63 9 79 17 -26 21 -34 -37 17 -10 -26 33 -10 -11 -58 -15 -2 67 -4 24 14 -33 -1 59 -17
5667 -17 -13 -19 11 -42 1 4 -47 -13 28 -51 59 65 -88 -5 5 -68 1 17 -46 -28 -37 -20 -32 5 -38 4 -1 -27 -54 2 4 -71 2
5700 2 36 -15 32 -51 -5 77 -46 -40 47 -65 20 -4 43 -28 30 44 -8 33 33 -1 55 62 -19 27 28 5 -49 18 -9 39 23 -11
5732 -11 23 116 -87 -13 -28 5 15 -53 -38 24 17 -38 -49 10 -9 -27 -14 -68 -37 4 31 -13 17 11 8 36 38 -18 68 -28 -49 36
5764 36 3 -17 -2 28 38 9 -11 57 -3 -9 -34 7 34 -10 -26 2 -15 -17 -4 -40 16 49 -2 2 14 -3 48 38 -55 42 51 39
5796 39 49 -17 1 48 19 74 -4 47 68 -38 56 -47 10 -12 -20 -50 -11 56 -16 5 18 15 -6 -12 -52 -13 -57 -2 3 -38 -48
5827 -48 -25 -26 13 -2 3 23 -33 19 -17 -29 69 -10 -16 44 -31 73 -17 5 17 28 -20 21 -44 -30 -23 19 -1 102 40 18 20 -11
5859 -11 55 32 -18 24 -11 6 -21 -52 15 38 -25 6 71 12 36 -10 27 48 32 -21 13 36 24 27 -12 29 50 -7 22 -16 20
5890 20 -20 -33 55 -2 36 -2 -13 10 18 -26 -52 1 -36 2 -9 -61 -4 -26 0 -62 33 44 13 -57 -11 -13 -25 11 -16 -22 24 6
5922 6 13 38 -9 -14 6 -25 64 19 -27 57 -37 -7 10 -7 13 34 -24 32 -15 16 -37 -20 51 -24 -13 78 35 -3 59 37 -22 69
5954 69 -32 22 3 -54 -28 36 9 12 1 25 27 17 -13 6 19 -1 -20 2 33 11 32 4 -54 -11 25 -47 7 -4 -65 48
5984 48 18 -14 72 -4 -84 -13 -65 12 -57 4 30 -23 35 -43 28 -12 -7 2 43 0 -17 54 20 46 39 -31 -92 66 -1 -12 22
6015 22 -46 26 61 -31 30 51 -39 31 13 53 -2 -2 57 -72 27 52 -68 15 69 -68 55 -20 -2 -8 85 -62 20 40 -56
6044 -56 -10 39 -40 -10 -11 -25 32 -13 -19 -20 48 -13 18 -41 -37 -46 52 -81 -19 -10 -20 -26 -5 -41 6 71 -55 5 15 4 4 24 -57
6077 -57 -5 -24 -27 -2 4 11 -27 3 45 -33 43 17 2 17 7 17 41 18 18 -12 42 4 -23 16 -57 15 -64 -38 -16 -15 33 12 -1
6110 -1 68 22 12 13 -106 16 17 -45 37 -45 11 48 -1 14 57 -44 9 -5 -1 -55 -1 -53 -81 19 -15 -4 -6 11 5 -59 -43
6141 -43 -6 -26 -6 -56 29 54 -46 51 8 -8 78 21 -54 2 -1 54 -62 6 33 -36 29 28 72 35 1 14 48 31 -32 17
6171 17 -49 -25 22 -34 -36 51 7 -59 68 -24 30 65 8 -18 2 -14 14 -23 20 -22 28 -2 -62 13 -15 23 -12 32 38 23 17
6202 17 -4 20 13 -55 17 23 -65 30 66 -50 16 -13 22 -16 -26 -46 7 5 -54 -6 1 36 32 14 25 -73 -18 -14 -2 25 -19 -6 34
6235 34 -12 -15 -9 5 26 22 -3 101 6 29 18 -27 43 29 -5 91 -45 54 7 -10 1 32 -5 -22 40 -33 33 -67 15 26
6265 26 -40 -46 -1 21 -11 -56 52 4 5 36 -23 -9 6 8 -28 19 39 -24 42 -48 52 15 0 3 55 5 14 1 -33 19 2 -41
6297 -41 -57 42 16 -40 -44 -3 -4 -25 -29 -20 12 25 6 -22 60 8 13 71 1 -1 49 -3 9 75 -4 -23 11 21 12 -7 58 -18 20 -9
6331 -9 -6 -6 34 46 53 59 -7 23 45 -95 -36 -36 -38 26 -5 -48 62 -50 -41 32 26 -14 1 54 8 17 -18 -25 -43 74 -54 -56 79
6364 79 -10 -4 8 38 -39 30 -12 -39 7 -22 17 -46 -11 -29 0 -15 -81 -56 12 -17 27 1 -6 -39 40 -21 21 26 23 38 100 -18
6396 -18 20 3 7 78 20 5 -3 54 13 -11 -21 9 11 -11 52 -47 -3 -33 -26 6 -18 -31 12 -31 -24 23 -22 15 -7 -35 -15 -3 -9
6429 -9 -14 -41 -46 -15 44 -18 2 86 -53 -35 -20 -48 -55 17 8 -8 27 28 -24 48 40 -80 25 28 -49 24 37 -16 -7 22 -73 3 -46
6462 -46 -23 50 13 -18 -11 33 -4 49 24 -2 6 64 -11 -37 25 3 1 41 -47 30 17 0 -9 7 -4 -3 0 77 -15 -40 -69 4 9 26
6496 26 -24 -40 -35 -42 -10 -3 -79 28 47 -41 -67 6 -50 12 -58 -3 18 3 12 26 -3 4 -30 -39 30 0 23 25 30 37 5 -13 48 9
6530 9 32 40 -49 -5 89 -40 -12 60 -56 12 -67 16 2 16 -18 -36 49 25 9 2 1 0 5 19 -15 9 70 -19 13 43 -41 57
6562 57 -1 -24 18 8 1 18 31 21 -28 -24 40 -21 -19 -31 -39 18 -31 -27 29 -22 -9 -8 -30 -45 25 -42 -40 -13 -72 -15 9 -35 -27 15
6596 15 -12 14 66 9 41 59 -9 11 6 19 -19 13 22 5 39 9 -25 -9 -62 -20 -50 -12 27 1 15 -66 -17 0 26 17 91 7
6628 7 37 10 23 -31 10 21 6 -8 23 -2 47 44 -28 -12 4 -59 41 -27 -30 -8 -4 -47 13 -29 -6 -14 -21 7 75 -43 27 8
6660 8 -22 -27 -53 33 -39 -52 20 -11 45 -27 -43 7 13 -25 8 19 12 -9 28 -5 -6 1 -52 40 8 28 30 54 -10 1 29 73 -27
6693 -27 11 -41 -47 48 17 -30 11 48 2 1 13 34 38 33 15 -36 -27 -14 55 37 -23 4 -20 -9 28 46 -53 6 51 -14 -22 88 34
6726 34 27 30 -68 -7 4 -34 -4 16 -39 -22 -6 10 5 -38 -23 -9 -36 -57 11 7 -37 -65 7 -18 -42 10 -51 -17 34 -4 3 74 -12
6759 -12 -4 107 -47 -30 50 30 31 2 -36 5 22 41 6 -7 25 12 -16 -49 -7 -47 44 -75 -16 8 1 42 57 -18 -38 9
6789 9 -35 11 -29 -30 -22 8 -5 9 10 40 -30 -26 10 -59 -74 -16 -45 27 16 1 7 42 -62 -18 -1 -63 -43 -54 26 -6 -50 -39 0
6822 0 -77 -34 -8 -33 16 -33 -3 15 -33 -13 -54 10 52 18 -47 6 41 -19 -31 -4 -17 -14 -22 -32 1 -26 6 34 -36 6 9 47
6854 47 14 -19 31 -18 -3 17 -57 53 -1 -74 0 53 -27 31 33 -30 7 19 3 35 -21 -6 16 7 21 -30 -3 22 -9 -10 32
6885 32 -86 14 0 -12 1 -32 -53 -21 -49 -58 -13 -12 -57 -61 23 -24 0 7 -9 6 -75 13 -25 -26 9 -127 41 -19 27 36 -25
6916 -25 8 -21 21 34 48 3 53 53 22 -6 48 12 6 16 7 71 15 -23 18 -16 -18 7 19 -1 -11 -22 -4 -39 12 12 -24 51 -9
6949 -9 -31 13 -27 -40 -17 -101 -29 29 36 34 24 43 17 -9 3 -3 -37 23 23 -17 23 7 -26 18 31 -23 55 -71 5 29 -67 -12
6981 -12 -2 -34 41 -27 26 6 1 -1 -6 2 -53 -11 32 -30 -7 58 22 6 15 14 7 58 8 -3 44 2 -5 74 -13 51 76 15 22 -22 41
7016 41 42 8 10 -6 10 37 -94 1 -18 -42 28 -7 -25 -7 34 -20 12 67 -38 54 -28 0 30 -22 -33 15 16 -25 -49 9 -32
7047 -32 10 -29 -50 -26 5 17 -32 57 -28 7 8 -47 -49 -26 -10 -52 40 20 -70 -1 1 6 46 -47 59 30 19 -7 3 26 42 -2
7079 -2 19 -27 -4 38 57 -3 18 -52 26 4 -60 -5 12 -15 -35 41 -53 -35 -9 -85 22 11 -52 -10 -36 -32 -47 -43 2 -26 64
7110 64 -8 -47 39 11 -6 14 -48 -14 35 6 -11 71 -2 1 4 3 -30 32 0 0 -11 15 49 -57 -30 -16 -20 20 -46 28 -17 -71
7142 -71 -6 -22 2 27 -10 -2 25 6 -13 25 68 -9 1 -9 31 21 57 -19 13 26 10 75 82 40 -30 27 31 -58 -24 -25 -55 25
7174 25 -30 -18 -14 16 -28 -39 -52 -26 -60 12 -64 -31 -1 -43 -46 -16 4 5 23 -29 6 55 11 -47 -13 -32 24 -26 -23 31 18 -41
7206 -41 -26 -4 -5 14 29 2 -27 13 12 -58 12 52 -7 8 62 -53 50 -8 28 31 2 11 32 -17 60 59 30 -18 45 21 -17 31
7238 31 39 -25 19 6 -12 7 51 42 -59 -10 -7 31 -25 -1 -25 22 -15 -30 4 16 21 -12 2 9 16 -39 2 -24 7 -27 -28 8 -31
7271 -31 -19 3 -46 -22 38 -20 -39 3 -6 22 31 -26 -30 54 25 42 -2 -54 11 8 -2 2 13 4 19 -50 -49 -27 -31 -6 -29 101 -47
7304 -47 -21 50 -103 34 5 4 31 38 16 20 20 27 9 1 -5 29 25 -15 19 22 33 -49 7 -17 -69 -61 13 -7 -45 9 -24 -19 -61 -33 -8
7339 -8 -12 -3 -25 -15 -35 -41 -32 -18 9 3 -17 -41 -22 -2 29 -5 -15 -25 -1 6 60 50 -50 3 -10 17 31 -12 51 8 -13 -24 -18 5
7373 5 8 -40 13 -16 -48 18 -8 -15 -34 -38 23 -11 26 -25 19 2 2 61 4 -8 27 41 44 -21 22 22 -14 22 20 -1 16 25 -57 0 7
7408 7 -1 12 28 -4 42 -29 -37 -12 -90 -42 -53 9 -8 -57 -21 -45 19 -46 -9 16 -17 36 22 -31 20 16 -4 -28 8 17 12 89 35
7441 35 -17 26 -27 -5 48 15 -35 29 -19 -6 5 7 -118 29 -52 32 -5 -29 13 -46 47 18 34 -2 6 -48 51 -25 -51 19
7471 19 16 1 54 96 -29 -5 -6 16 17 -11 -16 -15 -5 -26 -52 13 -23 -4 -33 -12 9 0 -16 -4 -1 -43 27 -4 -20 28 -40 15 14 -62
7505 -62 -1 -33 -31 -29 35 -7 8 -10 -7 -27 2 -28 -12 2 -7 5 -26 14 44 -30 40 60 10 61 0 14 48 65 -15 5 9 2 -9
7538 -9 -49 -40 -52 0 14 2 32 -28 49 22 2 -38 45 42 -46 47 -20 -1 1 -18 -22 26 23 8 32 -1 40 -14 -13 -25 30 19 -9 1
7572 1 27 -20 -19 -50 12 -38 -40 -55 1 8 -38 -11 40 38 6 -46 -10 48 19 -6 26 24 -81 4 0 32 6 43 61 32 -5 -4 9 41
7606 41 45 16 22 -25 10 48 -56 -16 10 -6 -33 24 -65 34 -1 -33 56 -29 -9 30 -33 -19 -17 -20 39 -5 39 12 -46 -2 41 -8
7638 -8 2 30 -22 7 -23 23 39 -24 9 -5 -9 4 -25 60 36 -9 -79 -10 -26 -39 -3 -19 -24 -32 -29 -27 -55 -43 -26 -68 -19 -20 8 9
7672 9 32 -1 3 36 -46 -5 6 -8 -5 -36 21 5 -3 -19 -61 39 5 -11 28 12 -19 63 3 -42 13 -49 -42 25 -37 -13 43 -22
7704 -22 -41 32 17 21 1 -27 -15 -4 6 -23 -19 -53 1 -40 -23 -2 -3 0 11 5 -18 -60 -24 -22 -24 27 -22 -17 -37 -44 -8 -30 -26 64 -45
7739 -45 10 -69 -7 -72 -11 25 40 8 -79 53 59 -37 29 26 -5 57 5 41 39 12 52 -3 -22 32 24 30 -46 -41 -11 21 19 42 75
7772 75 -56 21 -49 -36 14 -17 2 -6 -15 -36 27 -3 3 -43 -3 -25 -16 22 -40 21 3 -29 34 1 -13 -14 56 -1 -33 23 30 33 40 10
7806 10 0 -32 -20 -20 -17 -5 -7 12 9 -24 9 -4 -23 50 18 -61 32 -31 -80 -29 41 44 -14 13 -10 19 23 -25 4 73 -26 -4 18
7839 18 1 17 -8 43 65 6 -10 38 -10 -36 47 -32 -24 -53 6 -35 -3 3 -38 2 -39 -41 -35 -7 13 -3 26 -31 -14 -35 -12 5
7871 5 1 -18 -12 1 2 26 -5 -45 -5 71 -46 34 16 -2 -16 51 -4 -37 -11 -9 -11 75 32 3 4 15 -42 -33 -14 -18 -82 4 24 -5
7905 -5 -44 18 -50 60 -24 41 16 -2 -16 34 27 -5 2 36 39 37 -29 69 12 -4 -22 -39 13 -34 7 -32 -21 -29 -13 9 55 -8 -52
7938 -52 -5 3 -11 32 -50 -37 -3 -24 7 29 6 41 17 21 34 35 33 34 -33 -12 35 -1 -15 -11 52 -12 -32 16 54 16 -54 9 -11
7971 -11 26 -15 -9 -42 4 -31 -3 41 -34 44 -47 33 -17 18 -43 -11 31 11 5 10 20 5 43 54 -31 -3 15 -12 51 -16 11 -29
8003 -29 13 13 -1 6 1 -9 4 17 17 12 -7 -47 -9 3 -31 -24 25 38 2 -37 -6 16 -20 -21 36 -35 -37 8 -17 26 24 -15 5 -43 10
8038 10 -43 16 28 -9 33 8 -11 -25 8 1 -42 -20 15 -43 -14 -50 8 -19 -44 -10 6 -4 -2 13 1 -72 9 5 26 -42 -12 23
8070 23 10 -29 -8 13 -31 22 23 -5 -28 -19 -16 48 -5 22 35 -11 28 43 -1 -46 -15 -54 -5 -11 -49 11 11 -47 -15 8 -67 33
8102 33 2 3 -34 18 26 -9 -18 56 59 -43 -11 18 10 22 -13 0 0 41 -25 -45 6 -25 47 64 -10 -25 -9 7 -23 -61 -19 -56 -10
8135 -10 28 -16 17 18 -24 -14 -22 5 -3 -44 4 -21 9 30 13 63 -17 21 38 -12 2 -9 -15 -21 27 9 1 36 -38 60 10 -31 -11
8168 -11 21 -46 50 37 4 -46 -4 7 -22 -20 19 4 35 -15 -60 -1 -23 -8 28 -4 -11 18 -8
8191h
$$ Imaginary data points
##PAGE= N=2
##DATA TABLE= (X++(I..I)), XYDATA
0 0 0 0 0 0 0 0 0 0 8 -8 8 -8 8 -16 16 -24 24 -32 40 -48 56 -64 77 -88 104 -120 142 -161 188 -214 244
31 244 -277 311 -352 397 -447 501 -560 626 -693 771 -855 946 -1048 1158 -1278 1407 -1548
48 -1548 1706 -1879 2069 -2279 2514 -2774 3069 -3401 3785 -4223 4741 -5358 6105 -7030 8214
63 8214 -9776 11945 -15142 20310 -29953 53715 -223778 -277672 119686 -340066 29713 -46462
75 -46462 -211922 63057 -138639 -105959 -68378 -89416 3955 -121353 -18787 -59397 -57364
86 -57364 2862 -104113 -19306 -39569 -48403 -32475 -89001 40536 -58471 -59420 9536 -115659
98 -115659 15769 -31574 -119847 45374 -50815 -55933 -13297 -96987 -18966 -34079 -71676 -41223
110 -41223 -46379 -29310 -66382 -57996 -50678 -53641 -34836 -74356 -41389 -40872 -56776 -29761 -67332
123 -67332 -22314 -21887 -65129 -13564 -32264 -26954 -8886 -37934 -5552 -3616 -16012 -11098 -12307
136 -12307 12156 -697 -13731 8791 3330 4136 7174 -6005 8702 20587 3024 -1726 20192
149 20192 12408 -2318 22219 4075 7450 37087 -13261 7338 34908 -10824 18660 15396 3325
162 3325 27104 -899 5516 6876 16015 22622 -19682 23810 17637 -20416 30060 -7146 -6206 38835
176 38835 -14736 -4981 25079 2385 -949 13392 8375 -6265 23251 545 -15963 35949 -192
189 -192 -8509 25076 -4638 6692 12954 -2328 7409 12778 11619 -7522 9877 19668 -9797 12596
203 12596 12487 -8053 19066 7574 -12917 18817 13449 -10835 13838 10153 -6571 14973 4982
216 4982 -6756 15838 5561 -7306 7761 5605 32 2615 3182 3583 1330 4841 552 -3367
230 -3367 11157 521 -9601 10748 1198 -5900 9279 -3043 -1350 11315 -5832 -3192 9617
243 9617 -1351 1162 2874 645 6573 -1050 1262 3579 -1589 8728 -173 -5369 14901 298
257 298 -6155 15141 -4162 -1000 18182 -11349 1271 19803 -11549 4044 11723 -9263 9059
270 9059 4654 -5198 7909 4563 898 -2874 2622 6612 -7720 3599 6329 -10451 8659 3723
284 3723 -15703 11921 3385 -16114 12490 -34 -12893 14915 -4163 -10079 14452 -5093 -6830
297 -6830 8180 -4532 -1474 4909 -3441 -1325 1237 -184 -3916 -3046 6267 -4236 -6103 7789
311 7789 -8314 -5062 10357 -12572 -397 13188 -15043 3227 10613 -14046 8002 6934 -12471
324 -12471 8651 4013 -7953 7067 1968 -1376 5108 -1835 -16 2920 -90 2591 -2415 1841
338 1841 6739 -8072 2695 8262 -8966 7947 5590 -10913 13344 3498 -10040 15452 -252
351 -252 -4688 14963 -6034 -472 12837 -5685 1586 4733 -2249 4498 -2882 -336 3566 -4101
365 -4101 3108 -2437 -4713 7527 -5307 -7696 8498 -5474 -5844 9024 -10823 -2193 11098 -14330
379 -14330 88 6482 -11820 3938 -2726 -7825 4044 -5455 -1915 -5157 -3322 3110 -11522 494
393 494 1810 -9410 4015 -2469 -6827 4635 -644 -6667 2606 4639 -7668 3830 5696 -8621
407 -8621 10466 1335 -7716 12865 -3128 -214 7589 -4486 7452 -235 335 8287 -6430 8967
421 8967 2846 -7849 14976 -3100 -4418 14061 -5344 141 9153 -5384 2175 7744 -4773
434 -4773 -1022 7326 -3173 -3644 4700 -3761 -920 3695 -5808 17 1335 -3071 -2400 -4058 3151
449 3151 -4983 -5834 6046 -9765 989 5325 -16722 7504 2715 -14883 6619 -3234 -4914 4658
463 4658 -6609 -4134 2705 1197 -7549 -1399 5495 -5549 279 -725 -4302 3945 -1001 -3077 -2887
478 -2887 6155 -220 -10078 10314 -4877 -3426 10818 -15646 7021 8743 -14994 7519 -1182
491 -1182 -916 5498 -9483 4142 2514 -289 -3 -6647 7388 2369 -5281 -1063 2429 3639 -3820
506 -3820 1414 -4451 1641 9044 -16390 4486 8385 -13181 9792 -7894 -5081 14898 -15721
519 -15721 408 5050 -6944 8222 -12622 -1205 10487 -11602 2025 -4058 -3134 10516 -10312
532 -10312 -5692 4822 1452 -3639 -6578 2860 -2261 3157 -2237 -12419 12968 -978 -10638 6883
546 6883 -4950 4067 1443 -8909 5615 589 2388 -4950 -3369 13597 -7048 -1750 5271 -4935
560 -4935 10029 -1872 -7717 8289 5689 -1549 -5396 7247 3290 -1427 6783 -9645 8145 12054
574 12054 -13632 6119 4952 -621 5199 -4827 4443 3086 2062 -467 -5989 12595 -2394 -7594
588 -7594 9416 -3919 2808 2665 -8404 4187 5355 -3687 -6729 5164 2744 -5085 2385 -7012
602 -7012 2923 7440 -12801 894 3090 -2131 2302 -8328 3161 3126 -5763 2313 -5344 2918 5272
617 5272 -9893 2621 4094 -3992 2316 -2230 -263 6813 -2533 -3772 3790 2744 -271 -1749 -108
632 -108 4255 2194 -3071 -477 3725 2087 309 -2304 378 7034 -2695 -2474 6528 -3018 3115 2578
648 2578 -7724 8472 2567 -6756 5756 -218 -746 2750 -3192 1379 2669 -69 -2510 -655 4643
663 4643 -2192 -3235 2840 -781 -1029 2019 -3762 -1206 7086 -5335 -4945 8619 -5742 -2360 6593
678 6593 -9131 3160 4746 -10493 3651 2802 -5136 708 -420 -1029 -391 283 -2639 -1758 5041
693 5041 -3293 -4879 4410 -148 -3096 1656 -497 -2423 4857 -1583 -7361 9101 134 -8043 7895
708 7895 -2889 -2187 8127 -6910 191 7294 -4520 -7 1676 570 2561 -625 522 227 2096
723 2096 1793 -3337 2382 4148 -1764 -471 1675 862 831 1156 -1660 561 4559 -3591 -1046 4635
739 4635 -1948 1068 -527 -2536 3580 -1142 -685 526 -1413 3359 -3044 -2939 4341 -3034 -739 1568
755 1568 -4903 1959 1878 -5735 795 2322 -3871 -183 -172 -2680 1654 -343 -3061 20 886 -1349
771 -1349 -2587 1377 989 -3041 2356 -952 -3507 5630 -2092 -4263 6458 -2063 -3067 5790 -3053
786 -3053 -1001 6809 -4510 -1693 6538 -3384 -147 4696 -3059 1914 2817 -2801 1262 2039 950
801 950 -1096 687 3017 -2726 2157 2371 -4352 4589 1254 -5578 4915 976 -4002 4344 -571
816 -571 -3825 4664 -813 -4681 4975 -546 -3625 3569 -2632 -1628 3151 -2845 -1325 920 -664
831 -664 -1048 -2006 1090 -970 -1934 1660 -3498 -825 3124 -4506 -945 2995 -3636 -333 1436 -3656
847 -3656 938 1640 -3584 458 1272 -1799 594 -765 -363 1540 -1664 725 -180 -851 3905 -3058
863 -3058 -784 5721 -4260 1055 4302 -5243 4735 2158 -5042 5273 389 -1741 3186 -982 965
878 965 1199 327 742 -1070 2992 -46 -2525 3409 135 -2152 2552 212 -3019 3611 -35 -5566
894 -5566 5858 -923 -6011 6911 -3361 -3686 6143 -5445 -1518 3764 -3892 -475 658 -1051
908 -1051 -1498 -235 651 -3390 988 1064 -3894 1361 858 -3080 668 1420 -2902 -656 3358 -3687 -154
925 -154 4799 -5935 2169 4002 -6979 4358 1752 -4245 4925 -1159 -1057 3361 -1145 1145 459
940 459 1653 1316 -1776 3629 411 -649 3192 -516 633 2444 290 -1352 3117 2885 -3938 3985
956 3985 665 -3348 7283 -4220 -1267 7111 -5049 2360 189 -2163 5265 -4334 1124 885 -2713
971 -2713 4692 -5163 188 4403 -5277 1510 -805 -1499 1489 -1707 -841 -2027 3589 -2876 -4718 5824
987 5824 -4833 268 2009 -7711 5734 -298 -5024 1991 -2358 2865 -2936 -2696 3380 -3415 3249
1002 3249 -2194 -4466 6215 -2291 -2871 1827 -160 56 -43 -117 -2272 3884 689 -6291 5228 571
1018 571 -2818 3420 -3117 2353 2516 -3206 274 193 4254 -1828 -3347 5913 -2229 547 2315 -5671
1034 -5671 5672 2368 -5753 2385 1736 -248 77 -394 -440 1205 1747 -4091 385 3958 -2429 -1077
1050 -1077 -56 1077 207 -2087 914 -2160 2869 888 -8030 5701 1506 -6051 4472 -3635 -592
1065 -592 5160 -6224 -565 3036 -824 -1035 -2579 2080 -425 -1003 700 -3677 3434 889 -4872
1080 -4872 1901 1395 -561 -1243 43 867 -383 2284 -3547 -49 6418 -5279 -389 3814 -2982
1095 -2982 3416 -684 -3210 4181 694 -1826 -700 1696 1747 -1879 527 128 180 2397 -2338 -923
1111 -923 3163 91 -2399 902 1767 -1838 1096 -599 -2372 4182 -1751 -3600 3595 -1119 -1263 282
1127 282 -2488 1349 345 -2304 -748 -82 1092 -1811 -2499 2007 -383 -2036 857 -1706 -316 2580
1143 2580 -3724 -965 4059 -3091 -1026 2610 -2922 1738 1315 -4192 2678 1484 -2468 954 -2
1158 -2 1332 534 -1599 1893 -167 982 1501 -3277 3272 2718 -4050 2596 1978 -2170 3113 -90 -2599
1175 -2599 4881 398 -3902 4033 941 -2171 3042 -1439 -458 3839 -2168 -741 1993 544 -44
1190 -44 -1713 1656 509 -1520 1838 -2359 -99 3974 -4432 -941 4017 -3088 -495 1535 -3315
1205 -3315 1397 1847 -4675 577 2687 -3133 -309 484 -1342 1026 -690 -1734 265 939 -445 -2502
1221 -2502 879 1393 -2426 606 11 -1465 2598 -1115 -2892 3102 494 -2554 1627 115 -416 2230
1237 2230 -1634 -641 3008 -587 -696 917 462 1428 -698 283 1319 -230 1999 -831 -987 3724
1253 3724 -769 -1220 2769 -725 445 1931 -2102 717 2612 -1528 -513 1766 -392 -64 403 -917
1269 -917 589 679 -754 -749 249 950 -1421 -783 1537 -1911 196 1091 -3652 1786 1201 -4123 1769 310
1287 310 -2748 1705 -971 -2056 1883 -374 -2152 583 557 -1561 105 565 -1229 573 718 -1382
1303 -1382 51 1834 -776 -858 2467 -925 -631 3184 -2135 155 3932 -2690 653 2806 -1901 1621
1319 1621 1387 -1184 1550 1493 -486 -8 1832 602 -303 1627 116 -218 1986 -194 -654 2019 801
1336 801 -1221 1161 800 -1468 1893 215 -2115 2615 -345 -2272 1830 -661 -855 1087 -1585 -284
1352 -284 358 -736 -679 -980 911 -594 -1733 712 -1046 -832 1001 -1819 -953 1546 -1421 -1884 1368
1369 1368 -867 -1009 1593 -2386 -481 1946 -2457 258 389 -882 928 -1502 486 127 -1062 2278
1385 2278 -2222 165 2833 -3453 1332 1628 -2365 2253 292 -1944 1734 990 -1829 921 1453 -1927
1401 -1927 1614 410 -2198 2547 -323 -706 1163 -1227 1641 -1052 -78 1651 -2711 2890 -311
1416 -311 -3200 4031 -2114 -1011 3229 -3201 453 1807 -2234 -76 857 -679 -869 1194 -1318 -1074
1432 -1074 2089 -2590 -219 1454 -2242 882 -1034 -835 1042 -1958 843 -1176 -1021 2317 -3435
1447 -3435 75 1884 -3040 1628 -451 -2509 2466 -666 -2024 1138 110 -631 418 -615 -699 1654
1463 1654 -443 -1065 1305 -239 610 -188 -674 2263 -992 428 1222 -1775 3102 -441 -2057 3894
1479 3894 -965 -311 1914 -1740 1803 1139 -1545 689 964 609 -583 -210 837 481 123 -699 -32
1496 -32 654 579 -1102 -1098 2491 -982 -1449 1840 -2252 1142 1163 -3808 2105 767 -2294 741 -704 313
1514 313 368 -1131 -293 -6 1410 -1224 -1491 1921 -256 -579 -64 -549 989 468 -691 -1161 1833 1309
1532 1309 -2656 1539 814 -1300 2698 -1780 -670 3744 -1864 -368 1656 -457 1240 -278 -406
1547 -406 1311 346 393 -763 485 2032 -1211 -451 1439 -265 220 402 -1290 929 1721 -2283 -110
1564 -110 1994 -1638 463 176 -1746 2079 -611 -1752 1218 -661 213 -584 -1179 1528 -1277 -575
1580 -575 409 -1577 1395 -564 -2401 1782 -318 -1658 575 -807 -226 701 -1512 -1022 1372 -539
1596 -539 -1388 358 -263 105 -316 -1284 571 88 -159 -566 -947 1699 -689 -1586 1509 -742 135 700
1614 700 -2054 1020 1411 -1692 -77 1111 -143 -79 -25 -539 1074 1015 -1464 73 1348 -66 -91 -216
1632 -216 715 695 -141 -15 -475 1410 689 -1820 1151 893 -1044 1030 -601 -337 1899 -1064 -979 1417
1650 1417 -33 -501 65 -143 414 249 -705 -264 546 484 -814 -650 1101 -79 -905 707 -495 79
1668 79 1093 -1891 172 1795 -1539 -50 823 -737 805 -82 -1048 1067 576 -754 -183 486 655
1685 655 -249 -338 704 211 282 297 -1012 1351 1328 -2086 1025 1369 -1149 1479 -339 -912 2720 -569
1703 -569 -1211 1797 216 295 231 -419 938 673 -164 -294 432 1313 -303 -995 1054 641 -574 463
1721 463 -534 -183 1755 -1391 -1155 2124 -1005 -569 594 -1613 1057 448 -2090 420 218 -611 -388
1738 -388 -1013 339 90 -967 -352 -762 181 320 -1730 -237 997 -1251 -348 272 -1226 1041 71
1755 71 -2057 1153 394 -1350 723 -468 -98 1198 -993 -117 821 31 356 -477 515 937 -633 493
1773 493 431 -352 1482 -195 -746 1803 62 -638 1361 -320 -114 1678 -1037 -75 1805 -903 156
1790 156 799 -767 863 66 -537 611 -179 389 -381 -398 1074 -887 -100 591 -1291 516 327 -1616
1808 -1616 461 438 -1397 210 133 -1322 619 -61 -1716 776 -80 -1246 484 -617 -232 110 -666
1825 -666 -2 -460 365 -23 -1194 1021 -160 -855 1185 -806 -144 1258 -852 -152 1030 -135 -122
1842 -122 759 -65 34 1004 -293 -28 1045 18 9 443 390 383 50 686 -187 286 1224 -1160 448 1312
1862 1312 -1089 769 366 -911 1162 36 -719 388 292 -205 -223 385 -351 -175 469 -884 -95 334
1880 334 -531 -229 -105 63 -774 -15 273 -1446 780 -86 -1746 1510 -805 -1158 1320 -1276 -172
1897 -172 698 -1087 6 166 -261 -234 -110 133 -425 194 165 -508 200 322 -177 -350 737 -355 -263 1399
1917 1399 -1251 176 1527 -1593 905 689 -1344 1544 -90 -562 1037 -291 204 150 131 404 -373
1934 -373 646 72 -310 838 -241 -302 946 -50 -672 725 66 -566 990 -539 -711 1514 -753
1951 -753 -648 896 -708 147 222 -851 290 109 -163 -485 -242 626 -691 -435 413 -804 152 172 -1173
1970 -1173 298 477 -1159 -307 670 -701 -104 294 -1162 625 566 -1699 406 482 -650 261 -669 164
1988 164 602 -442 117 -609 746 749 -1584 836 683 -903 1264 -507 -693 2025 -629 -952 1485
2005 1485 -122 -343 835 -602 229 1168 -874 -93 786 70 80 -471 446 553 -602 529 -581 -98
2023 -98 1562 -1622 -312 1628 -1180 65 570 -1249 799 424 -1565 390 580 -925 -54 150 -513
2040 -513 232 -188 -719 245 -30 -345 -594 -85 564 -901 -166 401 -948 588 -43 -1399 1153 26
2058 26 -1311 910 -55 -551 726 -401 -376 1046 -238 -616 796 133 -271 404 -87 259 367 -123
2076 -123 102 80 760 -118 -662 1470 -138 -431 1196 -789 477 1157 -1312 565 1050 -771 253
2093 253 223 -142 517 16 -264 149 602 -252 -605 581 205 -518 116 -9 -402 612 -292 -1035 972
2112 972 80 -1227 625 -183 -550 672 -957 -352 782 -602 -577 49 128 -229 -499 -12 -49 -30 113
2131 113 -850 59 872 -803 -456 880 -325 -124 538 -918 441 1001 -1323 181 1039 -553 244
2148 244 180 -210 856 112 -458 222 757 321 -650 404 736 -154 284 92 -233 1124 153 -1089 1013
2167 1013 726 -849 488 113 -374 1162 -538 -953 1301 16 -704 233 -61 214 41 -516 -157 194
2185 194 375 -804 -668 1026 -489 -775 455 -694 100 560 -1394 -112 1033 -1077 -494 392 -610
2202 -610 182 12 -1073 269 419 -682 -315 70 322 -260 -439 332 -300 338 211 -1091 916 654
2220 654 -1176 769 361 -552 991 -325 -555 1263 -75 -619 761 223 -12 430 -239 246 532 -115
2238 -115 -22 5 632 102 -702 719 145 -506 797 -592 -221 1243 -1080 -339 1069 -713 23 455
2256 455 -842 345 399 -914 52 375 -417 -84 -144 -166 118 -348 -150 -274 -1 460 -965 -7 715 -961
2276 -961 274 238 -1073 968 -5 -1184 958 -84 -580 596 -366 -126 588 -226 -310 361 186 -127
2294 -127 -65 209 200 39 237 5 -153 802 -103 -588 1094 -274 -215 1087 -748 284 1035 -859 280
2313 280 686 -360 278 133 -219 220 324 -191 -226 393 89 -283 41 51 -237 132 204 -749 203 585 -1165
2334 -1165 260 334 -1056 779 -173 -1051 885 -354 -650 398 -315 -143 -63 -307 -127 -116 98 -354 -363
2353 -363 417 -293 -495 459 -157 -377 655 -538 -506 1007 -584 -357 898 -701 138 661 -858 298
2371 298 451 -431 216 -24 174 166 -40 316 -310 236 458 -566 379 472 -504 493 321 -523 505 332
2391 332 -611 518 335 -684 554 99 -508 632 -179 -339 480 -87 -102 -150 -65 107 -339 93 -187 -389
2411 -389 576 -406 -469 553 -354 -340 358 -490 -318 490 -492 -346 556 -493 -192 337 -508 125 218 -477
2431 -477 95 -79 26 -213 -326 505 -394 -120 500 -665 403 405 -972 552 350 -640 483 -101 -268
2450 -268 655 -155 -292 311 264 -97 -36 129 202 55 132 17 -43 508 -18 -400 705 80 -431 629 -265
2471 -265 -135 871 -737 -103 863 -535 -1 229 -336 389 22 -392 71 240 14 -472 14 218 -324
2490 -324 -120 -82 -324 70 97 -687 -23 488 -708 -47 266 -750 487 -5 -876 690 -48 -586 289
2509 289 -156 -99 73 -251 3 182 119 -188 -48 399 127 -272 267 152 -172 482 42 -259 861 -67
2529 -67 -393 873 -219 25 639 -328 460 380 -250 310 126 245 43 -78 448 -51 -6 340 -308 263
2549 263 292 -408 161 400 -389 40 252 -459 189 157 -695 300 148 -563 149 -118 -139 96 -397 -1 -92
2570 -92 -101 -53 -457 206 -6 -666 268 -9 -429 387 -355 -325 625 -305 -486 654 -175 -314 541 -481 57
2591 57 563 -610 174 383 -235 193 -118 162 351 -303 303 7 1 595 -500 5 778 -467 34 520
2611 520 -426 463 330 -723 602 429 -648 372 96 -181 523 -412 -47 537 -162 -31 -160 106 435
2630 435 -533 -4 348 -344 276 -289 -582 749 -113 -713 390 -59 -305 157 -575 -76 489 -509 -412 247
2650 247 6 -64 -337 -213 252 -35 -136 -198 -71 439 -455 -456 507 -161 -165 106 -424 378 370 -658 1 473
2672 473 -120 -48 -45 27 291 41 -327 22 473 137 -325 78 448 2 44 -2 -124 574 12 -582 512 339
2694 339 -315 250 -132 105 452 -425 -137 444 82 -161 -144 139 119 -160 -46 -237 175 267 -508 -167 441
2715 441 -184 -270 98 -350 131 195 -713 81 428 -495 3 -96 -284 268 -214 -296 157 -10 -36 -269 23 260
2737 260 -286 -15 2 -172 365 -122 -388 466 133 -283 286 50 -110 458 -164 -151 609 -93 -136 270 -72
2758 -72 202 159 -93 176 74 120 31 -170 389 -37 -173 341 -98 9 367 -311 -79 432 -301 -127 305
2779 305 -301 56 207 -473 166 204 -386 103 -94 -28 43 -250 109 -190 -99 215 -505 80 250 -586 244
2800 244 11 -502 332 -55 -447 299 -59 -319 273 -100 -288 239 -223 -134 247 -73 76 -109 80 130 -205
2821 -205 281 -6 -212 562 -189 -170 598 -284 42 446 -386 233 444 -300 109 277 -98 144 212 -116 149
2842 149 156 -43 135 66 111 -26 -82 271 -108 -56 281 -372 221 289 -527 268 206 -503 273 -100 -374 427 -137
2865 -137 -335 276 -169 -140 61 -255 15 63 -213 27 -183 70 148 -469 207 72 -389 427 -203 -367 656
2886 656 -350 -222 501 -415 153 226 -421 139 89 -141 108 -30 122 36 5 159 -16 124 177 -138 136
2907 136 358 -277 70 328 -120 251 236 -395 377 221 -378 336 29 -71 224 -81 -92 149 69 -22 -72 137
2929 137 13 -177 138 -100 -66 149 -210 -154 205 -120 -350 202 -107 -338 268 -349 -218 475 -444 -222 274
2950 274 -287 2 -6 -269 33 -13 -71 -198 34 167 -220 -72 211 -212 15 117 -303 169 193 -419 163 351
2972 351 -372 198 148 -361 443 38 -273 301 62 -69 50 23 250 -45 107 52 -250 497 -41 -309 461
2993 461 -75 -152 314 -193 -59 397 -216 -156 351 -150 -226 139 -126 -15 113 -221 -29 96 13 -182 -132 232
3015 232 -241 -111 236 -447 128 176 -629 159 164 -405 201 -20 -230 257 -3 -254 203 80 -199 57 -37
3036 -37 -67 10 15 52 -100 91 98 -349 325 67 -378 451 -62 -356 540 -270 -165 444 -322 -12 357 -192 58
3059 58 241 -100 90 35 10 94 -11 49 -63 -63 293 -138 -163 426 -218 -65 407 -467 176 378 -646 217
3081 217 271 -489 286 2 -298 300 -126 -271 102 -10 -133 -134 -7 116 -143 37 -66 -181 255 -95 -469
3102 -469 275 96 -430 224 -135 -258 474 -334 -348 561 -224 -265 281 -184 128 150 -322 16 257 23 -186
3123 -186 44 225 -82 -109 109 -68 245 127 -349 156 401 -302 -29 298 -72 212 120 -381 369 298 -317
3144 -317 30 137 79 111 -102 -17 191 170 -129 -184 334 153 -339 54 58 -63 190 -222 -255 448 -28 -423 169
3167 169 94 -124 124 -275 -112 331 -252 -289 58 206 -111 -266 107 -44 -48 95 -397 41 488 -497 -84
3188 -84 351 -193 116 81 -379 257 308 -399 76 349 -174 74 29 -98 278 63 -152 -20 223 198 -235 170
3210 170 294 -279 282 -33 -282 548 -29 -406 419 -14 -163 330 -195 -62 415 -179 -168 259 -75 -85 87
3231 87 -94 75 35 -104 -28 -25 165 -164 -216 288 -221 -140 224 -424 45 207 -495 136 152 -359 75 14 -280
3254 -280 7 15 -221 52 1 -174 31 -16 -11 -34 -78 94 -133 115 160 -250 217 103 -260 329 29 -256 324
3277 324 3 -201 321 -9 -36 204 -3 -41 98 60 -64 53 125 -55 6 83 -134 -103 239 -146 -146 355 -288
3300 -288 -147 356 -374 -36 291 -380 123 218 -294 50 55 -147 19 -53 -74 -147 29 20 -312 80 41 -345 118
3323 118 -12 -351 273 -71 -453 352 -70 -423 300 -181 -217 336 -292 -95 234 -149 -37 -54 9 40 -19 122
3345 122 -62 -58 266 -168 3 326 -242 20 273 -144 129 328 -231 114 384 -224 87 236 -237 201 82
3366 82 -163 195 67 -54 -2 0 159 -77 12 60 -196 103 86 -278 131 71 -277 111 8 -295 246 -40 -327
3389 -327 287 1 -299 176 -180 -111 75 -197 36 27 -46 4 -316 161 -7 -331 228 -199 -142 355 -334 -118
3411 -118 381 -282 19 174 -280 137 225 -296 92 236 -165 86 93 -7 110 -23 76 -10 118 229 -288 171
3433 171 315 -285 289 120 -224 433 -39 -217 403 0 -139 149 17 -33 239 -26 -141 204 81 -154
3453 -154 32 48 60 -18 -72 -19 -62 168 -111 -170 310 -144 -145 255 -237 50 181 -347 70 224 -193 -56 50
3476 50 -98 55 15 -147 24 108 -117 -82 -28 123 -93 -40 91 -146 58 119 -374 134 172 -342 183 -60 -191
3499 -191 341 -96 -97 261 1 -19 108 46 36 57 17 49 44 140 6 -69 224 14 -86 218 -103 -45 286 -134
3523 -134 -75 314 -144 40 169 -209 38 51 -153 -42 7 -35 -59 -3 -1 -120 98 -9 -232 54 13 -183 57
3546 57 52 -188 34 40 -237 118 38 -272 148 29 -172 139 -112 -139 90 6 -74 -38 9 18 -130 105 -24 -46 172
3571 172 -138 -74 250 -131 -141 194 -95 51 188 -151 26 279 -170 -15 176 -68 101 31 -52 138 26
3592 26 32 -26 24 215 -117 -42 246 -100 70 85 -208 233 54 -272 192 52 -155 90 -130 -80 179 -130 -172
3615 -172 13 38 -71 -72 -87 56 -8 -141 -36 -98 186 -65 -326 240 -30 -172 148 -245 -27 219 -296 -28
3637 -28 189 -93 -5 -84 -123 112 27 -112 -16 101 60 -106 -71 153 48 -147 87 -23 89 242 -299 116 347
3660 347 -214 95 37 -177 311 -40 -192 278 73 1 -68 -10 131 112 -96 -4 52 56 -2 -136 94 182 -195 105
3684 105 68 -143 257 -148 -186 303 -130 -173 156 -163 62 36 -239 31 70 -102 -101 -83 33 -63 -129 42 -79
3707 -79 -55 41 -181 -52 148 -166 -114 197 -259 106 122 -342 192 55 -259 128 34 -98 108 -94 11 69
3729 69 -8 31 -59 94 65 -38 91 33 -6 137 31 -94 176 64 -131 205 -27 -111 250 -109 -66 265 -151
3752 -151 76 90 -82 165 16 -30 47 -37 79 -26 -55 110 -96 -18 31 -136 57 82 -132 4 133 -158 37
3775 37 41 -125 130 25 -161 51 -13 -9 -23 -88 87 -73 -14 35 -178 154 67 -191 135 27 5 156 -65 -54
3799 -54 226 -7 -108 130 18 -69 113 -2 -7 128 38 -35 12 98 22 -44 118 27 -27 172 -121 36 291 -157
3823 -157 20 139 -135 188 92 -192 108 148 -136 26 39 -49 79 -2 -98 37 -1 12 -74 -34 76 -115 -55 93
3847 93 -205 128 -90 -275 152 -120 -168 166 -116 -47 115 -153 -48 94 -64 -112 32 -20 13 -17 -47 11 30
3870 30 71 7 -60 140 -22 -125 105 -105 -1 152 -183 78 174 -141 79 58 -49 58 -66 55 27 28 -37
3893 -37 -41 92 61 -12 -27 34 -28 41 14 -68 36 129 -187 78 158 -153 127 -11 -100 159 -58 -177 104 -20 -10
3918 -10 -14 -52 -27 -36 -9 -122 -56 82 -10 -155 82 -68 -81 99 -85 -83 178 -192 -162 210 -167 47 127 -200 119
3943 119 133 -152 29 44 23 10 -66 34 15 5 28 -87 103 121 -140 53 106 -28 120 64 -176 183 35 -228
3967 -228 168 41 -145 145 -75 -28 206 -118 10 87 -4 66 -44 99 69 -84 71 -50 -34 181 -73 -117
3989 -117 83 -51 -87 45 -99 6 146 -77 -92 78 -77 -46 72 -46 17 29 -87 -87 -54 83 -44 -72 122
4012 122 -91 -1 73 -231 44 73 -186 36 57 -120 44 -17 -73 78 96 -71 -13 113 -17 35 85 36 33 79 -23
4037 -23 -48 177 76 -153 201 -1 -91 208 -105 -69 188 -73 11 83 -27 59 93 -66 -9 30 -27 -30 1 39 -32
4062 -32 7 -16 -59 75 61 -165 -31 150 -156 2 125 -112 73 -8 -179 167 -47 -164 20 -55 -53 28 -86
4085 -86 -26 7 8 -46 -110 40 47 -138 4 62 -71 116 -57 -137 168 -9 -147 154 -11 -53 141 -137 21 221
4109 221 -80 35 74 37 61 -64 75 36 42 86 -109 75 200 -58 22 73 -28 93 87 -156 65 143 -183 -14
4133 -14 90 -71 75 -2 -85 127 -33 -65 -35 69 -6 -80 49 23 -62 96 -83 -104 160 -90 -122 78 -51 -46
4157 -46 46 -84 -63 180 -60 -91 105 -50 -9 45 -95 -41 12 -97 -16 -49 101 -103 -48 114 -116 63 125 -121
4181 -121 94 124 -142 117 178 -73 38 104 -60 115 100 -58 147 8 -30 57 -35 13 3 -9 89 -31 94 24
4205 24 -165 193 41 -131 166 -92 -81 148 -10 -115 163 -18 -56 92 -68 -51 68 -26 9 24 -15 -41 -6
4228 -6 40 -21 -13 88 -97 -18 72 -189 -4 83 -160 18 43 -134 -9 32 -76 -30 35 -89 28 43 -103 5 61
4253 61 -94 -7 17 22 13 74 47 -66 58 13 -91 100 29 -120 200 -12 -31 172 -46 -7 117 38 15 33 64 16
4279 16 68 -48 -73 43 64 -30 -51 68 -10 -73 104 -61 -33 176 -176 -44 172 -140 42 17 -164 130 -10
4302 -10 -134 35 -17 -32 -32 -3 29 -47 -22 -19 -65 72 7 -104 57 56 -100 15 17 -113 116 34 -194 155 -40 -94
4328 -94 82 -32 33 117 -72 -36 64 4 -57 4 38 -8 28 59 -28 41 77 -65 12 133 -69 -74 162 -26 23 142
4354 142 -161 22 172 -140 51 31 -74 71 -32 -77 16 63 26 -100 -4 34 -37 24 -40 -74 79 29 -154 110
4378 110 12 -140 34 -80 -95 155 -94 -117 124 -17 -91 53 -50 24 -58 -3 57 -77 72 -62 -59 137 -14
4401 -14 -30 66 -98 6 98 -118 24 156 -56 -53 81 -36 39 29 -64 36 123 35 12 12 51 -52 -34 24 -109 13
4427 13 60 -153 91 54 -65 83 -14 -88 92 -44 -113 128 -10 -45 -4 24 -6 64 -47 -68 0 -6 -28 -41 -8 13
4453 13 -138 107 -32 -86 62 -127 -44 117 -119 -39 65 -105 70 48 -88 49 71 -89 -8 -15 -22 10 20 -13 -4
4478 -4 35 0 -84 12 72 -60 91 47 -38 117 18 -90 155 3 -45 56 -36 -52 111 -23 -37 43 30 40 -23 43
4504 43 44 14 26 -22 -33 83 -8 -44 160 17 -73 101 -24 -26 146 -96 -19 73 -107 -34 -5 -39 42 4 -97 -81 1
4531 1 15 -80 -28 24 -41 1 -25 -107 59 13 -128 41 41 -120 54 -4 -90 102 27 -67 110 29 3 70 -2 11 -9 12
4559 12 28 13 136 -9 -55 108 18 21 58 -38 3 135 -115 -83 66 -17 24 100 -82 33 57 -58 19 94 -18 -13
4585 -13 42 -34 55 11 27 -11 -11 68 -56 -9 35 -26 -37 28 -97 77 41 -179 18 27 -119 1 -66 -73 100 -2 -66
4612 -66 59 -10 0 -14 -39 6 -78 -24 -15 4 106 -41 -81 100 1 -43 35 -59 20 157 -26 -8 88 8 -14 17 19 26 32
4641 32 -34 27 65 58 -21 17 98 -33 -1 73 -106 83 51 -144 39 48 -64 29 31 -43 103 22 -23 8 80 -46 8 42
4669 42 -21 9 -16 -5 -8 25 -17 -112 31 -45 -46 73 -67 -53 66 -132 -23 62 -74 -62 -44 17 -25 53 -36 -57 2 -30
4697 -30 -20 39 28 7 -18 13 39 -16 100 -49 -9 96 -34 36 73 -39 130 31 -55 92 21 27 31 -11 12 2 29 42
4725 42 46 31 71 -73 11 41 -41 -9 19 -92 100 -9 -70 62 -62 -5 67 -81 -43 -15 -58 28 -38 2 8 -61 -38 -34
4753 -34 -45 39 -84 -42 66 -68 -35 -9 -34 -30 25 -74 11 32 -130 -39 -4 -26 64 -43 -58 34 0 -41 29 -17 31 -12
4781 -12 -11 41 -21 121 14 -11 72 42 -8 47 46 -49 39 -44 3 115 -20 -6 79 -28 31 54 -46 73 49 7 -18 -25
4809 -25 42 18 -52 86 17 -10 21 -70 30 94 -106 -8 -2 -50 -21 16 -83 24 58 -120 -3 37 -43 46 -88 -43 16
4836 16 -15 7 -53 9 35 -89 30 11 -90 68 -20 17 109 -35 -30 -23 22 7 40 -20 -8 41 -22 -52 54 40 -25 -12
4864 -12 -53 93 5 33 1 -9 131 10 12 97 -47 17 33 -9 1 48 -50 68 -8 -6 46 -9 -30 40 -51 -29 -36 -3 7
4893 7 -45 -65 23 3 13 17 -101 48 25 -58 37 7 -3 5 -13 -7 70 -23 -33 22 -13 5 3 -29 11 35 31 7 -35 37 -20 -77
4925 -77 36 -21 -49 -18 -57 -5 84 -42 3 54 -33 58 10 43 56 -12 -2 -43 6 60 -39 -36 1 -13 61 34 -2 74 77 -59
4955 -59 17 39 -63 54 -16 -55 67 43 -69 55 29 -80 -9 -33 -28 18 -22 -17 -4 -16 -27 0 15 -17 -47 11 -94 -13
4983 -13 7 -72 -17 72 16 -27 -17 -28 48 19 -25 9 -20 -7 43 -63 -12 20 -3 6 -9 2 23 -42 35 19 -49 28 -15 -73
5013 -73 37 -4 -47 62 46 38 33 18 25 4 -7 10 6 51 37 24 17 46 -13 80 -16 -70 67 4 -75 51 -4 -24 31 -84
5043 -84 19 43 -35 -21 4 -42 27 -6 -29 -16 -10 -67 -50 -15 -34 -56 -112 38 -89 6 56 -93 9 23 -65 -7 -2 -56 54
5072 54 22 -71 87 -14 -9 31 -5 37 18 12 -52 20 -27 -6 28 30 74 -47 33 -29 -20 55 -13 20 75 -62 10 45 52 47 23
5103 23 -4 23 35 22 -37 23 21 55 52 20 -1 7 -9 15 -6 68 -46 -50 32 -50 12 53 -62 30 0 -85 -50 6 28 -27 -14
5134 -14 -15 -23 -18 -9 -29 -3 -39 -73 -5 7 9 32 -36 -54 80 -17 -50 50 -28 -29 45 -35 11 25 -81 -20 34 -28 -2 -43 -16 14
5166 14 -19 23 -73 -24 -21 24 61 15 -13 36 64 -3 -26 45 -20 -27 70 -51 62 -12 -55 90 -14 -20 -56 -9 -4 -39 11 -4
5196 -4 -16 78 3 -63 62 -37 -20 9 -87 -46 25 27 -64 10 -45 -46 22 -17 -59 65 -70 -43 27 -40 -12 -33 62 19 15 1 32
5227 32 32 -3 -98 -21 37 42 25 -12 -20 65 14 -25 -33 -6 -47 8 -42 -41 8 -8 -30 25 12 -1 -48 23 89 -65 5 -34 -70 73
5259 73 -27 -54 72 37 9 64 -37 24 75 -14 6 48 -40 -42 -15 -9 70 -2 -52 -23 -8 25 -23 21 38 -62 -51 -12 -83
5288 -83 33 28 -40 17 -10 -74 -4 -26 2 -49 -8 -13 23 74 -83 20 3 13 -17 -12 43 -8 67 11 -30 64 0 -46 98 -13
5318 -13 -13 115 -46 -81 113 -2 -50 6 -18 44 48 10 47 47 17 -5 -4 28 25 -3 -9 -14 -32 32 -59 38 52 -67 8 61 -6
5349 -6 43 26 -20 84 -10 -13 2 -5 84 26 -25 -14 -39 -4 -58 -74 18 -15 -91 -15 6 -75 10 -46 -38 21 -24 -24 33 -50 -23 41
5381 41 -2 4 35 15 -42 23 9 2 -38 25 -2 4 58 -12 30 42 -29 -20 27 -52 -2 15 -62 -3 38 -24 18 46 23 34 -66 -40
5413 -40 0 9 -38 -15 -27 -38 24 9 19 -7 2 -15 -36 69 32 -32 56 -16 -23 44 -71 -54 98 22 -55 42 10 -1 -8 26 -37
5444 -37 32 12 -42 14 52 -21 -21 48 -48 -21 -10 -50 8 28 -46 2 21 -34 36 27 -53 3 79 -8 9 -8 -54 32 34 55 19 78
5476 78 -8 6 43 30 -3 64 21 -35 82 -8 -67 29 28 -9 -9 -1 26 -21 39 -2 7 -4 -12 -13 8 -46 -42 14 -46 8 21 -21 -47
5509 -47 57 -26 -7 39 -16 8 40 -47 -3 22 6 -34 -16 -37 8 40 -28 -8 -11 -5 -63 60 -10 -57 9 19 -40 25 16 -24 68
5540 68 52 25 42 -8 -2 80 -33 0 25 20 27 -19 27 8 7 53 -35 33 50 -53 -21 -5 -34 -22 4 -21 32 66 -34 19 86
5571 86 -77 27 5 -31 64 -24 -71 36 -20 16 -18 -41 25 -23 -21 -21 6 -8 21 -60 17 45 -44 2 0 -68 27 -14 -12 34 -24
5602 -24 -15 10 -12 -10 -34 -38 11 -49 68 17 -16 19 37 21 38 27 -5 24 -34 17 39 -9 9 62 -14 14 37 -6 60 19 -6
5633 -6 33 -52 48 27 -9 45 7 2 2 -63 87 30 -21 56 -9 -99 45 4 5 10 8 -16 -8 -2 -65 25 -15 -30 27 -36 -31 -13 3
5666 3 -2 -72 24 13 -42 39 -17 -18 -5 21 17 10 40 2 16 -32 -32 -1 -30 -16 -2 44 -73 44 1 5 22 -31 -3 23 69 42 -8
5699 -8 44 -18 16 21 -33 -4 47 4 12 -21 81 54 4 27 50 37 25 37 43 -16 19 -23 -6 15 -19 -29 18 53 -5 -5 5 -27
5731 -27 -38 -6 -51 2 -10 -17 -26 -40 46 39 -1 -16 -14 -17 33 -2 -19 -31 -4 3 26 -44 16 53 8 -23 37 -34 45 46 -65 20 12 -21
5765 -21 21 -5 -30 8 -67 -28 14 -48 -53 -12 -25 5 -54 -4 25 25 21 -36 37 46 23 13 59 -7 46 18 -72 54 44 -36 -24 60
5797 60 -17 31 4 -22 -32 13 -2 -90 11 -27 -48 -28 -22 -63 6 27 -59 -34 -5 -38 -10 -41 -52 5 -14 -52 45 -43 -7 7
5827 7 11 21 -1 -4 64 15 -8 -24 -62 34 48 -34 -6 -25 -22 49 -50 -10 50 -33 10 48 -20 -70 24 -47 -13 48 -12 20 16 26 17
5860 17 16 24 -5 26 42 -2 -4 -10 4 13 25 21 -2 6 -34 61 10 -25 36 -31 26 -17 -14 -23 -28 -11 -11 -27 3 7 -85 -18 7 21 4 -30
5896 -30 -18 -13 -69 -5 9 -36 0 26 16 43 64 -65 -57 -3 61 51 -27 28 53 44 30 -21 31 63 14 -3 136 12 23 30 -19
5927 -19 32 30 -33 30 -28 -16 4 -26 -24 6 -34 -12 26 51 63 37 -29 23 -21 4 5 13 -2 26 12 -13 20 4 31 -54 -38 41
5959 41 0 4 23 -51 -62 8 -37 -29 18 13 -5 -33 -63 -25 -26 -39 1 -18 55 -42 -43 -6 38 5 -22 -26 14 -15 -37 24 1 33 7
5992 7 3 -23 24 25 53 -8 -6 -1 -104 53 50 -30 2 -5 9 0 -36 -38 80 -28 -53 45 -33 13 -7 -31 32 -11 17 38 -34 5 -62
6025 -62 -19 54 -36 3 -28 -30 11 52 -11 -34 3 -38 17 -4 -34 0 -6 -75 -4 16 -19 -18 -10 -19 -17 22 -8 3 16 8 -59 -48 8 -12
6059 -12 21 7 -83 69 47 -4 31 51 -7 -16 30 -18 53 16 -27 -28 -11 6 11 -42 38 15 25 8 -21 40 -27 -44 31 -8 37
6090 37 18 -21 -66 12 -28 55 14 -13 -22 -14 -65 -45 36 14 44 -20 -18 -39 -21 -18 26 -12 1 -31 2 42 -7 5 29 -61 25 -51
6122 -51 -42 47 12 -29 32 29 16 -47 -33 26 10 32 -13 3 5 -6 -24 -9 -13 8 31 -28 2 44 -3 49 36 -58 43 7 20 18
6154 18 29 -36 -28 37 70 -5 -11 16 4 -4 -20 18 29 34 -45 38 -18 -65 -28 23 -7 22 28 30 -24 -50 -1 4 -20 33 43 -12 -6 -43
6188 -43 34 24 -4 -12 -1 -1 -14 -27 -7 -45 -55 -64 18 4 9 40 -18 -58 12 -71 -39 50 -46 -3 -5 -22 21 -1 28 51 13 26 -12
6221 -12 13 51 23 2 18 -43 10 74 34 23 36 41 49 -24 -26 83 38 39 28 -35 -1 10 -12 -20 -7 -38 -8 -48 15 -26 -59 29
6253 29 -34 -39 48 -73 -51 34 4 5 -14 19 5 -26 -10 0 10 -10 13 16 -17 -39 -17 -1 -35 16 5 -16 -20 46 -15 28 -23 -38
6285 -38 41 3 8 65 22 2 -41 1 -40 14 5 -20 68 -12 -9 21 -26 6 -3 43 16 -22 58 39 29 54 -52 -15 19 36 -9 0
6317 0 7 1 4 -15 -58 9 4 40 -31 6 17 -16 -59 -24 18 63 -71 -55 7 -18 83 -28 -75 33 23 -41 24 15 -19 2 -8
6348 -8 -12 18 -11 23 -81 -2 32 -54 11 22 17 9 -8 -44 61 43 -3 -36 33 -1 25 -43 -22 79 -2 -16 27 8 -12 11 8
6379 8 18 26 34 -60 -29 -9 29 -10 20 20 46 54 10 -8 39 2 19 8 -18 -33 17 -23 -23 51 -42 10 -15 39 -20 7 3 -18 13 -51
6413 -51 -52 -26 -26 17 27 9 -7 -5 27 -63 29 -30 -25 -3 -1 -27 0 -72 -54 69 18 -15 0 -10 -11 -9 -49 -53 -20 64 -1 -5 47 14
6447 14 -6 28 2 13 5 -17 -36 8 -9 18 29 47 -18 -12 -7 51 30 44 -38 24 46 12 -12 12 38 30 -2 -27 24 -34 -5 25
6479 25 -47 29 66 -13 -49 -42 -24 -23 -8 -16 -27 -21 -30 -28 -28 -31 19 3 -10 -17 -38 39 -48 -4 46 -100 -9 60 -63 -6 13 7 63 -12
6513 -12 -3 -7 41 -9 21 -41 -3 48 22 -4 18 -4 6 7 -3 41 -43 48 -28 -30 9 30 -20 30 29 12 -3 27 46 7 24 45 8
6546 8 -25 -44 -24 69 -5 19 0 -45 4 4 -49 -49 -20 -12 -33 21 -43 -31 20 -46 -4 33 -6 17 -3 -25 -21 -43 43 -70 25 7
6578 7 -46 -18 14 -17 4 35 9 3 42 -6 -7 38 -5 59 -65 -65 -9 -14 -40 6 3 3 -36 33 -3 46 5 -26 -7 76 1 -37 -42 23
6612 23 6 5 -76 -27 43 -58 2 19 -57 1 41 5 -22 49 -34 -7 10 4 41 5 34 -45 -25 23 -45 -9 33 -22 24 -34 -48
6643 -48 -54 -11 -74 -52 11 -58 -45 -2 -56 -16 -9 -7 -28 4 -11 7 37 -3 -37 3 46 0 29 25 -59 129 -23 34 4 -16 -1
6674 -1 1 0 53 22 -8 -10 30 3 0 11 11 -28 -15 0 39 8 51 -29 -33 17 7 17 25 2 80 38 -91 28 56 35 14 11 38 29
6708 29 13 9 -21 53 32 0 16 -5 15 36 8 7 0 -18 17 2 -49 -82 -35 -16 -26 5 -40 -16 -35 21 11 -18 -61 19 8 -22
6740 -22 14 10 4 -22 -18 -10 -10 -11 32 32 4 40 -28 -42 35 63 6 -7 -2 7 -18 -55 -12 0 16 -27 -38 20 19 -6 -51 -49 -12 19 -44 19
6776 19 19 -23 22 -26 -1 48 -25 -62 4 -9 -62 21 -50 -23 -55 2 -1 -26 -2 -46 0 -38 1 4 6 -8 -65 -21 -84 4 -22 23
6808 23 12 -28 -43 11 36 -68 -14 -15 3 -23 -33 21 6 -35 29 -12 28 -5 -16 -2 15 14 14 55 46 63 -11 15 20 15 13 4 -29 -6
6842 -6 3 20 -2 -30 24 -17 -10 -17 0 12 -29 -88 20 -10 -3 -41 65 -41 3 -72 -38 2 -8 -54 28 22 -22 -5 -17 -1 -18 21
6874 21 -7 -20 5 -2 13 -12 -36 -5 16 -33 -62 2 -5 -48 -6 26 -45 9 -33 -10 13 15 -32 22 34 20 23 -5 21 63 -13 21
6906 21 20 7 20 12 12 34 40 26 -19 -36 67 -21 -4 -14 3 -43 0 -20 -22 13 -8 17 33 23 9 -6 -20 -55 0 17 -20 -15 -6
6939 -6 44 -37 3 -35 21 15 -57 58 22 -23 2 -13 -6 -13 28 -2 14 12 -27 -24 -84 30 -33 -28 -51 -27 -15 -46 -18 18 -15 -35 -32
6972 -32 16 -22 38 -18 -20 13 -29 -4 51 -20 5 8 -9 -27 36 26 19 99 -19 20 -16 10 5 19 31 -37 -15 6 -59 -25 -29 -74
7004 -74 -17 -2 -61 6 -25 -64 -32 -37 11 -14 -39 -6 -64 -27 -56 -18 -15 -38 -3 -11 -19 -32 4 -28 -10 39 21 -11 -13 -5 -36 9 -28
7037 -28 24 -20 -42 -52 -33 -10 -25 -1 -11 18 -12 -10 -39 -11 -3 -32 18 3 -17 22 69 -79 58 -9 14 10 69 60 53 35 45 73
7069 73 10 6 44 -22 13 45 -3 25 59 7 4 -29 32 -34 -61 -26 -18 42 9 -26 -64 11 -2 -25 25 -2 -39 31 -38 39 33 -40
7101 -40 -14 -63 28 17 -79 -20 -24 -32 7 -38 6 58 -50 4 47 -52 5 -42 -10 -41 -50 6 27 -22 -19 -4 -26 21 12 15 11 -17 41
7134 41 20 11 -10 20 -5 21 -12 -4 4 33 17 23 14 56 -39 16 30 -8 60 -5 -14 -8 -6 -24 -73 26 6 1 -21 -14 -13 -34 -16 -23 -3 -51
7170 -51 14 -16 38 27 -93 12 -25 -50 -10 -19 0 -37 0 -39 9 53 -19 -49 25 1 -37 32 21 4 16 -3 14 -17 -23 -12
7200 -12 37 12 28 -16 1 14 -38 -42 -35 -53 -72 -36 27 40 -42 12 19 4 -3 50 60 -32 16 -8 73 23 -22 -9 13 37 33 11 -64
7233 -64 -21 20 -19 -7 -6 10 -40 31 -12 17 -41 -12 -70 -3 50 -47 -47 -39 -41 -4 7 -14 -42 5 -46 -7 -42 1 -11 -27 -12 0
7265 0 -27 24 -13 -31 -9 3 44 13 -11 -13 19 29 30 -94 -36 -18 21 -6 3 -22 -2 7 -1 -29 -13 -24 -24 16 9 -27 -31 -20 -29 -11 58
7300 58 -7 -46 36 2 81 -6 -24 0 -3 9 -38 -14 -11 -79 -34 -12 -11 -8 -19 -36 1 -58 -41 -46 8 -33 0 -19 -22 16 17 -34 -2 -19
7334 -19 -4 -45 -39 -23 44 2 -22 15 9 10 -21 -37 -26 35 9 -1 1 39 -21 36 1 -17 17 23 31 6 18 -8 8 -3 -9 9 5 -42
7368 -42 6 30 -81 8 12 1 -16 8 -15 15 63 -18 -49 0 -35 24 10 -6 -19 17 -58 -47 22 43 -13 -26 5 10 -45 -35 45
7399 45 -7 -12 2 -24 -12 -17 -16 -91 -4 0 -7 -15 1 -41 -38 -18 -5 -16 32 -7 15 43 4 -10 30 26 -52 48 79 4 -13 -27 46 26
7433 26 -33 33 -18 26 -12 -26 21 -16 -18 22 -1 16 -25 7 -15 -7 -22 -22 21 31 35 54 -32 -4 -38 -9 -29 11 27 -30 -15 7
7465 7 -28 26 -34 -46 -25 -17 1 1 -13 -25 -21 -51 -12 9 -17 -26 14 -18 -21 -13 0 -41 41 41 -16 -5 12 -25 -26 -23 -80 8 -4 -20 -2
7500 -2 14 7 19 0 -9 -35 14 25 3 35 -6 10 41 53 44 1 18 16 -1 4 -9 -14 28 38 -30 21 -63 12 -18 -35 15 1 -18 -10
7534 -10 38 -2 -30 -53 -45 -20 -9 21 26 25 35 -43 15 -39 17 -49 0 -61 -16 -15 -15 41 -60 1 -4 23 14 -31 -16 -13 3 -12 -40 -38
7568 -38 27 -36 11 -7 -46 -29 -31 -14 -32 56 28 -42 -37 -45 -13 -32 -30 3 24 11 15 -49 23 33 57 -5 -43 -34 25 15 -13 -11 15 29
7602 29 -6 -67 -67 -14 -31 -15 -15 -63 63 -26 -42 -12 -54 -39 15 -18 -24 -14 -15 2 32 2 -7 -12 24 -14 -49 7 -8 20 -2 -8 15
7635 15 -27 -20 -14 7 -42 4 5 -26 -2 -10 -51 -61 -56 -15 -5 -17 21 -20 -44 34 7 8 -52 -25 14 30 -7 43 -80 11 36 -5 -13
7668 -13 -41 -12 -16 -27 -33 35 5 50 -9 -18 -19 -34 -37 -34 20 -56 31 -82 -44 3 -10 -34 -62 -28 -8 -57 -76 -26 43 -21 -19 -12 1 -2
7702 -2 5 38 26 -18 6 0 23 21 19 2 -55 -1 -43 -8 -18 -6 1 -45 9 26 19 20 -33 -5 14 37 -4 -26 8 -12 -9 30 9 16 -21
7737 -21 -37 4 10 37 -67 29 16 -28 -16 19 -25 14 -53 -3 64 -1 51 12 26 -37 53 -6 30 25 32 -17 -29 -14 -68 36 -30
7768 -30 17 -28 17 10 -17 -42 -37 -30 25 -41 -9 -33 -24 -29 16 10 -19 -16 39 33 15 -84 -19 50 -15 -13 18 -11 -3 44 0 -4 -2 -17 -31 1
7804 1 -39 62 -13 6 -36 27 -53 3 4 -6 -3 11 -4 34 -31 2 2 31 -39 -10 79 -18 -13 19 20 4 -33 -47 -25 1 6 3 47 14
7838 14 10 4 -5 -4 17 -67 -37 -28 -55 -40 -6 -2 37 -37 4 -34 -27 -27 11 -76 -46 4 7 -14 -20 -31 4 -41 19 38 -29 7 -22 -18 0 21
7874 21 27 51 -30 38 -43 -10 -27 -20 14 -25 -25 -20 -61 17 -19 26 -1 -3 -32 -64 -35 -24 14 67 3 34 6 44 56 -4 55 61 14
7907 14 15 -3 4 38 -29 -12 10 22 -10 7 -9 39 -32 9 7 -23 29 17 -6 15 22 -24 -40 18 -5 22 -84 -50 8 -56 10 -1
7939 -1 -43 -24 15 -50 23 39 53 4 7 3 29 34 -37 81 16 -21 -3 6 31 7 -12 -8 15 1 -26 13 22 -16 -23 -27 -2 -62 -28 -10
7973 -10 -26 47 63 19 31 -20 39 -31 23 -40 20 48 -48 6 24 7 1 1 -5 -3 -4 -21 -3 -32 -19 -29 -15 -29 -20 19 -64 -52 5
8006 5 4 -31 -17 -4 -18 20 19 -57 -6 -26 25 -4 3 7 -10 -17 -21 50 -9 -50 -12 0 6 3 -21 18 -8 -68 33 -15 3 25 -16 24
8040 24 18 37 -16 0 -4 26 12 18 -28 16 -6 -4 -17 -20 23 13 42 -29 -32 12 -8 -3 17 4 22 60 -4 -14 -11 34 27 -36 -31 7 -3
8075 -3 -4 -28 -24 -3 -26 -35 3 -8 -23 -2 35 -23 1 -51 -1 -20 -44 -41 9 -41 23 24 2 -43 13 35 8 20 -27 -18 49 -6 -4 -10 -35
8110 -35 -1 36 -20 8 40 -13 -40 11 -11 -55 39 38 -64 44 -1 -63 24 -20 -29 10 2 -12 -13 68 26 -34 0 -59 -2 61 -40
8141 -40 -33 -36 -21 9 8 2 -14 -21 -14 -3 -5 22 35 -42 -29 -39 -34 -34 -6 -80 -8 -50 -33 -18 -60 -26 -33 -45 11 -35 -45 -9 -33 -6 -34
8176 -34 -17 -20 -1 -4 -41 -15 0 7 29 21 -32 4 20 -23 20
8191B0
##END NTUPLES=NMR FID
##END=
