##TITLE=1H_2PBDP2307
 CDCl3, 8 sc, 
 24.7.2019
##JCAMPDX= 6.0         $$ Bruker NMR JCAMP-DX V2.0
##DATA TYPE= NMR FID
##DATA CLASS= NTUPLES
##ORIGIN= UXNMR, Bruker Analytische Messtechnik GmbH
##OWNER= root
$$ XWIN-NMR		Version 3.5
$$ Wed Jul 24 16:27:23 2019 Russian Standard Time (UT+4h)  she@DPX200
##.OBSERVE FREQUENCY= 200.13155
##.OBSERVE NUCLEUS= ^1H
##.DELAY= (6, 6)
##.ACQUISITION MODE= SIMULTANEOUS
##.ACQUISITION SCHEME= undefined
##.AVERAGES= 8
##.DIGITISER RES= 18
##SPECTROMETER/DATA SYSTEM= spect
##.PULSE SEQUENCE= zg30
##.SOLVENT NAME= CDCl3
##.SHIFT REFERENCE= (INTERNAL, CDCl3, 0, 15.7039)
##AUDIT TRAIL= $$ (NUMBER, WHEN, WHO, WHERE, WHAT)
$$ ##TITLE= Audit trail, XWIN-NMR		Version 3.5
$$ ##JCAMPDX= 5.01
$$ ##ORIGIN= Bruker BioSpin GmbH
$$ ##OWNER= she
$$ F:/spectra/data/she/nmr/H-F/1/audita.txt
$$ ##AUDIT TRAIL=  $$ (NUMBER, WHEN, WHO, WHERE, WHAT)
(   1,<2019-07-24 16:26:21.87 +0400>,<she>,<DPX200>,
      <created by zg, POWCHK disabled, PULCHK disabled
       configuration hash MD5:
       00 E9 B6 7A A2 85 ED C7 34 08 36 98 17 FE 4E 26
       data hash MD5: 16K
       38 DF 58 30 21 1A A8 E9 4A 96 A4 40 6C 8E 52 32>)
$$ ##END=
$$ 
$$ hash MD5
$$ 9B 09 4B B4 88 01 B3 CC CA 66 1D B2 39 52 DF 49
##$RELAX= 
##$RELAX= 
##$RELAX= 
##$RELAX= 
##$RELAX= 
##$RELAX= 
$$ Bruker specific parameters
$$ --------------------------
##$DU= <F:/spectra>
##$EXPNO= 1
##$NAME= <H-F>
##$PROCNO= 1
##$TYPE= <nmr>
##$USER= <she>
##$AMP= (0..31)
100 100 100 100 100 100 100 100 100 100 100 100 100 100 100 100 100 100 
100 100 100 100 100 100 100 100 100 100 100 100 100 100 
##$AQSEQ= 0
##$AQ_mod= 1
##$AUNM= <au_zg>
##$AUTOPOS= <>
##$BF1= 200.13
##$BF2= 200.13
##$BF3= 200.13
##$BF4= 200.13
##$BF5= 200.13
##$BF6= 200.13
##$BF7= 200.13
##$BF8= 200.13
##$BYTORDA= 1
##$CFDGTYP= 0
##$CFRGTYP= 5
##$CHEMSTR= <none>
##$CNST= (0..31)
1 1 145 1 1 1 1 1 1 1 1 1 1 1 1 1 1 1 1 1 1 1 1 1 1 1 1 1 1 1 1 1 
##$CPDPRG= <>
##$CPDPRG1= <>
##$CPDPRG2= <>
##$CPDPRG3= <>
##$CPDPRG4= <mlev>
##$CPDPRG5= <mlev>
##$CPDPRG6= <mlev>
##$CPDPRG7= <mlev>
##$CPDPRG8= <mlev>
##$CPDPRGB= <>
##$CPDPRGT= <>
##$D= (0..31)
0 1.2 0 0 0 0 0 0 0 0 0 0.03 0 0 0 0 0 0 0 0 0 0 0 0 0 0 0 0 0 0 0 0 
##$DATE= 1563971181
##$DBL= (0..7)
120 120 120 120 120 120 120 120 
##$DBP= (0..7)
150 150 150 150 150 150 150 150 
##$DBP07= 0
##$DBPNAM0= <>
##$DBPNAM1= <>
##$DBPNAM2= <>
##$DBPNAM3= <>
##$DBPNAM4= <>
##$DBPNAM5= <>
##$DBPNAM6= <>
##$DBPNAM7= <>
##$DBPOAL= (0..7)
0.5 0.5 0.5 0.5 0.5 0.5 0.5 0.5 
##$DBPOFFS= (0..7)
0 0 0 0 0 0 0 0 
##$DE= 6
##$DECBNUC= <off>
##$DECIM= 24
##$DECNUC= <off>
##$DECSTAT= 4
##$DIGMOD= 1
##$DIGTYP= 9
##$DL= (0..7)
0 120 120 120 120 120 120 120 
##$DP= (0..7)
150 150 150 150 150 150 150 150 
##$DP07= 0
##$DPNAME0= <>
##$DPNAME1= <>
##$DPNAME2= <>
##$DPNAME3= <>
##$DPNAME4= <>
##$DPNAME5= <>
##$DPNAME6= <>
##$DPNAME7= <>
##$DPOAL= (0..7)
0.5 0.5 0.5 0.5 0.5 0.5 0.5 0.5 
##$DPOFFS= (0..7)
0 0 0 0 0 0 0 0 
##$DQDMODE= 0
##$DR= 18
##$DS= 0
##$DSLIST= <SSSSSSSSSSSSSSS>
##$DSPFIRM= 0
$$ [...]
##$SUBNAM2= <"">
##$SUBNAM3= <"">
##$SUBNAM4= <"">
##$SUBNAM5= <"">
##$SUBNAM6= <"">
##$SUBNAM7= <"">
##$SUBNAM8= <"">
##$SUBNAM9= <"">
##$SW= 24.9336996594482
##$SWIBOX= (0..15)
0 0 2 0 0 0 0 0 0 0 0 0 0 0 0 0 
##$SW_h= 4990.01996007984
##$TD= 16384
##$TD0= 1
##$TE= 0
##$TE2= 300
##$TE3= 300
##$TEG= 300
##$TL= (0..7)
0 120 120 120 120 120 120 120 
##$TP= (0..7)
150 150 150 150 150 150 150 150 
##$TP07= 0
##$TPNAME0= <>
##$TPNAME1= <>
##$TPNAME2= <>
##$TPNAME3= <>
##$TPNAME4= <>
##$TPNAME5= <>
##$TPNAME6= <>
##$TPNAME7= <>
##$TPOAL= (0..7)
0.5 0.5 0.5 0.5 0.5 0.5 0.5 0.5 
##$TPOFFS= (0..7)
0 0 0 0 0 0 0 0 
##$TUNHIN= 0
##$TUNHOUT= 0
##$TUNXOUT= 0
##$USERA1= <user>
##$USERA2= <user>
##$USERA3= <user>
##$USERA4= <user>
##$USERA5= <user>
##$V9= 5
##$VALIST= <valist>
##$VCLIST= <CCCCCCCCCCCCCCC>
##$VD= 0
##$VDLIST= <DDDDDDDDDDDDDDD>
##$VPLIST= <PPPPPPPPPPPPPPP>
##$VTLIST= <TTTTTTTTTTTTTTT>
##$WBST= 1024
##$WBSW= 4
##$XGAIN= (0..3)
0 0 0 0 
##$XL= 0
##$YL= 0
##$YMAX_a= 477390
##$YMIN_a= -655103
##$ZGOPTNS= <>
##$ZL1= 120
##$ZL2= 120
##$ZL3= 120
##$ZL4= 120
##$ABSF1= 10
##$ABSF2= 0
##$ABSG= 5
##$ABSL= 3
##$ALPHA= 0
##$AQORDER= 0
##$ASSFAC= 0
##$ASSFACI= 0
##$ASSFACX= 0
##$ASSWID= 0
##$AUNMP= <proc_1d>
##$AZFE= 0.1
##$AZFW= 0.1
##$BCFW= 1
##$BC_mod= 2
##$BYTORDP= 1
##$COROFFS= 0
##$CY= 11.3945322036743
##$DATMOD= 1
##$DC= 2
##$DFILT= <>
##$DTYPP= 0
##$F1P= 18.9103706918063
##$F2P= -1.10871071338519
##$FCOR= 0.5
##$FTSIZE= 0
##$FT_mod= 4
##$GAMMA= 1
##$GB= 0.15
##$INTBC= 1
##$INTSCL= 1
##$ISEN= 128
##$LB= 0.24
##$LEV0= 0
##$LPBIN= 0
##$MAXI= 10000
##$MC2= 0
##$MEAN= 0
##$ME_mod= 0
##$MI= 1.114404
##$NCOEF= 0
##$NC_proc= 0
##$NLEV= 6
##$NOISF1= 3.799351
##$NOISF2= 2.8
##$NSP= 1
##$NTH_PI= 0
##$NZP= 0
##$OFFSET= 15.70392
##$PC= 1
##$PHC0= -8861.956
##$PHC1= 15.20097
##$PH_mod= 1
##$PKNL= yes
##$PPARMOD= 0
##$PSCAL= 0
##$PSIGN= 0
##$REVERSE= no
##$SF= 200.130013532006
##$SI= 16384
##$SIGF1= 3
##$SIGF2= 2
##$SINO= 400
##$SIOLD= 16384
##$SREGLST= <1H.CDCl3>
##$SSB= 0
##$STSI= 0
##$STSR= 0
##$SW_p= 3612.71676300578
##$SYMM= 0
##$S_DEV= 0
##$TDeff= 0
##$TDoff= 0
##$TI= <>
##$TILT= no
##$TM1= 0
##$TM2= 0
##$TOPLEV= 0
##$USERP1= <user>
##$USERP2= <user>
##$USERP3= <user>
##$USERP4= <user>
##$USERP5= <user>
##$WDW= 1
##$XDIM= 8192
##$YMAX_p= 0
##$YMIN_p= 0
$$ End of Bruker specific parameters
$$ ---------------------------------
##NTUPLES= NMR FID
##VAR_NAME=  TIME,          FID/REAL,        FID/IMAG
##SYMBOL=    X,             R,               I
##VAR_TYPE=  INDEPENDENT,   DEPENDENT,       DEPENDENT
##VAR_FORM=  AFFN,          ASDF,            ASDF
##VAR_DIM=   8192,          8192,            8192
##UNITS=     SECONDS,       ARBITRARY UNITS, ARBITRARY UNITS
##FACTOR=    0.0002004,     1,               1
##FIRST=     0,             0,               0
##LAST=      1.6414764,     0,               0
##MIN=       0,             -655103,         0
##MAX=       1.6414764,     477390,          0
$$ Real data points
##PAGE= N=1
##DATA TABLE= (X++(R..R)), XYDATA
$$ [...]
3237a522l01K285k7k087o66K990K17k383o64K656M99k154n07K781P4k868K78K549
3255A150K09l039N72K551k32k900Q01L204j058l372J465K716j112l107J559K997
3271B404j897k876J869K785j875k981J962L003k382k513K025K428k057k729K468
3286c66J986k060j787J904J677k481j258K121J681k812j166K577J361k505j304
3301b432K573J492k922j042L229N73k702p93L222N00l066l36L232m3k468l68L117
3318A766j17k775N01K601k74k795M25K338n88k004N80J761j004j344L22K013p17
3335F89j887Q72J232o45j258O61O71k13j548N18J469l68j682P44J211N5j464N3
3353h90J449k3j583J66J463N2j695K96J500j23j374j06J797l61j197R0J796n9
$$ plain form
3237 -1522 -1823 462 435 -1652 -2318 672 889 -1494 -2158 498 997 -1157 -1664 1117 1191 -1677 -1399 1150
3255 1150 1359 -1680 -1108 1443 1211 -1689 -888 2316 1258 -2114 -649 2067 955 -2152 -593 2404
3271 2404 507 -2369 -500 2285 410 -2571 -609 2394 12 -2501 -476 1952 -105 -2834 -366
3286 -366 1620 -440 -2227 -323 1354 -1127 -2385 -264 1417 -1395 -2561 16 1377 -1128 -2432
3301 -2432 141 1633 -1289 -2331 898 1471 -1231 -2024 1198 1698 -1368 -1704 1528 1485 -983 -1351 1766
3318 1766 1649 -1126 -625 1976 1702 -1093 -668 1670 1082 -922 -342 1419 415 -929 -607 1406 689
3335 689 -1198 -326 906 261 -997 -336 335 122 -1426 -908 561 193 -1489 -745 466 521 -943 -890
3353 -890 559 536 -1047 -881 582 634 -1061 -765 735 612 -762 -868 929 568 -629 -539 1257 1198
3371A198j702N98J350k43j441J54J496k42j947R35J388n93j760O77J700p50j802
3388i84N46J951p53k060P31J979j088k187J178K516j332k444J010K449j391k247
3404b126J598K317k047j999J733K095k015k004K339J855k249j445J966J707k112
3419c87j501K161J522k098j421K737Q76k661r64K825P93k627o66K736N37k873
3435a011l41K658L76k628j19K247N52k691n45L063j40k332m26K206K75k485n4
3452a395K572m19k019N7K085l71j890K32J991l67j930L92J994m60k398J090J654
3469H18q49j409Q67J263n83j009M16J326n38r85L65J425n54p90J35J338m96j233
3487d93L81J156qj130k42J431l27j272J11J539o9j519J51J299k93j337k21J832
$$ plain form
3371 1198 -504 94 1444 1201 -240 -86 1410 1168 -779 156 1544 951 -809 -132 1568 818 -984
3388 -984 -438 1513 760 -1300 -569 1410 322 -1865 -687 1829 497 -1947 -937 1512 121 -2126
3404 -2126 -528 1789 -258 -2257 -524 1571 -444 -2448 -109 1746 -503 -1948 18 1725 -387
3419 -387 -1888 273 1795 -303 -1724 1013 1889 -772 -1736 1089 1882 -745 -1411 1325 1862 -1011
3435 -1011 -1352 1306 1682 -946 -1065 1182 1734 -957 -1502 1561 1421 -911 -1337 869 1144 -1341 -1395
3452 -1395 1177 758 -1261 -1204 881 510 -1380 -1148 843 476 -1454 -1062 932 472 -1926 -836 818
3469 818 -31 -1440 -573 690 107 -902 -486 840 302 -683 -318 1107 553 -237 -102 1236 740 -493
3487 -493 -112 1044 1036 -94 -336 1095 768 -504 -393 1146 1077 -442 -291 1008 715 -622 -843 989
3505I89n62j218K38J675l19k319O31J921o66k284R54J898p13j707P24J694o13
3522C23k031O97K052p06j855R81J704j062j626J195J326r15j509J396J340j308
3538Br13J008J612j256j525J228J584j301j616J697J296j662j249J868Q30j822
3554b19j172J792J123j886j239J935J062k135j099K098Q64k098n58J871P21k137
3570a077o07K340K14j764p59K368k97j831K78J944k88j926O20J801n70j683P78
3587d59J562n67j627P94J468k54j616O24J527k45k022N24J617l20j391K62J436
3604A313n22j146M02J016l29j400P44Q54l29j145O47R53q61r09N56Q71n50o15
3622d50J33R64p46p15M51R10o29j014N16Q88l62m49O1Q53n56q49L23J226J08j349
$$ plain form
3505 989 427 -791 -553 1122 803 -1516 -885 1036 370 -1914 -960 938 225 -1482 -758 936 323
3522 323 -1708 -1011 1041 335 -1520 -539 1165 103 -1523 -328 998 83 -1426 -30 1310 2
3538 2 -911 97 1709 453 -1072 156 1740 439 -1177 520 1816 154 -1095 773 1603 -219
3554 -219 -1391 401 1524 -362 -1601 334 1396 -739 -1838 260 1124 -974 -1532 339 1060 -1077
3570 -1077 -1684 656 870 -894 -1653 715 418 -1413 -1135 809 521 -1405 -785 1016 446 -1237 -459
3587 -459 1103 536 -1091 -297 1171 917 -699 -75 1452 1207 -815 -291 1326 1006 -385 -123 1313
3604 1313 791 -355 47 1063 734 -666 78 932 603 -542 105 1058 197 -712 -156 715 165 -450
3622 -450 -317 647 -99 -814 -363 547 -82 -1096 -580 308 -54 -503 -442 411 -145 -994 -671 555 663 -686
3642f86L22R47j31q34p7J545n26j224M21J852q55j406O20J378o71j295Q88R73
3660A241r52j196J412Q00j160p67J534j08q94p11J052O95j216n49J079Q80j455
3677c15r30J241R22j406r07J222O99j489l70J094O26j092q34J430Q04j544p50
3694a599J676Q12j719o07K104M0j670k65J998J01j902J69J942q9j954N58J683
3711A278n6j981L35J618o48j228N60J163n98j458R24J062n16j068M78J083o84
3728B64j041O54P20o38n08j39J030l18p49K62J061p06r34K97J223o57j054J048
3746a85Q14p30j043P10P83m52j254R39J134q56r11J143N62n96o70P27Q07q19n21
3765d18J013J91n28o13R42N12p40q49R02L84m51n22M88L63o44m75M85R13o62j037
$$ plain form
3642 -686 -364 583 452 -382 -459 1086 560 -664 -243 1609 754 -652 -32 1346 675 -620 268 1241
3660 1241 289 -907 505 1305 145 -622 912 804 -90 -801 251 946 -270 -819 260 1140 -315
3677 -315 -1245 -4 918 -488 -1395 -173 526 -963 -1333 -239 387 -705 -1539 -109 695 -849 -1599
3694 -1599 77 889 -830 -1437 667 707 -963 -1228 770 871 -1031 -862 1080 991 -963 -405 1278
3711 1278 1222 -759 -424 1194 546 -682 -122 1041 443 -1015 -91 971 455 -613 -135 948 264
3728 264 -777 -123 597 -41 -549 -688 342 24 -725 -463 598 -108 -1042 -745 478 -179 -1233 -185
3746 -185 629 -101 -1144 -434 349 -103 -1357 -418 716 -140 -1051 92 654 58 -612 115 922 103 -418
3765 -418 595 786 258 -355 587 1099 359 -490 412 796 345 -177 311 674 30 -445 40 953 291 -746
3785g46Q41P36r72q21M80J402j292p85J131P56j270m18J107K09j177m35J226P77
3803G49j128r68J462K77p00p29J284O09j153n74J459L56j094l64J341K06j363
3820c30m0J128L27q97m36J239K16j527rJ169L12j655m1J679o1j571j29J446N0
3839H70j635J38J775k58j635K53J449l13j872M21J628n16j679J063J075q07j110
3856a153J033J042j063j001P22J092j041n06O24Q32o22o42O35N25l47p60Q81N70
3874H21n41j005R60Q87q27o74O76P11p98q97J194L52n26o72J006M91p43r90J269
3893F94K40r27o66Q52L69q34j94N14K68j014R4P68%o78o30J261N54j432kO93K16
3914A46p47k53J053J13r77j27Q86N24j110m31R13N13o08n16P01Q89j307l26Q73
$$ plain form
3785 -746 95 831 -141 -962 -482 920 -372 -1157 -26 730 -540 -958 149 358 -819 -1254 -28 749
3803 749 -379 -1347 115 392 -308 -1037 247 856 -297 -871 588 944 -150 -514 827 1033 -330
3820 -330 -370 758 1085 188 -248 991 1207 -320 -329 840 1152 -503 -544 1135 1074 -497 -626 820 870
3839 870 -765 -627 1148 890 -745 -492 957 644 -1228 -807 821 305 -1374 -311 764 -43 -1153
3856 -1153 -120 922 -141 -1142 -420 672 -369 -875 -251 581 -41 -683 -48 477 130 -630 251 821
3874 821 280 -725 235 1122 295 -379 297 1008 210 -687 507 859 333 -339 667 1158 415 -575 694
3893 694 934 7 -659 193 562 -272 -466 48 316 -698 -604 164 164 -514 -1144 117 671 -761 -763 -70 146
3914 146 -601 -854 199 312 -665 -792 94 618 -492 -923 -10 503 -105 -621 80 969 -338 -664 209
3933B09N65q58m61J173L24p89o84J374r0j147J66R64j17j127M21N47j2r11Q4R44
3953E75J63j511O5J318j38j369J5J277J94j582R2J353j30j390O02J123n86r93
3971i22j2J142k3j265M18J260k93j295O35J149n14r95N37J161n90j031P30Q17
3989I09n03j067P47J082r82j100J067J088j296l36Q30N29q30j069J534L73j040
4006f4o44P83Q85j130n54Q59L38p55l30N11P87j024o77R86L22p66n26J069J44
4025B14q41m43J119L28j486L26Q73O12j075o12J320O9j099M0J115Q2p58l38J115
4044E61M3j137l3J265R6j135n3J272r7p61l14J114k11p40Q0P48J49j168j0J061
4064G30k62j031J58O57K89r02j11J028j6j128J44R01L4j453J60J232J4j447L54
$$ plain form
3933 209 774 -84 -545 628 952 163 -521 853 763 -384 -218 746 629 -498 -77 470 458 -453 -369 575
3953 575 738 -773 -708 610 472 -897 -882 395 589 -993 -901 452 322 -1068 -466 657 71 -922
3971 -922 -934 208 185 -1080 -662 598 305 -990 -355 794 280 -715 -178 983 393 -638 92 909
3989 909 406 -661 86 1168 186 -914 153 1241 -55 -391 439 968 138 -931 603 976 -64
4006 -64 -708 75 960 -170 -724 135 473 -282 -612 -101 686 -338 -1015 -29 293 -473 -999 70 214
4025 214 -627 -1070 49 377 -1109 -783 90 702 -373 -985 335 404 -695 -655 460 542 -216 -554 561
4044 561 604 -533 -566 699 795 -340 -393 879 782 21 -293 821 610 -130 -50 698 847 -321 -331 730
4064 730 468 -563 -405 252 541 -361 -472 556 540 -588 -444 457 491 -962 -802 430 444 -1003 -649
4083f49J217l87j310L86J366k41j205J35J246k9j193J86R83m7j540P26J504p20
4101D28j183J037P14l96j271Q03Q60k17j146M34J185r07r91R60J205r40j550R74
4119aJ261r70j691J577J010j372q86R95N48m64p40M07J116j245o83J087P56j126
4137d21q81J016R58j073q99J494O22j586o20J648J01q80m06J104N71j583K6J080
4155B71O71j472j15J336K88j197k33J082L54j322l60J432J44r71l76J089L64j203
4173b18j77R02M9q84j90O49M16r39j81J088J04j351J84Q38J25j236J38J108J51
4192E76j591J13R58O5j122J73J184r6j199J76J343l31j163OJ580M4j214k09J356
4211F49j83j053K07J240m39o41k0J177l16j011M25R33l47r43n3J336l12j620Q07
$$ plain form
4083 -649 568 181 -1129 -743 623 382 -823 -688 558 529 -664 -478 505 458 -1082 -356 1148 428
4101 428 -755 282 996 600 -671 132 992 775 -371 63 1248 341 -650 310 1515 575 -975 -1
4119 -1 1260 290 -1401 176 1186 -186 -1072 -77 471 7 -733 -326 790 -455 -1138 -51 705 -421
4137 -421 -1302 -286 672 -401 -1300 194 816 -770 -1390 258 359 -521 -927 177 748 -835 -809 271
4155 271 942 -530 -645 691 979 -218 -451 631 985 -337 -697 735 879 -92 -468 621 985 -218
4173 -218 -395 507 556 -328 -518 131 547 -392 -573 515 619 -732 -548 290 415 -821 -683 425 576
4192 576 -1015 -902 56 121 -1001 -828 356 260 -939 -763 580 249 -914 -908 672 716 -498 -707 649
4211 649 466 -587 -380 860 421 -220 -240 937 621 -390 35 968 621 -322 -375 961 649 -971 -164
4230a64J220n16j166K50J645j183j059Q00J148r02j139N40J185o55j481J258Q19
4247F00n58j596J154J344j183j042P47J281r24p99R13R92r84j025O73J316q49
4264F0j043J123J218j503p33J111K13m32m85R63R55j138j173J204R41j430m12
4281e61J327N16j106q76J150P33j421n50J140P34j576n23J652J31j300l58J231
4298C43J73r87m42J662l83j131J44J082o4j457L95J318o62q56L25Q62L2j073M80
4317b39R00m28o84j74J200k3j126P4J068O1j190J63J367j67j179j57J435L71j551
4336b79j73J421j31j242J91J316m37j170r5J661o08j261P31O73k49j167P00R07
4354G88m37j305Q45N96l46j148L92J425q33r65L47J008k83j294P84J098q40j045
$$ plain form
4230 -164 1056 540 -626 -376 1269 86 -973 -173 975 73 -1066 -526 659 4 -1477 -219 600
4247 600 42 -1554 -400 944 -239 -1281 -534 747 -177 -976 -63 929 -55 -1080 -407 909 60
4264 60 -983 140 1358 -145 -878 233 446 14 -471 492 1447 309 -864 340 1281 -149 -561
4281 -561 766 1282 176 -700 450 1183 -238 -788 352 1086 -490 -1013 639 770 -530 -888 343
4298 343 516 -471 -913 749 366 -765 -621 461 397 -1060 -665 653 -9 -865 -540 322 354 -719 -239
4317 -239 661 233 -451 -625 575 552 -574 -500 568 629 -561 -398 969 802 -377 -534 901 1272 -279
4336 -279 -452 969 838 -404 -213 1103 666 -504 -599 1062 454 -807 -76 597 348 -819 -119 788
4354 788 351 -954 -109 487 141 -1007 -615 810 -23 -988 -641 367 84 -1210 -426 672 -168 -1213
4372a213P79J475r33j013O92J161p05j494J148J333j076j266J336J144j263r03
4388g98J020J111j409o64J028O20r86q23J252P49j203p71J282N40j367q63J332
4405E0J008j747l23J513M98j573o28J545K82j060r14J516N03j030q20J506N23
4422H49j707k00J693K28j344n97J490K32j199k3J020N71j423k64J519o4j541L21
4440d39J652m87j769N74J230J5j340J47J297J44j746L66J371r2j188l25J555l5
4458I30j565R7J177j56j241K9J252j48j299J85J247k70r48K2J558n80j506L57
4476h59J344n1j878N39J704p29j140L77J601n15j749J118R48j52j814P83J517
4493A044o77j159P89J178q26j330P82J591p38j476O79J675j322q42P26J147r46
$$ plain form
4372 -1213 -434 1041 108 -905 -213 948 243 -1251 -103 1230 154 -1112 224 1368 105 -798
4388 -798 222 1333 -76 -740 288 908 -78 -901 351 1100 -103 -874 408 948 -419 -1282 50
4405 50 1058 -689 -1012 501 999 -574 -1202 343 625 -435 -1349 167 670 -360 -1180 326 849
4422 849 -858 -1058 635 863 -481 -1078 412 644 -555 -578 442 1013 -410 -674 845 781 -760 -439
4440 -439 1213 726 -1043 -469 761 776 -564 -417 880 1024 -722 -356 1015 923 -265 -590 965 930
4458 930 -635 -538 639 483 -758 -729 523 375 -924 -739 508 238 -710 -688 870 290 -1216 -859
4476 -859 485 434 -1444 -905 799 70 -1070 -693 908 393 -1356 -238 710 558 -1256 -473 1044
4493 1044 367 -792 -3 1175 349 -981 -199 1392 654 -822 -143 1532 210 -632 94 1241 295
4510B95j470J465O80n74j252Q13J207j021j063R04J661j523j349J155J013j514
4526e73r14J372J079j230j009J275Q24j191r14J098P74j109o90J091J269j794
4542f42n75J697P92j389p91J294O73j405o14J466O72j657l43J456O86j780k43
4559g03J631K18j627j98J400M70j595m11J669L28j492l68J441L46j766l02J698
4576G39j94j210j41J279J2j316j81J308k5j200J26J245L0j567K84J215j53j369
4594a118M26J298Q1j795M91J285k8j207j5J460j20j610M5J551m22j154L83J806
4612A357m99j718M51J664j50j944P10J043k77j435N10J640o85j470N25J229j95
4629G56j652N69J293o95j484N70J595o08j728Q28J852j100j814J351J441r70j714
$$ plain form
4510 295 -1175 290 970 396 -856 -43 1164 143 -920 -16 1645 122 -1227 -72 941 -573
4526 -573 -1487 -115 964 -266 -1275 0 824 -367 -1281 -183 591 -518 -1208 -117 1152 -642
4542 -642 -1217 480 1272 -117 -908 386 1059 -346 -960 506 1178 -479 -822 634 1320 -460 -703
4559 -703 928 1146 -481 -679 721 1191 -404 -815 854 1182 -310 -678 763 1109 -657 -959 739
4576 739 545 -665 -806 473 485 -831 -1012 296 271 -929 -803 442 472 -1095 -811 404 251 -1118
4594 -1118 -692 606 687 -1108 -617 668 640 -567 -582 878 758 -852 -807 744 322 -832 -449 1357
4612 1357 858 -860 -409 1255 1105 -839 -129 914 637 -798 -288 1352 667 -803 -278 951 756
4629 756 -896 -327 966 271 -1213 -643 952 344 -1384 -556 1296 196 -1618 -267 1174 204 -1510
4646a510J132J454j250j321J452J064j067j616J285J563j265j157J319Q57j015
4661g5p70R53J285j339j260J370J125j302q81J450R04j806m74J273Q25j631n76
4678i29J671L63j411p08J628O08j775n91J854K13j503p35J783N00j829l06J646
4695D79Q11j928m21J890o9j171n08J178N30j385o65J852j14j267j09J710q5j441
4713g13m4J310K74j440J51J058J60j400K86J156J5j410l4J575r7j425J68J381
4731I71m11j303L01J585j72j731J85J577p0j659Q6J455Q9j729J71J465m38j397
4749a025N26J156k13j624O33J373k45j800P13J753r39j763R76J252p06j473R68
4766d38J402p68j450R64J523r83j616Q76K004j225j549J023J909j200j542P35
$$ plain form
4646 -1510 -378 1076 -174 -1495 -43 1021 -46 -1662 -377 1186 -79 -1236 83 940 -75
4661 -75 -845 108 1393 54 -1206 164 1289 -13 -894 556 1460 -346 -820 453 1278 -353 -929
4678 -929 742 1105 -306 -1014 614 1222 -553 -1144 710 923 -580 -1315 468 968 -861 -1167 479
4695 479 1290 -638 -1059 831 762 -409 -917 261 791 -594 -1259 593 479 -788 -897 813 728 -713
4713 -713 -757 553 827 -613 -462 596 756 -644 -358 798 813 -597 -631 944 847 -578 -410 971
4731 971 560 -743 -442 1143 971 -760 -575 1002 932 -727 -641 814 903 -826 -655 810 372 -1025
4749 -1025 -499 657 444 -1180 -547 826 581 -1219 -506 1247 308 -1455 -479 773 67 -1406 -438
4766 -438 964 196 -1254 -290 1233 250 -1366 -490 1514 289 -1260 -237 1672 472 -1070 -335
4782c35J883j192j707J360J308j241j281J251J342j178j266J180J519j724j196
4797a277J259J599j746j231J700P49j347j317J759R36j546j057J754R28k050j036
4813a923J771J282j309r93J350P61j494p65K013Q70k146p63J801Q79j538q40J703
4830F59L45j316m26J176O71j441l17J251Q47j951m52J960l2j443k81J579N35j914
4848e50j91J389L87j598l27J565J21j530j87J707K5j482m78K037P2k008M9J339
4866C40L58j515J4J248M85k029K55J620k70j485jJ593J55j963L29J907n28j434
4884i21J07K092o64j577N7K149n43j893O52J852k45k109L24J920l16k148Q83J370
4902I90n54j465N19J706n41j387L64J608p98j538R67J377r61j226O28J596j018
$$ plain form
4782 -335 1548 356 -1351 9 1317 76 -1205 46 1388 210 -1056 124 1643 -81 -1277
4797 -1277 -18 1581 -165 -1396 304 1053 -294 -1611 148 1084 -462 -1519 235 1163 -887 -1923
4813 -1923 -152 1130 -179 -1172 178 939 -555 -1320 693 1563 -583 -1346 455 1334 -204 -1044 659
4830 659 1004 -312 -738 438 1109 -332 -649 602 1449 -502 -954 1006 974 -469 -750 829 1364 -550
4848 -550 -741 648 1035 -563 -890 675 796 -734 -921 786 811 -671 -1149 888 960 -1048 -999 340
4866 340 698 -817 -803 445 930 -1099 -844 776 506 -979 -980 613 768 -1195 -866 1041 513 -921
4884 -921 -814 1278 614 -963 -906 1243 700 -1193 -541 1311 1066 -1043 -719 1201 885 -1263 -380 990
4902 990 436 -1029 -510 1196 655 -732 -368 1240 442 -1096 -129 1248 287 -939 -311 1285 267
4919B67j837J336J317r86j583J047J767j736q74P71J381r25j526J404J461j566
4935b82j226J467J287j122j288J126J461j439j177J470J092j046j681J561J274
4950A477j508j268J763P94j530m47J163Q00j788l66J588N47j395r82J641M02j231
4967c40m88J331N27j713j81J624K72j707l82J543J60j503o11J830M81j715j80
4984a052J220O11j389l70J352L93j312n05J397O06j392o15J835l4j373j62J470
5001F80K67j614k18K004m27j417J35J687j4j847J36J815n33j423QJ854k27j735
5019h69M80J512k42j968M09J513k06j683L02J587k10j998M98J644m25j541K20
5036i77J999m77j794M86J894j251j192P20J535n41j963J523J155r04j757J289
$$ plain form
4919 267 -1570 -234 1083 97 -1486 -439 1328 -408 -1282 -511 870 -55 -1581 -177 1284 -282
4935 -282 -1508 -41 1246 124 -1164 -38 1423 -16 -1193 277 1369 323 -1358 203 1477
4950 1477 -31 -1299 464 1258 -272 -719 444 1244 -544 -910 678 1225 -170 -1152 489 891 -340
4967 -340 -828 503 1030 -683 -864 760 1032 -675 -1057 486 646 -857 -1468 362 843 -872 -1052
4984 -1052 168 779 -610 -980 372 765 -547 -1052 345 951 -441 -1056 779 745 -628 -790 680
5001 680 947 -667 -885 1119 692 -725 -590 1097 1083 -764 -628 1187 654 -769 -761 1093 866 -869
5019 -869 -389 1123 881 -1087 -678 835 629 -1054 -752 835 625 -1373 -875 769 344 -1197 -977
5036 -977 1022 545 -1249 -763 1131 -120 -1312 -592 943 402 -1561 -38 1117 213 -1544 -255
5052b55J781j436j255J122J383j068j621J232J797j466j599J362J599j251j803
5067a478J674J331j509j183J378J203j423r41J193R76j344j369J739R90j483j016
5083a262J588J022j908o79J300J035j486j138J917O88j719o67J490Q99j790o65
5099a375J588N93j571p38J803J075j925q92J786J013k121j60J379P35j934n57
5115a301K025K46j358n71J728J73j337o69K140J11j651k01J628P7j798j4J563
5132G91K91j883r7K017O7k260k5J569L68j715m09K026M95k315k09K126j93j637
5150i93l11J969J61j799p1K101j70j865K32J792l81k059O53J641q2j699R1K055
5168A265l05k040L81K082o95k056J233J534o02j893O38J858m98j935L67K315p57
$$ plain form
5052 -255 1526 90 -1165 -43 1340 272 -1349 -117 1680 214 -1385 -23 1576 325 -1478
5067 -1478 196 1527 18 -1165 213 1416 -7 -948 245 1221 -123 -1492 247 1237 -246 -1262
5083 -1262 326 1348 -560 -1239 61 1096 -390 -1528 389 1077 -642 -1309 181 1080 -710 -1375
5099 -1375 213 806 -765 -1503 300 1375 -550 -1442 344 1357 -764 -924 455 1190 -744 -1301
5115 -1301 724 970 -388 -959 769 942 -395 -1064 1076 1187 -464 -665 963 1040 -758 -772 791
5132 791 1082 -801 -898 1119 1186 -1074 -1099 470 838 -877 -1286 740 1235 -1080 -1289 837 644 -993
5150 -993 -1304 665 826 -973 -1044 1057 887 -978 -746 1046 665 -1394 -741 900 818 -881 -790 1265
5168 1265 960 -1080 -699 1383 688 -1368 -135 1399 797 -1096 -458 1400 902 -1033 -666 1649 892
5185H92k205Q67K213j143j906J064J647q80j944J074J699j473j211R19J781j129
5201B65j885J371J397j217j570J027J755j276j353J476J330j451j356J363J295
5216A171j160j619J544J331j154j595J557J411j571r66J337R43j108j296J286
5231A11J178j388r19J659O52j641q37J611Q53j534r49J592O81j640n60J464R60
5248A293j931p21K049M64j631o50J338J144k108p17J765R44j939n61J492O40j444
5265e73o99J832O78k070n07J752O74j820m16J802N71k057rJ181P86j642k39J570
5283H14L90j898r9J736L15k015j75J969o7j765q0K135L3k353q2K293j11j929Q9
5302h00J909l40j921L07K153n71j782K66K144r26j542J32J882k94j988O58J711
$$ plain form
5185 892 -1313 -446 1767 624 -1282 -218 1429 549 -1395 -321 1378 -95 -1306 -387 1394 265
5201 265 -1620 -249 1148 -69 -1639 -612 1143 -133 -1486 -10 1320 -131 -1487 -124 1171
5216 1171 11 -1608 -64 1267 113 -1482 75 1486 -85 -1051 286 1229 121 -1175 111
5231 111 1289 -99 -1018 641 1293 -348 -1185 426 1279 -255 -1204 388 1069 -571 -1131 333 1293
5248 1293 -638 -1359 690 1154 -477 -1127 211 1355 -753 -1470 295 1239 -700 -1261 231 871 -573
5265 -573 -1272 560 1238 -832 -1339 413 1087 -733 -1149 653 1224 -833 -842 339 1125 -517 -756 814
5283 814 1204 -694 -793 943 1258 -757 -932 1037 970 -795 -875 1260 1293 -1060 -1142 1151 1040 -889 -800
5302 -800 1109 769 -1152 -845 1308 737 -1045 -779 1365 439 -1103 -971 911 617 -1371 -713 998
5319I98k11k008L97J852p23j467M77J860j124j577J235J460p65j623Q91J531j234
5336c1j130P67J513q22j759J488J594j446j436P27J982r92j461J171J132p18j730
5353a151J267J150q33j743J484J084j247q76P85J265j319j157J264J376j478j056
5369a185J307J096j468j057J390J030j313j188J838N02j690q15J686J189j654
5384c32j024J658O80j446j035J832J230j951r66J919P28j928m85J588P05j379
5400b06q83J511O89j753n52J703J002k314j53K026K60j535j016K119L55k094k67
5417a108J865M29k415k41K200L26j785n00K371j45k120J10J895J99k146j08J949
5434G76l35j585P9K098k10j938l52K435J6k258M38J396J04j903M79J839j46k100
$$ plain form
5319 998 787 -1221 -824 1028 305 -1162 -685 1175 51 -1526 -291 1169 404 -1219 -328 1203 -31
5336 -31 -1161 -394 1119 297 -1462 26 1620 174 -1262 -535 1447 455 -1006 165 1297 579 -1151
5353 -1151 116 1266 433 -1310 174 1258 11 -865 -80 1185 -134 -1291 -27 1349 -129 -1185
5369 -1185 122 1218 -250 -1307 83 1113 -200 -1388 450 952 -738 -1553 133 1322 -332
5384 -332 -1356 302 982 -464 -1499 333 1563 -388 -1354 565 1293 -635 -1120 468 1173 -206
5400 -206 -1089 422 1111 -642 -1194 509 1511 -803 -956 1070 1330 -205 -1221 898 1253 -841 -1108
5417 -1108 757 1186 -1229 -1470 730 1056 -729 -1229 1142 997 -1123 -1013 882 1081 -1065 -1173 776
5434 776 441 -1144 -1065 1033 823 -1115 -1467 968 984 -1274 -836 560 664 -1239 -760 1079 933 -1167
5452a167P23J776m82k077P50K131j158j880J004J939q15j908R85J561r68j591
5468a177Q80J709o88k207R06J821r42j594Q48J905j304j593J260J346r80j597
5484a407J220J514j169j682J523J470j266j670J531J167j230j217J063J299j039
5499A07j496J273J457j383j143J325J074r27j639J527J083j011j506J408J212
5514A361j130j280J432R09r15j574J170J413j438j178J661Q58j377j307J808R18
5530A331j563r50J396J142k003j052J994Q35j633p42J691Q19j960p71J653J257
5546A444k304q03K072P59j857o28J902O13j787j119K346M23j847n29K182N31j979
5563e81m17K076K74k140k43K056M03k111J11J575N8k113J67K027L92k613L22K093
$$ plain form
5452 -1167 -444 1332 850 -1227 -477 1654 496 -1384 -380 1559 744 -1164 -179 1382 414 -1177
5468 -1177 -297 1412 724 -1483 -577 1244 302 -1292 -444 1461 157 -1436 -176 1170 190 -1407
5484 -1407 -187 1327 158 -1524 -1 1469 203 -1467 64 1231 1 -1216 -153 1146 107
5499 107 -1389 -116 1341 -42 -1185 140 1214 287 -1352 175 1258 247 -1259 149 1361
5514 1361 231 -1049 383 1292 377 -1197 -27 1386 -52 -1230 431 1289 -88 -1395 413 1331
5530 1331 -232 -1182 214 1356 -647 -1699 295 1130 -503 -1245 446 1265 -695 -1466 187 1444
5546 1444 -860 -1663 409 1168 -689 -1317 585 1198 -589 -1708 638 1061 -786 -1315 867 1398 -581
5563 -581 -998 1078 1352 -788 -1031 1025 1428 -683 -572 1003 1061 -1052 -885 1142 1534 -1079 -757 1336
5581A336k90j925o7K178k46k050M23K076n96j844K81J755n16j950N71J704j05
5598G35k048L42J721n05j714O34J891o23j763L61J601k48j341K34K127j110j605
5615a311J020J567r32j738R07J806p94j684P63J528q15j548R06J807j005j697
5631a220J193J524j033j510R14J781j406j196P70J286r72j348R49J464r80j318
5647a102R29J569j390j164J007J162j047j457J602R43j207j221J294J325j616
5662c73j320J593J180j664q08J523J314j560j257J516J367j525j219J621J322
5677A710j799j244J840J108k051r96J764J103j783r38J883Q97k018m83J824O85
5693A502k314k69J915L91j856n40J964K25j541p30K226J22k217l8J969R8j959
$$ plain form
5581 1336 1046 -879 -946 1232 986 -1064 -641 1435 839 -1005 -724 1031 515 -1435 -864 840 735
5598 735 -1313 -971 750 245 -1469 -835 1056 433 -1330 -969 632 384 -957 -723 1404 294 -1311
5615 -1311 -291 1276 344 -1394 -487 1319 525 -1159 -396 1132 317 -1231 -325 1482 477 -1220
5631 -1220 -27 1497 464 -1046 -132 1649 243 -953 -183 1103 131 -1217 -268 1196 216 -1102
5647 -1102 -173 1396 6 -1158 -151 1011 -36 -1493 109 1052 -155 -1376 -82 1243 -373
5662 -373 -1693 -100 1080 -584 -1392 131 1445 -115 -1372 144 1511 -14 -1233 388 1710
5677 1710 -89 -1333 507 1615 -436 -1432 332 1435 -348 -1286 597 1494 -524 -1007 817 1502
5693 1502 -812 -1081 834 1225 -631 -1171 793 1018 -523 -1253 973 1095 -1122 -1160 809 907 -1052
5710a052k7K262l08k070q3J967L7j766O9K017n31j264j37J681Oj898L57J804m47
5729F17j511J44J618j54j638K23J912k35j932L45J931q44j586M38J719j10k163
5746a226N91K017p43j517K23J757n09j589M28J921p57j692N78J581n67j702M78
5763g28J941p63j681R32J369n22k042P26J844r57j586J021J536j008j543R69J565
5780A073q72j807J282J759j151j845J264K068j680j353J301J531j478j500J395
5795a3J489j436j463J465J382j134j685J523J324j575j056J329J232j298j666
5810a582J910J287j958j220J771J301j746r91J450J048j733r94J756J197j882
5825c86r84J895R13k175r88K170N85j635r05J999Q11k042q01K254M36j684m31
$$ plain form
5710 -1052 -1079 1183 875 -1195 -1278 689 726 -1040 -971 1046 515 -749 -886 795 801 -1097 -740 1064 617
5729 617 -894 -750 868 714 -924 -701 1211 976 -956 -611 1320 476 -1110 -672 1047 937 -1226
5746 -1226 -635 1382 639 -878 -655 1102 593 -996 -568 1353 596 -1096 -518 1063 496 -1206 -728
5763 -728 1213 450 -1231 -299 1070 548 -1494 -768 1076 119 -1467 -446 1090 82 -1461 -492 1073
5780 1073 201 -1606 -324 1435 284 -1561 -297 1771 91 -1262 39 1570 92 -1408 -13
5795 -13 1476 40 -1423 42 1424 290 -1395 128 1452 -123 -1179 150 1382 84 -1582
5810 -1582 328 1615 -343 -1563 208 1509 -237 -1228 222 1270 -463 -1457 299 1496 -386
5825 -386 -1370 525 1438 -737 -1725 445 1030 -605 -1510 489 1300 -742 -1543 711 1147 -537 -968
5842i68J703L97j909m38K140K92j658p18J987K77j803KJ567J80j975M8J806O0
5860I90k158L37J742J93j984J96J564R3j887K01J757q2j842j81K160j99k021j31
5878a252K313j08k235M91J853n90j777P15J815l52j960L71J685Qk204N04K015
5895A292n99k017N39J905o24j898P44K025r36j594P31J953o13k205Q24J843l74
5912I96k488P40K252q59j789O35K156j147j747R40J848j084j812Q36K153j264
5928C66j479P90J600j363j274J193J580j353j353J192J365j167j741J747J321
5943A424j731j118J462J483j773j336J622J207j182j572J699J149j778j110J812
5958B58J174j690j220J789J270k030o71J671P22j562p35J661R13j786p41J712
$$ plain form
5842 -968 735 1132 -777 -1215 925 1217 -441 -1159 828 1105 -698 -696 871 1051 -924 -876 930 990
5860 990 -1168 -831 911 1104 -880 -684 880 973 -914 -713 1044 962 -880 -1061 1099 900 -1121 -1252
5878 -1252 1061 953 -1282 -791 1062 472 -1305 -590 1225 873 -1087 -716 969 977 -1227 -723 1292
5895 1292 693 -1324 -785 1120 496 -1402 -658 1367 431 -1163 -432 1521 908 -1297 -473 1370 996
5912 996 -1492 -752 1500 641 -1148 -513 1643 496 -1251 -311 1537 453 -1359 -523 1630 366
5928 366 -1113 -323 1277 -86 -1360 -167 1413 60 -1293 -101 1264 97 -1644 103 1424
5943 1424 -307 -1425 37 1520 -253 -1589 33 1240 58 -1514 185 1334 -444 -1554 258
5958 258 1432 -258 -1478 311 1581 -449 -1120 551 1273 -289 -1024 637 1550 -236 -977 735
5974G35M09j611q56J771N65j241p96J749K92j595n71J843L99j645p39J574M25
5991G08j519n53J964L41j887j3J404O55k000j81J828M30j868m74J753J34j611
6008h89j91J753L61j927j01J738J06j702O1J841l53j605K28J954l80j596m2J779
6026A035m1j848J49J861n10j767Q31J402m17j650L39J913l94j911O5K030m26j943
6044a282M95J949m77j854L55K157j017j494O47J638p58j509O12J723p88k091J286
6061d08J610q79j943J192J794j220j542J137J642j172j562J264J565r79j774J206
6077f9J546j506j309J376J417j380j251J242J472j500j222J490J261j233j469
6092a135J248J053j626n99J286J236j876p17J544R15j713r76J770O68j601j112
$$ plain form
5974 735 1144 -467 -1323 448 1013 -228 -1024 725 1017 -578 -1149 694 1093 -552 -1291 283 708
5991 708 -811 -1364 600 941 -946 -959 445 1100 -900 -1081 747 1177 -691 -1165 588 722 -889
6008 -889 -1080 673 1034 -893 -994 744 850 -852 -791 1050 697 -908 -680 1274 894 -702 -744 1035
6026 1035 994 -854 -705 1156 646 -1121 -290 1112 695 -955 -616 1297 903 -1008 -943 1087 661 -1282
6044 -1282 -787 1162 685 -1169 -814 1343 326 -1168 -521 1117 359 -1150 -538 1185 397 -1694 -408
6061 -408 1202 323 -1620 -428 1366 146 -1396 -259 1383 211 -1351 -87 1478 499 -1275 -69
6077 -69 1477 -29 -1338 38 1455 75 -1176 66 1538 38 -1184 306 1567 334 -1135
6092 -1135 113 1166 -460 -1059 227 1463 -413 -1130 414 1329 -384 -1360 410 1078 -523 -1635
6108a635J776R81j667q25J746J041j896q06J754Q41j956o42J853M08j187r51J679
6125E14N61j555p51J805Q47j886p66J988M09j679o44K079L50k003j36J649M75
6142A257j977J88J058M77j586j87J675K16j873l24K058j53j683l85K461K06k678
6159a250J29J933K69j970j90J984j56k046K04J822L03k135NK175j51j938R6J937
6177A021r4j878J7K444o56k028M33K075p17j968O91K099n83k136R08J966q93k022
6195a321R28J579o26j942Q08J980p64j958R98K064j088k069J015J425r02j570
6211a443J121J529j011j987J561J426j296j464J224J491j063j333J101J466j220
6226A02j483J322J463j317j492J706R91j560j519J796J335j335j374J242J398
$$ plain form
6108 -1635 141 1122 -545 -1370 376 1417 -479 -1285 469 1310 -646 -1288 565 973 -214 -1165 514
6125 514 1075 -480 -1231 574 1421 -465 -1231 757 1166 -513 -1157 922 1272 -731 -867 782 1257
6142 1257 -720 -532 526 1003 -583 -770 905 1121 -752 -1076 982 829 -854 -1239 1222 1428 -1250
6159 -1250 -1121 812 1081 -889 -1079 905 749 -1297 -1093 729 1032 -1103 -1098 1077 926 -1012 -916 1021
6177 1021 927 -951 -934 1510 854 -1174 -741 1334 617 -1351 -660 1439 856 -1280 -372 1594 701 -1321
6195 -1321 -393 1186 560 -1382 -574 1406 642 -1316 -318 1746 658 -1411 -396 1029 127 -1443
6211 -1443 -322 1207 196 -1791 -230 1196 -100 -1564 -340 1151 88 -1245 -144 1322 102
6226 102 -1381 -59 1404 87 -1405 301 1292 -268 -1787 9 1344 9 -1365 -123 1275
6241A275j458j491J795J196j723q85J630J284j876j040J430J258j694q30J511
6256C82P55j299p05J259N61j366m99J250Q38j604j035J875O68j762o99J679R63
6273A261j473q93J559N42j611p28J622R55j832p80J848M52j479q39J942N65j809
6290f98k31J706N67k057m10J920J67j541m70J935k6j698oJ711j00j399k43J768
6308H95Q9k044O0J815Q7j865j45K293j83k193Q1K271j43j997L39K164n66j938
6326i80J51K071n95j892K76J592J88j911O48J377o00j757R03J515n79j291M72
6343d12J812p23j912O65J699r34j469J038J417j072q83N36J562p78j579J058J320
6360A345j194j426J306J044o77j639J139J162q54j391J334R14j082q95R73J086
$$ plain form
6241 1275 -183 -1674 121 1317 -406 -1291 339 1623 -253 -1293 137 1395 -299 -1129 382
6256 382 1137 -162 -867 392 953 -413 -912 338 1176 -428 -1463 412 1080 -682 -1381 298 1261
6273 1261 -212 -1105 454 996 -615 -1343 279 1234 -598 -1378 470 922 -557 -1396 546 1111 -698
6290 -698 -929 777 1344 -713 -1123 797 964 -577 -1047 888 862 -836 -842 869 769 -630 -873 895
6308 895 984 -1060 -1000 815 902 -963 -1108 1185 1002 -1191 -1110 1161 1018 -979 -640 1524 958 -980
6326 -980 -829 1242 647 -1245 -969 623 811 -1100 -452 925 325 -1432 -529 986 407 -884 -412
6343 -412 1400 677 -1235 -570 1129 195 -1274 -236 1181 109 -774 -238 1324 546 -1033 25 1345
6360 1345 151 -1275 31 1075 398 -1241 -102 1060 206 -1185 149 1063 -19 -914 59 1145
6376A145j240j218J283J163j523r69J423Q74j266q73J457R19j524j154J458J462
6392A417j812r24J720O88j430j061J648J060j687r55J475J147j664l68R28J308
6408A490j757q56J509Q03j131j002J455O93j616m52J480M78j688n07J596O32j237
6425a10r34J734O13k008l91J992O47k271l55K154l4k163k52K123J54j823k95K222
6443A003n7j580j14J790k56j708j39K020p8k028L7K404l94j785j56J946q2k006
6461a183M69J773j99j928M97J859m27k157N77J852l58j811K82K236n29k269J222
6478i4J665r95j620M03K100r22j461N94J669n76j935P95J632q82j970J126J533
6495A062q85j577J190J396q99j607J105J477j106j546J176J473j275j233R06J645
$$ plain form
6376 1145 -95 -1313 -30 1133 -390 -1359 64 938 -328 -1201 256 1175 -349 -1503 -45 1417
6392 1417 -395 -1319 401 1089 -341 -1402 246 1306 -381 -1336 139 1286 -378 -746 182 1490
6408 1490 -267 -1123 386 1189 58 -944 511 1204 -412 -864 616 1094 -594 -1101 495 1127 -110
6425 -110 -1044 690 1303 -705 -1096 896 1543 -728 -1083 1071 1037 -1126 -1378 745 899 -924 -1219 1003
6443 1003 946 -634 -748 1042 786 -922 -1061 959 881 -1147 -1110 1294 900 -885 -1041 905 823 -1183
6461 -1183 -714 1059 860 -1068 -571 1288 861 -1296 -719 1133 775 -1036 -754 1482 953 -1316 -94
6478 -94 1571 576 -1044 -641 1459 537 -924 -330 1339 763 -1172 -377 1255 373 -1597 -471 1062
6495 1062 177 -1400 -210 1186 287 -1320 -215 1262 156 -1390 -214 1259 -16 -1249 -343 1302
6511A302j285j329J355J422j389j320J223J260j301j181J097J854j590j446J466
6526A38J147o45j934J310J702j612j040Q44J585j364j489J518J218j050j451J253
6542A30J259j268j408J305J182j459q96J427J015j783q54J875J038k070q89J944
6558E48O25j318j537K173Q91k040n93J647P83k010n57J888N69j586q41J620R54
6575A216j626o83J910O08k250l56J864L16j621m57J889O45k276M5J864r8j713
6592g23k99J625O60k382P3K234q1j954k42K112j92j714o9J912L9k045k7K139Q2
6611A148j853m63K088j95j900K03J840k7j864N5K179j72k194M02J870m12j836
6628a131P77J406m52j710O11J551n33j387N85J670p22j955R43J570r61j296L53
$$ plain form
6511 1302 17 -1312 43 1465 76 -1244 -21 1239 -62 -1243 -146 1708 118 -1328 138
6526 138 1285 640 -1294 16 1718 106 -934 -90 1495 131 -1358 160 1378 328 -1123 130
6542 130 1389 121 -1287 18 1200 -259 -1155 272 1287 -496 -1350 525 1563 -507 -1396 548
6558 548 1173 -145 -1682 491 1382 -658 -1251 396 1179 -831 -1388 500 1069 -517 -1358 262 1216
6575 1216 -410 -1093 817 1425 -825 -1181 683 999 -622 -1079 810 1455 -821 -776 1088 990 -723
6592 -723 -1022 603 1263 -1119 -1046 1188 1107 -847 -1089 1023 831 -883 -952 960 999 -1046 -1073 1066 1148
6611 1148 -705 -1168 920 725 -1175 -972 868 841 -1023 -968 1211 1039 -1155 -753 1117 705 -1131
6628 -1131 -354 1052 600 -1110 -499 1052 519 -868 -283 1387 665 -1290 -347 1223 262 -1034 -681
6645f81K200q66j420L04J725p52j521M02J837m25j807M75J746q97j577P37K159
6662A639j273j574Q56J308p32j458P95J828j468j283J289J250j150j278J176J139
6678A064r69j384J301J522j517j200J413J075j463j141J527R81j325j018J198
6693F4J385j596j277J689J018j079j397J819P14j753q01J640R54j826o54J741
6709F41M93j691l45J582Q38k043n51J711O14j922n14J992L00j702n65K080j29
6726G89j260q02J849L69j765l26J619J97j496J27J374J89j696q3J537N9j373J0
6744f82J472K2j849L15J529K09j879J81J646j85j564K13J513j59j606J39J685
6761A000k44j827N85J632n90j595K22J809o14j626O77J399o6j646K44J883n80
$$ plain form
6645 -681 1519 653 -767 -463 1262 510 -1011 -609 1228 803 -1004 -529 1217 320 -1257 -520 1639
6662 1639 366 -1208 -352 956 224 -1234 -439 1389 -79 -1362 -73 1177 27 -1251 -75 1064
6678 1064 95 -1289 12 1534 17 -1183 230 1305 -158 -1299 228 1209 -116 -1134 64
6693 64 1449 -147 -1424 265 1283 204 -1193 626 1340 -413 -1214 426 1380 -446 -1100 641
6709 641 1134 -557 -902 680 1518 -525 -1076 635 1249 -673 -1187 805 1105 -597 -1162 918 789
6726 789 -471 -1273 576 945 -820 -1146 473 670 -826 -699 675 864 -832 -915 622 681 -692 -682
6744 -682 790 812 -1037 -722 807 1016 -863 -682 964 779 -785 -572 941 782 -824 -685 1000
6761 1000 756 -1071 -486 1146 556 -1039 -817 992 378 -1248 -571 828 762 -884 -640 1243 663
6778F63j597N08J411n65j659P34J509q71j127L55J823r73j251M71J515o40j589
6795a283O48J916j039j559J236J437q65j962J345J176p86j727J373J488r05j827
6811a334J037J629j150j669J300J495j103j420J264J209j214j364J370J243j437
6826a44j206J834O98j386r93J295J057j301j307J818J130j690j108J591Q45j434
6842c01j185J630J310k070j208K598M47k006m30J785O68k022m76J591Q53j735
6858e51p95J968O14j944k86J442N37j506k74J582L15j546n19J794L1j301o00J882
6876H43K57j948j8J722L31k181K84J391L92j912l06J829K11j586m67K147j41j729
6894h81N5J574n9j721M2J819j66j472L4J584k97j506M50J609o08j700O27J778
$$ plain form
6778 663 -934 -426 985 420 -1239 -505 1004 133 -994 -639 1184 211 -1040 -569 946 306 -1283
6795 -1283 -635 1281 242 -1317 -81 1356 491 -1471 -126 1050 264 -1463 -90 1398 493 -1334
6811 -1334 -297 1332 182 -1487 -187 1308 205 -1215 49 1258 44 -1320 50 1293 -144
6826 -144 -1350 484 1182 -204 -1197 98 1155 -146 -1453 365 1495 -195 -1303 288 1133 -301
6842 -301 -1486 144 1454 -616 -1824 774 1221 -785 -1215 570 1238 -784 -1260 331 1184 -551
6858 -551 -1346 622 1236 -708 -994 448 985 -521 -795 787 1102 -444 -963 831 862 -439 -1039 843
6876 843 1100 -848 -866 856 1187 -994 -710 681 1073 -839 -1145 684 895 -691 -1158 989 848 -881
6894 -881 -826 748 689 -1032 -990 829 663 -809 -775 809 512 -994 -544 1065 457 -1243 -616 1162
6912A162n73j457J44J414J44j800M20J739m96j873O58J863m79j865J88K036m22
6929H03j824O55J646m89j642J82J884m37j807M62K034q77j932J178J853r15j872
6946a098Q39J510q18j756R89J230o95j614J166J603j137j710J609J028r43j595
6962a392J131J429j346j235J622R18r70j314J137J362j292j246J285J268j385
6977b8j041J508R98j525j123J264J417j559j048J397P87j363p54J220R74j562
6993d38n21J665L16j282q46J451J167k197m16J511M26j360m54J459N56j881O5
7010g79J308O13j640o88J567P18j671l59J463L22j417n03J639K68j249l02J491
7027G81l1j025o60J875j96j152n40J742P8j654J21J513K0j556Q8J639m41j313
$$ plain form
6912 1162 589 -868 -724 690 834 -966 -546 1193 697 -1176 -518 1345 866 -999 -811 1225 803
6929 803 -1021 -366 1280 791 -851 -669 1215 778 -1029 -567 1467 590 -1342 -164 1689 774 -1098
6946 -1098 -259 1251 433 -1323 -334 896 201 -1413 -247 1356 219 -1491 118 1146 203 -1392
6962 -1392 -261 1168 -178 -1413 209 1127 157 -1157 -20 1342 50 -1196 89 1357 -28
6977 -28 -1069 439 1437 -88 -1211 53 1470 -89 -1137 260 1047 -316 -1070 150 1124 -438
6993 -438 -959 706 1022 -260 -1106 345 1512 -685 -1101 410 836 -524 -978 481 1037 -844 -779
7010 -779 529 1142 -498 -1186 381 1099 -572 -931 532 854 -563 -1066 573 841 -408 -710 781
7027 781 750 -275 -935 940 744 -408 -948 794 872 -782 -661 852 872 -684 -596 1043 602 -711
7045g11j25J683J01j547m40K090j01j910K81J763j65j982M35J228k98j364J43
7062i19J618j05j599L75J317j05j584K24J802o74j518Q58J460o17j866R55J315
7079I37n83j386M15J584n23j481N73J646p13j833R75K127j454j669J436R11n58
7096D04j562R11J558q41j660J396Q24n97j683J206J376j477q92R79R18j120r62
7113a222J468Q68j392r25J003J345j577p51J435P38j451j168K168P31j698j012
7129a440J791O37j312r12J481J237j891q77J456J181j751p48J567Q98j554n26
7145g63J096P35j431n12J385P19j741m45J697K58j695j52J637M99j929n04J654
7162E08L76j481m79J765L83j773m37J686N94j877k00J836k26j540Q4J449J06j483
$$ plain form
7045 -711 -836 847 948 -599 -1039 1051 950 -960 -679 1084 919 -1063 -628 600 302 -1062 -919
7062 -919 699 594 -1005 -630 687 582 -1002 -778 1024 350 -1168 -310 1150 533 -1333 -378 937
7079 937 354 -1032 -617 967 444 -1037 -464 1182 469 -1364 -389 1738 284 -1385 51 962 404
7096 404 -1158 -247 1311 470 -1190 206 1030 433 -1250 -44 1332 -145 -1037 -58 860 -260 -1222
7113 -1222 246 1114 -278 -1203 -200 1145 -432 -1183 252 990 -461 -1629 539 1270 -428 -1440
7129 -1440 351 988 -324 -1236 245 1482 -409 -1286 170 1351 -400 -1148 419 1317 -237 -763
7145 -763 333 1068 -363 -875 510 1229 -512 -957 740 998 -697 -849 788 1287 -642 -1146 508
7162 508 884 -597 -1076 689 1072 -701 -1138 548 1142 -735 -935 901 675 -865 -781 668 774 -709
7180g09p3J502m08j314k54J984K27j998K06J537P3j544K34J812q27j419K69J968
7198A266n04j653M02J399k44j738P5K274n79j711M06J925p54j731M48J950o77
7215E54j573P61J486p98j412N48J270l80j560N75J787q92j518P53J786j086j470
7232a169Q52J323j105j245R26J546o21j937R19J659q99j561J211J514j364j358
7248a309J336J572j687q11P69J220q87j475J302R79j034j203J240J243j262j094
7264a101J099R04r73q89J358P29j093j111J141R00j097r85J311R56j563k91R22
7281B17Q92j558n72J071J070j250j156J444Q75j587q65J680P83j822k56J645J52
7298G63j173l92R92R01j393o87J357O18j467o12J591N16j408n81J645L9j169m01
$$ plain form
7180 -709 -782 720 312 -1002 -1256 728 955 -1043 -837 700 773 -771 -537 1275 448 -971 -702 1266
7198 1266 762 -891 -489 910 666 -1072 -997 1277 698 -1013 -607 1318 564 -1167 -719 1231 554
7215 554 -1019 -258 1228 430 -982 -434 836 456 -1104 -529 1258 366 -1152 -399 1387 301 -1169
7232 -1169 -317 1006 -99 -1344 -418 1128 507 -1430 -511 1148 249 -1312 -101 1413 49 -1309
7248 -1309 27 1599 -88 -899 -130 1090 203 -1272 30 1009 -25 -1228 12 1255 -7 -1101
7264 -1101 -2 902 -71 -960 398 1127 34 -1077 64 964 -133 -1118 193 1149 -414 -705 217
7281 217 1109 -449 -1021 50 1120 -130 -1286 158 1033 -554 -1419 261 1044 -778 -1034 611 763
7298 763 -410 -802 190 1091 -302 -989 368 986 -481 -1093 498 1014 -394 -975 670 709 -460 -861
7316h61J690J94j562k08J548J67j315n40J767q8j487k24J705R1j598j05J541L45
7334A060j723k40J561J55j855K74J485N8k034K96J463O9j478L05J380l28j487
7351a039M64J300q3j816L88J653k11j833P12J331m00j536N89J222n02j525N44
7368g42J664p42j140Q59J394r66j579J021J256o60j234P63J158m26j518O79J266
7385A053r42r26N37J255r97j038R21J305j182j069P41J149q18j111R63Q39q55
7402a75j004J341L99p93p11P24J397j230p68P99J034j482m55R02J209j315j168
7419a296J447Q01j066o84J125O16q37r25J154P86j281p46J345O55j287p09J335
7436D33Q84j745m20J211Q24j475q09J478N61j485j37J041M00j223n32J486N49
$$ plain form
7316 -861 829 1023 -539 -747 801 968 -347 -887 880 792 -695 -919 786 877 -721 -826 715 1060
7334 1060 -663 -903 658 813 -1042 -768 717 775 -1259 -963 500 569 -909 -604 776 448 -1039
7351 -1039 -575 725 642 -1174 -786 867 656 -1177 -465 866 466 -1070 -481 741 239 -1286 -742
7368 -742 922 180 -960 -101 1293 327 -1252 -231 1025 365 -869 -106 1052 626 -892 -213 1053
7385 1053 111 -815 -278 977 -20 -1058 -137 1168 -14 -1083 -342 807 -11 -1122 -159 680 -175
7402 -175 -1179 162 561 -232 -943 -219 1178 -52 -820 -21 1013 -469 -924 -22 1187 -128 -1296
7419 -1296 151 952 -114 -798 327 943 106 -819 335 1121 -160 -906 439 1094 -193 -902 433
7436 433 1317 -428 -848 363 1187 -288 -1097 381 942 -543 -680 361 761 -462 -994 492 1041
7453A041j508n95J638O39k325j40J691M76j866j05J743o6j501L1J481L48j293
7470c11o50J854k78j493r7J740K23k114R9J711J09j479J49J562l38j517L17J356
7488H43j78j533O16J198n15j337N08J746j045j356N35J687q63j260M10J435l09
7505E82j646N46J691o30j381J75J565o55j428R08J196n98j308J024P68n10j295
7522i96P12J395p78j317P94J522j130j557J071J465r73j396J227P83q69q68O42
7539b73J312r63p82N67J391j212j056R72J017o44j453J001J232j237p75Q53J268
7556A218j038j026O54J095r71j204J380R61j218r11J172Q91j349n29R89J039j427
7573b74o79P67J027j058j174J612Q47j624p23J478P29j058q42J445L97j528k25
$$ plain form
7453 1041 -467 -1062 576 1215 -1110 -1250 441 917 -949 -1054 689 623 -878 -847 634 982 -311
7470 -311 -961 893 615 -878 -975 765 988 -1126 -1027 684 793 -686 -537 1025 687 -830 -513 843
7488 843 665 -868 -252 946 431 -906 -398 1348 303 -1053 -518 1169 306 -954 -544 891 582
7505 582 -1064 -518 1173 543 -838 -663 902 247 -1181 -273 923 325 -983 41 809 299 -996
7522 -996 -284 1111 333 -984 -190 1332 202 -1355 -284 1181 208 -1188 39 822 -47 -915 -273
7539 -273 1039 76 -706 -139 1252 40 -1016 -44 973 329 -1124 -123 1109 -128 -903 -50 1218
7556 1218 180 -846 -192 903 -68 -1272 108 1069 -149 -1060 112 1003 -346 -875 114 1153 -274
7573 -274 -953 -186 841 -217 -1391 221 1068 -556 -1279 199 928 -130 -972 473 870 -658 -883
7590h83J325O29j559k80J148N05q07j296J936M78j413o87J654K70j248n61J332
7607E43M17j862J25J414K12j384k64J846Oj778QJ354J50j599K50J143J24j415
7625g10KJ444q6j548M12J061p5j330J38J371L1j603J34J276j93j038j43J693m27
7644D09j301N75J002l52j090O02J187o20j010K92J206o58r55O3J411l11j559Q75
7662b34J052j61j185N29R60n94j482O51J158l56j346P68J318p23j074O06R27l79
7680D35j225L67J591q43j110M34J463j223r92R45P04p41p14J131L53n67j125J021
7698i6J017q43j092Q65J196j276n40R01O14p58q83R96J015q51j271J273J167j686
7716b52n53R61R31j295p25J253P18j329o47R26Q06j119n61J191P79j404n22J211
$$ plain form
7590 -883 442 1071 -488 -768 380 885 78 -1218 718 1196 -217 -904 750 1020 -228 -789 543
7607 543 960 -902 -777 637 849 -535 -799 1047 1053 -725 -717 637 787 -812 -562 581 705 -710
7625 -710 -708 736 650 -898 -486 575 500 -830 -692 679 710 -893 -759 517 324 -714 -857 836 409
7644 409 -892 -317 685 333 -757 -155 1032 412 -598 -306 900 242 -713 -650 761 450 -1109 -234
7662 -234 818 657 -528 1 961 367 -1115 -464 694 338 -1008 -240 1078 355 -719 -113 814 435
7680 435 -790 -423 1168 325 -785 -351 1112 -111 -1103 -158 546 -195 -909 222 575 8 -1117 -96
7698 -96 921 78 -1014 -149 1047 -229 -769 132 746 -12 -895 101 1116 265 -1006 267 1434 -252
7716 -252 -805 156 1087 -208 -933 320 1038 -291 -938 -12 794 -325 -886 305 1084 -320 -842 369
7734C69P82j632n79J479N61j634m67J558K48j350k59J408O7j196l3J370K83j695
7752g20K0J272j32r54k84J223L39j225k44J510o2j355K89Q85K96j182N9P65N8
7771E58j005l83J570k27j178J56J593n53j290R4J280l4j035J1J092R8j459K50
7789d62J320l95j151M13J098j95j376L66R48j11j189J54J206j88j401N42J169
7806G48n74j132N58J203m25j395P46P73n4j387N94J172r80o93J86J566m95j341
7824i30N35J306m09j315L85J697j107j067Q82R80q59j186Q84J134j060p50J000
7841A20R45j222p54J048J029j136j264J380P23p11j307R74J284j203p37J097N44
7858H10j047o60J291J035j838j55P45N87o61j218J430M87j205o76J272O43j249
$$ plain form
7734 369 1151 -481 -1060 419 980 -654 -1121 437 685 -665 -924 484 551 -645 -678 692 975 -720
7752 -720 -700 572 440 -514 -798 425 764 -461 -705 805 743 -612 -323 562 858 -324 -265 500 558
7771 558 -447 -830 740 513 -665 -509 1084 531 -759 -665 615 581 -454 -443 649 747 -712 -462
7789 -462 858 463 -688 -275 823 628 -748 -382 566 455 -734 -580 626 438 -963 -421 748
7806 748 174 -958 -400 803 378 -1017 -271 502 448 -939 -345 827 -153 -846 -660 906 411 -930
7824 -930 -395 911 502 -813 -428 1269 162 -905 -23 957 98 -1088 -204 930 -130 -880 120
7841 120 1065 -157 -911 137 1166 30 -1234 146 869 158 -1149 -175 1109 -94 -831 266 810
7858 810 -237 -897 394 1429 -409 -564 181 768 107 -1111 319 806 -399 -1075 197 840 -409
7875d09o35J541J04q14o97J268K96q38m52J237Q7j214J11R94J46j281k56J214
7893D02K52j273k49J399K34j121q3P77L77j346j04R39M67j338J94Q29J24j049
7911e69q8J014L91j272k25J177J03j250R2P86N53j391K86J000j61r91k01J625
7929H79m02q97q4J097j82q23L6Q56R3j292J25J213j65j178p3J741o84r59N08R07
7949G16l35r00J70J200n13j001J43J343n93p66J0J238m27j231P56J288p08j286
7967h96N55R14P3j614P08J225q26j060R93M33m47j187Q61Q98l84j135P31J146
7985I88r77r44Q44P58p09p44P78R49r05p96R04Q52j130l92O04N58p17q94J211
8004B38O82j114o30J066O75j311l03Q97N04q34q01J049O43j175n0J055K30j086
$$ plain form
7875 -409 -1044 497 601 -213 -910 358 654 -184 -636 601 688 -526 -415 579 725 -556 -812 402
7893 402 654 -619 -868 531 765 -356 -439 338 715 -631 -735 204 671 -667 -473 356 480 -569
7911 -569 -657 357 748 -524 -749 428 531 -719 -627 159 712 -679 -393 607 446 -545 -746 879
7929 879 477 -420 -504 593 411 -412 -376 480 573 -719 -594 619 454 -724 -797 944 260 -699 -191 716
7949 716 381 -519 -349 851 338 -663 -520 823 230 -536 -526 712 285 -946 -190 1098 390 -896
7967 -896 -341 573 646 -968 -260 965 139 -921 72 505 58 -1129 -268 630 246 -889 -158 988
7985 988 11 -933 -89 669 -40 -784 -6 943 38 -758 146 998 -132 -524 80 638 -79 -973 238
8004 238 920 -194 -824 242 917 -394 -697 200 704 -130 -931 118 761 -414 -464 591 821 -265
8022b65o91J117N00r88j54R14J99p92o77J357J77q50n57J143L89q78m65N83N52
8041F14q33l48Q04N37j028k98P88M35j005J45Q06p7p71j01P61K52j167K5P80K90
8061F09j082P9L80N67r33j5O62N59j363k91J138K68q64l68J368k45r84J9J170
8080F74k39j037J32J022k07j107K83J073k52j111L35J235l65j123L50J088l95
8097C56q99L25J130o09j041P46Q80q10r04N90J093p42p03L06J350p83j202O03
8115c14J333o43j291O95R86l95j334O49J067p00n60P11K71l80r87P63O51l00p33
8134e11N87N86o67q50J044N47p71p12R26O78q84p47Q92K72m68o45J116L54r05
8153a58m72M16J078r79n10O45P45o25o11Q04M27j027l55R34K81p45n29J130K0
$$ plain form
8022 -265 -956 161 661 -327 -481 433 632 -160 -837 520 697 -153 -710 433 822 -56 -521 62 614
8041 614 -219 -567 237 774 -254 -552 236 671 -334 -189 617 540 -231 -332 429 681 -486 -461 319 609
8061 609 -473 -394 -14 553 -380 -395 267 826 -537 -828 310 578 -286 -654 714 469 -515 -496 674
8080 674 435 -602 -470 552 345 -762 -479 594 342 -769 -434 801 436 -687 -337 751 356
8097 356 -543 -218 912 303 -738 8 888 78 -826 -236 857 115 -588 -282 1068 285 -917 -314
8115 -314 1019 376 -915 -220 766 371 -963 -314 753 53 -507 204 475 95 -892 -129 522 222 -511
8134 -511 76 662 -5 -855 189 736 -35 -747 179 857 -27 -774 118 390 -78 -723 393 747 -158
8153 -158 -630 -214 864 -115 -625 20 765 140 -471 333 760 -267 -622 312 593 -152 -681 449 469
8172D69p40m72P61P36j114qO77N62j418j22J029M79j093l04Q39O26j494j24P44
$$ plain form
8172 469 -271 -743 18 754 -360 -368 309 871 -547 -669 360 839 -254 -558 281 907 -587 -711 33
8191C3
$$ Imaginary data points
##PAGE= N=2
##DATA TABLE= (X++(I..I)), XYDATA
0@%%%Qj6QqJ6k4L2l2M0n6P2q8J04j28J52j73K05k42K79l22L71m27M90n56O31p18
29c82Q11r11J023j148J283j430J594j775J970k182K420k682K966l282L638m033
45b120M471m966N536o193O951p844Q925j0254J1931j4129J7147k1562K8639m1783
59b5251P4076k88066m15862P58492J89385o42222q3922P13691m19o92003k1343
70d33444O05299o1327n11704J28724M95818j49929m40968J22831L69893j21850
80C343k85234J46581K87114j21482k72433O9758K46075m3956k11704O7530K62579
91A48171l6191k76919J5388K83764j8023k80036O1655L27452o1228l34054P3892
102i6129L27302r6351l00589J51810L18012j53410k94727J55158K48634j75310
$$ plain form
0 0 0 0 0 8 -8 0 -8 8 -16 16 -16 24 -32 40 -48 56 -72 80 -93 112 -130 149 -173 198 -229 261 -295 336 -382
29 -382 429 -482 541 -607 676 -754 840 -935 1035 -1147 1273 -1409 1557 -1725 1913 -2120
45 -2120 2351 -2615 2921 -3272 3679 -4165 4760 -5494 6437 -7692 9455 -12107 16532 -25251
59 -25251 48825 -239241 -655103 103389 292774 -349448 -433370 280321 279902 -412101 -433444
70 -433444 171855 110528 -401176 -272452 223366 73437 -367531 -244700 125193 3343
80 3343 -281891 -135310 151804 30322 -242111 -172353 73722 29766 -181938 -114408 148171
91 148171 111980 -164939 -149551 134213 116190 -163846 -102191 225261 164033 -170021 -96129
102 -96129 231173 134822 -165767 -13957 304055 150645 -144082 11076 259710 84400
112H4400k13335J95361K07108j66765j65737J50422J28669j43198j17330J18353
122G7948J09189q6049j01815N9506J03692l7281j16106J8418J33661n303j64050
133h190j5830J77026P340k07914l259K36987N72k57095O542K61749l7420k87250
145a26742M5671K91131o3202k91606P9688K85706j00310k85590J07417K70533
155B12696j23254k64554J25924K49554j36814k44182J36373K32462j38958k26284
165a77037J41860K21807j45973k26022J42094K20293j49738k24296J57900K32772
175A93660j62142k36002J70583K35859j88351k42674K03297K45070k19007k42283
185b41990K38267K37275k57883k26160K81007K16095k98641k00065L13231J74550
$$ plain form
112 84400 -128935 66426 273534 106769 -58968 91454 220123 76925 -40405 77948
122 77948 187137 101088 -727 58779 162471 125190 9084 27502 161163 155860 -8190
133 -8190 -24020 153006 160346 -47568 -50827 186160 186732 -70363 -63821 197928 160508 -126742
145 -126742 -81071 210060 146858 -144748 -65060 220646 120336 -165254 -57837 212696
155 212696 89442 -175112 -49188 200366 63552 -180630 -44257 188205 49247 -177037
165 -177037 -35177 186630 40657 -185365 -43271 177022 27284 -197012 -39112 193660
175 193660 31518 -204484 -33901 201958 13607 -229067 -25770 219300 293 -241990
185 -241990 -3723 233552 -24331 -250491 30516 246611 -52030 -252095 61136 235686
195B35686l30988j48861L45839J26498l49033r3770L51557O0036l55838l2664
205a91538L48913O460l35881K2422L23339m4398l09926N8255K90502o9049k69092
216a69993P6193K48302q1374k33649P5663K16754o7917j98568O2441J87137n6989
227E8000j82882M5326J76146l7386j71183L4935J72877l2937j75200L2100J76776
238I6572l4273j75850M0957J77321m8193j76724N5808J75011o0488j66229P0351
249d5737J62078p5206j54379P8009J46819p6664j35790P7565J30398p0708j23911
260h7526O4196J20188n4076j17871M5609J19632l5255j23212K5213J29404j7101
271F9201j35844J1978J44830r763j55934Q538J65496j3580j75972J9367J84296
$$ plain form
195 235686 -95302 -244163 101676 228174 -120859 -214629 136928 196964 -158874 -191538
205 -191538 157375 163835 -172046 -149624 173715 129317 -180609 -122354 168148 99099 -169993
216 -169993 -93800 154502 73128 -160521 -84858 131896 63979 -134589 -72148 114989 58000
227 58000 -124882 -79556 96590 59204 -111979 -77044 95833 62896 -112304 -80204 96572
238 96572 62299 -113551 -72594 104727 56534 -120190 -64382 110629 50141 -116088 -45737
249 -45737 116341 41135 -113244 -35235 111584 34920 -100870 -23305 107093 36385 -87526
260 -87526 -23330 96858 42782 -75089 -29480 90152 54897 -68315 -43102 86302 69201
271 69201 -66643 -54665 90165 80402 -75532 -66994 98502 84922 -91050 -71683 112613
282A12613k9898j93626M0016J98651n4281k05041O7380K06987q2585k09741R4630
293e4895K08962j09286k08510J19701K05926j30932k03627J39028J99183j46846
303A8704j95611J53417J90758j60161j86547J65420J81014j70869j75556J77270
313b161J70187j83872j63278J90314J56235j98851j47735K06951J38703k15036
323d8543j28893K23227J17811k31373j05578K38662R2516k45525p9031K49239
333H2512O4749k52511n0310K54342L6501k53228k1631K49999Q076k45990N155
344a22336K39599j5889k30435K6899K20251l5000k09345M3569J99326m8883j84985
355a17229N3577J73614n6772j61861N9861J52765n8514j40756O0550J33580o0088
$$ plain form
282 112613 82715 -110911 -70895 127756 73475 -131566 -64186 142801 60216 -149525 -54895
293 -54895 154067 44781 -163729 -44028 161898 30966 -172661 -33633 165550 18704
303 18704 -176907 -23490 167268 7107 -179440 -14020 166994 -3875 -179431 -2161
313 -2161 168026 -15846 -179124 11190 167425 -31426 -179161 27790 166493 -48543
323 -48543 -177436 45791 163602 -67771 -173349 65313 157829 -87696 -166727 82512
333 82512 147261 -105250 -155560 98782 135283 -117945 -139576 110423 118499 -127491 -122336
344 -122336 117263 101374 -129061 -102162 118089 83089 -126256 -82687 116639 67756 -117229
355 -117229 -63652 109962 53190 -108671 -48810 103955 45441 -95315 -34765 98815 38727
366C8727j26880N9167J22171n4847j15831N2987J13285n0621j11370M7054J10635
377H4477m2168j08551L8412J06805l5623j06747L0573J05956k5914j05098K1284
388c6594J03406j9609j05183J4234J03936j1136j04900P561J04925p122j08900
399e9382L570J10428k238j13785J286J16507l218j23014L532J28058n105j33512
411g6873Q032J39187j2721j46689J6981J53356k2071j58916K9118J65758l5300
422E9862j71039M1963J76144m9028j78328N8021J80847o5872j82301P4710J82694
433A27673q2917j79923R2323J77264j02299j73216J11319J68814j20976j62546
443a44484J31155J56035j40205j49155J48589J41230j56731j33560J64648J24953
$$ plain form
366 38727 -88153 -28986 93185 38338 -77493 -24506 88779 38158 -73212 -26158 84477
377 84477 42309 -66242 -27830 78975 43352 -63395 -32822 73134 47220 -57878 -36594
388 -36594 66812 47203 -57980 -43746 60190 49054 -55846 -48285 56640 49518 -59382
399 -59382 -55812 54616 52378 -61407 -60121 56386 53168 -69846 -66314 61744 56639 -76873
411 -76873 -68841 70346 57625 -89064 -72083 81273 59202 -99714 -70596 95162 59862
422 59862 -111177 -69214 106930 57902 -120426 -62405 118442 52570 -129731 -55021 127673
433 127673 44756 -135167 -42844 134420 32121 -141095 -29776 139038 18062 -144484
443 -144484 -13329 142706 2501 -146654 1935 143165 -13566 -147126 17522 142475
453A42475j72060j16569J77541J08084j82425r9167J85856Q9400j88616q0413
463a35894J90095P1349j89524o1473J88860N2326j86822m1996J84429L2986j80463
474g6127k3099J75868J4135j70786m843J65240k690j58656J1190J52914j7253
485F5893j46583K2928J40477k7303j33824L1991J27367l5043j22354L6463J17085
496G7097l7803j12121L7578J06538l8136j02527L6546R7978l5622r3974L3361
507c1085Q8927l0735q5415K7919Q0515k5632p6257K2092P2223j8867o9170J4716
519c0769O6146j1536o3520P983O2768l919o2596R28O4986K678o7616n395P2907
532C3045R033p7665j0760Q5168J1491r1811j1662J00800J1678j08021r392J14767
$$ plain form
453 142475 -29585 -146154 31387 139471 -42954 -142121 43735 133135 -55481 -135894
463 -135894 54201 125550 -63974 -125447 63413 115739 -71083 -113079 71350 104336 -76127
474 -76127 -99226 76642 90777 -80009 -84852 80388 77698 -80958 -69768 83146 65893
485 65893 -80690 -57762 82715 55412 -78412 -46421 80946 45903 -76451 -39988 77097
496 77097 39294 -72827 -35249 71289 33153 -69374 -32828 65150 29528 -64446 -31085
507 -31085 57842 27107 -58308 -30389 50126 24494 -51763 -29671 42552 23685 -45485 -30769
519 -30769 35377 23841 -39679 -31696 31072 27153 -35443 -34515 30471 33149 -34467 -39862 33045
532 33045 42078 -35587 -46347 38821 50312 -41499 -53161 47639 59317 -48704 -58096 56671
544E6671O256j21375j422J27893l103j31466Q912J34500j5582j37264K2242J38259
556H4521k9706j37623L6177J35869m4364j34554M9735J32123n6725j28521O2688
567c0380J25495o9897j23668P5359J20613q1154j17146Q7511J14630r4131j12581
578a05349R9267J09459j04953j06287J11355J02651j16277r8886J21054R4342
588A06376j24550q7480J29028Q2693j31904p5429J33500O7836j34475n9169J36846
599D3272N1354j36683m3613J36298L5435j35902k6834J34934J9499j32622j2217
610f7079J30705N286j28929J239J26593o027j23037J0481J18225j5668j14683
621f2894J8316J10384k0369j04940K1904R8255k2998r3605K3852Q7482k2494q1521
$$ plain form
544 56671 62927 -58448 -59870 68023 64920 -66546 -57634 76866 61284 -75980 -53738 84521
556 84521 54815 -82808 -46631 89238 44874 -89680 -39945 92178 35453 -93068 -30380
567 -30380 95115 25218 -98450 -23091 97522 16368 -100778 -13267 101363 7232 -105349
578 -105349 -6082 103377 -1576 -107863 3492 106143 -10134 -109020 12034 106376
588 106376 -18174 -105654 23374 106067 -25837 -101266 32234 100070 -34405 -93574 43272
599 43272 94626 -42057 -85670 50628 86063 -49839 -76673 58261 77760 -54862 -67079
610 -67079 63626 68912 -60017 -58778 67815 61788 -61249 -50768 67457 51789 -62894
621 -62894 -44578 65806 45437 -59503 -37599 60656 37658 -55947 -32095 55387 32893 -48628
633d8628K1571P5940k0320p0783J8463O6729j5507o3159J3958O0303j2454n8486
645c2373J0522N7257q656n5747P846N5711o804n6192N582N6293m101n6592L089
658b4165N7293j480n9492k033O0489N018o3095q747O4992J1844o9290j7408P2787
671B6713K0890p8146k4517Q3767K5152r0957k6749R7572K5070j06316k1843J13530
683D4166J5591j20947q578J27042j830j32013J2354J35704k3238j36487L5472
694e2764J36231m6723j32897N7504J29624o5627j22556P3248J16036p8072j08392
705i4388Q2529J01953q2378r4945Q2853R0305q1491q5307Q0504Q3249p8414q0777
717g6307P8037P9980p8123p9335P9939P8388q2939p7057Q7287P4271r2548p1528
$$ plain form
633 -48628 -27057 48883 28563 -42220 -23757 42972 27465 -35694 -21736 38567 26113 -32373
645 -32373 -21851 35406 26750 -28997 -21151 34560 27756 -28436 -22854 33439 29338 -27254 -24165
658 -24165 33128 31648 -27844 -29877 30612 35630 -27465 -36212 28780 40624 -28666 -46074 26713
671 26713 47603 -30543 -55060 28707 53859 -37098 -63847 33725 58795 -47521 -69364 44166
683 44166 59757 -61190 -69768 57274 55444 -76569 -64215 71489 48251 -88236 -52764
694 -52764 83467 36744 -96153 -38649 90975 25348 -97208 -23960 92076 14004 -94388
705 -94388 -11859 90094 7716 -87229 -4376 85929 4438 -80869 -365 82884 4470 -76307
717 -76307 1730 81710 3587 -75748 4191 82579 -360 -77417 9870 84141 -8407 -79935
729g9935R7907O6149j04251n9424J08711N1188j13380m2408J14754L3111j15932
740d3510k3792J14264J4365j10680o758J04820k14r8115M925R0210p863q2040
752d4388R178P4369q503o6786P010O0968m421n5498J763N3110J845n2294l643
765b7290N2000N647n2447o211N4572N844n6073m561N7319K775n7250n98N6320
778C0047j490n4946J858N2287k273m8830R43M4560J482m1154n989L7658J0290
791B4443l5957j6797L4412K3616l5324k9899L7110L5126m1520m0086M7381M3386
803D5891n3350m5014O0573M4335o8766m1134P6989L7343q3320l1096Q9363K4130
815E5944r4496j5960R9388P949j00652K13J02044p245j02401J4660J01686k0170
$$ plain form
729 -79935 17972 84121 -20130 -79554 29157 80345 -33035 -75443 39311 72422 -43510
740 -43510 -67302 46962 61327 -49353 -56111 48709 48495 -49620 -44695 45515 37652 -44388
752 -44388 -35210 39159 30656 -36130 -29120 31848 27427 -28071 -26308 26802 28647 -23647 -27290
765 -27290 24710 30357 -22090 -28301 26271 32115 -23958 -28519 28800 31575 -25675 -26273 30047
778 30047 28557 -26389 -24531 27756 25483 -23347 -22404 22156 23638 -17516 -23505 14153 24443
791 24443 -11514 -28311 6101 29717 -5607 -35506 1604 36730 -4790 -44876 2505 45891
803 45891 -7459 -52473 8100 52435 -16331 -57465 19524 56867 -26453 -57549 31814 55944
815 55944 -38552 -54512 44876 52825 -47827 -47614 54430 47185 -55216 -40556 61130 40960
827D0960r9381K5259R7103k9454r4521L3095R1289l6162q8215L8245Q5600m1436
839B2382q2878M3198P9903m6664p7360N0557P4175n4361p1836N7093O8607o1174
851A642o5220O4673O1420o8221n8219P0880N3907p3077m9953P5325M5310p6178
863a7711m1538P7411L7211p7114l2737P6480K9513p5468k5053P4246K2159p2891
875b5492j8152P0904J4971o8277j0868O6105O928o3282l774O0835L49n8087L537
888b4303N5155o741n2560Q922M8509j1178m5206J2688M2269j3671l9866J2387
900a3595L5456j1419l2779R496L0694p541k8590L316K5896n75k3789l113K3972
913G429O610k3380j1057K2406J3587k2093j5431K4152J8219k6024k0252K6444
$$ plain form
827 40960 -58421 -33162 63941 34487 -60034 -26939 64350 28188 -60027 -21782 63818 22382
839 22382 -60496 -17298 62605 15941 -61419 -10862 63313 8952 -62884 -5791 62816 1642
851 1642 -63578 1095 62515 -5706 -63925 6955 60862 -12215 -62168 13157 58467 -17711
863 -17711 -59249 18162 55373 -21741 -54478 22002 51515 -23953 -49006 25240 47399 -25492
875 -25492 -43644 27260 42231 -26046 -36914 29191 36119 -27163 -30937 29898 30247 -27840 -24303
888 -24303 30852 24111 -28449 -19527 28982 17804 -27402 -14714 27555 13884 -25982 -13595
900 -13595 21861 10442 -22337 -12841 17853 10312 -18278 -14962 10934 10359 -13430 -16543 7429
913 7429 14039 -9341 -20398 2008 15595 -6498 -21929 2223 20442 -5582 -25834 610
925F10K1641k7349k1378L0960K2639l3237k3945L5721K4532l8354k3063M3135
937A1912K3489m6679k3696M9180K2824n3198k1211N8273K0432o2679j8969O5427
949B5105J6031o9077j3170P3684J0142p6705p138P7057K310p8723K782Q0481p367
962C5412q1063J1591P8245j6946p7208K2961P5880k7265p3821L1513P0412l6898
974A2813o6924M1632O5295m4349o1924M6820N8533m9861n5110N2454N4054n3399
986C4n1416N4124M8277n5468m4516N6870M2873n6237m0080N6214L6641n5975l3536
999d2195N6594L0504n6185k7719N5294K3536n5528j9953N5255J6759n4991j3124
1011c1753N2565R896n2188o978N1411M139m9551k610M6589j67m4621J476M2766
$$ plain form
925 610 22251 -5098 -26476 4484 27123 -6114 -30059 5662 30194 -8160 -31223 11912
937 11912 35401 -11278 -34974 14206 37030 -16168 -37379 20894 41326 -21353 -40322 25105
949 25105 41136 -27941 -41111 32573 42715 -33990 -41128 35929 38239 -40484 -37702 42779 35412
962 35412 -45651 -34060 44185 27239 -49969 -27008 48872 21607 -52214 -20701 49711 12813
974 12813 -54111 -12479 52816 8467 -53457 -6637 51896 2035 -53075 -621 53433 34
986 34 -51382 2742 51019 -4449 -48965 7905 50778 -5459 -45539 10675 47316 -8659 -42195
999 -42195 14399 44903 -11282 -39001 16293 39829 -15699 -35652 19603 36362 -18629 -31753
1011 -31753 20812 30708 -21480 -28458 22953 27092 -22459 -25069 21520 21353 -23268 -21792 20974
1024B0974k503m0303K105L7027k709l3624K050L1394l47k8226q43K4625K586k1456
1038i250m058J9633P032j7022r615J5610J1173j4294j2425J4403J5851j5079j7777
1051a5818J5313J9647j6177k0529J8563K2726k1453k4931K3945K5600k7147k5924
1063b6185L0144K7442l3968k8947L6139K8574l9942k7978M2908K7787m5791k8436
1075c8253M7540K7156m9783k4903N2702K2917n5101k1825N5840J9771n7454j6016
1087c7409N9441J2938o1122r892O2062O111o1660k122O4023j783o4442N561O4759
1100C6465r162o4062J4181O4277j7930o3565K0955O2332k4387o0143K8260N8726
1112D5947l1361n6354L2752N3504l5301m9327L6925M6152l8844m2616L8754L7954
$$ plain form
1024 20974 18471 -21832 -19727 17300 14591 -19033 -16983 14411 14064 -14162 -15005 9620 12206 -9250
1038 -9250 -13308 6325 13357 -3665 -13280 2330 13503 -791 -13216 1187 17038 1959 -15818
1051 -15818 -505 19142 2965 -17564 999 23725 2272 -22659 1286 26886 -261 -26185
1063 -26185 3959 31401 -2567 -31514 4625 33199 -6743 -34721 8187 35974 -9817 -38253
1075 -38253 9287 36443 -13340 -38243 14459 37376 -17725 -39550 16290 36061 -21393 -37409
1087 -37409 22032 34970 -26152 -36044 26018 32129 -29531 -31653 32370 30587 -33855 -28294 36465
1100 36465 27303 -36759 -22578 41699 23769 -39796 -18841 43491 19104 -41039 -12779 45947
1112 45947 14586 -41768 -9016 44488 9187 -40140 -3215 42937 4093 -38523 231 38185
1124C8185l9157l4206L9347L0185m0086k6979L9069K3045l9436j9478L8858J7286
1136B6633l8824j5262L7495J2869l6497j0727L5612R641l4728q416L2923P365
1148A8084l1001n643K9429M959k7050m612K5236M040k2065l331K0666L175j7622
1161e735l236J5017L150j2133l346J0129M272q422n852P021O822n693q358M653
1175a711J0352m984j2531M701J4525n855j6507O894J7680p960k0488R724K1629
1188A5469j1746k3400J3608K4674j5847k5837J7089K7300j9315k7963K1457K8031
1200B3520k2112k8818K4529K8508k5823k7855K7573K7857k9810k5911L2094K4972
1212B8724l4224k2963L7087K1348l9475j8385M2127J5511m3762j3010M6751R692
$$ plain form
1124 38185 -972 -35178 4169 34354 -5732 -32711 6358 29403 -10033 -29511 9347 26633
1136 26633 -12191 -27453 10042 22911 -13586 -24313 11299 20940 -13788 -22204 10719 18084
1148 18084 -12917 -18560 10869 15828 -11222 -15834 9402 13442 -8623 -11954 8712 11887 -5735
1161 -5735 -8971 6046 9196 -2937 -6283 3846 8118 -304 -6156 865 7687 1994 -6364 -1711
1175 -1711 8641 3657 -8874 -4173 10352 4497 -12010 -5116 12564 4604 -15884 -6160 15469
1188 15469 3723 -19677 -6069 18605 2758 -23079 -5990 21310 1995 -25968 -4511 23520
1200 23520 1408 -27410 -2881 25627 -196 -28051 -478 27379 -2431 -28342 3752 28724
1212 28724 -5500 -28463 8624 29972 -9503 -27888 14239 29750 -14012 -27022 19729 29421
1224B9421m8110o354M8990L405n0414J50N0300l117n0462N850M9713r144m9097
1237b8869J1154M7628j3439m6068J4905M4342j7524m2321J8598M0173k0869l8132
1249c0422K2319L6109k4386l4016K6019L1770k7794k9432L0032K6981l1273k4704
1261b8797L3065K2017l4221j8547L4937J6339l5083j3319L4633J0771l3089p882
1273a9176L1949N414k9372l124K6491J583k3463K43K0085r09j6705J094J3561
1286G671j469j0832R92Q324n96o421r23M372K369l814l600L004N489l748p247
1301f429L208Q525l396j0459L936J2452n103j3957N579J5473o610j6327P750J7474
1315A2116q050j8799Q433K0160r085j9831R940K0652r901k2157J1432K1946j0827
$$ plain form
1224 29421 -18689 -25043 23947 27352 -23062 -22912 27388 24271 -26191 -20341 29372 20228 -28869
1237 -28869 -17715 29913 16474 -29594 -14689 29653 12129 -30192 -11594 28579 7710 -30422
1249 -30422 -8103 28006 3620 -30396 -4377 27393 -401 -29833 199 27180 -4093 -28797
1261 -28797 4268 26285 -7936 -26483 8454 24793 -10290 -23609 11024 21795 -11294 -19176
1273 -19176 12773 18187 -11185 -14309 12182 13765 -9698 -9455 10630 9721 -6984 -5890 7671
1286 7671 6202 -4630 -3638 4686 4090 -2331 -3254 1118 3487 -327 -3927 -923 4566 818 -6429
1301 -6429 -3221 5304 1908 -8551 -4615 7837 2734 -11223 -5644 9829 3219 -13108 -5358 12116
1315 12116 4066 -14733 -6300 13860 4775 -15056 -5116 15536 5635 -16522 -5090 16856 6029
1328F029k2847J2879K2624j3468k3089J5069K3229j6513k2840J8192K2485k0219
1340A531k2486K1851K2517k4473k1823K6368K1472k9885k0835L1790J9537l3988
1352h424j8946L6464J7072l8603j6249M0378J3584m1335j1242M2001Q138m2535
1364a9697n630M2898J953m1855K119M0233m997l9037Q402L7238j0648l4610J3543
1377a0088L2380j5146k9834J6155K8880j6986k6410J8201K4818j8398k3758J8276
1389a910K3694j8437k1583J7920K0947j8277k0154J8571J9356j8781j8091J9037
1401B292J6336j9828j4399J9433J2212k0279r158J9342N842j8561l460J7323j17
1414F978j5147K872J2541n006r506N442O645o882k305O434j142m714M044K130
$$ plain form
1328 6029 -16818 -3939 18685 5217 -17872 -2803 20426 3913 -18927 -735 21750 1531
1340 1531 -20955 896 23413 -1060 -22883 3485 24957 -4928 -25763 6027 25564 -8424
1352 -8424 -27370 9094 26166 -12437 -28686 11692 25276 -16059 -27301 14700 22838 -19697
1364 -19697 -25327 17571 19524 -22331 -20212 20021 15024 -24013 -15611 21627 10979 -23631 -10088
1377 -10088 22292 7146 -22688 -6533 22347 5361 -21049 -2848 21970 3572 -20186 -1910
1389 -1910 21784 3347 -18236 -316 20631 2354 -17800 771 20127 1346 -16745 2292
1401 2292 18628 -1200 -15599 3834 16046 -4233 -13391 5951 11793 -6768 -10228 7095 6978
1414 6978 -8169 -5297 7244 2238 -7268 -1826 4819 -2063 -4368 2066 924 -3790 254 2384
1428B384o669J319Q753m848r421Q870J0223j3064r581J7340Q456j9668o529K2639
1442A0204L806k3896j630K4856m14k4740L245K3590n346k2532O775K0894q544
1455F268j8467Q599J6852q707j6089Q354J4774p702j5246P113J5952p231j7528
1468a3058O624J8772p626k0256Q294K2629j0630k3789J2167K5106j4425k5852
1480b2044J7860K5817k0560k4722K3277K3340k5439k0713K7335J8436k8834j4608
1492b0855K9900J0979k9889p315K9868M240k8480o31K7948k324k6412M101K5232
1505A6362n888k3813P429K2751q823k2032R131K0653r183k0224R946J8910j0500
1518D719j8276J0008J7272j1062j5510J1328J3837j1531j3395J1786J0871j2217
$$ plain form
1428 2384 -4285 -2966 5787 939 -8482 388 10611 -2453 -12034 5306 13762 -5906 -12435 10204
1442 10204 14010 -9886 -11516 13340 12926 -11814 -8569 15021 9675 -12857 -6082 14812 6268
1455 6268 -12199 -3600 13252 4545 -11544 -3190 11584 3882 -11364 -4251 11701 4470 -13058
1468 -13058 -6434 12338 4712 -15544 -7250 15379 4749 -19040 -6873 18233 3808 -22044
1480 -22044 -4184 21633 1073 -23649 -372 22968 -2471 -23184 4151 22587 -6247 -20855
1492 -20855 9045 20024 -9865 -17180 12688 16928 -11552 -12183 15765 13441 -12971 -8870 16362
1505 16362 10474 -13339 -5910 16841 8018 -14014 -4883 15770 6587 -13637 -3691 15219 4719
1518 4719 -13557 -3549 13723 2661 -12849 -1521 12316 785 -12610 -824 10047 -2170
1530b170q592J2497O371j2516m837J2205K350j1578J45J0965q12j0340K609Q625
1544D922l709o377M141N515l871l697L624J710l132K73K732j387j422L432J36
1559B890m581P63O079k163o844L867P527m954q354N403R370p544r530Q420R037
1574I386r381r260J0607Q360j1983p955J3240O488j4486n244J5592L143j6716
1587h209j502J7493p52j7963K240J8590m002j9691O217J9588p609j9106R278J9172
1601A3744j0389j8800J1386J8382j1627j7042J2856J6139j2994j5452J3377J4486
1613A4066j3673j3233J4538J2677j5229j1686J5624J0776j6707r727J7770Q985
1625A4181j9458p402K0060N935k0841n217K2303L266k3190j992K3309K03k3743
$$ plain form
1530 -2170 -10762 1735 8106 -4410 -9247 2958 5308 -6270 -6125 4840 4028 -6312 -3703 4922
1544 4922 1213 -5164 -1023 4492 621 -3076 548 2258 -874 -601 2131 744 -678 2754 2890
1559 2890 -1691 -928 5151 2988 -3856 11 7538 2584 -5770 -367 9003 1459 -8071 349 9386
1574 9386 5 -9255 1352 9712 -2271 -10226 3014 9502 -4984 -10228 5364 8507 -8209
1587 -8209 -9711 7782 7030 -10933 -8693 9897 5895 -13796 -7579 12009 4400 -14706 -5428 13744
1601 13744 3355 -15445 -4059 14323 2696 -14346 -1490 14649 1655 -13797 -420 14066
1613 14066 393 -12840 1698 14375 -854 -12540 3084 13860 -2847 -12574 5196 14181
1625 14181 -5277 -12679 7381 13316 -7525 -12742 9561 12827 -10363 -12355 10954 11157 -12586
1638a2586J182K4000l421k3072M659K2208o321k1129Q379J9154r423j7175J0573
1651b972J5101j1403j2604J1742J0841j2432q339J2838O570j2627m125J2338K766
1664G694j1408j184J0421K63q854K31Q123r61o702J351M675j204l365J274J744
1679B098j165o61O24q30k89J985k84l707K93M904j790n462J865O351k894o660
1695e622K816O702l427p352L800Q075m842q311O000P810o744p718Q172P937r216
1710a920p670J0839P370j2062o657J3359O964j5155n984J7015N394j8041m501
1723a1049J9255L477j9977j786K0730N94k0977N35K1157k005k0789L234K0368
1736A2767m528k0119N966J8811p592j7993Q625J7151j0206j6321J1261J4742j2743
$$ plain form
1638 -12586 -11404 12596 9175 -13897 -9238 12970 6649 -14480 -6101 13053 3630 -13545 -2972
1651 -2972 12129 726 -11878 -136 10705 -1727 -10066 2772 9342 -3285 -7410 4928 7694
1664 7694 -3714 -4898 5523 5786 -3068 -2837 5286 4325 -2377 -1026 3649 2445 -920 354 2098
1679 2098 933 272 896 66 -223 1762 1478 -2229 -1936 2968 1178 -4284 -2419 3932 1038 -5622
1695 -5622 -2806 3896 469 -6883 -3083 4992 150 -8161 -2161 5649 -1095 -8813 -641 7296 -1920
1710 -1920 -9590 1249 8619 -3443 -10100 3259 10223 -4932 -10916 6099 11493 -6548 -11049
1723 -11049 8206 11683 -8294 -10080 10650 11244 -9733 -9198 11959 9954 -10835 -7601 12767
1736 12767 8239 -11880 -5914 12897 5305 -12688 -4063 13088 2882 -13439 -2178 12564 -179
1749a79j3660J3210J2948j4231j1784J4306J0801j5047j0430J5476R588j5290
1761d292q511J5531P593j5398p382J5826O462j4996n278J4736M655j4930l144
1774i128J4550J787j3029k77J2870p60j2474K206J1407l380j0012M758Q733n169
1788B082p935N966O153o478m390O344L616o083k873M858R93m370q1L513j084j560
1804a329J317l00k514J449K816l239k140L790K670n364l151O308K482o552k156
1819e913P931J820q243j730Q504J376q754O9R366Pr310N66R571j745r968L488
1835b965J0922l955j0903N079J0894o267j1393Q021J1678q520j1741R724J1291
1848A1865j1330j1418J2913J0698j3409r697J3633Q391j4903p284J5312N968j5259
$$ plain form
1749 -179 -13839 -629 12319 -1912 -13696 610 11411 -3636 -14066 1410 10998 -4292
1761 -4292 -12803 2728 10321 -5077 -12459 3367 9829 -5167 -10445 4291 8946 -5984 -9128
1774 -9128 5422 7209 -5820 -6097 6773 6013 -6461 -4255 7152 3772 -6240 -1482 7251 2082
1788 2082 -5853 113 6266 -212 -4602 1742 5358 -725 -3598 1260 2253 -2117 -2198 1315 231 -1329
1804 -1329 -12 -312 -2826 -1377 1439 -1800 -3940 -150 2520 -2844 -5995 313 2795 -3757 -5913
1819 -5913 2018 3838 -4405 -6135 2369 3745 -5009 -4940 4426 4433 -4877 -4311 5260 3515 -6453 -2965
1835 -2965 7957 4002 -6901 -1822 9072 2805 -8588 -567 11111 2591 -9150 574 11865
1848 11865 535 -10883 2030 12728 -681 -10378 3255 11646 -3257 -10541 4771 10739 -4520
1861d520m788J5135K543j5616j285J4949N30j4391R87J3609k568j3411L244J2906
1875G324l760j2369N016J2114n646j1317N631J1105n649j0766O619J1168p274
1888B196j0752P390R915p249q706Q653P626q556o826Q673N132q690l664R070K440
1903F652q799j005Q301l45q444J963P645k702o659L354N173m578m191M545L056
1918C966m171j839L498O90l399K91K120p46j212J951N50k808K12K971j551k673
1934b150K417L530l189l212L055L102l278k939M013L257l878k756L339K981l809
1949D83k851M139L134m393k951M900K459n555k867O496K753p842j971Q389J069
1964E392r693n23J0351l6j2102J564J2274k801j3406L998J3226n381j3414O422
$$ plain form
1861 -4520 -9308 5827 8370 -7246 -8531 6418 6948 -7443 -6456 7153 4585 -8826 -5582 7324
1875 7324 3564 -8805 -3789 8325 2679 -8638 -3007 8098 2449 -8317 -1698 9470 2196
1888 2196 -8556 -1166 8749 1500 -7206 1447 9073 517 -6309 2364 7496 -1194 -4858 4212 6652
1903 6652 -2147 -3152 5149 4804 -3640 -1677 5968 3266 -3393 -39 5134 556 -3635 910 3966
1918 3966 -205 -2044 1454 2144 -1255 -964 1156 410 -802 1149 1699 -1109 -897 2074 523 -2150
1934 -2150 267 3797 608 -2604 451 3553 275 -2664 1349 4606 728 -2028 1311 4292 483
1949 483 -2368 1771 4905 512 -2439 2461 4920 -635 -3502 2994 5747 -2095 -4066 4323 5392
1964 5392 -4301 -4824 5527 5491 -6611 -5047 7227 4426 -8980 -4982 8244 2863 -10551 -4129
1978d129J3040p954j2631Q947J1659j0286j0389J1477R426j2879p167J2697O395
1991H206j3768m049J3951K952j4047j345J4020L31j3726J262J3762k197j2613
2004g261K895J2006k933j2124M127J0995l768j0243M142R443l894r429L524R394
2018F874m376q121M111P517m480p426M556O943n262o128N499M999o079n026O810
2033D11M096p281l598P780K482q217j326P789M32p528N12P178j580n406J763M379
2049A886k286k910K715J940k824L44K612k132j335L062J244m149k45N105p65n572
2065c310K206N467k721n395L858M980m777m285N776L101n761k743O272J661o352
2080b023j599O457P16o594m0N753N49o425n21O264J198p068j475P318K208q433
$$ plain form
1978 -4129 8911 957 -11674 -2727 8932 -1354 -11743 -266 9160 -3719 -10886 1811 8206
1991 8206 -5562 -9611 4340 7292 -6755 -8100 5920 6251 -7475 -6213 7549 5352 -7261
2004 -7261 -4366 7640 4707 -7417 -3290 7705 3937 -6306 -2164 7279 3385 -6044 -2520 6874
2018 6874 2498 -5623 -1512 6005 1525 -5901 -1345 5598 336 -5792 -293 4706 -1373 -6399 411
2033 411 4507 -2774 -6372 1408 3890 -4327 -5653 2136 2568 -4960 -4448 2730 1150 -4256 -2493 1886
2049 1886 -400 -3310 -595 1345 -1479 -1135 1477 -655 -1990 1072 2316 -1833 -2078 3027 2262 -3310
2065 -3310 -1104 4363 1642 -3753 105 5085 308 -3977 1799 4900 -861 -3604 2668 4329 -2023
2080 -2023 -3622 2835 3551 -3043 -3083 2670 3219 -3206 -3727 2537 3735 -3333 -4808 2510 4718 -3715
2096c715k500R061K421r975k479J1021K633j2334j276J3105K28j3535J112J4470
2110H237k781j4184M540J4236o207j3538Q312J2536r839j1631J1745R748j2480
2123a306q709J3282P279j3376o202J3539N036j3966l469J2881K218j2069j794
2136f656J1249O78j0626l94R435K38r171K41P852n47p493O59P025j028o422N85
2152d375O823j513o130J927N642k090n114K088N397k453m823K818M590k646l769
2167c628K665L626j989l211K198K898j886k023J630J378n80r22q1P65M58Oj397
2184i3L14J894k87k480j19L137l54l284n8L928o80m262Q16M535j438m713J649
2201a495M839k749m977L624M999m495n441N468N427o489m824O618N002p616m748
$$ plain form
2096 -3715 -6215 2846 5267 -4708 -7187 3834 6467 -5867 -7143 5962 6190 -7345 -6233 8237
2110 8237 5456 -8728 -4188 10048 3841 -9697 -1385 11151 1312 -10319 1426 11174 -1306
2123 -1306 -10015 3267 10546 -2830 -9032 4507 9543 -4423 -7892 4989 7207 -4862 -6656
2136 -6656 4593 5271 -5355 -5749 3686 3924 -5247 -5006 2846 2299 -5194 -4535 2490 1462 -4960 -4375
2152 -4375 2448 935 -5195 -3268 2374 284 -4830 -2742 2655 202 -4621 -1803 2787 141 -3628
2167 -3628 -963 2663 674 -2537 -339 2559 673 -1350 280 1658 1078 156 75 840 1298 1304 -93
2184 -93 221 2115 1828 -652 -771 2366 2012 -1272 -1330 2598 1918 -2344 -1528 3007 1569 -3144 -1495
2201 -1495 3344 595 -4382 -758 4241 -254 -5695 -227 5200 -1289 -6113 505 5507 -2109 -6857
2216f857Q480M541r171l627R289L393q973l104R488K547r223j929R225J595q800
2231c126j135R009N08q535j52Q768l05q700Q95Q376p14r367J829R015j772r682
2247e088K740R481l512j0101M534R976n410j0034N956R526p263q967P703Q734
2261H275q978p351R125O254r408n439R929L866r401k216R388M91r183P31Q282
2276D365j348p014K547O465l304n558L381M976l190l516L101K751k719k342J923
2291E18J632m74j506P0R72O08j031j486J232J747j156k400R81K842k040k998K051
2308d38K156j875k092K171J730k322k076K067J709j647j365J438Q75j149j570
2323b388J032J988q74k165J157K753j417l239J373M223j711m350K563N294l178
$$ plain form
2216 -6857 1623 6164 -3007 -6634 2655 6048 -2925 -6029 3459 6006 -3217 -5146 4079 5674 -3126
2231 -3126 -4261 4748 5256 -3279 -3431 5337 5032 -3668 -2773 5603 4889 -4478 -2649 6366 4594 -5088
2247 -5088 -2348 7133 3621 -6480 -1946 8030 2620 -7414 -1458 8068 805 -8162 -459 8275
2261 8275 -703 -8054 1071 7325 -2083 -7522 2407 6273 -3128 -5344 4044 4535 -4648 -3917 4365
2276 4365 3017 -3997 -1450 5015 1711 -3847 -466 4510 1320 -2196 905 3656 937 -1405 518
2291 518 2150 1676 170 240 1212 1820 789 -697 535 2282 1126 -1274 -293 2549 509 -2489 -438
2308 -438 1718 -157 -2249 -78 1652 -670 -2746 -679 1030 -617 -1982 -544 331 -818 -2388
2323 -2388 -1356 632 -242 -2407 -1250 1503 86 -3153 -1780 2443 732 -3618 -1055 4239 1061
2338A061n888L998O209m409o192N452O540o714n855O817O247p700n181Q522M476
2353G383r120l909R197K505q875j873R520P19r351p41R127k91r268Q93R120j446
2369C590q887J566Q882k159q917K210Q745k076r206K625R344l354r154L102R280
2384E591l255q874L716R202m807q664N642Q501o201p104O355P010o973p001Q142
2399A280N634p962m824Q637L768q909k975Q963J736q271p79P830N20p630j77O649
2415C490m32o160J378M980j156m027J84K881l74k176J98J480K81q70j092M23J103
2432A11k85j625N76K149O5l016J85K803q82k672J351L411j309l543J852L368k076
2449D63l160K648L425k654l565K864L515k725l660K841M408k610m890K764M606
$$ plain form
2338 1061 -4827 -829 5380 971 -5221 231 6771 57 -5798 1019 7266 -434 -5615 2907 7383
2353 7383 -1737 -5646 3551 6056 -2819 -4692 4828 5547 -3804 -4545 4582 4291 -4977 -4084 5036 3590
2369 3590 -5297 -3731 5151 2992 -5925 -3715 5030 2954 -6252 -3627 5717 2363 -6791 -3689 5591
2384 5591 2336 -6538 -2822 6380 1573 -7091 -1449 7052 851 -6253 102 7112 139 -6862 1280
2399 1280 6914 -1048 -5872 2765 6533 -2376 -5351 3612 5348 -2923 -3702 4128 4648 -2982 -3159 3490
2415 3490 3058 -3102 -1724 3256 2100 -1927 -1743 1138 764 -1412 -1214 266 547 -323 -1415 -992 111
2432 111 -174 -1799 -1223 926 991 -2025 -1840 963 81 -2591 -1240 2171 862 -2681 -829 2539 463
2449 463 -2697 -49 3376 722 -2843 21 3536 811 -2849 -8 4400 1790 -3100 -336 4270
2464D270l032m752K628N525k630n960K530O501l224p245M266O242m199p120N341
2479h59O358o273o271O426O177p241n668Q162M768q712m484Q905L862r529k708
2494g087R729K777j0311j831J0040J437r931o52J0146J93r243k98R022L4q521
2509d496N30Q551k21q458N31Q272j359p730K332P346j907p797K573P191k881p120
2525d643L427P047m002o767M191O121m817n785M880N417n147m776M757M466n152
2540g83l947M708L233m750k258L714K427l566k393L053K034k232j683J834J774
2555A165j716j436J230J832j151j199M95K104p71j719N35K150m7k518L19K269
2571A542J59l474J030K879l32l205N32L271j29m078O25L786j32m629M10M374o96
$$ plain form
2464 4270 1238 -3514 -886 4639 2009 -3951 -1421 5080 1856 -5389 -1123 5119 920 -6200 -859
2479 -859 5499 -774 -7045 -619 5558 -1683 -7351 811 5579 -3133 -7617 1288 5150 -4379 -7087
2494 -7087 2642 5419 -4892 -6723 3317 4754 -5177 -5829 4317 4510 -4733 -5031 3991 4025 -4496
2509 -4496 -3966 4585 4364 -4094 -3563 4709 3350 -4380 -2048 5298 3391 -4406 -1833 5358 2477 -4643
2525 -4643 -1216 5831 1829 -4938 -747 5374 557 -5228 -348 5069 -78 -4854 -97 4369 -783
2540 -783 -4730 -22 3211 -1539 -3797 -83 2344 -1222 -3615 -562 1472 -760 -2443 -609 1165
2555 1165 -551 -1987 -757 1075 -76 -1275 -780 1324 553 -1166 -631 1519 1472 -1046 -727 1542
2571 1542 1701 -1773 -743 2136 1804 -1401 -869 2402 2273 -1805 -1180 2606 2474 -2155 -1745 2629 1933
2588A933m878K78N395o34n258N81N628j245n665J277N900k106n927K412O024k772
2604I43n916K867N964l726n490M488N336m680n184N209N141n547m630O133M404
2619E312o322l765O353L636o424l578P025L358o911l377P238K963p252k419P368
2634C205J945p467j269P068Q00o994o19O902j99p195N80P072j342p052J774O551
2650C760j961o705K380N921k561n992L130N655k769n668L324M593l328m414L359
2665a276M092k757m029L356L232k434l764L054L206k517k483K281K447k351j663
2680a606J881K163j926j859K041J923k413j213J706J646j427j693J503J402j432
2695F96j879J496K181j569j927R75K048r76k643Q41L180j118k883K32K956l79
$$ plain form
2588 1933 -2945 -2667 2728 2094 -3164 -2583 3045 1800 -3865 -2588 3312 1206 -4721 -2309 3715 943
2604 943 -4973 -2106 3858 132 -5358 -870 4466 -214 -5398 -189 4952 -595 -5225 908 5312
2619 5312 -1010 -4775 1578 5214 -1210 -4788 2237 5595 -1316 -4693 2545 5508 -1744 -4163 3205
2634 3205 5150 -2317 -3586 3482 4282 -2712 -3331 3571 3372 -3823 -3243 3829 2487 -4565 -2791 3760
2650 3760 1799 -4906 -2526 3395 834 -5158 -2028 3627 858 -4810 -1486 3107 -221 -4635 -1276
2665 -1276 2816 59 -3970 -614 2618 184 -3580 -526 2680 163 -2320 -39 2408 57 -1606
2680 -1606 275 2438 512 -1347 694 2617 204 -1009 697 2343 916 -777 726 2128 696
2695 696 -1183 313 2494 925 -1002 -27 2021 1045 -1598 -757 2423 1305 -1578 -1346 1610 1231
2711A231l415M97L543l46l713M63L435m41l590L25M242l44m356O34M256j059m148
2728b786J197N281j760m918K210N011k740n098K998N972l516o148M410N632m905
2743H40n486N140N808n719n598O120N056o397m808O560M014o478l638O668K968
2758E050o833k741P115J629o636k028P064Q61o343j127O396O79o241m38O146M13
2774B966o961L05O540J2o617P66O421p53o684J077O105p71n924J235N864j451
2790B130n221J736N119j378n275J595M861j839m123J776M044j811l859K078K855
2805B688k007k788K250K597k403k623J759K447j509k614J537K276j292k651R61
2820a372K503j022k608J070K651j240k637R60K549o34k550J79K914r5k867J40
$$ plain form
2711 1231 -2184 -1687 1856 1510 -2203 -1740 1695 1254 -2336 -2011 2231 1887 -2469 -1835 2421 1362 -2786
2728 -2786 -1589 3692 1932 -2986 -776 4235 1495 -3603 -605 5367 1851 -4297 113 5745 840
2743 840 -4646 494 6302 583 -5015 1105 6161 -236 -5044 1516 5530 -948 -4586 2082 5050
2758 5050 -1783 -4524 2591 4220 -2416 -4444 2620 3481 -2862 -3989 2407 3086 -3155 -3593 2553 2966
2774 2966 -3995 -3690 2850 2862 -3755 -2989 3432 2679 -4005 -2928 3177 2406 -3518 -2283 3581 2130
2790 2130 -3091 -1355 3764 2386 -2889 -1294 3567 1728 -2395 -619 3425 1614 -2245 -167 2688
2805 2688 681 -2107 143 2740 337 -2286 -527 1920 411 -2203 -666 1610 318 -2333 -1372
2820 -1372 1131 109 -2499 -1429 1222 -18 -2655 -1695 854 220 -2330 -2151 763 668 -2199 -2059
2836b059K776R5k481n14K977O98l358r0L257M85l386m58M036M39m289J13M349
2853B590k89m219K77N099r09n007R90M850j367m803J156N589j750n549J912N358
2869C928k519n367K412N777k988n251K565N532l080n611L569N352m086n001L870
2884h98M896m300m432M567M176n136l516N224L639n938k642O105K587o223k072
2899c963O155J701o140j084O328J136o259o97N729M14n614J3N295j14m595K07
2915a488M286j10m353N79L748m15m079N42L307j95l514j99L522Qm203O82L791
2932A909p97l838Q34L868j190l822J433L493j541l306J994K806j423l488J667
2947a401L166j666k353J691J851j144j818J203J887r58j251L22J544L8j378o8
$$ plain form
2836 -2059 717 812 -1669 -2183 794 1492 -1866 -1956 1301 1786 -1600 -2058 1978 2417 -1872 -1759 2590
2853 2590 2301 -1918 -1641 3458 2549 -2458 -1468 3382 2015 -2788 -1632 3957 2207 -3342 -1430 3928
2869 3928 1409 -3958 -1546 4231 1243 -4008 -1443 4089 1009 -4602 -1033 4319 233 -4768 -898
2884 -898 3998 -302 -4734 -167 4009 -1127 -4643 581 4220 -1718 -4360 1745 4332 -1891 -3963
2899 -3963 2192 3893 -2247 -3331 2997 4133 -2126 -2823 2906 3320 -2294 -2281 3014 2900 -1695 -1488
2915 -1488 2798 2688 -1665 -1086 2662 2247 -1832 -1290 2017 1822 -1692 -1891 1631 1639 -2564 -1882 1909
2932 1909 1112 -2726 -1892 1976 786 -3036 -1603 1890 349 -2957 -963 1843 420 -3068 -1401
2947 -1401 1765 99 -2254 -563 1288 144 -1674 -471 1416 458 -793 -471 1073 1111 -267 -335
2963c35J091N82j715m76K287N48k303m44K149O93k887m72L409K23l574k32L113
2980A657L67l823N01L702n77m179O67M282j555l941J078L909j308l715J313L674
2996B052j304l473J053L825j381l911J421M245k068l554J711L967j784l957K262
3011h96L831k481l890L322L657l247l657L588L912m108l637M860L150m561l454
3026c611N424K625n182k545N302J926n308j450N006R92n071l78M591N12m750j94
3042b111M290j86l948k73M093r73l437P47L225m26l371M28L230k23l380N73L098
3059A356k64l301M66L137J34l647M18L560j67l631N15L571n01l734J135K876m39
3076A484l418J297K541n00k891J117K634j215k078O18K475j366j835Q80J660j112
$$ plain form
2963 -335 756 1338 -377 -853 1434 1982 -321 -765 1384 2077 -810 -1282 2127 2350 -1224 -1456 1657
2980 1657 2024 -1799 -1298 2404 1827 -2352 -1685 2597 1042 -2899 -1821 2088 780 -2935 -1622 2052
2996 2052 748 -2725 -1672 2153 772 -3139 -1718 2527 459 -3095 -1384 2583 799 -3158 -896
3011 -896 2935 454 -3436 -114 3543 296 -3361 227 4139 31 -3606 1254 4404 -157 -3611
3026 -3611 1813 4438 -744 -3289 2013 3939 -1369 -2819 2187 3179 -1892 -2270 2321 2833 -1917 -2111
3042 -2111 2179 1993 -1955 -2228 1865 892 -2545 -1798 1427 1001 -2370 -1942 1288 1065 -2315 -1742 1356
3059 1356 1092 -2209 -1743 1394 1528 -2119 -1701 1859 1692 -1939 -1424 2147 1646 -2088 -953 1923 1484
3076 1484 -1934 -637 1904 1404 -1487 -370 2264 1049 -1029 -411 2064 698 -1137 -257 1403 291
3092B91j426P31J263m36j629J80J645N2j988j3J965K15k650n0K505K26k968n69
3110b656L749J90l541l13L607k9l575J83M129l98l846N40M038q93m121J409L796
3127B269j054l714J539L631j768l268J742L491j958l243K084L210k144l258K113
3142c28L313k172l565K545L497k782l410K678L431l028l736L433L069l122l404
3157c581L534L102l876k756L727K309l674k055L979K072m566j197M061J291m264
3172a894o07L852N30m005j03L778J82l691L42L464ll533M03L181J06k977J84K920
3190B129j96k839N2K809j90k526J43K599J14k615k27K539n21j991K11K192j63
3207A520k203j45J956l2j923j90K320m87j805L30J792l49k145K72K102P7k574
$$ plain form
3092 291 -1135 -404 859 423 -1206 -1026 619 671 -1317 -1330 635 850 -1800 -1850 655 881 -2087 -2656
3110 -2656 1093 1283 -2258 -2571 1036 1007 -2568 -2385 1744 1346 -2500 -1960 2078 1185 -2936 -1527 2269
3127 2269 1215 -2499 -960 2671 903 -2365 -623 2868 910 -2333 -249 2961 817 -2441 -328
3142 -328 2985 813 -2752 -207 3290 508 -2902 -224 3207 179 -3557 -124 2945 -177 -3581
3157 -3581 -47 3055 -821 -3577 150 2459 -1215 -3270 709 2781 -1785 -2982 1079 2370 -1894
3172 -1894 -2501 1351 1881 -2124 -2227 1551 1733 -1958 -1616 1848 1845 -1688 -1285 1896 2002 -975 -791 2129
3190 2129 1933 -906 -854 1955 1765 -761 -618 1981 2095 -520 -747 1792 1271 -720 -509 1683 1520
3207 1520 -683 -828 1128 1096 -827 -1017 1303 816 -989 -659 1133 784 -1361 -1089 1013 1090 -1484
3224a484L19K014q7j659J24J956q5k140K9J873L59k009l1J914O96k537J03K221
3242A576J87k511j50K467L71k492J67K103J27k498k36K987l22k975M81L046m51
3259A877l161L18K896p94k994J088L019j417l160J028L214j570k758J041L453
3274B080j818l015J890K741j983k680K159K255k079k627K322K559k464j706K276
3289i0J693k332j694K494J687k427j288K870J135k941j039K755R55k315j355L065
3305A173R21k777j007K994M63k808r5K529K07k719k69K677Q8k760OK663l40k711
3323a765M85K229o78k216O63K019n90j630M35J570n41j741Q07J504o57j371L88
3340a089J580k12j665P36J333m09j776P63J486l85j360L62J916k71j967M06J646
$$ plain form
3224 -1484 -1165 849 762 -897 -773 1183 1098 -1042 -1013 860 1219 -790 -821 1093 1789 -748 -645 1576
3242 1576 1763 -748 -898 1569 1940 -552 -385 1718 1845 -653 -889 2098 1776 -1199 -718 2328 1877
3259 1877 -1284 -966 1930 1136 -1858 -770 2249 832 -2328 -1300 1914 344 -2414 -1373 2080
3274 2080 262 -2753 -863 1878 -105 -2785 -626 1629 -450 -3077 -755 1804 -660 -2366 -90
3289 -90 1603 -729 -2423 71 1758 -669 -1957 913 2048 -893 -1932 823 1778 -537 -1892 1173
3305 1173 2094 -683 -1690 1304 1767 -1041 -1136 1393 1600 -1119 -1388 1289 1377 -1383 -1377 1286 946 -1765
3323 -1765 -1280 949 271 -1945 -1282 737 147 -1483 -1048 522 -19 -1760 -953 551 -106 -1477 -1089
3340 -1089 491 279 -1386 -650 683 274 -1502 -739 747 362 -998 -636 1280 1009 -958 -552 1094
3357A094p0j713J46J722j79j533KJ778j25j816L1J665k04j689O04J392o11j084
3375e90r7J729m06j989N95J744l39j926M75J877o11j924M01K211j017j837O33
3392a071K304j078j910R59K213j222k258J416K031j082k051J102K407j297k038
3407a575J167K461j837k109J988J857j943j699K292J580j948j545K222J498k649
3422b40j018K214J249k712q15K493N74k592p61K811N40k818k45K230O86k710n15
3439a629K561O2k040n39K414k9k450L50K036K54k439R4K330j73k527M94K237m15
3457E91k070M93K296o05j803N90K064p74j795N88K295q31k060J160J266p68j482
3474h45R96J330o58j221J15J808r20j233M60J076j94j317N33J209n70r55j90J330
$$ plain form
3357 1094 1024 -689 -543 1179 1000 -533 -531 1247 1122 -694 -663 1002 798 -891 -287 1105 494 -590
3375 -590 -687 1042 636 -1353 -758 986 647 -1279 -804 1073 462 -1462 -1061 1150 133 -1704 -1071
3392 -1071 1233 155 -1755 -796 1417 195 -2063 -647 1384 302 -1749 -647 1760 463 -1575
3407 -1575 -408 2053 216 -1893 95 1952 9 -1690 602 2182 234 -1311 911 2409 -240
3422 -240 -1258 956 2205 -507 -1322 1171 1745 -847 -1608 1203 1743 -1075 -1320 910 1596 -1114 -1629
3439 -1629 932 994 -1046 -1585 829 800 -1650 -1300 736 990 -1449 -1355 975 802 -1725 -1231 1006 591
3457 591 -1479 -986 1310 705 -1098 -508 1556 782 -1013 -425 1870 1039 -1021 139 1405 637 -845
3474 -845 151 1481 823 -398 -283 1525 605 -628 -168 908 714 -603 -70 1139 569 -386 -576 754
3492G54n9j276p5J313l66j509L00J705l34j918N04J657l90j613M50J595p79j711
3510a752Q25J828p98j824R51J872p86j775Q78J974n30j845O40J641m08j954J021
3527d2J699r46j646R80J690r89j663J107J502j222j570J080J614j271j448J403
3543B78J478j692j427J327J292j545j344J644J338j900j207J781J391k132j354
3558b072K218Q04j890r69K225N05j852o55K302O48k490m33K456J98k252j55K325
3575I13K37j868k84K386o66j816L23K367o63j605N20J203o0j577L57J609n91j480
3593f95J55J716l83j485L37J418k26j480M17Q58o2j228J80J185n12j183N49J201
3611G62r14j082N23J238p03q34N43O67m89j073R12Q93n19p28M54O74m76o30O83
$$ plain form
3492 754 695 -581 -656 657 291 -1218 -918 787 453 -1465 -961 696 306 -1307 -857 738 -41 -1752
3510 -1752 -927 901 103 -1721 -770 1102 316 -1459 -581 1393 863 -982 -342 1299 891 -1063 -42
3527 -42 1657 711 -935 45 1735 746 -917 190 1692 470 -1100 -20 1594 323 -1125 278
3543 278 1756 64 -1363 -36 1256 -289 -1633 11 1349 -551 -1758 23 1414 -718 -2072
3558 -2072 146 950 -940 -1909 316 821 -1031 -1686 616 1264 -1226 -1659 797 995 -1257 -1412 913
3575 913 1150 -718 -1002 1384 718 -1098 -775 1592 929 -676 -156 1047 987 -590 -233 1376 785 -695
3593 -695 -540 1176 793 -692 -355 1063 837 -643 -226 632 570 -658 -478 707 195 -988 -439 762
3611 762 -152 -1234 -711 527 -176 -1010 -467 200 -289 -1362 -450 443 -76 -804 -350 324 -152 -782 -99
3630i9O09k99l57j0Q79l67o35k8J214l95o39j18J090K34j631M80J065j19j269
3649c95J87J396n18j198K13J594j099r88Q69J243j205j273J539Q28j631o65J035
3666f8J095j617q16J461O06j038j077J464O59j185r76J435N96r30n82J195N07
3683G29j183p94J245R96j223q98J676O94j433n37J549N38j551k67J985j89j815
3700d78m59K098J76j880k54K109O2k056J88J901m21j792L04K031j068j651Q10
3717c80J695p72j832P28J569p70j342M41J040n89p75N38J057o72j093M94R64m26
3735a25q41P19O68n53j097Q50R03m76o55K38J231p10q83N99J101r02r11J075O36
3754H67r01o54Q58Q30p25p43R13M46o78p89N45Q19p42l79O87L69r00k37L93Om16
$$ plain form
3630 -99 510 211 -146 -156 723 356 -279 -307 907 512 -127 -245 845 1079 -552 -72 993 874 -395
3649 -395 -208 1188 670 -528 -315 1279 180 -808 61 1304 99 -1174 365 1193 -438 -1103 -68
3666 -68 1027 -590 -1406 55 661 -377 -1454 10 669 -516 -1492 -57 539 -391 -973 222 729
3683 729 -454 -1248 -3 993 -230 -1128 548 1242 -191 -728 821 1359 -192 -459 1526 1337 -478
3700 -478 -937 1161 1337 -543 -797 1312 1374 -682 -494 1407 986 -806 -502 1529 461 -1190 -380
3717 -380 1315 543 -1289 -561 1008 238 -1104 -663 377 -212 -987 -449 608 -64 -1157 -663 301 -125
3735 -125 -966 -247 421 -132 -1229 -379 524 48 -607 -369 862 152 -731 -132 969 67 -844 231 867
3754 867 -34 -688 170 1000 275 -468 445 891 213 -576 -31 788 46 -333 354 723 -177 -414 -21 -15 -431
3775d31k47J83P77p20o81P80N27n96r12O60Q73r12o02N47J687j377n67N67P54
3794C10o88j135J375P92j191n87J525N17j397o14J632M72j295m29J369M38j368
3811b74o22J547N17j059k63O93J50q04j71Q55M43j141l44J045J02j278j95J172
3829C73N84j737j17J445k81j044l66J710N0j857K54J360j43j516K33J888l67j641
3847a172J45J913n69j432J65J536n42j145O03J378q41q70P78J093q06q92Q54R73
3865A169o19j224R59Q75q00q91R80N30r98m29N70R66r09o10O36N95p65o72O19
3884a8J161j354n68N59N52o37p37P64R22q76q56R68M53j100J0M97N88r66l17J090
3904A35K70q41l05P49L09o16l95J105J11j089o2Q85O50r22l69O71O24m84q71P64
$$ plain form
3775 -431 -678 -495 282 -438 -1119 -339 188 -408 -1320 -660 213 -699 -1301 -754 933 -444 -1011 -444 310
3794 310 -378 -1513 -138 654 -537 -1124 401 918 -479 -1093 539 1011 -284 -713 656 1094 -274
3811 -274 -896 651 1168 109 -154 539 689 -115 -286 569 1012 -129 -473 572 674 -604 -799 373
3829 373 957 -780 -897 548 267 -777 -1143 567 617 -1240 -986 374 231 -1285 -1052 836 469 -1172
3847 -1172 -1027 886 317 -1115 -950 586 44 -1101 -498 880 39 -831 -53 1040 234 -658 196 1169
3865 1169 550 -674 285 1160 360 -531 449 979 -19 -448 122 1088 179 -431 205 800 35 -637 -18
3884 -18 1143 -211 -779 -220 332 -305 -1042 -278 644 -232 -1088 -120 333 -767 -757 -260 328 -638 -955 135
3904 135 405 -436 -741 8 317 -299 -694 411 522 -567 -629 256 906 -16 -385 286 910 426 -445 319
3924C19N06p05o73J052M17q79k92J107J57q60o52R77J43p17k94R00K90j095j90
3943d89Q91M07j265k89J408j05j362j01J475k69j217L69J255n32q05m42J401j69
3961A61j035K17J111m6j258K91J161P1j316j74J661m03j023M39J038j20j083L63
3979E5J002p51o44M90P11l44j108P19J114p11j120O01J137o54j175P55J097r85
3997A89j052Q72R12j324n57R44M55p41o13J013k6q72m40J223N85j255l37Q47P27
4016E50r96m11P39N64q37m18R77N43r00o63J504P7r85n03J097L58q15m62J283
4035G02P9q26l29J006K14j122K75R37m2j182J23O13N27j185j23R65K91j471K34
4054c14R06J5j007l16Q73K66r65q2Q95K12j211M3J275k41r56n51J666n1j418L42
$$ plain form
3924 319 825 120 -553 499 916 37 -255 852 1009 149 -503 474 617 -100 -394 506 796 -299 -489
3943 -489 402 809 -456 -745 663 558 -804 -905 570 301 -916 -547 708 176 -629 -1071 330 161
3961 161 -874 -657 454 408 -850 -559 602 673 -643 -817 844 441 -582 -143 895 775 -308 55
3979 55 1057 306 -338 152 863 519 -589 130 1244 533 -587 14 1151 497 -678 77 1174 189
3997 189 -863 9 921 -403 -960 -16 439 -302 -915 98 72 -800 -1240 -17 568 -687 -1024 -177 550
4016 550 -446 -857 -118 446 -391 -809 168 711 -189 -852 652 729 -256 -759 338 696 -119 -581 702
4035 702 781 -45 -374 632 846 -276 -1 936 894 -288 -165 448 975 -210 -333 632 923 -548 -314
4054 -314 592 607 -400 -716 157 423 -542 -624 271 483 -728 -685 590 349 -607 -1158 508 457 -961 -619
4074f19J285j07j525K37J273J19j235Q5J059kj109K60J067j92j166L55J187l07
4092F65j091k1J512o23q23L33J245m21j496N38J206j67j310L02J393q19j508J009
4110g6J055q76j318J096P58q82r16R19J280j323j059J379R25j579n92P17J181
4127F89j103j084J179J232j123j085J123J392j601o26J184M26j117l28J406M82
4143A046j181q12J092Q22j033o90J546J32j020l61J154M15j424k4J181M51j740
4160d46J1J140K15j614J8J477M0j263n26J205N08j058m01Q41L88j075Q1N44K11
4179B96j154lR90K90j036j25J111k20r94K83R87j17q05k42J314j42j090O7J337
4198G47j42j130K13J276m60q75j12J567j08j238J20J042j07j509K69J377j00j260
$$ plain form
4074 -619 666 559 -966 -729 544 663 -572 -487 572 570 -539 -279 788 596 -570 -215 972 665
4092 665 -426 -447 1065 442 -381 -48 1197 776 -720 -182 1024 857 -453 -151 1242 423 -1085 -76
4110 -76 979 103 -1215 -119 639 -243 -1159 -240 1040 -283 -1342 37 962 -617 -1209 -492 689
4127 689 -414 -1498 -319 913 -210 -1295 -172 1220 -381 -1007 177 603 -514 -842 564 1046
4143 1046 -135 -947 145 967 -66 -756 790 922 -98 -459 695 1110 -314 -338 843 1294 -446
4160 -446 -435 705 920 -694 -676 801 841 -422 -948 257 765 -293 -694 147 535 -540 -459 85 296
4179 296 -858 -861 129 419 -617 -742 369 149 -845 -562 425 308 -497 -739 575 433 -657 -590 747
4198 747 605 -525 -312 964 504 -371 -483 1084 976 -262 -142 900 793 -716 -447 930 830 -430
4216d30r8R27r6p54qJ186l22j152J90J295n32q38K10J427o69j446L40J538n58
4235B10j361O22J181n64j166N94J041n65j365J043J024n53j443R37J308q77j399
4252a333J265J160r48r81J028J071j062j029R56J051j204m45R35P92j013p60J064
4269E47M45r08o93J145O93j581n46J316M47j252q45J245O89j362n09J274P55j548
4287f88m39J464L08j376m59J474P20j594n02J702K01j335m76J354K16j403K00
4304f33J197n9j114j04J295k62r56J93J089k15p51j51J066K92j167j81J284J2
4322H35j238J74R58M6j093L6R80K68j471M9J494k91j281k5J204Rj417K40J143
$$ plain form
4216 -430 -528 399 303 -451 -459 727 405 -747 -557 738 206 -632 -422 1005 336 -1110 -770 768 210
4235 210 -1151 -529 652 88 -1078 -484 557 -8 -1373 -330 694 141 -1302 -365 943 66 -1333
4252 -1333 -68 1092 144 -837 191 1262 200 -829 127 1178 -26 -471 464 1256 243 -517 547
4269 547 992 84 -609 536 1229 -352 -898 418 865 -387 -1232 13 702 -660 -1169 105 860 -688
4287 -688 -1127 337 645 -731 -1190 284 1004 -590 -1092 610 811 -524 -1000 354 570 -833 -633
4304 -633 564 505 -609 -713 582 320 -636 -443 646 431 -320 -471 595 887 -280 -461 823 835
4322 835 -403 -229 729 775 -318 -282 698 966 -505 -456 1038 747 -534 -559 645 654 -763 -523 620
$$ [...]
8191G54
##END NTUPLES=NMR FID
##END=
