##TITLE=1H_2PBDP2212
 CDCl3
 8 sc, 
 23.12.2022
##JCAMPDX= 6.0         $$ Bruker NMR JCAMP-DX V2.0
##DATA TYPE= NMR FID
##DATA CLASS= NTUPLES
##ORIGIN= UXNMR, Bruker Analytische Messtechnik GmbH
##OWNER= root
$$ XWIN-NMR		Version 3.5
$$ Fri Dec 23 14:08:54 2022 Russian Standard Time (UT+4h)  she@DPX200
##.OBSERVE FREQUENCY= 200.13135
##.OBSERVE NUCLEUS= ^1H
##.DELAY= (6, 6)
##.ACQUISITION MODE= SIMULTANEOUS
##.ACQUISITION SCHEME= undefined
##.AVERAGES= 8
##.DIGITISER RES= 18
##SPECTROMETER/DATA SYSTEM= spect
##.PULSE SEQUENCE= zg30
##.SOLVENT NAME= CDCl3
##.SHIFT REFERENCE= (INTERNAL, CDCl3, 0, 15.7039)
##AUDIT TRAIL= $$ (NUMBER, WHEN, WHO, WHERE, WHAT)
$$ ##TITLE= Audit trail, XWIN-NMR		Version 3.5
$$ ##JCAMPDX= 5.01
$$ ##ORIGIN= Bruker BioSpin GmbH
$$ ##OWNER= she
$$ F:/spectra/data/she/nmr/H-F/1/audita.txt
$$ ##AUDIT TRAIL=  $$ (NUMBER, WHEN, WHO, WHERE, WHAT)
(   1,<2022-12-23 14:08:04.15 +0400>,<she>,<DPX200>,
      <created by zg, POWCHK disabled, PULCHK disabled
       configuration hash MD5:
       00 E9 B6 7A A2 85 ED C7 34 08 36 98 17 FE 4E 26
       data hash MD5: 16K
       36 66 5F 42 7E 95 46 52 7E DF 40 B7 49 5D F3 17>)
$$ ##END=
$$ 
$$ hash MD5
$$ 8C 4B 60 EA 9C C7 B0 AA 77 63 C0 73 09 79 2B C3
##$RELAX= 
##$RELAX= 
##$RELAX= 
##$RELAX= 
##$RELAX= 
##$RELAX= 
$$ Bruker specific parameters
$$ --------------------------
##$DU= <F:/spectra>
##$EXPNO= 1
##$NAME= <H-F>
##$PROCNO= 1
##$TYPE= <nmr>
##$USER= <she>
##$AMP= (0..31)
100 100 100 100 100 100 100 100 100 100 100 100 100 100 100 100 100 100 
100 100 100 100 100 100 100 100 100 100 100 100 100 100 
##$AQSEQ= 0
##$AQ_mod= 1
##$AUNM= <au_zg>
##$AUTOPOS= <>
##$BF1= 200.13
##$BF2= 200.13
##$BF3= 200.13
##$BF4= 200.13
##$BF5= 200.13
##$BF6= 200.13
##$BF7= 200.13
##$BF8= 200.13
##$BYTORDA= 1
##$CFDGTYP= 0
##$CFRGTYP= 5
##$CHEMSTR= <none>
##$CNST= (0..31)
1 1 145 1 1 1 1 1 1 1 1 1 1 1 1 1 1 1 1 1 1 1 1 1 1 1 1 1 1 1 1 1 
##$CPDPRG= <>
##$CPDPRG1= <>
##$CPDPRG2= <>
##$CPDPRG3= <>
##$CPDPRG4= <mlev>
##$CPDPRG5= <mlev>
##$CPDPRG6= <mlev>
##$CPDPRG7= <mlev>
##$CPDPRG8= <mlev>
##$CPDPRGB= <>
##$CPDPRGT= <>
##$D= (0..31)
0 1.2 0 0 0 0 0 0 0 0.06 0 0.03 0 0 0 0 0.0002 0 0 0 0 0 0 0 0 0 0 0 0 
0 0 0 
##$DATE= 1671790083
##$DBL= (0..7)
120 120 120 120 120 120 120 120 
##$DBP= (0..7)
150 150 150 150 150 150 150 150 
##$DBP07= 0
##$DBPNAM0= <>
##$DBPNAM1= <>
##$DBPNAM2= <>
##$DBPNAM3= <>
##$DBPNAM4= <>
##$DBPNAM5= <>
##$DBPNAM6= <>
##$DBPNAM7= <>
##$DBPOAL= (0..7)
0.5 0.5 0.5 0.5 0.5 0.5 0.5 0.5 
##$DBPOFFS= (0..7)
0 0 0 0 0 0 0 0 
##$DE= 6
##$DECBNUC= <off>
##$DECIM= 32
##$DECNUC= <off>
##$DECSTAT= 4
##$DIGMOD= 1
##$DIGTYP= 9
##$DL= (0..7)
0 120 120 120 120 120 120 120 
##$DP= (0..7)
150 150 150 150 150 150 150 150 
##$DP07= 0
##$DPNAME0= <>
##$DPNAME1= <>
##$DPNAME2= <>
##$DPNAME3= <>
##$DPNAME4= <>
##$DPNAME5= <>
##$DPNAME6= <>
##$DPNAME7= <>
##$DPOAL= (0..7)
0.5 0.5 0.5 0.5 0.5 0.5 0.5 0.5 
##$DPOFFS= (0..7)
0 0 0 0 0 0 0 0 
##$DQDMODE= 0
##$DR= 18
##$DS= 0
##$DSLIST= <SSSSSSSSSSSSSSS>
$$ [...]
##$SUBNAM2= <"">
##$SUBNAM3= <"">
##$SUBNAM4= <"">
##$SUBNAM5= <"">
##$SUBNAM6= <"">
##$SUBNAM7= <"">
##$SUBNAM8= <"">
##$SUBNAM9= <"">
##$SW= 18.05172834244
##$SWIBOX= (0..15)
0 0 2 0 0 0 0 0 0 0 0 0 0 0 0 0 
##$SW_h= 3612.71676300578
##$TD= 16384
##$TD0= 1
##$TE= 0
##$TE2= 300
##$TE3= 300
##$TEG= 300
##$TL= (0..7)
0 120 120 120 120 120 120 120 
##$TP= (0..7)
150 150 150 150 150 150 150 150 
##$TP07= 0
##$TPNAME0= <>
##$TPNAME1= <>
##$TPNAME2= <>
##$TPNAME3= <>
##$TPNAME4= <>
##$TPNAME5= <>
##$TPNAME6= <>
##$TPNAME7= <>
##$TPOAL= (0..7)
0.5 0.5 0.5 0.5 0.5 0.5 0.5 0.5 
##$TPOFFS= (0..7)
0 0 0 0 0 0 0 0 
##$TUNHIN= 0
##$TUNHOUT= 0
##$TUNXOUT= 0
##$USERA1= <user>
##$USERA2= <user>
##$USERA3= <user>
##$USERA4= <user>
##$USERA5= <user>
##$V9= 5
##$VALIST= <valist>
##$VCLIST= <CCCCCCCCCCCCCCC>
##$VD= 0
##$VDLIST= <DDDDDDDDDDDDDDD>
##$VPLIST= <PPPPPPPPPPPPPPP>
##$VTLIST= <TTTTTTTTTTTTTTT>
##$WBST= 1024
##$WBSW= 4
##$XGAIN= (0..3)
0 0 0 0 
##$XL= 0
##$YL= 0
##$YMAX_a= 258365
##$YMIN_a= -294420
##$ZGOPTNS= <>
##$ZL1= 120
##$ZL2= 120
##$ZL3= 120
##$ZL4= 120
##$ABSF1= 10
##$ABSF2= 0
##$ABSG= 5
##$ABSL= 3
##$ALPHA= 0
##$AQORDER= 0
##$ASSFAC= 0
##$ASSFACI= 0
##$ASSFACX= 0
##$ASSWID= 0
##$AUNMP= <proc_1d>
##$AZFE= 0.1
##$AZFW= 0.1
##$BCFW= 1
##$BC_mod= 2
##$BYTORDP= 1
##$COROFFS= 0
##$CY= 11.3945322036743
##$DATMOD= 1
##$DC= 2
##$DFILT= <>
##$DTYPP= 0
##$F1P= 2.36226072786647
##$F2P= -0.459571619588291
##$FCOR= 0.5
##$FTSIZE= 0
##$FT_mod= 4
##$GAMMA= 1
##$GB= 0.15
##$INTBC= 1
##$INTSCL= 1
##$ISEN= 128
##$LB= 0.24
##$LEV0= 0
##$LPBIN= 0
##$MAXI= 10000
##$MC2= 0
##$MEAN= 0
##$ME_mod= 0
##$MI= 1.114404
##$NCOEF= 0
##$NC_proc= 0
##$NLEV= 6
##$NOISF1= 3.799351
##$NOISF2= 2.8
##$NSP= 1
##$NTH_PI= 0
##$NZP= 0
##$OFFSET= 15.70392
##$PC= 1
##$PHC0= -19271.94
##$PHC1= 16.40073
##$PH_mod= 1
##$PKNL= yes
##$PPARMOD= 0
##$PSCAL= 0
##$PSIGN= 0
##$REVERSE= no
##$SF= 200.130013532006
##$SI= 16384
##$SIGF1= 3
##$SIGF2= 2
##$SINO= 400
##$SIOLD= 16384
##$SREGLST= <1H.CDCl3>
##$SSB= 0
##$STSI= 0
##$STSR= 0
##$SW_p= 3612.71676300578
##$SYMM= 0
##$S_DEV= 0
##$TDeff= 0
##$TDoff= 0
##$TI= <>
##$TILT= no
##$TM1= 0
##$TM2= 0
##$TOPLEV= 0
##$USERP1= <user>
##$USERP2= <user>
##$USERP3= <user>
##$USERP4= <user>
##$USERP5= <user>
##$WDW= 1
##$XDIM= 8192
##$YMAX_p= 0
##$YMIN_p= 0
$$ End of Bruker specific parameters
$$ ---------------------------------
##NTUPLES= NMR FID
##VAR_NAME=  TIME,          FID/REAL,        FID/IMAG
##SYMBOL=    X,             R,               I
##VAR_TYPE=  INDEPENDENT,   DEPENDENT,       DEPENDENT
##VAR_FORM=  AFFN,          ASDF,            ASDF
##VAR_DIM=   8192,          8192,            8192
##UNITS=     SECONDS,       ARBITRARY UNITS, ARBITRARY UNITS
##FACTOR=    0.0002768,     1,               1
##FIRST=     0,             0,               0
##LAST=      2.2672688,     0,               0
##MIN=       0,             -294420,         0
##MAX=       2.2672688,     258365,          0
$$ Real data points
##PAGE= N=1
##DATA TABLE= (X++(R..R)), XYDATA
0@%%%%%%%%%%Qj6J6k4L2l2M0n6P2q5J01j20J36j60J92k24K61l02L46m01M64n28
$$ 0 0 0 0 0 0 0 0 0 0 0 8 -8 8 -16 16 -16 24 -32 40 -45 56 -64 72 -88 104 -120 141 -161 185 -216 248 -280
32b80O00o80P66q63R70j090J221j362J516j684J868k073K297k539K803l091L407
$$ -280 320 -360 406 -457 513 -577 644 -718 798 -886 982 -1091 1206 -1333 1470 -1621 1786
49A786l753M134m555N020n536O113o761P497q337R307j0447J1802j3448J5498
$$ 1786 -1967 2167 -2388 2632 -2904 3209 -3552 3945 -4392 4915 -5532 6270 -7178 8320
63H320j8130K1652k6629L4245m7475P6787k53549P8578L10143m66166J24474L63558
$$ 8320 -9810 11842 -14787 19458 -28017 48770 -204779 -126201 183942 -282224 -157750 205808
75B05808k07639j63574L19495k8523j83637J18299P9280j45634J9518O9736n4713
$$ 205808 -1831 -165405 154090 125567 -58070 60229 139509 -6125 13393 83129 28416
86B8416n4315M9468Q779o2887j3078R4266k8024r6292R4390O6709j65705J6474
$$ 28416 -25899 23569 32348 -30539 -43617 50649 22625 -73667 20723 87432 -78273 -61799
98f1799J63457j21441j11624J84876Kj82816J04482J32075j49247k3025J57147
$$ -61799 101658 -19783 -131407 53469 53471 -129345 -24863 107212 -42035 -65060 92087
109I2087m9585j03824R3330L8288r3897M236N8874m1183m3778L7803J2445m6626
$$ 92087 42502 -61322 32008 70296 -23601 -19365 39509 -1674 -45452 -7649 4796 -41830
121d1830R806M6622l3547k5491P0672M710p3340M9103O5978r4061k7285J16174
$$ -41830 -32024 14598 -18949 -44440 26232 30942 -42398 6705 72683 -21378 -48663 67511
133F7511l6540j07340R3057N6647j26122J0319J16724o8740o9542J02655Q239
$$ 67511 30971 -76369 16688 73335 -52787 -42468 74256 5516 -64026 38629 46868
144D6868j01802M7155O8593q2777j7105Q6874m0525o7001P7172K3085q5408L3985
$$ 46868 -54934 -7779 60814 -21963 -39068 47806 7281 -59720 17452 40537 -44871 -10886
156a0886P3206p4413l1446R7011k1676r1863O6329M9469j02298k757R7524m9699
$$ -10886 62320 -12093 -43539 53472 31796 -60067 6262 55731 -46567 -49324 48200 -1499
168a499p0273Q1336K5787q5990K4990P3823n3586l2721P2011n935o0346M2747
$$ -1499 -71772 9564 35351 -50639 -25649 48174 -5412 -38133 33878 27943 -32403 10344
180A0344L4189o1359L32N8335l6743m2504N8513J0617o6144K2825N4202m9016
$$ 10344 44533 -16826 -16494 41841 5098 -37406 21107 31724 -34420 -11595 42607 -6409
192f409k7920N9915l372n5792K6862L6319m2181j2898M3195j0541l3400K7870
$$ -6409 -34329 25586 22214 -33578 -6716 29603 -12578 -25476 17719 7178 -26222 1648
204A648J6295l4442M147L2485k1032k1120L4644N335l9860J5113L4388l5164j7620
$$ 1648 17943 -16499 -12352 20133 -899 -22019 12625 17960 -21900 -6787 27601 -7563 -25183
217b5183M7754o443m7182L1857L3514n0033q632N6711k0537m8660M4402K5624
$$ -25183 22571 16128 -31054 803 34317 -15716 -24348 32363 11826 -36834 7568 33192
229C3192n6977L465N1825l0400l3622M5128P336m4636J9465L0439l8179n654M3951
$$ 33192 -23785 -20320 31505 1105 -32517 12611 19947 -24689 -5224 25215 -12964 -18618 25333
242B5333k1445l2469M3950R070n2985K0113M7313m5005k6825O0201k455o0931
$$ 25333 3888 -28581 15369 24439 -28546 -8433 38880 -6125 -32950 27251 24796 -36135
254c6135L1548M4488n3157j8761N6584j1386m6335L2346K5040m0823j198L6361
$$ -36135 -4587 39901 -13256 -32017 24567 13181 -33154 -808 24232 -16591 -17789 18572
266A8572j7205j9964K8009J991k4805J3928J4281k1059k37K0188j2043j4523J8975
$$ 18572 1367 -18597 9412 11403 -13402 526 14807 -6252 -6489 13699 1656 -12867 6108
279F108N153k1733M694J9678j3799j4860J9695Q495k2517j858K3269n779k2319
$$ 6108 11261 -10472 -5778 13900 101 -14759 4936 13431 -9086 -10944 12325 6546 -15773
292a5773J2954J8292j8468j1769K0665M404j9278K935J5906p931j0077J0379L448
$$ -15773 -2819 15473 -2995 -14764 5901 10305 -8973 -6038 9868 1937 -8140 2239 5687
305E687q698L121L477p025K860N806r122r06J2723o150j2466J3662P497j8349
$$ 5687 -3011 110 3587 -3438 -578 5228 -3894 -4800 7923 1773 -10693 2969 10466 -7883
319g883J358J7754j0737j2113J6420L564j6516M889J1387j0707l817J1380l919
$$ -7883 -6525 11229 492 -11621 4799 8363 -8153 -3264 8123 -2584 -6401 4979 1060
332A060o937Q417o48p587Q153K626j0684N615Q545j2034j640J5571o697j3957
$$ 1060 -5877 2540 1892 -5695 2458 5084 -5600 15 8560 -3474 -5114 10457 3760 -10197
346a0197J3936O986j8092J408J6272r367j1387J1814L920j0466J505O393l510
$$ -10197 3739 10725 -7367 -5959 10313 946 -10441 1373 5293 -5173 -3668 2725 -785
359g85j538K181j587J900K423n688l70P506k579o511N638M720o380j887O923Q55
$$ -785 -2323 -142 -1729 171 2594 -3094 -3464 4042 1463 -5048 590 5310 -1070 -2957 3966 4821
375D821n270R51L855j913k792P47J480l85l636k104M483O00p369J551Q726n804
$$ 4821 -449 502 4357 2444 -348 399 1879 1494 -2142 -4246 237 837 -6532 -4981 3745 -2059
391b059p216J1329M034j2747L541J1583q962n160J1486j966q329O957R91q023
$$ -2059 -9275 2054 6088 -6659 -3118 8465 -497 -5657 5829 3863 -4466 2491 3482 -4541
405d541O580M062j1142L960J0843j1599n047J5888l168j4975R307Q719j3463k751
$$ -4541 2039 6101 -5041 -1081 9762 -1837 -6884 9004 5836 -9139 168 8887 -4576 -7327
419g327J1691l273q525M604L611l285P0J143l0J977k97j845K550K504k247k152
$$ -7327 4364 1091 -7434 -2830 781 -2504 -2434 -1291 -1321 656 359 -1486 1064 3568 1321 -831
435h31K312L025l206l692N561K685q767r2R968m978q911R401L718j2138J889R942
$$ -831 1481 4506 1300 -2392 3169 5854 -2913 -3005 6963 1985 -6926 2475 6193 -5945 -4056 5886
451E886o978o103P710J971o349m66N396J038n971j45Q063k367p646P768L798j0698
$$ 5886 -1092 -7195 515 2486 -3863 -4329 1067 2105 -3866 -4011 4052 1685 -5961 1807 5605 -5093
467e093M445Q922j2337K51J4740j2998p510K2556o883k2247K1939J0437l0694
$$ -5093 -648 8274 -4063 -3812 10928 -2070 -9580 12976 6093 -16154 5785 16222 -14472
480a4472O397K7729k1422j6326K7328N79k4611J1286J5365j6087n014J3934k112
$$ -14472 -8075 19654 -1768 -18094 9234 9813 -14798 -3512 11853 -4234 -9248 4686 2574
493B574q598N985M426p007o43P426l494o256R666K749j4280M694J4797j3762r000
$$ 2574 -6024 -39 4387 -2620 -3263 4163 669 -5587 4079 6828 -7452 -2758 12039 -1723 -10723
508a0723K1401j828k3289J3678J6800k2956m859K4383q099j8936J5385Q656j6060
$$ -10723 10678 8850 -14439 -761 16039 -6917 -11776 12607 4508 -14428 957 9613 -6447
521f447M65J1619n262n723N252R91j929J352r19n00K908p34k287J721K640m76
$$ -6447 -5982 5637 375 -5348 -96 895 -1034 318 -601 -1101 1807 1073 -1214 507 3147 2671
537B671l906J99O673k564r400P464Q332j4815l888J8385n951j7845J5838J0478
$$ 2671 -1235 -1036 5637 3073 -6327 1137 9469 -5346 -9234 9151 3200 -14645 1193 11671
551A1671k1778J221K0213j1905j0484J7765r87j4468J0010N171j2306N514Q287
$$ 11671 -10107 -8886 11327 -578 -11062 6703 5716 -8752 1258 6429 -5877 -363 7924
564G924j2032n9J2313q498p394J4280O29j5227N675J2451j0908q352J4357L330
$$ 7924 -4108 -4167 8146 -352 -7746 6534 7163 -8064 -2389 10062 -846 -9198 5159 8489
578H489j6822J692J5947q043j2580J3712O332j6268J399J3926p903o893J1669
$$ 8489 -8333 -6641 9306 1263 -11317 2395 8727 -7541 -6142 7784 -119 -7012 4657
591D657j927r885R227K942j1867O622R332j3580j952J5771o203j2225J3029N886
$$ 4657 2730 -7155 2072 5014 -6853 -231 9101 -4479 -6431 9340 3137 -9088 3941 9827
605I827j5619Q51J3500o489r434Q780M163r503j195Q053j403o415L579M456m947
$$ 9827 -5792 -4941 8559 2070 -7364 1416 5579 -3924 -5119 2934 1531 -4884 -1305 3151 -1796
620a796j643N679j509l593M538M15n586L936L968p552K74R428n566q013J0692
$$ -1796 -3439 2240 731 -2862 1676 2091 -3495 441 4409 -3143 -2869 6559 993 -7020 3672
635C672L337j3494L508J3060j0032r297J4411K081j5741N730J2278j2355n545
$$ 3672 7009 -6485 -2977 10083 51 -9246 5165 7246 -8495 -2765 9513 -2842 -8387
648h387J4036l386j0691J0159L912j2510M244J0057j0651l297J4297m287j3134
$$ -8387 5649 2263 -8428 1731 5643 -6867 -2623 7434 -3217 -6514 7783 3496 -9638
661i638J1689Q194j6043k55J7239q258j4241J4815O928j8491K405J7155j1827
$$ -9638 2051 10245 -5798 -6053 11186 2928 -11313 3502 10430 -8061 -5656 11499 -328
674c28j1320J7178J468j7048Q096J1400j4181k497J4426n994r342J1426J869j2054
$$ -328 -11648 5530 6998 -10050 -1954 9446 -4735 -7232 7194 1200 -8142 3284 5153 -6901
688f901N380R084r892l384J1846k283j1131P431Q761j1292m436J3685j453j3775
$$ -6901 -1521 7563 -2329 -5713 6133 3850 -7281 150 8911 -2381 -6817 6868 5415 -8360
702h360P223J0266j1937m511J3041k117j0772O971N416q753K22O698m357k475
$$ -8360 -1137 9129 -2808 -7319 5722 3605 -7167 -196 5220 -3533 -3311 3387 -970 -3445
716c445N906k094m655N499K009p073J600P542m633o106P924L823r973J34J0579
$$ -3445 2461 367 -4288 1211 3220 -3853 -2253 5289 656 -5450 2474 6297 -3676 -3542 7037
731G037m893q743R038M386j1491R19J0125o441o110R263J42q884M960M902q020
$$ 7037 2144 -6599 2439 6825 -4666 -3747 6378 -63 -6173 3090 3232 -5652 -692 4210 -3810
746c810Q05P547n958l774R166j634q932P408N802j1240M1J2395n874r577J0956
$$ -3810 -3005 4542 -1416 -5190 3976 2342 -6590 818 6620 -4620 -4579 7816 1942 -7635 3321
761C321M247j3092K163J1612p800p219J0808Q36j0711M565P032q110k001Q358
$$ 3321 7568 -5524 -3361 8251 451 -6768 4040 4876 -5835 -1270 5762 -2348 -4349 4009
775D009l333o139O937J726q079K895O817o565l286Q839p64q734N063O828q181
$$ 4009 676 -5463 1474 3200 -4879 -1984 4833 -1732 -5018 3821 3057 -5677 -614 6214 -1967
790a967k779R969j610r099N658O090q375j851Q677k521o938N491L483o828J30
$$ -1967 -4746 5223 3613 -5486 172 6262 -2113 -3964 4713 2192 -4746 745 4228 -2600 -2470
805b470N717l517l135M843l00m442L267K412n428O84O190l906m705O988J986q471
$$ -2470 3247 -270 -3405 1438 1138 -3304 -37 2375 -3053 -2369 3821 -85 -4790 2198 4184 -4287
821d287J874Q549n437o272Q366K586r403J731P960n541m662P046M37o507L410
$$ -4287 -2413 6136 699 -5573 2793 5379 -4024 -2293 5667 126 -4536 2510 2947 -3560 -150
836a50L438n733L04N346m201k874O613j262o689N210M643q114o20R130l601p490
$$ -150 3288 -2445 -2141 3205 -996 -3870 2743 1481 -5208 2 4645 -3469 -4089 5041 1440 -6050
852f050P496M298r293L84Q930m497o327P514K179q229K022O276n292l022O357
$$ -6050 1446 5744 -3549 -3165 5765 1268 -5059 2455 4634 -3595 -1573 4703 -589 -3611 2746
867B746j009n452M004K435n502R60M771m073k519N624l60n614L357M322n313j817
$$ 2746 1737 -3715 289 2724 -2778 -1818 2953 -1120 -3639 1985 1625 -3989 -632 3690 -1623 -3440
883c440O311m17n764K861M613m373k640N174N16m938J328L835k999k229L473J21
$$ -3440 2871 2454 -3310 -449 4164 -209 -2849 2325 2841 -2097 -769 3066 67 -2162 1311 1432
899A432l054J204J645k168o1J911j684q63K684j082k495K960J337m042P01M189
$$ 1432 -1622 -418 1227 -941 -1002 909 -775 -1638 1046 -36 -2531 429 1766 -2276 -1575 2614
915B614k548l008M252J317m553O64L971k023k410K701P08k323L37J317p97l03
$$ 2614 66 -2942 1310 2627 -1926 -1262 2709 686 -1724 977 1685 -638 -301 1016 219 -84
931h4N87q24k8J313j361j231K469L18l415R04L428k395k835L791J460m203M70
$$ -84 503 -321 -349 964 -397 -1628 841 1159 -2256 -1352 2076 -319 -3154 637 2097 -2106 -1636
948a636L944j922k345K856O66k540J075J480j918L10J794k041q51K793r76k785
$$ -1636 2308 386 -1959 897 1563 -977 98 1578 -340 -30 1764 -277 -1128 1665 689 -2096
964b096K614J319l689K04L349j959k240K942Q21l068N00K637j276j601J824R56
$$ -2096 518 1837 -1852 -1648 1701 -258 -2498 444 1265 -1803 -1303 1334 58 -1543 281 1237
980A237j661l40J731L3j460N47J034r06m47Q86k62l00N20p61l90J267n95j516
$$ 1237 -424 -764 967 1000 -460 87 1121 215 -232 654 392 92 612 -149 -539 728 133 -1383
998a383J772R22k785n6K897j253k351K219J459k532o98K394L53k030K53J835m31
$$ -1383 389 1311 -1474 -1530 1367 114 -2237 -18 1441 -1091 -1789 605 958 -1072 -819 1016 585
1015E85j531Q60J224o78o35M44J52P8q3p54P27J093k090r63L215n73l665K567
$$ 585 -946 -86 1138 460 -175 269 421 499 416 -338 389 1482 -608 -1571 1644 1071 -2594 -27
1033b7K664m381j034M712j116l770K839J801l010RK078o97j13L19o43R00N11j832
$$ -27 2637 -1744 -2778 1934 818 -2952 -113 1688 -1322 -1313 765 68 -45 274 -369 531 1042 -790
1051g90P71K071j643j442J694L50j270j06O54M62q77j500J516J595k775l50L387
$$ -790 -19 2052 409 -1033 661 1011 -259 -365 289 751 -126 -1626 -110 1485 -1290 -1640 1747
1068A747j659k843L109J049k848R60J428j638O06O83j313J533O71k899J239K679
$$ 1747 88 -2755 354 1403 -1445 -485 943 -695 -89 594 -719 814 1485 -1414 -175 2504
1084B504l183o75M043j924k943L216M12k914J381J153j724L06M52q73Q58K32j493
$$ 2504 -679 -1354 2689 765 -2178 1038 1450 -1464 -83 1070 -654 -348 104 -769 89 321 -1172
1101a172R84J004k059J14K017p65r41P94J79Qp2o28J282O88k329K60K668j626
$$ -1172 -188 816 -1243 -1129 888 123 -818 -24 155 163 91 -537 745 1433 -896 -636 2032 406
1119D06k007K771O90l266O41K446j788j157J852j87j211N16K33m05N41j25p32
$$ 406 -1601 1170 1860 -1406 -765 1681 -107 -1264 588 401 -810 -294 -61 -466 75 -50 -782
1136g82O90N04j192J87J477m64j287P16J092q15p98J043R58j574p00J877J54k082
$$ -782 -92 412 -780 -593 884 420 -867 -151 941 126 -672 371 1329 -245 -945 932 1086 -996
1154i96Q06J609j712q14J773j07j325Q01J15q76P63J0j150J337O43k279N27K408
$$ -996 -190 1419 -293 -1107 666 559 -766 35 150 -726 37 47 -1103 234 877 -1402 -875 1533
1172A533j682j612K552O44k599M21K313j015j634J432R74j418l78J247j51j098
$$ 1533 -149 -1761 791 1435 -1164 -743 1570 555 -1079 353 1327 -91 -469 778 627 -471
1188d71O65M15r92J79O74j054k2J327j179j046K041j21k351J599J907k495p15
$$ -471 194 609 -383 -204 470 -584 -606 721 -458 -1504 537 416 -1935 -336 1571 -924 -1639
1205a639L141o84k558K015J783k566n38K562m05k150J145J578j806q15J779j63
$$ -1639 1502 818 -1740 275 2058 -508 -1046 1516 1111 -1039 106 1684 -122 -937 842 679
1221F79j526Q60O71j396K17R74j114k77J724j110j501K418N12l029J134K914k642
$$ 679 -847 13 684 -712 -495 479 -635 -912 812 -298 -1799 619 1131 -1898 -764 2150 -492
1238d92j700L552M09l397J171K668k179j417K467J56k073P79J196j416j05J086
$$ -492 -2192 1360 1769 -1628 -457 2211 32 -1385 1082 1238 -835 -56 1140 -276 -381 705
1254G05p66n83J289n00j466J550Q01k391K65K543j490k115K648J059l147L10L140
$$ 705 -61 -644 645 145 -1321 229 1030 -1361 -1096 1447 -43 -2158 490 1549 -1598 -1288 1852
1271A852j535k240K597J037k793M43K328j459j250K051n6j984J244J038k138L15
$$ 1852 317 -1923 674 1711 -1082 -639 1689 230 -1020 1031 975 -1009 235 1273 -865 -550
1287e50J913j729j112K470k87k549J582J849k680n11L030r26k464K031J489k642
$$ -550 1363 -366 -1478 992 705 -1844 -262 1587 -1093 -1604 1426 500 -1964 67 1556 -1086
1303a086pK574r56j890J808R24k038J80J899j178j161J634J55j676P99J115j616
$$ -1086 -1093 1481 525 -1365 443 1367 -671 -491 1408 230 -931 703 858 -818 -19 1096 -520
1320e20k66J657q82j251J774J56k144J068J743j944q10K417l47k203J415J719
$$ -520 -786 871 -11 -1262 512 668 -1476 -408 1335 -609 -1419 998 651 -1552 -137 1582
1336A582k010o60K025k94j578J109Q59j193l0R90o87m89J022l22j137J079N22
$$ 1582 -428 -1088 937 643 -935 174 1033 -160 -190 800 113 -376 646 324 -813 266 788
1353G88j728K56J839j263j559K077P29k487M35K405j650j512K375L29k221R71
$$ 788 -940 -684 1155 -108 -1667 410 1139 -1348 -913 1492 -158 -1670 705 1034 -1187 -216
1369b16J360j558j7J544j046o74J535l86j439J363P43j741N7J657r53j427J415
$$ -216 1144 -414 -431 1113 67 -607 928 542 -897 466 1209 -532 -475 1182 229 -1198 217
1386B17P94j834l16K048n95j965J537J412k361k09K471j024j736K230M51k306
$$ 217 1011 -823 -1139 909 314 -1651 -114 1298 -1063 -1272 1199 175 -1561 669 1120 -1186
1402a186J071J533k057K42J944j722q05K403p78j996K016O29k461P00J819j544
$$ -1186 -115 1418 -639 -397 1547 -175 -980 1423 645 -1351 665 1294 -1167 -467 1352 -192
1418a92r23J568R5j479K73J126l94j010N83J000j003o04J556o1j597J133R09j578
$$ -192 -1115 453 548 -931 -658 468 74 -936 -353 647 -356 -960 596 535 -1062 71 980 -598
1436e98M52J361j495k93J983j291j290K468l13k630J870J562k877k1K716j534
$$ -598 -146 1215 -280 -573 1410 119 -1171 1297 984 -1646 224 1786 -1091 -1112 1604 70
1452G0j810K088O35j972K47J308n40p26N12N71l92m43N29K39o42L89N67j039K95
$$ 70 -1740 348 983 -989 -742 566 26 -700 -188 383 -9 -452 77 316 -326 63 630 -409 -114
1471a14J214j465l69K340j068k251K595P05l293J097K778k800j290L206o60k471
$$ -114 1100 -365 -734 1606 538 -1713 882 1587 -1706 -609 2169 -631 -1921 1285 625 -1846
1487a846K023R64k268N41J400j065k93R22l35m85N84J29m20J78M51k87n22M94
$$ -1846 177 1141 -1127 -586 814 -251 -544 378 43 -442 142 271 -149 29 480 193 -329 165
1505A65P57j024m62J590m13j876J511J182k580K74K293j657j433K386m5k143J331
$$ 165 922 -102 -564 1026 613 -1263 248 1430 -1150 -876 1417 -240 -1673 713 668 -1475 -144
1522a44J137j801K36J416j182j89J302q65n20J217l44q50Q53L54p51O5L79K0l24
$$ -144 993 -808 -572 844 -338 -527 775 -90 -610 607 263 -587 266 620 -131 -66 313 333 9
1541Ik92O95K48j209R4J409j112j080K022j19k238J353J350k190L47J858j522
$$ 9 -283 412 660 -549 -455 954 -158 -1238 784 665 -1573 -220 1130 -1060 -713 1145 -377
1558c77o34J837q01j048J763q7j812J385R01j923M97J670j275q61J306J43r93
$$ -377 -1011 826 25 -1023 740 653 -1159 226 1127 -796 -299 1371 96 -765 541 684 -309
1575c09J55N73q1o84j19P22q9q80N26O11j089Q2J040o41l69J082o80o43J487l61
$$ -309 -154 419 338 -346 -465 257 168 -712 -186 425 -664 -582 458 -183 -552 530 -150 -793 694 333
1595C33j350J484O49k076N94J798j596p62J995m84j602J323N35j349L93O52q25
$$ 333 -1017 467 1116 -960 -366 1432 -164 -926 1069 585 -1017 306 841 -508 -115 537 -288
1612b88j9O32n99j28N71k66l88N43N8o08L01M61k33l55K95L55l32l84O63L76r39
$$ -288 -307 325 -274 -402 169 -97 -485 58 116 -492 -191 270 37 -318 -23 332 0 -384 279 655 -284
1633b84J8R45m33o97Q44K09j028K44P06o83k21P20m15m19M74l9l34N54M9p31L71
$$ -284 -266 679 246 -451 393 602 -426 -182 524 -159 -380 340 -75 -494 -20 -59 -393 161 210 -521 -150
1654a50N71p42o5R51k75r43O54O60p91l20R73L6q90J50P60l14n78M75K51n90l1
$$ -150 421 -321 -386 565 290 -653 1 661 -130 -450 523 559 -331 -181 579 265 -313 162 413 -177 -208
1675b08M21j75j30O1k18P7L37l87l32P79N9j050M67J083r38o31J264J59j241L58
$$ -208 213 38 -92 -31 -249 -172 165 -222 -554 225 284 -766 -299 784 -154 -785 479 638 -603 -245
1695b45R33o34m85P24J11n03K30J45k66J22J13m30J33M16n07m01O92R5r19L92
$$ -245 688 54 -431 293 404 -99 131 276 10 132 245 -185 -52 364 -143 -544 148 243 -676 -284
1715b84P68p05n37J037j1p97L91O10n72k50O51l4m27K29J28k38J28J34r5m9J7
$$ -284 484 -221 -758 279 268 -529 -138 472 -100 -350 301 267 -160 69 197 -41 87 221 126 77 94
1736I4l9m0J54p6j57o8J75j56j48K66%l49j2M59j03m81M28M38n87j70P87j13n92
$$ 94 55 15 169 93 -64 -132 43 -113 -261 5 5 -344 -356 103 0 -481 -53 385 -202 -372 415 302 -290
1759b90L76M24n85r4N06j56l15L12o5l08L96Mn10L92J98p01P7P02l99n86N64L49
$$ -290 86 510 -75 -169 337 181 -134 178 113 -195 201 205 -305 87 285 -416 -339 363 -36 -622 -58 291
1781B91p11KO97j93m97L58K83k91j5L23j21j91K37j5k06K80O3n84K20N20n98k63
$$ 291 -420 -418 279 86 -411 -53 230 -61 -76 247 126 -65 172 157 -49 231 294 -290 -70 450 -148 -411
1803d11Q60k38r02P14O12r84j27R29n24m86O93Rn66L60J31l46K06K83l54P8L63
$$ -411 449 211 -691 23 635 -349 -476 453 -71 -557 136 145 -421 -61 70 -276 -70 213 -141 -63 300
1824C00l49j02M26K2l88J97K28k12k49K43J67l88j82M98p7n14L27L59n79p1N41
$$ 300 -49 -151 275 297 -91 106 334 122 -127 116 283 -105 -287 211 134 -380 -53 306 -273 -344 197
1845A97k92l20M45J4l78K70J99k76K42J12l50J21M41l93j89N12j06l72J31L14
$$ 197 -95 -415 30 44 -334 -64 135 -141 101 213 -137 -16 425 32 -157 355 249 -123 8 322
1865C22k36l25K15K86m15k64N50J23p13Q0P36m03m54P00k7o44N34K36o08L01L93
$$ 322 86 -239 -24 262 -153 -417 133 256 -457 -377 359 -44 -498 202 175 -469 65 301 -307 -6 387
1886C87p67K24Q26q58l30J206l35j060R01N98j150nR65n17o50P08J83o14J48J96
$$ 387 -380 -156 670 -188 -518 688 353 -707 194 792 -358 -363 602 85 -565 143 326 -288 -140 56
1906E6q5k31J74J31j17j48K34m8j16K55M2m66L86L85p77J49Q25o12o55J142R1
$$ 56 -29 -260 -86 45 -72 -220 14 -34 -150 105 147 -319 67 452 -325 -176 649 37 -618 524 615
1927F15j214N97Q28j058j71R65m91n29O86n9n73L20K09m35J85K77l47k3K65l7
$$ 615 -599 -2 826 -232 -403 562 71 -458 228 169 -404 -84 125 -310 -125 152 -195 -218 47 10
1947A0j22K6J45l2j32J3N04l80l26O35N8q30N23N93r55p4J017n43q09R67J50j031
$$ 10 -112 -86 59 27 -105 -92 412 32 -294 341 399 -431 92 685 -270 -344 673 130 -679 288 438 -593
1969e93M04O95q49k7O63l89l77O20q8m25L56K40l94j1M97j90l35L50L00n73j48
$$ -593 -189 506 -343 -370 293 -96 -473 147 59 -366 -10 230 -164 -175 322 132 -203 147 447 -126 -274
1990b74P39j71p41L65N96p85j83R07k36q05O52K65q02L05O62p88m9P67o14l33
$$ -274 465 294 -447 -82 514 -271 -454 453 217 -588 64 329 -473 -168 494 -294 -343 424 -190 -523
2010e23R38k02q82P62M43r79K12Q43n84m59O97N8m80K01J98j49q7L1L7k1r9J7
$$ -523 415 213 -669 93 536 -443 -231 612 28 -431 266 324 -156 45 243 94 7 38 75 54 -45 -28
2032b8P5k08O6K08l01n6M50l40l39P12j86o62O29M68q66J67Q28n82m39R16k23
$$ -28 47 -161 -95 113 -188 -244 206 -134 -473 239 53 -609 20 488 -378 -211 617 35 -404 512 289
2053B89n84N20J86n89J66L22m22k0K35j59j42K30n9p2O4m2M2p3l9K06l9l67M11
$$ 289 -295 225 411 -178 -12 310 -112 -132 103 -56 -198 32 -27 -99 -35 -77 -35 -108 -147 59 20 -347 64
2076F4J41o04L63N88p94j95R76l62p45R01K53j013L30P08q00q9P81n76l21O98
$$ 64 205 -399 -36 552 -242 -437 539 177 -568 333 586 -427 -97 611 -189 -278 503 -73 -394 304
2096C04l13n10P47M8q29M10N22o90n6P09k11n47L84K98k70j86K71J32k24j99L83
$$ 304 -9 -519 228 276 -553 -143 379 -311 -367 342 131 -416 -32 266 -4 -190 81 213 -11 -210 173
2117A73P1l65J39J81k09j4K55l29J6L51l54k15N40o4o46L89M88p01n3O35l17l89
$$ 173 244 -121 18 199 -10 -24 231 -98 -82 269 -85 -300 240 176 -470 -81 407 -294 -347 288 -29 -418
2139d18M65K10m89O1L80j66k35K51J33j67k7K5Q3j04J33kj37k7J46j42j15K84
$$ -418 47 257 -232 -171 209 43 -192 59 192 25 -2 23 106 2 135 133 -4 -31 115 -27 -142 142
2161A42p7k95K55J34l69k7M79k75m21N05J58o45L07N28m25k69N76n6m51K62L18
$$ 142 65 -230 25 159 -210 -237 242 -33 -454 51 209 -436 -129 399 -26 -295 281 225 -226 36 354
2182C54m01m9L61j85j78L07j47k96K83P8m06J18L91l42k87O16M2o55K76M99n13
$$ 354 -47 -96 265 80 -98 209 62 -234 49 127 -279 -161 230 -112 -399 217 259 -396 -120 379 -134
2203a34k88O06J3m99K22K76l48kL57k19J8K19j65o6J74j8k41J00K26k85q3K10
$$ -134 -422 184 197 -302 -80 196 -152 -154 203 -16 2 221 56 -10 164 146 -95 5 231 -54 -137 73
2225G3K4l11M8L24j35k70K00K29l40r4L61j3l40J89K01k37M2J90j06o8J36J1j56
$$ 73 97 -214 -166 158 23 -247 -47 182 -158 -252 109 96 -244 -55 146 -91 -49 141 35 -33 103 114 -42
2248d2K48k3k17J10J08k50n6K90j97k24J90J45j88j31K73Nk44J44K09j79j37J89
$$ -42 206 183 -34 76 184 -66 -122 168 -29 -253 -63 82 -106 -237 36 41 -203 -59 150 -29 -166 23
2270B3L5k28J79J21k63R4J84j76j1K39j10j81K86J0l85K21K73m40o1L68j72l24
$$ 23 58 -170 9 130 -133 -39 145 -31 -42 197 87 -94 192 202 -183 38 311 -129 -190 178 6 -318
2292c18L05J73l80P3K60j87r6K25mj42J28K4j65J01J68k46KK61j76q5K00O6l15
$$ -318 -13 160 -220 -147 113 -74 -170 55 51 -91 37 61 -104 -3 165 -81 -79 182 6 -79 121 187 -128
2315a28J23J97j35j85J98J07k63q7K09j1j32P1k3JnO8kM9l4j22J13J31j72j9J18
$$ -128 -5 192 57 -128 70 177 -86 -173 36 25 -107 -36 -59 -58 -63 5 3 52 18 -104 9 140 -32 -51 67
2340F7R1k55L8K94j82q9J27N6j81k5R9J09j75LR7l8j91J04Q4j72J5J52j34Q6P7
$$ 67 158 -97 -59 235 53 -36 91 147 -34 -59 40 149 -26 -23 74 36 -155 -51 33 -139 -124 28 -106 -20 57
2365E7j33k1K01j44j22K58L1k67J11K85k60j16L05m6l33K44K01l28o0L57k15j64
$$ 57 -76 -97 104 -40 -162 96 127 -140 -29 256 -4 -120 185 139 -194 50 251 -77 -137 220 5 -159
2387a59J19J26k09K5J70j46l6J71k0k02K10M1j87M4K01j15k56L56M1l45J62L44
$$ -159 -40 86 -123 -98 72 -74 -110 61 41 -161 49 90 -97 -53 148 33 -223 133 174 -171 -9 335
2409C35l52k10M96j06l32J76K11l70K2K73j21j11J72q1j70K06k6j80K11K9k09
$$ 335 -17 -227 269 163 -169 7 218 -152 -130 143 22 -89 83 2 -168 38 12 -168 43 72 -137
2430a37J06J33j04o8L9J37j06o8J13J40j84o9K29ll37J82K36l07j8K32j54j18
$$ -137 -31 102 -2 -70 -31 106 0 -68 45 185 1 -68 161 158 -179 3 239 -68 -86 146 -8 -126
2452a26K20j25j82K60qk48J46J92k79j0L51k22r8J78O9j88K3J53k7j41Q5J67j33
$$ -126 94 -31 -213 47 39 -209 -63 129 -150 -160 191 -31 -129 49 118 -70 -47 106 79 -62 23 190 57
2475E7j58K87r2j46J31Q4k80P8J64j83q7L00j30k82L46L2l40J44K57l36n4M18
$$ 57 -101 186 94 -52 79 163 -117 -39 125 -58 -145 155 25 -257 89 121 -219 -75 182 -154 -208 210
2497B10j92l02M15L0l34K16J80k56lJ76m2r9P6j2q8M3M2m5n6N8m6m4jJ73j33j37
$$ 210 18 -284 131 161 -173 43 223 -33 -36 140 98 -1 75 63 -25 18 60 15 -41 17 -29 -73 -74 99 -34 -171
2523a71K26k1k54J13L05k88j16L78p6l13K37K09k52k6J81j34n5J28n3kR2j34r7
$$ -171 55 34 -220 -107 198 -90 -206 172 96 -217 20 229 -23 -49 132 -2 -57 71 18 16 108 -26 -123
2546a23J94j1j28n0K39j30j66Q4J72o7j77J06J94k62n4L20p4k84K02K64m10J04
$$ -123 71 60 -68 -118 121 -9 -175 -91 81 14 -163 -57 137 -125 -179 141 67 -217 -15 249 -161 -57
2568e7K94k61j07L20j43j93L11p1l29K77J91m44N7L62k46j74L45k5l12J21K48
$$ -57 237 -24 -131 189 46 -147 164 93 -236 41 232 -212 -155 207 -39 -213 132 107 -205 -84 164
2589A64k47q4K43m2j77P4K37j05j50J76%j66J40Q2j34o5J62q3k08K82K9k60J58
$$ 164 -83 -167 76 34 -143 -69 168 63 -87 89 89 -77 63 145 11 -54 108 25 -183 99 128 -132 26
2612B6J05l20O7L20j85l00L66L1l54J03L50k49j20K80J3k80J36J75j39j05J66
$$ 26 131 -189 -122 198 13 -287 79 110 -244 -141 209 -40 -160 120 133 -147 -11 164 25 -80 86
2633H6p7k8Q8m6j16J56M3j50l3J89o9j61J13J42k16j25L16o7k37J37J70j67j33
$$ 86 9 -19 69 23 -93 63 106 -44 -77 112 43 -118 -5 137 -79 -204 112 45 -192 -55 115 -52 -185
2656a85K38P3k87J38J60j84KJ79r6j60K08Lk07J79J40l12Q0K56k15k00L21O1l70
$$ -185 53 126 -161 -23 137 -47 -45 134 38 -122 86 89 -118 61 201 -111 -31 225 10 -190 131 192 -178
2679a78J25K45l05j10L24p5k41J80J38k02qK03k9k55K60O6j87P0Q9j59M6J61q1
$$ -178 -53 192 -113 -223 101 26 -215 -35 103 -99 -107 96 67 -188 72 138 -49 21 110 -49 -3 158 77
2702G7k21K28L9k40Q1J91j88q4J92k2k04J14J56j55j49K50r2j35J97N5k24R6J15
$$ 77 -144 84 123 -117 -36 155 -33 -117 75 53 -151 -37 119 -36 -185 65 -27 -162 35 90 -134 -38 77
2725G7j30M5Q4n7n0J40L1j45o7K30j21j14J27K0j19k2J98q1j23J05N4j88j8J49
$$ 77 -53 -8 76 19 -31 109 140 -5 -72 158 37 -77 50 70 -49 -71 127 46 -77 28 82 -106 -124 25
2749B5k3j24J39k8r4M6O7o5M5P1k1m9Q8L5j99R2J90j45j67K49j7k45J00K20k14
$$ 25 2 -122 17 -11 -105 -59 8 -57 -12 59 38 -11 77 112 -87 5 195 50 -117 132 115 -130 -30 190 -24
2774b4q0J95l4j77J35K2j68P6Q0j07%J30p6p8J44L8j98J26J37j56k8J60j01p6
$$ -24 -104 91 57 -120 15 37 -131 -55 25 -82 -82 48 -28 -106 38 76 -122 4 141 -15 -43 117 16 -60
2798f0M4J31q7o1P4Nr8L3J29j34K8K7l1j9RK4j25K1J43j51NJ85p6r2J79k1j65
$$ -60 -16 115 28 -33 41 46 -52 -19 110 -24 4 31 0 -19 -10 14 -111 -90 53 -98 -93 92 16 -76 103 82 -83
2825h3R7J65j93m9J61Lj55Q4Q9j29jJ27j35o6M9R2j03QL9l1k2l3J16j15P8J1j9
$$ -83 14 179 -14 -63 98 101 -54 30 119 -10 -11 116 -19 -85 -36 56 -47 -39 0 -31 -53 -86 30 -85 -7 4 -15
2852a5m2J57j03j11J82R2k08M8J89j81j13J76P4j88M4J20j38o6N7J9j05J05j2
$$ -15 -57 100 -3 -114 68 160 -48 0 189 8 -105 71 145 -43 1 121 -17 -83 -26 -7 -112 -7 -19
2875a9o2P6N6p6k2P7m9j17J22J05j27o5K09n7j73J78O6j98O4J29r0o1J69k9k20
$$ -19 -81 -5 51 -25 -47 30 -19 -136 -14 91 -36 -101 108 51 -122 56 122 -76 -12 117 27 -34 135 106 -114
2900a14J67nj39P1Q9j44LJ49j16q0J01J08j98N2Q6k1j40J84Rj23rJ02j5m6N0N7
$$ -114 53 48 -91 -20 69 -75 -72 77 -39 -119 -18 90 -108 -56 30 9 -131 53 62 -61 -70 32 17 -29 21 78
2926G8n1n9J46q7r0P2J11k00N2J31q4r9J12p2n3J49k7j55O5J50j87L8J30j10o4
$$ 78 27 -32 114 27 -63 9 120 -80 -28 103 19 -80 32 -40 -93 56 29 -126 -61 89 -98 -60 70 -40 -104
2951a04J16J04j56pJ12m5k9qJ20j07J4M3Qn9J1Jo2O1K4j32JK84k61n2J85L5j91
$$ -104 12 116 -40 -47 65 20 -9 -17 103 -4 10 53 61 2 13 14 -48 13 37 -95 -94 190 -71 -123 62 97 -94
2978i4P7J52k48O0J86q1j12R1M4j07N4j3Nm5N6Kj12J62j2j04K1J24j28k8R7Oj01
$$ -94 -17 135 -113 -53 133 52 -60 31 75 -32 22 9 14 -31 25 27 -85 77 65 -39 -18 106 -22 -50 47 53 -48
3005d8K6R6j11l9J53J5j54pJ47j16j7J10l7r7R7J9m6m7J31r5K4O7p6n2M7J25j61
$$ -48 -22 74 -37 -76 77 92 -62 -69 78 -38 -55 55 18 -79 18 37 -9 -56 75 -20 4 71 -5 -57 -10 115 -46
3032d6K0J9kk8N4l2r6J09J03j17o4J06M4j41j8J67l3j23J53m2m2%J15j39O9Q5
$$ -46 -26 -7 -9 -37 17 -15 -111 -2 101 -16 -80 26 70 -71 -89 78 45 -78 75 33 -9 -9 106 -33 36 121
3058A21j33%J60j05j54K00Rk34J37R0j23q8J16L7j57J23R7j51L0J01k6j32L5L2
$$ 121 -12 -12 148 43 -111 89 98 -136 1 91 -32 -120 -4 33 -124 -1 96 -55 -25 76 50 -82 -47 -15
3082a5k2O4m0N4n1J9Kp6N3J03q4o8J43l9j96J54J05j25o5K53j66j45J59P8k11
$$ -15 -37 27 -13 41 -10 9 11 -65 -12 91 7 -61 82 43 -153 1 106 -19 -84 169 3 -142 17 95 -116
3107a16J32K1j45P4J16l1j27J92o4j09J23m8r0L2N6l2rN1k5Ll7K1Q4j38lJ56j31
$$ -116 16 37 -108 -34 82 51 -76 116 52 -57 66 18 -72 -40 16 -16 -25 26 1 4 -33 -12 72 -66 -69 87 -44
3134d4m3J11M6j74J21O1j59O7O8p6o4J72k4j22P8O7j23NJ57p5j08J57l1k20J64
$$ -44 -87 24 70 -104 17 78 -81 -14 54 -22 -86 86 62 -60 18 85 -38 -33 124 49 -59 98 67 -153 11
3159A1J07j30n7J85p0j13L4R9r0J7R8q6j25J01P1j08P7k0JqJ01o6q8J28N6j51
$$ 11 118 -12 -69 116 46 -67 -33 66 -24 -7 91 5 -120 -19 52 -56 21 1 2 -6 95 29 -59 69 125 -26
3185b6l0J63o9j08J34L3j98L7J21n7q4J28N1j81J8J12n4kM7p2n6P5N8r3O9P1r9
$$ -26 -56 107 38 -70 64 97 -101 -64 57 0 -84 44 95 -86 -68 44 -10 -12 35 -37 -93 -18 40 -53 16 87 -12
3212a2j1J11m7p7L2J12j83L1J42o5q0L7L0n6k7O9M4q8P0n7NJ4J6m8L1O8r9m8J35
$$ -12 -23 88 41 -36 -4 108 -75 -44 98 33 -47 -10 20 -36 -63 6 50 -38 32 -25 -20 -6 10 -38 -7 61 -38 -86 49
3241D9K1j28M4J22j22m6J65o2j09R5J30k12l2J45l1j00J47k1j38J6J10p9l4R3
$$ 49 70 -58 -14 108 -14 -60 105 43 -66 29 159 -53 -85 60 29 -71 76 55 -83 -67 43 -36 -70 23
3265B3m5k4J01j6j25O0R9j37QJ26p0n2J25J5j17n7J29l0p3P7R2q7j07J03op6J20
$$ 23 -22 -46 55 39 -86 -26 73 -64 -56 70 0 -52 73 88 -29 -86 43 13 -60 17 109 22 -85 18 12 -64 56
3292E6j1r8nJ05q4n1J71j50m5J49L0j97Q0J49j31l2J05N3k28J55J03j60NP7j4
$$ 56 45 -53 -58 47 -37 -88 83 -67 -112 37 67 -130 -50 99 -32 -64 41 94 -134 21 124 -36 -31 46 32
3317C2o6P5l3j4O1o1ok3J01p9p9J07Or1rJ14o6K3PO9j59Q5J01q5n2R1M5j84P5
$$ 32 -34 41 8 -6 55 -6 -12 -35 66 -13 -92 15 21 -70 -79 35 -31 -8 -1 68 -91 -6 95 10 -42 49 94 -90 -15
3346a5J27j17k7J39j33J8N5J0j17J0J26j10OjO3p4K6J1j9K8Q3j19l3M3J18j81
$$ -15 112 -5 -32 107 -26 -8 47 57 -60 -50 76 -34 -28 -29 34 -40 -14 -3 -22 6 89 -30 -63 -20 98 -83
3372h3J1J84r3k7J06j0j64R5J16j18n4J48r8p7R2K4j36P1L7p1lJ30r0j03J72k9
$$ -83 -72 112 19 -8 98 88 -76 19 135 17 -37 111 13 -64 28 52 -84 -13 24 -47 -50 80 -10 -113 59 30
3398C0n0kJ31r6o8O7OqnO0j0n7K1M9m7o5J20q4JJ01p3p3J07lj07J3Q3r1p5J63
$$ 30 -20 -22 109 13 -55 12 18 10 5 65 55 -2 19 68 21 -44 76 -8 -7 94 21 -52 55 52 -55 -42 41 -50 -125 38
3428C8o3m4J10Lr8N6L2r3J4M2L5j9J7rLn1P9j2q2P0N4q0k4P2mr7pJ61j44j6R8
$$ 38 -25 -69 41 44 -54 2 34 -59 -45 -3 32 13 30 21 24 -27 52 40 -42 28 82 2 -22 50 46 -51 -58 103 -41 -57 41
3459D1m9l4O1J6j09J31Kj15lJ50j06l7O1j1j8N4k7j6K9L2q1J2Q6p3j5qP8q3%M5
$$ 41 -8 -42 19 35 -74 57 59 -56 -59 91 -15 -52 9 -2 -20 34 7 -9 20 52 -29 -17 69 -4 -19 -27 51 -32 -32 13
3489A3M7p4n5J10Pj61J19K0q5j4J02l5l4R5m1o3J13or6J04m1r3N5N3j8q0J40q1
$$ 13 60 -14 -69 41 48 -113 6 26 -59 -73 29 -6 -40 55 14 -49 64 58 -38 66 25 -68 -13 40 22 -58 82 1
3517AJ3kJ9Mj03M4L3mq1J04j6q5Q9J9p4O6j6rqR9q4o1J30m5q0M6R4j44LJ40j13
$$ 1 14 12 31 35 -68 -24 9 5 -76 28 12 -73 16 35 -39 27 11 2 -6 93 9 -52 78 33 -47 -1 93 -51 -48 92 -21
3548b1p4J65n4j23L2R0l9LJ7p5K0N0K1%jK5l3J1l1L0Pm9Q4k6m3O5or3J2J02j08
$$ -21 -95 70 16 -107 -75 15 -24 -21 -4 -79 -59 -9 12 12 11 36 3 14 -17 13 20 -29 55 29 -14 51 45 -48 -36 66 -42
3579d2K3J21q0q1K3Q4j51M7J26r0l0P8J2p1O2rj06O3J3o0K0J33n2p9J5P6p2L0
$$ -42 -19 102 22 -59 -36 48 -103 -56 70 -20 -50 28 40 -31 31 22 -84 -21 -8 -68 -48 85 33 -46 -31 45 -27 3
3607CO5n4l7KP7p1lN8j9n7K8Rn1m3J26p3l3O7Oo6Q0K0j05K5J53j31j9J07j2m0
$$ 3 68 14 -23 -21 56 -15 -18 40 21 -36 -8 1 -50 -93 33 -40 -73 -6 0 -66 14 34 -71 -46 107 -24 -43 64 52 12
3637A2l7P0o1k8Q0M2n6k1mqj9M8q2L3pO1l6K1nk7J6L3k0q7Q4N8l1j12J21J3j07
$$ 12 -25 45 -16 -44 36 78 22 1 -3 -11 -30 18 -64 -31 -38 23 -13 8 3 -24 -8 25 5 -82 2 60 29 -83 38 51 -56
3668e6Q7K1p3J8M9q2mN9J3r7J08qo5l9Q3k1k1M3no7N2K6o1%O9q7J6L3Q3j18N1
$$ -56 31 52 -21 -3 46 -36 -40 19 32 -65 43 35 -30 -69 14 -7 -28 15 10 -57 -5 21 -40 -40 29 -58 -42 -9 74 -44 7
3699GM1o4m7J33r1K6J1K4no7jJ02r6J7J2m3N7k4l0jJ7L0n1J9P7m5J0L0l6o4J05
$$ 7 48 -16 -63 70 -21 5 16 40 35 -32 -33 69 -27 -10 2 -41 16 -8 -38 -39 -22 8 -43 -24 53 8 18 48 12 -52 53
3730E3L6n1o4nO9o2Q0L5r3n0J23p5m8Q8k0j17J38K6j12M2Q3q2m6P6Nn8qR7p4L1
$$ 53 89 38 -26 -31 38 -24 56 91 -2 -52 71 -4 -52 36 16 -101 37 63 -49 -7 76 -6 -52 24 29 -29 -37 60 -14 17
3760A7JL2j01M3Q8o0j6oL0L5m8N2j33N5P7l4l5J5L6j13O9K7j06N5M8o9j9L6k8
$$ 17 18 50 -51 -8 80 20 4 -2 28 63 15 67 -66 -11 66 32 -3 12 48 -65 4 31 -75 -20 28 -41 -60 -24 -52
3789e2L2J5M4o0l0J28q1p1J02M8r5j0N6m0L9m9M2j7QM7o0l1M7k2Qj6Rp2M9J00
$$ -52 -20 -5 39 -21 -51 77 -4 -75 27 75 -20 -30 26 -14 25 -24 18 1 9 56 -4 -35 12 -10 -2 -18 -9 -81 -32 68
3819F8l1r0J01J5r3L5N3k8r5O2L4p2M5Q8r9nK3l5J4M0l7l3K1L6rp6R4l5l8M8J8
$$ 68 37 -53 48 63 -30 5 58 30 -65 -3 31 -41 4 92 -7 -12 11 -24 -10 30 -7 -40 -19 17 8 -68 26 -9 -47 1 19
3850A9l4k9J03q4j4L0N7q5M7M6p5L5K2L2j50J37j0r8O3N4o4j16J10N4p0L1J9m4
$$ 19 -15 -44 59 -25 -39 -9 48 -37 10 56 -19 16 38 70 -80 57 47 -51 12 66 2 -114 -4 50 -20 11 30 -14
3878a4l4L6K0j4J3jk6o9J01n9M4LL6k1j4kj1j0N1mo5J9J03j75K3J30m6q8O0L5
$$ -14 -48 -12 8 -6 7 6 -20 -89 12 -47 -3 0 36 15 1 -1 -12 -22 29 25 -40 -21 82 -93 -70 60 14 -74 -14 21
3908B1q3J47j2j02J7M9l2o8O3j3m7K3J6Q6k6l1O4j3m0l8oJ2K3L4l8J4po7j4Q4
$$ 21 -62 85 73 -29 -12 37 5 -63 0 -13 -60 -37 -21 65 39 8 72 59 19 -19 -25 -13 10 44 6 20 13 -54 -68 16
3938A6k8n1J04J2r5J0J3kn8Q3l0l4K3N3M6n1k5lKK6jkJ0K9j18K8Q4o3j0K4K3K1
$$ 16 -12 -63 41 53 -42 -32 -19 -21 -79 4 -26 -60 -37 16 62 11 -14 -17 -15 11 10 8 18 47 -71 -43 41 -22 -32 -8 15 36
3970C6n3K2j4n1P9K1j56J07J9j6mN6o1N3j9J6n3L3k9K0k0K2L3j37Q8M3l0N7J1
$$ 36 -17 5 -9 -60 19 40 -116 -9 10 -6 -10 46 -15 38 19 35 -18 15 -14 6 -14 8 41 -96 -8 35 5 62 73
3999G3q5pK2M9o8l1R6o1n7J12p1j5L2O4p7m6N7L8n5M1%j3K7k8KmJ22j06l5J9O5
$$ 73 -12 -19 3 52 -16 -47 49 -12 -69 43 -28 -43 -11 53 -24 -70 -13 25 -30 11 11 -2 25 -3 -1 -5 117 11 -24 -5 60
4030F0q7N4%o5JK3N0q9k0R1l8M6J7q1N9o2P5n0k8M6L9Mm5L9p9K2O3r9m0J35l1
$$ 60 -27 27 27 -38 -37 -14 36 -53 -73 18 -20 26 43 -38 21 -41 34 -16 -44 2 41 45 0 39 -40 -18 45 -54 -94 41 10
4061A0o9L9L5l4j8O1K4r8O3k3p0J24l4o3j0M5K4o2P6ok4k2N3l0rk9Q1ok8K1KK4
$$ 10 -59 -20 15 -19 -37 24 48 -50 13 -10 -80 44 10 -53 -63 -18 6 -56 20 14 -10 -32 21 -9 -18 -47 34 28 0 21 23 47
4093D7m8Q1j51j4Q3n2M1N4m1n8Q5k2j9j5M2j7jK2k6p6J38p3j2K8J6l0PO8j4o3
$$ 47 -1 80 -71 -85 -2 -54 -13 41 0 -58 27 5 -14 -29 13 -4 -5 17 -9 -85 53 -20 -32 -4 12 -18 -11 57 43 -20
4123b0J0QRn4J9J04j00K0M9j27L0O8Jpq0Q0n2L6K2k2kN1l8o5L6M0K2m4M2m7n4
$$ -20 -10 -2 7 -47 -28 76 -24 -4 45 -82 -52 16 17 10 -70 10 -42 -6 16 -6 -8 43 5 -60 -24 16 38 -6 36 -11 -65
4154f5R1N3r1J8L0Qr1J08k4o2K5l2kK8J6n4J9L1N6p8M0L3n0l8P0l5l0N3l9M5k5
$$ -65 26 79 -12 6 36 44 -47 61 37 -25 0 -32 -34 -6 10 -44 -25 6 62 -16 24 57 7 -31 39 4 -26 27 -12 33 8
4185HLQl3L2K5m7M1J7m5LJ7j7l7L1L3n3QRn1K9J2K7p3O3O2j47O3P4k7k8J9k2L6
$$ 8 11 19 -14 18 43 -4 37 54 9 12 29 12 -25 6 39 -14 -6 3 -48 -19 -7 20 -53 10 72 -75 -12 62 35 7 26 4 40
4218D0l6N8n1rrL0n3K5Q8r4QN1o4L0Oj7j2L9j7n6O4m5K7m3O0J3J3r7R0o2j9K9
$$ 40 4 62 11 2 -7 23 -30 -5 83 -11 -3 48 -16 14 20 3 -9 30 13 -43 21 -24 3 -40 20 33 46 -51 39 -23 -42 -13
4250a3J3k8L5KL5m1L7j3j4k6O8m2m3O4q0L3mK7p1O7M3o6J3k0J2k3J3L8l0k4J06
$$ -13 0 -28 7 9 44 3 40 27 13 -13 55 13 -30 34 -46 -13 -17 10 -61 6 49 -17 -4 -24 -12 -35 -22 16 -14 -38 68
4281F8lo4K4jj9j4O0q2nlM3nK3J9rk7m4K5n7N3K7o6j5J01q7J8M8K1l4k1O0l0M2
$$ 68 65 1 25 24 5 -9 51 -31 -36 -39 4 -1 22 41 32 5 -39 -14 -71 -18 9 -57 -72 29 -58 -40 8 29 -5 -26 34 4 46
4314D6K1p9m4M3O2q1jM5o6K1J12p4k4L6L4o1p7Q8J7n0qO7j07J0Q4j5kO3l5l2o
$$ 46 67 -12 -56 -13 49 -32 -33 12 -54 -33 79 5 -19 17 51 -10 -87 1 18 -32 -40 27 -80 -70 14 -1 -3 60 25 -7 -13
4345a3O9l0J4j2m3QM7rm7l1M5j0m8J12rq0JO3n8l1R4m2o4M8N8l0N4o4Ol1J2K6
$$ -13 56 26 40 28 -15 -7 40 31 -16 -47 -2 -12 -60 52 43 -37 -36 27 -31 -62 32 -10 -74 -26 32 2 56 -8 -2 -33 -21 5
4377EJj4J11n2l3O5j23nO7K6m3l8N3n7RPJ02r3l2J02m5n4j6P2o1R1n7NkL1Lo8
$$ 5 6 -8 103 51 18 83 -40 -45 22 48 5 -33 20 -37 -28 -21 81 -12 -44 58 13 -41 -57 15 -46 45 -12 -7 -9 22 25 -43
4409d3M5Rj4j6P3k9p0O8J5o3j2Q6k2m3M0m3j7Q7m7q1K5J06l9j1Pj6o3J21m9k1
$$ -43 2 11 -3 -19 54 25 -45 23 38 -25 -37 49 27 -16 24 -19 -36 51 4 -77 -52 54 15 4 11 -5 -68 53 4 -17
4439a7KN7o9lO0k3n5O5l8m3K5O8k5o1R2k4k5KJ6M1q2M5l0%O9k6k4j0nK2l1J2K7
$$ -17 -15 42 -27 -30 30 7 -48 17 -21 -64 -39 29 4 -57 35 11 -14 -12 4 45 -37 8 -22 -22 47 21 -3 -13 -18 4 -27 -15 12
4472A2l7M4Po8J10j0n9n8Q9k6J3nK8q8L9M8rm7k5M8j7mN1p7j6O6Or3M8O3J1l5
$$ 12 -25 19 26 -42 68 58 -1 -59 30 4 17 12 40 -48 -9 39 30 -17 -42 6 -11 -15 36 -41 -57 9 15 -78 -30 33 44 9
4504IK3p2K9L7oj6m3P3m7J0rQ8n8j2K8l7nQ2j02M8m2l1N4k2J3KoJ7l1M2m4L8j9
$$ 9 32 -40 -11 26 20 4 -39 34 -13 -3 -12 76 18 6 34 -3 -8 74 -28 20 -22 -53 1 -21 -8 -6 -12 5 -26 16 -28 10 -9
4537iK8k3ol9O8j3j3j4J5O6m2MJ0j05R7oqj9K0o1L9J3oJ4k0n9J25q1J7M4o1lP7
$$ -9 19 -4 -10 -49 19 6 -7 -21 -6 60 18 22 32 -73 24 18 10 -9 11 -50 -11 2 -4 10 -10 -69 56 -25 -8 36 -25 -28 49
4570D9m9m2O5J4j18N1J3O8j20N0M3n2KQ1k2n1J6l5j4Q5lp7O0N2j18N2J7l8k5K9
$$ 49 0 -42 23 37 -81 -30 -17 51 -69 -19 24 -28 -26 55 33 -18 -2 -37 -51 34 31 -46 14 66 -52 0 17 -21 -46 -17
4600a7Q7o4k4L6J3m1L4l1k9J5P3q4M2nLk0NL5r0JP3k4m5M4K2m5K0J4n4J7R7j3
$$ -17 70 6 -18 18 31 -10 24 -7 -36 -21 52 -32 10 5 8 -12 -7 28 -62 -61 12 -12 -57 -13 9 -36 -16 -2 -56 -39 58 45
4632D5r1N4O0j54N2QM4p7J07j7n5R2p6kM6n9L5l2J2Rn3N3qj6J8k2M0l0j0M9o3
$$ 45 -46 8 68 -86 -34 -26 18 -59 48 31 -24 68 -8 -10 36 -23 12 -20 -8 1 -52 1 -7 -23 -5 -27 13 -17 -27 22 -41
4663d1J2oO2q0P1L5m9MpL8m1N6j9p9K5K3o5P7j8N1j08M6lk6P5J7j05M2L2jo0M0
$$ -41 -29 -35 27 -53 18 53 4 8 1 39 -2 54 35 -44 -19 4 -61 16 -2 49 -59 -13 -16 -42 33 50 -55 -13 19 18 -42 -2
4695bJ4L7o7j3M8o4NL6O1p6N0j4l7K0L0q6P5Jp6N0k1K8oN6n7J7NM1j9n7KK1M4
$$ -2 12 49 -18 -31 17 -47 -42 -6 55 -21 29 15 -22 -2 28 -58 17 18 -58 -8 -29 -1 -7 49 -8 9 14 55 36 -21 -19 2 46
4728D6j7Kl1JKNn5P9Qq6M4oJ0o3O1%p2Q6J0Jq4K6O6o9Q8l0k5KM4r5L5RL0n8R3
$$ 46 29 31 0 1 3 8 -47 32 40 -46 -2 -8 2 -61 0 0 -72 14 24 25 -59 -33 33 -36 52 22 -3 -1 43 -52 -17 -8 22 -36 57
4763E7m3k3Lj0Q0m8m2L7l2J6Oj7k5O0K4o1m2N4L5l7k3M8kj0Lj5l3N8j5l6N9k5
$$ 57 14 -9 -6 -16 64 16 -26 11 -21 -5 1 -16 -41 19 43 -18 -60 -6 29 -8 -31 17 15 5 8 -7 -40 18 3 -33 26 1
4795Ao7Q3ojJK4k4K1J9k5K4j8O1r3J4K4m6O9p5K9rl4J9M5n0oQl9M1K0O1o1L6%
$$ 1 -66 17 11 10 11 35 11 32 51 26 50 32 93 0 14 38 -8 61 -14 15 6 -28 -9 36 -14 -20 -12 -51 -10 10 71 10 46 46
4829D6k3M5m6o6O8rk1%K8J4kj9l3J7k4%P0o8l6L6M0k8N2p4R8p6KK7n6N2JL6l4
$$ 46 23 68 22 -44 24 15 -6 -6 22 36 34 15 -18 -1 -25 -25 45 -23 -59 -23 17 -11 41 -33 65 -11 -9 18 -38 14 15 51 17
4862A7K9n3l1L2N1o8Q2k5m6L5Nl9N6l3m1k8M5jnJ9L0m8rJ7k4J2M0M8j12JL9PJ7
$$ 17 46 -7 -38 -6 45 -23 59 34 -12 23 28 -11 45 12 -29 -57 -12 -13 -18 1 31 -17 -26 -9 -33 -21 19 67 -45 -44 -5 2 19
4895A9j4qk4O0PJ8o0N5n3olj3k5L5J6l1N2l9L3r2M6R1o1N0j4p2N0j1j6MK1J3j1
$$ 19 5 -3 -27 33 40 58 -2 53 0 -6 -9 -22 -47 -12 4 -27 25 -14 19 -73 -27 64 3 53 39 -33 17 6 -10 -6 15 28 17
4928A7n3L7L4o4K9kN4p1NM2r3N4O0k2o3L0J3o0O0N4n1k1M6o1N0Mk6j5LK8Ml4j9
$$ 17 -36 1 35 -29 0 -2 52 -19 -14 28 -65 -11 49 27 -36 -6 7 -53 7 61 10 -11 35 -26 24 28 2 -13 -10 18 22 -12 -31
4961c1L6J4l6N5l9K2k6K0K1n6nl4R9l4J5j2j4Qpj5M6p0N0j9j4L6M4o0m3Q7ko4
$$ -31 5 19 -17 38 -1 21 -5 15 36 -20 -25 -59 40 6 21 9 -5 3 -4 -19 27 -43 7 -12 -26 10 54 -6 -49 38 36 -28
4993b8L2l0lK2l8M0PN4j16JJ00n9K5J1l9N6j6j9J4o6P4K7l9l2J8N7q7M8L2q2J9
$$ -28 4 -26 -29 -7 -45 -5 2 56 -60 -59 41 -18 7 18 -21 35 19 0 14 -52 22 49 10 -22 -4 53 -34 14 46 -36 -17
5024a7L2n9K0P6j8M4n3Mj6qk3P9r7O0oom6K5K9n5M7k7k7N6j2k0N3j6Pl2kJ6k5
$$ -17 15 -44 -24 52 34 78 25 29 13 5 -18 61 -36 24 18 12 -34 -9 20 -35 12 -15 -42 14 2 -18 35 19 26 -6 -8 8 -17
5057a7L9m7M0K2Qk5n7PN9m7M1J3l7mnJ4N3m6m1J7k6M2k2l0L6K6l9N9o6M3o3N7
$$ -17 22 -25 15 37 45 20 -37 -30 29 -18 23 36 -1 -5 -10 4 57 11 -30 -13 -39 3 -19 -49 -13 13 -26 33 -33 10 -53 4
5089DLJ5rJ8L4q7k1P6J4o5Mk3L9MjK3m3K0k7j8P6l5j6K1k3k7N5K6k4p7N7J1J1
$$ 4 7 22 13 31 65 -22 -43 33 47 -18 -14 -37 2 6 5 28 -15 5 -22 -40 36 1 -15 6 -17 -44 11 37 13 -64 -7 4 15
5122A5mm8L4j9m4Q8k8N0q8jO2Pq2P0L5l4j7K3m0%j1J1KlN3n9j3J9J01p4k9LN7
$$ 15 11 -37 -3 -22 -66 22 -6 44 -44 -45 17 24 -58 12 47 13 -4 19 -21 -21 -32 -21 -19 -22 31 -28 -41 -22 79 5 -24 -21 36
5155C6q1O8on4O4l6J1j3oM0l3J5K0l8j6J7nM0k4qk4L7m6M0o3L2J8k4N2Q%n9j7
$$ 36 -45 23 17 -37 27 -9 2 -11 -17 23 -10 5 25 -13 -29 -12 -17 23 -1 -9 -33 4 -42 -2 -65 -33 -15 -39 13 21 21 -38 -55
5188e5O2kl2M8o5N4K2k8l3L7K4Jk7j8M0j5k8M4K4n6MjoN3n4j9O1l1O5l6l1j6N7
$$ -55 7 5 -27 21 -44 10 32 4 -29 8 32 33 6 -12 28 13 -15 29 53 -3 1 0 -6 47 -7 -26 35 4 69 33 2 -14 43
5221D3j12O4%%J1j1M0L3p1%J0M4l4m7P9l4o3L5RmO7p6LJ0pQ0q9M5j3k6M3j4k7
$$ 43 -69 -5 -5 -5 6 -5 35 68 -3 -3 7 51 17 -30 49 15 -48 -13 -4 -8 59 -17 -14 -4 -11 69 -20 25 12 -14 29 15 -12
5254a2RL5Pk1n3P1o9K5oM2k5M0p2PJ0m1R0r0R0l6j4K1k1k7O2JK1n5J7K6k7pK9
$$ -12 -3 32 39 18 -35 36 -33 -8 -14 28 3 43 -29 -22 -12 -53 37 -53 37 1 -13 8 -13 -40 22 23 44 -11 6 32 5 -2 27
5287B7m4L7j4L8%l9o7J4O3l1k4O5j2k7J8m1K6L4L5p2JK2Qk8rK1K5o2N4J0J1k1
$$ 27 -17 20 6 44 44 5 -62 -48 15 -16 -40 25 13 -14 4 -37 -11 23 58 -14 -13 9 17 -11 -20 1 26 -36 18 28 39 18
5319A8qJ7Km9O0J4m7N2p5L9o6P0m5P9l7k5K8L9m8m1K4j7R4o8mkj3QP4j36M8rO8
$$ 18 10 27 29 -20 40 54 7 59 -16 23 -43 27 -18 61 24 -1 27 66 18 -23 1 -16 78 10 6 4 -9 -1 73 -63 -15 -24 44
5352D4o6KO2l8m2N3kN7r6K2J2j3P6m7p4O1knj6N5p9L9k0K2%j7K0l2N3k4k1M6n8
$$ 44 -22 -20 42 4 -38 15 13 70 -26 -4 8 -5 71 24 -50 11 9 4 -12 43 -36 3 -17 5 5 -12 8 -24 29 5 -16 30 -28
5385b8j8RlO3Qm8J3%M6j3j7o8K0P9l6j5K6m1K1l2O2n9K8mK5j8N8k0j07J07m8M4
$$ -28 -46 -37 -40 23 31 -17 -4 -4 42 29 12 -56 -36 43 7 -8 18 -23 -2 -34 28 -31 -3 -7 18 0 58 38 -69 38 -10 34
5417C4n5L3rk9k0K9m4M8j3K5k6L0Ln7M8K9p2Q1m6K9p6J07j2j9m0M8j1J3j3j0J5
$$ 34 -21 12 3 -26 -46 -17 -61 -13 -26 -1 -27 3 6 -51 -3 26 -46 35 -11 18 -58 49 37 18 -22 26 15 28 15 5 20
5448B0kn0LLJ07m4n7ML0j5k2L1k4J5k2J8m3N7Kl0j0kL1l7K2L4n9MM0pK4pn6N6
$$ 20 18 -32 -29 -26 81 37 -20 -16 14 -1 -23 8 -16 -1 -23 -5 -48 9 11 -19 -29 -31 0 -37 -15 19 -40 -36 4 -3 21 14 -42 14
5482A4P3p4rN4rk7k9M2j9k8OM2J3n6J%j8Q3l0p8J11r6MK7L0k3m3L5K0m5L5N6j04
$$ 14 87 13 4 58 49 22 -7 35 16 -12 -6 36 49 -7 -6 -6 -24 59 29 -49 62 -34 -30 -3 27 4 -39 -4 16 -29 6 62 -42
5515d2P0K4q6kP9Kn5n3N5M2m0qM6k5KM9n6n4N1J0Jk4L7o7O3j0l3K1J3k2K4j9m
$$ -42 28 52 -34 -36 43 45 -10 -63 -8 34 -6 -14 32 7 9 58 2 -52 -1 9 10 -14 23 -44 19 9 -24 -3 10 -12 12 -7 -11
5548a1k7M8K2k9k8jJ8M6j03J45j7p4Ok6J11p9K5l4k1J8O1q0K5M2j8k0Mn8N2nN1
$$ -11 -38 10 32 3 -25 -26 -8 38 -65 80 63 -11 -5 -31 80 1 26 -8 -29 -11 50 -30 -5 37 19 -1 3 -55 -3 -8 43
5579D3k8Ol1qN4k0j2l1L2K7k4m4PK3K5l4J8k7K6Ml6j1K5k7K1J2k2K6L7k0j1o0
$$ 43 15 21 -10 -18 36 16 4 -27 5 32 8 -36 -29 -6 19 -15 3 -24 2 6 -30 -41 -16 -43 -22 -10 -32 -6 31 11 0 -60
5611f0P1k1K4J5o1K4M9l2Nl9k6N8Rl1j9N7o1L3j2oM3L0o4N3op4Q7k4m3J6o0L4
$$ -60 11 -10 14 29 -32 -8 41 9 14 -25 -51 7 16 -15 -34 23 -38 -5 -17 -23 20 50 -14 39 33 -41 46 22 -21 -5 -65 -31
5643c1L5K0j4j2%m7N6J0k2k5O9r2O7N9q6Jj4l5P5jkO6p5pK0l6K4j3N0l1L5o1L3
$$ -31 4 24 10 -2 -2 -49 7 17 -5 -30 39 -53 14 73 -13 -12 -26 -61 14 13 11 77 2 -5 15 -21 3 -10 40 9 44 -17 16
5676A6p3K4K9LK5o8J1L3n2L0qP0j8j2l3Pj2QJ3n7O6K9k0OnPn0K0L7m1j9P7j8o3
$$ 16 -57 -33 -4 -1 24 -44 -33 0 -52 -22 -30 40 22 10 -23 -16 -28 -20 -7 -64 2 31 11 17 12 19 -31 -11 26 -15 -34 43 25 -38
5710c8O8k8j6pN0p1O7jM5r0J5k4k1J1j8M6KN8n2M4o9L0K3j1k7M5nm9K4Rl6k0M6
$$ -38 30 2 -14 -21 29 -42 25 24 69 -21 -6 -30 -51 -40 -58 -12 -10 48 -4 40 -29 1 24 13 -14 31 26 -23 1 10 -26 -46 0
5743@j8RqL2k0J8l5J5k1M9jl2m1M9Mm4K3j1N6j9Mrl5%M9j5J1j7QOL0n7K7K7l5
$$ 0 -18 -9 -17 15 -5 13 -22 -7 -28 21 20 -12 -53 -4 0 -44 -21 -32 24 5 9 0 -35 -35 14 -1 10 -7 1 7 37 -20 7 34 -1
5778am6M1Lk5K2K9k0j1L0m4J8j5l5P4m5J2L0KK4l8L2q7N9N0o7O9p6J4j0P7k9l1
$$ -1 -47 -6 -3 -28 -6 23 3 -8 22 -22 -4 -19 -54 20 -25 -13 17 19 43 5 37 -50 9 59 -8 61 -15 -1 -11 66 37 6
5810FJK5p9J5RM2q1Q3K3m8j3Jl5O2K3m9P6q5K2QQl2L6joK0n7O2k6j5L6m9RLn6
$$ 6 7 32 -47 -32 -23 19 -62 21 44 -4 -17 -16 -51 11 34 -15 61 -24 -2 6 14 -18 18 17 11 31 -26 36 10 -5 31 -18 -9 -6 -62
5845f2N7rO4q3N2l4K4ok4J6K8p8K2J7JnN1m5J4m6KO1m5M1j3L3n8O7k9k1J6n0O4
$$ -62 -5 -14 50 -33 19 -15 9 3 -21 -5 23 -55 -33 -16 -15 -20 31 -14 0 -46 -44 17 -28 13 0 33 -25 42 13 -8 8 -42 22
5878B2K5o2P1p1K8K2l9kl1L2N8p5m9J61j12L8J7n7J8j5N3Pk8o5R6Jl5Npj3j9O
$$ 22 47 -15 56 -15 13 35 -4 -6 -37 -5 53 -22 -71 90 -22 16 33 -24 -6 -21 32 39 11 -54 42 43 8 13 6 -7 -26 -20
5910b0K5J1K1l4J7K0ok3lL0l6j0Lk3Q6n8j2K8k9M5j7prmL8m6lK9n1M4Kpomk1o
$$ -20 5 16 37 3 20 40 34 11 8 38 2 -8 -5 -28 58 0 -12 16 -13 32 15 8 -1 -5 33 -13 -16 13 -38 6 8 1 -5 -9 -30 -36
5946c6L4k7L4MjO0j7m9j9J9K7l8J06p3J4p9O0l5J0k7j0M7l4J1J5Kl2mNM3Lo0L9
$$ -36 -2 -29 5 9 8 68 51 2 -17 2 29 -9 97 24 38 -41 19 -16 -6 -33 -43 4 -30 -19 -4 -2 -34 -38 -33 10 13 -47 -8
5979hJ6l5N2j8j7Rj0mNL2k1Q9p0k4j3L9j6n4M7k7J4OM1p1Q3k9J3m3ooNJ9k2jO9
$$ -8 8 -27 25 7 -10 -1 -11 -15 -10 22 1 90 20 -4 -17 22 6 -48 -1 -28 -14 -8 33 -38 45 16 29 -14 -20 -26 -21 -2 -24 -25 44
6014D4o0J9J9K3n0j7J3K9K3k0r7J07Nj9n5R1m5J3M6k6l0oL0J9l4l6M1j6j8M7o3
$$ 44 -16 3 22 45 -5 -22 -9 20 43 23 -74 33 38 19 -36 55 10 23 69 43 13 7 37 56 22 -14 27 11 -7 40 -23
6045b3kP2p4LN6j7j5j1L7m8jM3Pkp9M7k0k9N5K3o6K0L0m2P9q0O6Qpk1pQJ3N3r1
$$ -23 -25 47 -27 -24 32 15 0 -11 26 -22 -23 20 27 25 -54 -7 -27 -56 -1 22 -44 -24 6 -36 43 -37 29 37 30 9 2 10 23 76 -15
6080a5M1Km3l4L5K1L3j0k9m6nR6rj9jk7qK5K0j8LL1k3m5L8J6j9K3q0P1oJ9l0l4
$$ -15 26 28 -15 -49 -14 7 40 30 1 -45 -50 46 37 18 17 -10 -18 7 27 9 12 43 20 -25 13 29 10 33 -47 24 18 37 7 -27
6114b7J30j15o3N5P4m4L0L3r9M1m1N1l0k0O4l5J2J6n7MK4L3j1k4J2j0Pj2J4l4
$$ -27 103 -12 -75 -20 54 10 40 73 -26 15 -26 25 -5 -25 39 4 16 32 -25 -21 3 36 25 1 13 3 10 -2 12 -22
6144b2O2k5m3N2OmJ6K1n6k0Q9j02jQ2j00M1K9%k0J8k4M1l6j6J3K5o1N7j7J5j6
$$ -22 40 15 -28 24 30 26 42 63 7 -13 76 -26 -27 55 -45 -4 25 25 5 23 -1 40 4 -12 1 26 -35 22 5 20 4
6175Dj0m6j3Q5m4K0l2R6m1n7M7J9l0J4k5OJO9p4Pl1OO3jq8P4j1j6Ml1j2O0m6j9
$$ 4 -6 -52 -65 20 -24 -4 -36 60 19 -38 9 28 -2 12 -13 -7 -6 63 -11 -4 -35 -29 34 33 -55 19 8 -8 -4 -35 -47 13 -33 -52
6209e2O2Pk4l6L8lM4l2M4n9K2%j2N1r5O9m5j1O1l9N5l9kj2l2P0n6L2k6N0m3P6
$$ -52 10 17 -7 -43 -5 -8 36 4 48 -11 11 11 -1 50 -45 24 -21 -32 29 -10 45 6 4 -8 -40 30 -26 6 -20 30 -13 63
6241F3o5K2On4L2j0k0rk7O2j4MM6k6l3K3l8N2J7L2q9N9J1p4nM0Ql3L3j3k2kO7
$$ 63 -2 20 26 -28 4 -6 -26 -35 -62 0 -14 -10 36 10 -23 0 -38 14 31 63 -26 33 44 -30 -35 5 13 -20 13 0 -22 -24 43
6274D3q3O2n4L6Mk9j0M2nq1N8RLqQK6l5N9j17J12m6M7k3JkJr4M2J2M5J6m2j9P
$$ 43 -40 22 -32 4 8 -21 -31 11 6 -75 -17 -8 -5 -13 -5 21 -14 45 -72 40 -6 41 18 19 17 18 -76 -34 -22 23 39 -3 -22 -15
6308a5%N0l8m7M7j9KQl3MR3o6J3L0o6K0P1o7K9k8M0j7J9n5P4n0K1L4o4J8J3k7
$$ -15 -15 35 -3 -50 -3 -22 -20 -12 -45 -41 52 -14 -1 29 -37 -17 54 -13 16 -12 28 11 30 -25 49 -1 20 54 -10 8 21 -6
6340fLM3p0j2MK8J6k9N9l9j15J72j3m9P1q5l6N6PMk0l7M5k0N0Ok0n0N7Joo0M2
$$ -6 -3 40 -30 -42 -38 -10 6 -23 36 -3 -118 54 41 -8 63 -22 -58 -2 5 9 -11 -48 -3 -23 27 33 13 -37 20 21 15 -45 -3
6373cl9Q9m0mMk6N5n5Kkm0N2k1J9N7o3L4k8J0K5o8P7OPn8J3j2J6J0m4P2n0L7M3
$$ -3 -42 47 7 3 7 -19 36 -19 -17 -19 -59 -7 -28 -9 48 -15 19 -9 1 26 -42 35 41 48 -10 3 -9 7 17 -27 45 -5 32 75
6407G5q4M5J0m3M4m4JL3j8%m4K4n4J0K5jJ3J8M1j8k6K3o6N1pl5N6k2ml6lMpO7
$$ 75 -9 36 46 3 47 3 4 37 19 19 -25 -1 -55 -45 -20 -21 -8 10 51 33 7 30 -36 15 8 -27 29 7 3 -33 -36 -32 -39 28
6441B8j9J7ok7J9K5qj0l7J6J8J4l1K5j4kK7p8PL5j8J3jj7K6Ok0MnJ8Nm4N9j8K0
$$ 28 9 26 20 -7 12 37 29 19 -18 -2 16 30 -1 24 10 8 35 -43 -36 -1 -19 -6 -7 -24 2 8 -12 -8 -13 5 10 -34 25 7 27
6476B7m0J9k4JJ3lK7k9ok0O4o8M4L6n1Pk0L1J6kn4QoM4j4j4J0l7N0j9pO2p1RK7
$$ 27 -13 6 -18 -17 -4 -7 20 -9 -15 -35 29 -39 5 41 -10 -3 -23 8 24 22 -32 -24 -30 14 0 -14 -4 -41 9 -10 -17 45 -26 -17 10
6511A0m0M8k1J7%l3nK0K1o7R5p5N1K6n4qK7L1o6j3oML0L5o0O2j6k4P2m6L0l8m7
$$ 10 -30 18 -3 14 14 -19 -24 -4 17 -50 45 -30 21 47 -7 -15 12 43 -23 -36 -42 -38 -8 27 -33 29 13 -11 61 15 45 7 -40
6544d0P1j9j8M1j5O4n6J6k8k8K2kJ9ql9pnk0Q5m8L0MPj00O3pknP0j7l6l9P9k2
$$ -40 31 12 -6 35 20 84 28 44 16 -12 10 8 27 19 -20 -27 -32 -52 33 -15 15 19 26 -74 -11 -18 -20 -25 45 28 -8 -47 32 10
6578A0N0j4n5j3L0J7mL9o4P0p6K9k7k3N4K9l8m2j4O6n5M8J0n8M0J7m4L6m7Loj4
$$ 10 60 46 -9 -22 8 25 21 60 -4 66 -10 19 -8 -31 23 52 14 -28 -42 24 -31 17 27 -31 9 26 -18 18 -29 -26 -32 -46
6610d6P4k1Np7P3n3O1k8oO6k8J1l1N7km4K3p2K7J0k3P8n0lk7m4M9M4n3O7NJ3m1
$$ -46 28 7 12 -65 8 -45 16 -12 -18 48 20 31 0 57 55 11 34 -38 -11 -1 -24 54 4 1 -26 -70 -21 23 -30 37 42 55 14
6643A4j7M9l9LmooL6m7M8l1J8J1q4N1O1o3k1M5j8J3k6L9Qo6J4J7K8J2o6K0K6J0
$$ 14 -3 46 7 10 6 0 -6 30 -17 31 0 18 29 -55 -4 57 -6 -27 18 0 13 -13 26 34 -32 -18 -1 27 39 -27 -7 19 29
6676B9l1LJ2k9k0P1Mj6K4j6J8o5J5j1oK1P2q8N9j5m4L5L8jj14RK1J5J2J1J0j6
$$ 29 -2 1 13 -16 -36 35 39 23 47 31 49 -16 -1 -12 -18 3 75 -13 46 31 -13 22 60 59 -55 -46 -25 -10 2 13 23 7
6708GK5Kk3J1lm7m1P3L3n4K5kpLM0n4j3MP8r3O8ml6K6k7mjk1K7M0m1K5n8Q4l3
$$ 7 32 34 11 22 19 -28 -69 4 37 -17 8 6 -1 2 42 -12 -25 -21 57 -36 32 28 -8 18 -9 -13 -14 -35 -8 32 -9 16 -42 42 9
6743INj4q2R0K7Pk9L8k1k6M2l1L6o1l4K4J4J0J5j3N6k6lL5o3J5mJj3O1r4J9pm2
$$ 9 14 0 -82 8 35 42 13 51 30 4 46 15 51 -10 -44 -20 -6 4 19 6 62 36 33 68 5 20 16 17 4 65 -29 -10 -17 -59
6777e9O3K7k6Kk6k2P5r2R3l1K1mpL6r3PL4L3q8P2k8N5rj5k8M3oK2p3L9L1J0o0
$$ -59 4 31 5 7 -19 -41 34 -58 35 4 25 21 14 50 -43 -36 -2 31 -57 15 -13 42 33 18 -10 33 27 49 -24 15 46 56 -4
6810dj7N0J9l2Nn7N8m1N5p8N0OK1j08Q5J8n0J0Jl1Nk1k8O7N4l1k1N3k5l3L5L3
$$ -4 -21 29 48 16 21 -36 22 -19 36 -42 8 14 35 -73 12 30 -20 -10 -9 -40 -35 -56 -84 -17 37 6 -15 38 13 -20 15 48
6842D8o5M7n4K6J4M8K4p1j6l1M5kj5J4M1j3k5L8j01N9L6n6RO0m9j8M1l4OJ1J2
$$ 48 -17 30 -24 2 16 64 88 17 1 -30 15 13 -2 12 53 40 15 53 -48 11 47 -9 0 60 11 -7 34 0 6 17 29
6873B9J9l7N6j29J05o9J5l0K9L4j3K8%j5n4J8L4Mk6JJ1j6L3J1l9KqL0l8L1K9p9
$$ 29 48 11 67 -62 43 -26 -11 -41 -12 22 9 37 37 22 -32 -14 20 24 -2 -1 10 -6 27 38 -1 1 -7 23 -15 16 45 -34
6905c4J02q2oK2L3j8l5L6l1n1O9J8j5j7J3kl5J2mK7j9j1N0m3J4K6j0K5O0n6n0
$$ -34 68 -14 -20 2 35 17 -18 18 -13 -64 5 23 8 -9 4 2 -33 -21 -25 2 -17 -28 22 -21 -7 19 9 34 94 38 -12
6936a2K6JjJoK1o1J4J5j5M7k8J1r5K9P6Qj3q0J6O8l4j1K7j9L4%K0k6j3mKL6n4
$$ -12 14 15 14 15 9 30 -31 -17 -2 -17 30 2 13 -82 -53 23 31 18 -62 -46 22 -12 -23 4 -15 19 19 39 13 0 -4 -2 34 -20
6970b0K9j9Qjj5L6J1l2O1o6M6K4o9m0L6k4L3k6pJ3k2J01l5J7k1k6O7o4K4j2%M8
$$ -20 9 -10 -2 -3 -18 18 29 -3 58 -8 38 62 -7 -47 -11 -35 -2 -28 -35 -22 -44 57 22 39 18 -8 59 -5 19 7 7 55
7002E5q7M2Ml2K5l2P6j00M7Nj8Oj6L5k8jJ0j8N8%m4K6k3M1n9N1n2l2Q5n9N4ll1
$$ 55 -32 10 14 -18 7 -25 51 -49 -2 3 -15 -9 -25 10 -18 -19 -9 -27 31 31 -13 13 -10 31 -28 23 -29 -61 24 -35 19 16 -15
7035a5Pm6Q0k3K3qPM%k0M4o4l0K7M1j5LJ0p1M8J0k4M0l5O0m2l6K3nL3rPj4j2J8
$$ -15 -8 -54 26 3 26 18 25 29 29 9 53 -11 -41 -14 27 12 15 25 -46 2 12 -12 28 -7 53 11 -25 -2 -7 26 17 24 10 -2 16
7070A6m8K8Oom8Q7j3L6o2M2k5J6n0L4Lj2njK3Ok2j8J7rPj6M8k7l3K9J2K9l4k0
$$ 16 -32 -4 2 -4 -52 35 22 58 -4 38 13 29 -21 13 16 4 -1 -2 21 27 5 -13 4 -5 2 -14 34 7 -26 3 15 44 10 -10
7104a0O4m9Nj8lKNk6J7J7Rj5k2K6m1N6m5K9k7KO8k4l8N6o0k8K2QJ07o2j6j2QN3
$$ -10 54 5 10 -8 -11 -9 -4 -30 -13 4 13 -2 -24 2 -39 17 -28 1 -26 -24 44 20 -18 38 -22 -50 -28 -20 87 25 9 -3 5 58
7138E8r7M7l0L0K6k4k5L9L1k8lj1rn5L2P2n0J1k2M4o1L9l1N3l0k3M4p0R3m5M9
$$ 58 -39 8 -22 8 34 10 -15 24 55 27 24 13 4 -51 -19 53 3 14 -8 36 -25 14 -17 36 6 -17 27 -43 50 5 54
7169E4k1m0l1M1qK8J2j7jl8L0k1L7J7m1k2P0p1K4k0J3O6n3l3K3NjJ9QK6n3L2j3
$$ 54 33 -7 -38 3 -5 23 35 18 17 -21 9 -12 25 42 1 -21 49 -22 2 -18 -5 61 8 -25 -2 3 2 21 29 55 2 34 21
7202B1n9L7Qn7J0L4M4k5l4nJ0K5j4k7J6J7j5L3l7O8l7Oo5P5j0j2K3l7k6JL4J6
$$ 21 -38 -1 7 -50 -40 -6 38 13 -21 -26 -16 9 -5 -32 -16 1 -14 19 -18 50 13 19 -46 29 19 7 30 -7 -33 -32 2 18
7234A8k3Q8j33L6P3j44J06n0J0L7n1M0lJj3rL9Jl6M7l9Q0o6m2M9ko2M4K8n5P6
$$ 18 -5 83 -50 -14 59 -85 21 -29 -19 18 -33 7 4 5 -8 -17 22 23 -13 34 -5 75 9 -33 16 14 -48 -4 24 -31 45
7265D5rj3k6J7j0J6m7L3j4J3j3M3J3r3N2l7K0j3J5L0j3K0k1n0N3J3k6l2K6k0L7
$$ 45 36 23 -3 14 4 20 -27 6 -8 5 -8 35 48 -45 7 -30 -10 -23 -8 22 9 29 8 -42 11 24 -2 -34 -8 -28 9
7296IkJ5l3jK0J8Mp4M6K1Mk0k9M6q5J36j18J3J8k1P4n4k9L5K4J5l1n4P2k8O3r0
$$ 9 7 22 -11 -12 8 26 30 -44 2 23 27 7 -22 24 -61 75 -43 -30 -12 -33 41 -13 -42 -7 17 32 1 -53 19 -9 54 -36
7328c6J0N4k7J9k8M9j0l4n0Q1l1K5Nm7J9K3j5RpJ9j7Pj0J6n2O0k2OK8n2lM7n2
$$ -36 -26 28 1 20 -8 41 31 -3 -53 28 -3 22 27 -20 -1 22 7 16 9 28 11 18 8 24 -28 32 10 16 44 -8 -11 36 -16
7361a6J7L1k3k8J2k5LJ3j9O9m6K6o6P3n4J6K7l3L0mJ7l6j0J0L8m9K3qK7j9l3M3
$$ -16 1 32 9 -19 -7 -32 -29 -16 -35 34 -12 14 -52 21 -33 -17 10 -23 7 3 20 -16 -26 -16 22 -27 -4 -12 15 -4 -37 6
7393FK8l6M1k9N4o5M3l8J5pK7mr4N6K8l3J3Jk9k2R4o5KKl5P0l1J3k9L8k3k0jM3
$$ 6 34 -2 39 10 64 -1 42 4 19 12 39 35 -59 -3 25 -8 5 6 -23 -45 49 -16 -14 -12 -47 23 -8 5 -24 14 -9 -29 -30 13
7427A3q2R1qpj4N3m0k3M2l5j6j6N3n3N3M1k5k6OrL1k6J6L9l8l7O5j6l5L3jk5p
$$ 13 -69 22 14 7 -7 46 6 -17 25 -10 -26 -42 11 -42 11 52 27 1 7 -2 29 3 19 58 20 -17 48 32 -3 30 29 4 -3
7460ck3%nK3L2lk1k0J7J8m6KN8rPl8N7m7k8l1Q8k7j1N1o8O6k5M8p4K3m4Rj2K2
$$ -3 -26 -26 -31 -8 24 21 0 -20 -3 15 -31 -29 29 20 27 -11 46 -1 -29 -60 28 1 -10 41 -27 39 14 62 -12 11 -33 -24 -36 -14
7494a4L9Qkk2j2q1J25n4J6qPj3k3J9oJ1m5K1j1M9k0j5Q7r2K3%j0P6l0Mn1N2LJ0
$$ -14 25 33 31 9 -3 -84 41 -13 3 -5 2 -11 -34 -15 -21 -10 -55 -34 -45 4 -16 -31 56 -36 -13 -13 -23 53 23 27 -24 28 31 41
7528D1m1l2M8L9qm1mPkk9L4k9nO2k7rrJ3m2K1L6Pk9j6RK9k4l8O1o8L1N6lo8j6
$$ 41 0 -32 16 55 47 6 2 9 7 -22 12 -17 -22 40 13 4 -5 8 -34 -13 23 30 1 -15 -6 23 -1 -39 22 -46 -15 41 38 -30 -46
7563d6O0k2j4M3Prj5l0m5Q1k4m0N1j6KM4l0jo7Q4j7k5PN8j8kq2L2L8M9n1m0K1
$$ -46 14 -8 -22 21 28 19 4 -26 -71 10 -14 -54 -3 -19 -17 27 -3 -4 -71 13 -4 -29 -22 36 18 16 -66 -34 4 53 2 -38 -17
7596a7joL1o6M1j3RM4k8J1J5k6k8M1J5l0L5rj2L6p3M6j6K7k1Qj1N8q2M8o5R2j09
$$ -17 -18 -24 7 -59 -18 -31 -22 22 -6 5 20 -6 -34 7 22 -8 27 18 6 42 -31 15 -1 26 5 13 2 60 -22 26 -39 53 -56
7629e6R1j01R7k7j6lK9P5n9K2n3n0N2m8Q1Jm2J7o5Q0k3ml4L0lN7l5J0MJ7n0j2
$$ -56 35 -66 31 4 -12 -15 14 89 30 52 -1 -51 1 -47 34 35 -7 10 -55 25 2 -2 -36 -6 -9 48 13 23 27 44 -6 -18
7661a8k3N2l6RK0K0l2qK5oJ2oK5n7N2m3j2k0N6k2J1moklj0llJ7K7k8l4R4k0ml9
$$ -18 -41 11 -25 -16 4 24 -8 -16 9 3 15 9 34 -23 29 -14 -26 -46 10 -12 -1 -5 -11 -13 -16 -26 -29 -32 -15 12 -16 -50 44 24 20 -19
7697a9l0R2k6j0l3K9j6K6n8RL0P7j16Q8n8K7k5P3n3mJll3j5J5k7J24n8l4j9J3
$$ -19 -49 43 17 7 -26 3 -13 13 -45 -36 -6 71 -45 43 -15 12 -13 60 7 3 4 1 -32 -47 -32 -59 65 7 -27 -46 -33
7728c3%L7K9Rn1K3k9j5M3m3L6mm4O0m9P3m5j1J0J8J9k6L5m3l4kJ7k1j8L7K3ll8
$$ -33 -33 4 33 42 -9 14 -15 -30 13 -30 6 2 -42 18 -31 42 -3 -14 -4 14 33 7 42 -1 -35 -37 -20 -41 -59 -22 1 -2 -40
7761d0M5k4l0Q8n3L7m2M8j7n1M4j9m0M9kJ8K6l8nmL4n9K1j0J1j6J6m3Q6m9M2N
$$ -40 5 -19 -49 39 -14 23 -19 29 12 -39 5 -14 -54 -5 -7 11 37 -1 -6 -10 24 -35 -14 -24 -13 -29 -13 -56 30 -19 23 28
7793B8n3R3o7l6M6k9K3l7L2n1J0Q3p4O2o5M9k3O8Lj18R4m9K7l6Ql2K0M5l6M2p
$$ 28 -25 68 1 -35 11 -18 5 -32 0 -51 -41 42 -32 30 -35 14 -9 59 62 -56 38 -11 16 -20 -12 -44 -24 21 -15 27 20
7824B0o3L9J3Q1p7l1M5pOk6j2L6%k6l3J2L1K9p3K9j4K8k1M4rl5K5Mj4k0j3Q6n3
$$ 20 -43 -4 9 90 13 -18 27 20 26 0 -12 24 24 -2 -35 -23 8 37 -36 -7 -21 7 -14 30 21 -14 11 15 1 -19 -32 54 1
7857AJ5J2l1k7K5pk0K3J7m0oM6rJ9N2r3k6M9K1m0N5p8K9k5O2k7OK3k9L8m7K8l
$$ 1 16 28 -3 -30 -5 -12 -32 -9 8 -32 -38 8 -1 18 70 -23 -49 0 21 -19 36 -42 -13 -38 24 -3 3 26 -3 35 -12 16 13
7890A3j7N7m4j8O8m6mk7N6j3o0O0j8KOk1k7N8j5k0K4j5M5o0K6m7J0L8L1n8j3L1
$$ 13 -4 53 9 -9 59 13 9 -18 38 25 -35 25 7 9 15 -6 -33 25 10 -10 14 -1 44 -16 10 -37 -27 11 42 -16 -29 2
7922Bk5Mm1P7l5J0J9K3k9mJ6l5L6o3L9M5m6M7m0M2m8kl4N8m1K5J4k6M0Pp9kK7
$$ 2 -23 -19 -60 17 -18 -8 11 34 5 1 17 -18 18 -45 -6 39 -7 40 0 42 -6 -8 -42 16 -25 0 14 -12 28 35 -44 -46 -19
7955a9O5k7n8J2K3j2M8k3LJ2kk6Ol7M1n3K5P0q8lP7j4k8k7O4k6j3JL6k6o1M6J9
$$ -19 46 19 -39 -27 -4 -16 32 9 12 24 22 -4 2 -35 6 -47 -22 48 -40 -43 34 20 -8 -35 29 3 -10 -9 27 1 -60 -14 5
7988EK4m8K4k2J2J8o1J20l0n9l5Q7n3L5qJ9o3J1P0m5K0o5K0K7J7Rkl4k5LJ6oP2
$$ 5 29 -19 5 -17 -5 13 -48 72 42 -17 -52 35 -18 17 9 28 -35 -24 46 1 21 -44 -24 3 20 29 27 -7 -32 -29 -13 -19 53
8021E3m6Kp8P1jJ4Mk1K6k3Q2j37N2k3k1K7L2j7MK1Qk7j2M8k1n3M8J2l5k3OLm3
$$ 53 7 9 -69 2 1 15 19 -2 24 1 83 -54 -2 -25 -46 -19 13 -4 0 21 29 2 -10 38 17 -36 12 24 -11 -34 -28 -25 -68
8054f8P1K0l3j0K6k6MQK8Lnj8ml8L3mj9P3nmMk9l1k0N0NL5j8o4J0M3J6m5l9L1
$$ -68 3 23 -10 -20 6 -20 -16 -8 20 23 18 0 -4 -42 -9 -13 -32 41 36 32 36 7 -24 -44 6 11 46 28 -36 -26 17 33 -12 -51 -20
8089b0L8m4J4nlnK9j2j8K5k8KM1n3O5j1r6J21m8qM4j9L2m4j9k0M3M6l2n3L6k5
$$ -20 18 -26 -12 -17 -20 -25 4 -8 -26 -1 -29 -27 14 -39 26 15 -81 40 -8 -16 28 9 41 -3 -22 -42 1 47 15 -38 -2 -27
8121b7O0l1J3lJnk5J2lj2k0K6%L7m4K9k8KL9LK0o6Q3o0NJ5o4L0K2J6l3l8J5J8
$$ -27 33 2 15 12 13 8 -17 -5 -8 -20 -40 -14 -14 23 -21 8 -20 -18 21 24 44 -22 61 1 6 21 -43 -13 9 25 -8 -46 -31 -13
8155a3j0j0L6o5O6M9o1j0OJ3Jj1j1j9K7m1N1O%K1l2j1J4L2N1o8LrQl9oQ5p6M0
$$ -13 -23 -33 3 -62 4 53 -8 -18 -12 1 2 -9 -20 -39 -12 -53 -2 4 4 25 -7 -18 -4 28 79 11 14 5 13 -26 -32 53 -23 17
8189A7l5L9
$$ 17 -18 21
8191B1
$$ Imaginary data points
##PAGE= N=2
##DATA TABLE= (X++(I..I)), XYDATA
0@%%%%%%%%%%%%%%%%%%%%%%%%%%JmPqQqJ4k1K3k4K6l3M1m5M9n8O6p3Q2r1J03j16
$$ 0 0 0 0 0 0 0 0 0 0 0 0 0 0 0 0 0 0 0 0 0 0 0 0 0 0 0 1 -3 4 -4 4 -4 10 -11 12 -12 14 -19 22 -23 26 -32 34 -39 43 -48 55 -61
48f1J28j41J55j71J87k04K23k40K57k75K89k99L03k90K52j70jL54j120L010r048
$$ -61 67 -74 81 -90 97 -107 116 -124 133 -142 147 -152 151 -139 113 -57 -58 296 -824 2186 -6862
69f862N4052K11175m15869r3388M11434j92680k62282K97952P2681k42435J15723
$$ -6862 47190 258365 -157504 -250892 160542 -32138 -294420 3532 76213 -166222 -50499
80e0499J55759j26841j2085J19319m1351o3985M5702K1183o2988k1338P2413l378
$$ -50499 105260 -21581 -33666 85653 44302 -19683 26019 47202 -15786 -37124 35289 31911
92C1911r8512N9811R0253j30818k6171J77147o7742j45919J55957N1800j99127
$$ 31911 -66601 -6790 83463 -47355 -73526 103621 35879 -110040 45917 97717 -101410
103a01410N1348J60764j36000p9734J60997j3893j28197Q6218P9778r0862r590
$$ -101410 -50062 110702 -25298 -105032 55965 42072 -86125 93 79871 -10991 -20581
114b0581P9772k5292n2246L6892K1010n1802j2098L8585k7409m1150N2256J7698
$$ -20581 59191 33899 -18347 18545 39555 -12247 -24345 14240 -13169 -54319 -2063 15635
126A5635p2839K4567P8590o6325m4035J13156j351j16787O5936Q4751j15825k5970
$$ 15635 -57204 -32637 45953 -20372 -64407 48749 47398 -69389 -3453 81298 -34527 -60497
138f0497J24336m3624r6685R1313M1809j04204K2747Q9161o7679m3589Q9040j3399
$$ -60497 63839 20215 -76470 14843 56652 -47552 -24805 64356 -3323 -46912 42128 28729
150B8729q2256N8998M4426q6038N915Q3899n4800n3375R0989Q321r4975M8630
$$ 28729 -53527 5471 49897 -36141 -30226 53673 -1127 -54502 36487 44808 -50167 -1537
162a537P5460q7980k8959J00993k8113r0419O4363M4461r1262k776Q1477m0962
$$ -1537 73923 -14057 -43016 57977 29864 -60555 3808 48269 -42993 -45769 35708 -5254
174e254n3461O7408J5028o6855K8982N2461n1086j5233O2873j9488n2560M9681
$$ -5254 -58715 8693 23721 -43134 -14152 38309 -12777 -28010 34863 15375 -37185 12496
186A2496K8024o4603N685O1520l7983m1975N7529J2889n9931J5528M6313l6378
$$ 12496 40520 -24083 -18398 43122 5139 -36836 20693 33582 -26349 -10821 35492 -886
198h86k4900M4112p1m1207J8595K4353l2559n520L4986j3267k8180K8380J4456
$$ -886 -25786 18326 18255 -22952 -4357 19996 -12563 -18083 16903 3636 -24544 3836 18292
211A8292l7189N584L8762k6005k7790M2886O810m8754J9741M1605m2531k1755
$$ 18292 -18897 -13313 25449 -556 -28346 14540 21350 -27404 -7663 33942 -8589 -30344
223c0344N6071m897n4062L3376L7878n3123j1296N6710j7975m4839L8304J9953
$$ -30344 25727 20830 -33232 144 38022 -15101 -26397 30313 12338 -32501 5803 25756
235B5756m7058O826L9562l0385j9647M2422q277l9557L4745K2387n0470N108N2245
$$ 25756 -21302 -14476 25086 -5299 -24946 17476 9199 -30358 4387 26774 -23696 -18588 33657
248C3657l2621l7360N5183J3202o2685J7754N5082m3206l1964N6749K273n4394
$$ 33657 1036 -36324 18859 32061 -30624 -12870 42212 -994 -32958 23791 26064 -28330
260b8330K2386L6163l8717j3823L9014j0166k9640K4291J1680k7264O817K0205
$$ -28330 -5944 30219 -8498 -22321 16693 6527 -23113 1178 12858 -14406 -7589 12616
272A2616j8505o515K2497n484j7504J5793R774k0817K64K1690r429j7961J6586
$$ 12616 -5889 -12404 10093 4609 -12895 2898 12672 -8145 -7881 13809 4380 -13581 3005
285C005J1900k0876m518K3401k337k3791Q996K0733j5886j5247J9406P091k1034
$$ 3005 14905 -5971 -10489 12912 10575 -13216 -4220 16513 627 -14620 4786 11877 -9157
298i157q02J8240n332j3206R280O475j0146O87P197n249m92O612o283l222J2080
$$ -9157 -9959 8281 2949 -10257 -977 5498 -4648 -3961 3236 -2013 -2505 4107 -2176 -5398 6682
313F682k112j3206R581J0301j6223k712J9406o191j6034J3803P924j6831J199
$$ 6682 4570 -8636 945 11246 -4977 -7689 11717 5526 -10508 3295 11219 -5612 -4413
326d413J4329q922q514J1215k75r649O681K846r464M305N655r761J783J0168r350
$$ -4413 9916 994 -7520 3695 3420 -6229 452 3298 -6166 -1861 3794 -5967 -4184 5984 -3366
341c366n585J4826j473j4426J1146J0976j6820k831J8340n309j4061J0870O860
$$ -3366 -8951 5875 4402 -10024 1122 12098 -4722 -7553 10787 5478 -8583 2287 9147
354I147j2200r20Q799k825m125K730o88k85K644l714j783O346j659p560M315N895
$$ 9147 -3053 -3973 4826 2001 -2124 606 -82 -367 2277 -1437 -3220 3126 1467 -6093 -1778 4117
370D117o291l768O281J266n829J044N418j117l053J786K603J72j778r25L474R11
$$ 4117 -2174 -5942 339 1605 -4224 -3180 2238 1121 -1932 -146 2457 2629 851 -74 3400 4311
386D311o518o7Q060m085r063P960N831j2250J16J3272o474q838J0894J961j0094
$$ 4311 -2207 -2274 5786 1701 -7362 598 6429 -5821 -5705 7567 1093 -7745 3149 5110 -4984
401d984N211M826q848K299O248r457j0J1643q231q585J4530J676j5284P182J2458
$$ -4984 227 5053 -3795 -1496 4752 -4705 -4715 6928 -1303 -9888 4642 6318 -8966 -1784 10674
416A0674j1924n668J3284k40j0437L736N102m992j788K280l32L87l97k402J607
$$ 10674 -1250 -6918 6366 6126 -4311 -575 4527 -465 -2253 27 -305 82 -315 -2717 -1110
431a110K667j917j878K251K385k632l255M640L589p329j930R537k152r526P619
$$ -1110 1557 -360 -2238 13 2398 -234 -3489 1151 4740 -2589 -4519 5018 2866 -6660 959
446I59O672j1505j141J1506m464p938P708L406p766j196N722R38n474r29O632
$$ 959 7631 -3874 -5015 6491 2027 -5911 1797 5203 -2563 -3759 1963 2901 -2573 -3502 3130
461C130r92q149N413O599r682k71J0470q609m953J4794o420j2495J8464R53k3531
$$ 3130 2138 -6011 -598 6001 -3681 -3952 6518 -2091 -7044 7750 1330 -11165 7299 8252 -15279
476a5279J5352J7769k7590k495L0604j4500k2601K5839Q301k7614N745K0233j4615
$$ -15279 73 17842 -9748 -12243 18361 3861 -18740 7099 15400 -12214 -6469 13764 -851
489h51r854J5516N98j1530M321O517o400k530P125j474p175O755N178j2093N08
$$ -851 -10705 4811 5409 -6121 -1800 4717 -1683 -4213 2912 1438 -5737 1018 6196 -5897 -5389
504e389J5053r270j2400J8546M501k3185P760K0796j9008j0979K4993j953k2838
$$ -5389 9664 394 -12006 6540 11041 -12144 -4384 16412 -2596 -13575 11418 9465 -13373
517a3373J2205J3773j6558l601J4204l783r173N488L058l557O23J33j492J832
$$ -13373 -1168 12605 -3953 -7554 6650 2867 -6306 -818 2240 -1317 -694 -561 -2053 -221
531b21o9k418J820K627j246k935L85N678j89p813M882R232j1291o655J7212p60
$$ -221 -290 -2708 -888 1739 493 -2442 -2057 3621 3432 -4381 501 9733 -1558 -8213 8999 8239
547H239j9349J0455J4292j9976n041K1982p166j6336J5547M764j6822O611J0485
$$ 8239 -11110 -655 13637 -6339 -11380 10602 3436 -12900 2647 7411 -9411 -2800 7685
560G685j1989J60J0945r143m283J3085m440j0471J1815M235j5059L067J4401q541
$$ 7685 -4304 -4144 6801 -2342 -6625 6460 2020 -8451 3364 7599 -7460 -4393 10008 1467
574A467j0526J2904O095j5629j018J6489n251j4921J1080R748j5631k714J5366
$$ 1467 -9059 3845 9940 -5689 -6707 9782 4531 -10390 690 10438 -5193 -7907 7459
587G459n057j0745J0624K667j1622N792O714j1244J934J1414j0673o111J5161
$$ 7459 2402 -8343 2281 4948 -6674 -882 5832 -5412 -3478 7936 -2737 -8848 6313
600F313k098j4250J0538R645j4745k450J5221l647j1253Q142O540r666k894Q604
$$ 6313 4215 -10035 503 10148 -4597 -7047 8174 4527 -6726 1416 7956 -1710 -4604 4000
614D000k77p333K165N179m851l252N687L38m809L042K054n450J936N410n662k221
$$ 4000 3723 -3610 -1445 3734 -1117 -4369 1318 1656 -3153 -111 1943 -3507 -1571 3839 -1823 -4044
630d044Q667l005r039Q508O275j2337j52J3765o801j1299J2915O063j5630J727
$$ -4044 4623 1618 -7421 1087 7362 -4975 -5127 8638 1837 -9462 3453 9516 -6114 -4387
644d387J4439r469r204J3756Q78j3364O846P595j2080K19J1731q096p224J2958
$$ -4387 10052 583 -8621 5135 6013 -7351 -505 7090 -4990 -4771 6960 -1136 -8360 4598
658D598l06j4045Q367J1076j4240m197J7326l725j5979J1843J1053j7109k296
$$ 4598 4292 -9753 -1386 9690 -4550 -8747 8579 4854 -11125 718 11771 -5338 -7634
671g634J8661p226j5021J5001O448j8066L632J4858j1904p451J4775k191j2351
$$ -7634 11027 3801 -11220 3781 10229 -7837 -4205 10653 -1251 -8702 6073 3882 -8469
684h469R266N714j2418J760J0837p983o227J1326N18j1838N054J0333r219o459
$$ -8469 797 6511 -5907 -4147 6690 -1293 -7520 3806 4324 -7514 -2460 7873 -1346 -7805
698g805J2776J595j4144M554J2687r670p651J2879R50j2541M955Q428q269k728
$$ -7805 4971 6566 -7578 -3024 9663 -7 -7658 5221 6171 -6370 -1415 7013 -1256 -3984
712c984P949k812m787N528J8n690L724L201o582j49P532l195p088O269N285q890
$$ -3984 3965 1153 -3634 1894 1912 -3778 -54 3147 -3435 -3584 3948 753 -6335 -66 5219 -3671
728c671j677J0710k350r873P156P114j0417j597J1237l978q570Q233L160r496
$$ -3671 -5348 5362 3012 -6861 295 7409 -3008 -4605 6632 2654 -5916 2317 5477 -4019
742d019K550P036p057k275Q241l613o153P777J041r688M699P722r661k994J2077
$$ -4019 -1469 5567 -1490 -3765 4476 863 -5290 2487 3528 -6160 -1461 6261 -3400 -6394 5683
757E683l043j1301Q887P369j2212j090J2849n066r571R890M234j1205J929R209
$$ 5683 2640 -8661 226 7595 -4617 -5707 7142 2076 -7495 2395 6629 -4576 -2647 6562
771F562o611m579Q635r79p644N266M002p885O06P567n150n394P929J289r023K962
$$ 6562 -49 -4628 4007 3028 -4616 650 4652 -3233 -2627 4940 -210 -5604 2325 3614 -5409 -2447
787b447P976o829m981R439P99r615L750P832p217l934R031l21p995M191N393o400
$$ -2447 5529 -1300 -6281 3158 3957 -5658 -1908 5924 -1293 -5227 3804 3483 -4512 -321 5072 -1328
803a328j609O598k010m676M277J336m917J872L540m738j110N852k381n639N547
$$ -1328 -2937 3661 1651 -3025 1252 2588 -2329 -457 3083 -1655 -2765 3087 706 -4933 614
818F14L557q023k67Q925l552p551P214M638r160l51R063l580o417O512K548p020
$$ 614 4171 -3852 -4119 4806 1254 -6297 917 5555 -3605 -3956 5107 1527 -4890 1622 4170 -2850
834b850J710N246m724j760N687k503m259N668Q04o986L081N694o946k834Q900
$$ -2850 -1140 4106 -618 -2378 3309 806 -3453 2215 3019 -3967 -886 4808 -2138 -4972 3928
849C928j557q629N586O177q581j926R595k510p811O329M432p928l5P576l787m767
$$ 3928 2371 -6258 -672 5505 -3076 -5002 4593 2083 -5728 601 5033 -2895 -2930 4646 859 -3908
865c908O131J050o180K743L990n123q15N331k633l920M934R03n920J833N059m488
$$ -3908 2223 3273 -2907 -164 3826 -1297 -2112 3219 586 -3334 1600 2503 -3417 -1584 3475 -1013
881a013l189N859P07o116J804N373l556l628M938J632m995P05M416k178k965L261
$$ -1013 -4202 1657 2364 -3752 -1948 3425 -131 -3759 1179 2811 -2184 -1479 2937 759 -2206 1055
897A055J212l307N94K482j911r81K178q79j574K142o2k896J964K030l772l75M173
$$ 1055 2267 -1040 -446 2036 125 -856 1322 443 -1131 1011 949 -1947 17 2047 -1725 -2100 2073
914B073j716l775L559K289m501k40M455j439l207K635J653k504j30J969o20p80
$$ 2073 357 -3418 141 2430 -2071 -2311 2144 705 -2502 133 1786 -718 -848 1121 501 -279
930b79Q73l34l57J178o65j366J852Q42l032J61L490j833l273L093K088m224o01
$$ -279 594 260 -97 1081 416 -950 902 1744 -1288 -1127 2363 530 -2743 350 2438 -1786 -2387
947b387M158j261l187K534J546k863M28K286j561n31K130j114j375K590L2k883
$$ -2387 1771 510 -2677 -143 1403 -1460 -1032 1254 -307 -838 1292 178 -1197 1393 1425 -1458
963a458J940K040l245o58L567j216k941K354J453l177j95K886j061k220J638J198
$$ -1458 482 2522 -723 -1381 2186 970 -1971 383 1836 -1341 -1536 1350 289 -1931 -293 905
979I05j718n43J684K73j580L24J349p13o18J068J29n45L87j81m90J147j15j431
$$ 905 -813 -1356 328 601 -979 -655 694 -19 -637 431 560 15 402 221 -269 878 763 -668
997f68J139J287k348o19K900o73k728J677J838k510j020K365M14k253n7J928l99
$$ -668 471 1758 -590 -1209 1691 1018 -1710 -33 1805 -705 -1725 640 1054 -1199 -1256 672 273
1014B73j650O82J455p91q47O61M67k11J06l50L07J024j285j133K848L04l600J568
$$ 273 -1377 -695 760 -31 -878 -217 250 39 145 -205 102 1126 -159 -1292 1556 1860 -1740 -172
1032a72L343l775j917M717k29m362J974K692l210r86K644n29j119O02m11L36Q99
$$ -172 3171 -604 -2521 2196 1967 -2395 -421 2271 -939 -1925 719 190 -929 -327 -738 -402 497
1049D97j483K26K215j283j660J923R19j537m5J024J81o77r88J047J617k242j198
$$ 497 -986 -760 1455 172 -1488 435 1354 -183 -228 796 977 300 -688 359 1976 -266 -1464
1066a464L171p18l455K525J927l205P8K116j572m68J305j043M58J294k412K26
$$ -1464 1707 989 -2466 59 1986 -1219 -1141 975 -597 -1065 240 -803 -345 949 -1463 -1237
1082a237L217k311j694L986o24l679K772J762l119O28K077j814m27J229p69K73
$$ -1237 1980 -331 -2025 1961 1337 -2342 430 2192 -927 -299 1778 -36 -463 766 -3 270
1098B70O27j442K75J301j681m05K051o20j615Q49M27l93ol43P14P78j890j97K731
$$ 270 897 -545 -270 1031 -650 -1055 996 376 -1239 -390 37 -356 -362 -705 9 787 -1103 -1300 1431
1117A431p96k414K289J502l047k8K950j220j886J839N16j630M01P19o24J39J28
$$ 1431 635 -1779 510 2012 -1035 -1063 1887 667 -1219 620 1136 -494 -93 626 2 141 269
1134B69q07L86O86j070k56J421l72j443O71J150p74q70J002Q82j171q49J755N18
$$ 269 -538 -152 534 -536 -792 629 257 -1186 -515 635 -139 -1009 -7 875 -296 -1145 610 1128
1152A128j998L84J947j205j316J771L98j676N54P75r62K53M10j020O87R46j991
$$ 1128 -870 -486 1461 256 -1060 711 1109 -567 -13 762 -200 53 463 -557 130 1076 -915
1169i15j95K438j273j939K150J041k560k02K582p16j919J285J326j417n99J413
$$ -915 -1110 1328 55 -1884 266 1307 -1253 -1455 1127 411 -1508 -223 1103 -314 -913 500
1185E00K80j068L21P82p83j31R91o84m04J205p27j322J595M91k371P46K070k153
$$ 500 780 -288 33 815 32 -99 892 208 -196 1009 282 -1040 555 1046 -1325 -579 1491 -662
1203f62j374K917jk980J355K325k350r45K656Q4k389R39J977j439j159J882L24
$$ -662 -2036 881 880 -2100 -745 1580 -770 -1715 941 1025 -1364 -425 1552 113 -1046 836 1160
1220A160j754N72J230j166l32J225q16p33J499m70j807J707J010k893K93L128
$$ 1160 -594 -22 1208 42 -290 935 119 -614 885 415 -1392 315 1325 -1568 -1275 1853
1236A853k039k338L076J097l540N40L178j651k120K425Q58k342M85J725j097o92
$$ 1853 -186 -2524 552 1649 -1891 -1351 1827 176 -1944 481 1339 -1003 -518 1207 110 -582
1252e82J355l33r32J176qj471R88J212k032l82K489r68k424K033J626l007m21
$$ -582 773 440 -492 684 676 -795 193 1405 -627 -1009 1480 512 -1912 121 1747 -1260 -1681
1269a681L172r88k747K179J678k735l45K741r82j783J993O25k030P31J508j716
$$ -1681 1491 503 -2244 -65 1613 -1122 -1467 1274 292 -1491 502 1127 -903 -172 1336 -380
1285c80l23K133r96j697K139M61k689J046K217k304j322K865j78k810J510J959
$$ -380 -703 1430 434 -1263 876 1337 -1352 -306 1911 -393 -1715 1150 972 -1838 -328 1631
1301A631k490q00K688n11k110J431J431k011l25K110o42j501J507O13j643L59
$$ 1631 -859 -1659 1029 518 -1592 -161 1270 -741 -1066 1044 402 -1099 408 1021 -622 -263
1317b63J521j205q03J676k93j598J336Q04k013K36J980j618j345K334K27k454
$$ -263 1258 53 -750 926 633 -965 371 1175 -838 -602 1378 -240 -1585 749 976 -1478
1333a478Q07J990j728j138K094J73j928P49J345j100l70J193l89o50P94K51j098
$$ -1478 -671 1319 -409 -1547 547 720 -1208 -459 886 -214 -584 609 220 -430 364 615 -483
1350d83O68Q96j387k62J844p25j888J698J143k437j94K506j044k082J976Q85k375
$$ -483 185 1081 -306 -568 1276 551 -1337 361 1504 -933 -1127 1379 335 -1747 229 1114 -1261
1367a261M47J860j368p27J670n31j148J444J97j547Q95J290j594k90J874n96j526
$$ -1261 -814 1046 -322 -1049 621 90 -1058 386 583 -964 -69 1221 -373 -663 1211 615 -911
1384i11J079J169j601o04J929j61k104R39J765k026q95K402m61k272J756J165
$$ -911 168 1337 -264 -868 1061 900 -1204 -265 1500 -526 -1421 981 520 -1752 4 1169
1400A169k403L78J966j656o38K316j053j439K273j00k179J552J419k264j4K150
$$ 1169 -1234 -856 1110 -546 -1184 1132 79 -1360 913 813 -1366 186 1605 -659 -673 1477
1416A477j158j351J663M43j581L2J190l36j012M29R10q34r75J354K91j575N89
$$ 1477 319 -1032 631 1074 -507 -475 715 379 -633 -204 706 -128 -1103 251 542 -1033 -444
1433d44J214j384k42J658r95p35J828n36j763K013O93k637J133K224k539p80K988
$$ -444 770 -614 -856 802 -193 -928 900 364 -1399 614 1307 -1330 -197 2027 -512 -1292 1696
1450A696q94k249J823J068k167o6J645m89j082N32N39m32m66M50L20p15J04O08
$$ 1696 802 -1447 376 1444 -723 -789 856 367 -715 -183 356 -76 -542 -92 228 -487 -383 225
1468B25o43j04J292r40r18K058k54k341J970J608l065P4L273j928k168L065K68
$$ 225 -418 -522 770 -170 -1088 970 716 -1625 345 1953 -1112 -1038 2235 307 -1861 1204 1472
1485A472l143J445J825k235k51J785r12q62J121Lp79M65K21n68J09N12k17n58
$$ 1472 -1671 -226 1599 -636 -887 898 -14 -876 245 248 -531 -66 155 -413 -304 208 -9 -567
1503e67L48P39o82n18J351J42j868R81J641j992n31K537j066k118K169P20k380
$$ -567 -219 520 -162 -680 671 813 -1055 -74 1567 -425 -956 1581 515 -1603 566 1286 -1094
1520a094O94J630j758m17J771q69q15J367l64j073J133J98j142P65M86q94j43
$$ -1094 -400 1230 -528 -945 826 -43 -858 509 145 -928 205 403 -739 26 512 -382 -525
1537e25O84P3k82j42M02L51q56q4J410n98j424J587N80k320P99J759j880o11K137
$$ -525 159 232 -50 -192 210 561 -295 -379 1031 433 -991 596 1176 -1144 -345 1414 -466 -1077 1060
1556A060r74j339J774r2j612J412M76j896R12J366j812k28J959r01j167J348M70
$$ 1060 86 -1253 521 429 -1183 229 705 -1191 -279 1087 -725 -953 1006 105 -1062 286 756
1573G56j090J14Q21q8n53p2N93P5q98L11P57q87m62J085l94p51R83j73j058J124
$$ 756 -334 -220 601 513 -40 -112 481 556 -342 -31 726 -161 -623 462 68 -683 300 127 -931 193
1593A93K34j469R96J041j859o3K068j121j246K005K5j904J073J123j401L8J125
$$ 193 427 -1042 -46 995 -864 -927 1141 20 -1226 779 804 -1100 -27 1096 -305 -267 858
1610H58q18m31R40k85n32O72j33p22M64K49n61M1N02l10m55L35L32k00l63L86
$$ 858 40 -391 549 264 -268 404 271 -451 13 262 -299 -258 244 -66 -521 -186 146 -54 -417 -31
1630c1L91p64j48J020k39q02O44N21r26M6R93n25m92P04j64m91M50O8n31L26K12
$$ -31 360 -404 -552 468 229 -573 71 592 -334 -288 705 180 -312 392 228 -263 187 255 -276 50 262
1651B62o44K07N76n94l91R29j24q75M25P50o81n45R14K51q91OQ40j91o88N65M39
$$ 262 -382 -175 401 -193 -584 345 221 -654 -229 521 -160 -705 209 460 -431 -425 415 224 -464 101 540
1672E40n42k09N28m2l36K33r6q7J92j79l48O21J54j027J57J113o82q82J091L85
$$ 540 -2 -211 317 275 -61 172 76 -11 181 2 -346 275 429 -598 -441 672 -10 -892 199 584
1692E84j288J00J154m72o75P51J99p03J49M41k11O6K18l08n8N08k54m78N97K04
$$ 584 -704 -604 550 78 -597 154 353 -350 -201 240 29 95 313 5 -53 455 201 -277 320 524
1712E24q96N6Q83m73p45P88K83j050K87P84n27m37N75J23n14K53K52k63r2K55
$$ 524 -372 -316 567 94 -651 137 420 -630 -343 441 -86 -523 52 175 -339 -86 166 -97 -189 66
1732F6o1q8J64k5l1J19M0r5K0J06o9k16K28J40l04j85L72j33m48J91M50m70k85
$$ 66 5 -83 81 56 25 144 184 89 109 215 146 -70 158 298 -6 -191 181 48 -400 -209 241 -229 -514
1755e14O27P7o92L15N25m14k91M85M9l65K32J95l48K41J25m04K39M27n34k10O89
$$ -514 113 190 -502 -187 338 -76 -367 118 167 -198 34 229 -119 122 247 -157 82 509 -25 -235 454
1776D54j90o74N21L83o94j92N91r0n28K10L48l58j37L83O5k69J74Q9k45J50K88
$$ 454 264 -410 111 494 -200 -392 199 109 -419 -209 139 -219 -356 27 92 -177 -3 86 -159 -9 279
1797B79m01J7N19m77l51Q08J0q57M46P13q88k16R48k77p83O15K47o57K30L43m88
$$ 279 -122 -105 414 -63 -414 394 404 -453 -7 706 -182 -398 550 273 -510 105 352 -305 -75 268 -220
1818b20L7K50l19j4M27j93l03M24O2l36P9L87j95k59K83J88k14k24M23O1o08K13
$$ -220 -183 67 -252 -266 161 -32 -335 89 151 -185 -106 281 86 -173 110 298 84 -140 283 344 -264 -51
1840e1M43m18j73N23j63m97L61J85m43O1J47j92M1K99l45j1M24k84k61N44R4m82
$$ -51 392 -26 -199 324 161 -336 25 210 -233 -172 -25 -217 -176 123 -222 -233 191 -93 -354 190 284 -198
1862a98J43L55j26k76K44K11k57k87L70K51n68j21P19l90o31O63K42p75K71M47
$$ -198 -55 300 174 -102 142 353 96 -191 179 430 -138 -259 460 70 -561 102 344 -431 -160 287
1882B87o05P6N50n26k32R09n20o70J110O4j172O28R01j100k10J164l15p83O29
$$ 287 -318 -242 308 -218 -450 459 -61 -731 379 443 -729 -101 800 -300 -510 654 339 -444 185
1901A85L35o25k7N02k32k79J10J44j25j15J76J6l19K18J17m27K88L23o26j42R87
$$ 185 520 -105 -132 370 138 -141 -31 113 -12 -127 49 65 -254 -36 81 -346 -58 265 -361 -503 484
1922D84l85q34R33M28j262L20J169q39n52J052j36q57P22K85p28J54M05m94jL31
$$ 484 99 -735 198 626 -636 -316 853 14 -538 514 378 -479 243 528 -200 -46 359 -135 -136 195
1942A95j90j72K31o9j89J27N1jj81K5K69r1l60M59K47q35K69Q14o86l72J074k60
$$ 195 5 -167 64 -5 -194 -67 -16 -17 -198 -173 96 5 -355 104 351 -484 -215 599 -87 -459 615 355
1964C55r96Q51M67j005J04Q90o66m67Q52j49o13M29J77n58J67L60m38m0M33r2
$$ 355 -641 210 677 -328 -224 666 0 -467 385 236 -377 52 229 -329 -162 198 -240 -280 153 61
1984F1m28L50L74m12k16N74N5p26K51P56n98m90Q62k0q67M62N76q77M5P95n85
$$ 61 -367 -17 357 -55 -271 303 358 -368 -117 639 41 -449 413 393 -474 -12 564 -313 -268 527 -58
2005e8l59Q52l49o11P81J08j023N70N66r08p5R33l63n94N76K13n44J89L52j61
$$ -58 -417 435 86 -525 256 364 -659 -89 477 -431 -506 427 64 -530 46 259 -285 -96 256 95
2025I5j30K1Q3N9n8k9J50j18p6K15j65j77M08k38m13N13R2p17L72N94q33j60Q75
$$ 95 -35 -14 69 128 70 41 191 73 -3 212 47 -130 278 40 -373 140 232 -485 -113 481 -352 -512 363
2048C63l94n94P95J20p80M45M34n55P1N04l70j18L36o5k07J60k0j28j2O0j1jj31
$$ 363 -31 -625 170 290 -490 -45 389 -166 -95 409 39 -79 257 192 -15 145 125 -3 -15 45 34 33 -98
2071i8Q9O1k74K17K52n28L2O63n35m60Q62n4q91O55O18r80J07Q17o19l42Q44j64
$$ -98 -9 52 -222 -5 247 -281 -249 414 -121 -581 281 227 -664 -9 609 -371 -264 553 -66 -408 436 272
2093B72o05N96M0p08N23L71q15J85O28n71m18P84K3p07K49M10l91j81K90K58l24
$$ 272 -333 263 303 -405 118 489 -326 -141 487 -84 -502 282 305 -402 -153 257 -134 -315 -25 233 -91
2114i1k01L14R0k81O0L56k44j61K99j09o6L01j35m10N00N7o00L27M61o18k32P48
$$ -91 -292 22 112 -169 -109 247 3 -158 141 32 -34 267 132 -278 222 279 -321 6 467 -151 -383 365
2136C65j37o37L80L47n44o3M20j08k85J96J47k12l5J38Q6n5k6J15q5m3J80J0k28
$$ 365 228 -409 -29 318 -226 -289 131 23 -262 -66 81 -131 -166 -28 58 3 -23 92 7 -36 144 154 -74
2159g4K05pk59J67K48l80n3M52k27l95M08J83o12J08N86l99m18N36R6m66J56L87
$$ -74 131 124 -135 32 280 -100 -153 299 72 -323 85 268 -344 -236 350 -49 -467 69 165 -301 -145 242
2181B42l10j24L15k6k38K33J19k91J22J90l49k2M71k54m55N25K15o57J28O37m49
$$ 242 -68 -192 123 97 -141 92 211 -80 42 232 -117 -139 332 78 -377 148 363 -294 -166 471 22
2202B2m39O22N5n67J86L94l48k30L97j02k21L00k4k09K27oj34J45J80k43j32K66
$$ 22 -417 205 260 -307 -121 273 -75 -305 92 -10 -231 69 45 -164 63 57 -77 68 248 5 -127 139
2224A39J13k95m8K79o3l28J25L25l22j60L68Nm41K33K51l20JK09j33j41K06mj76
$$ 139 252 -43 -91 188 125 -203 -78 247 -75 -235 133 138 -303 -70 181 -139 -138 71 -62 -203 3 -1 -177
2247a77J90J3j63J87J75j95q9K23O9l45J80J08j64j11J91j1k09k4K84j97j55K54
$$ -177 13 26 -137 50 225 30 -59 164 233 -112 68 176 12 -99 92 81 -128 -152 132 -65 -220 34
2269C4P0k06jJ66k15L3J72j20j25K49m3k31K77J78l58Q2L02k27k12M79%m82K19
$$ 34 104 -102 -103 63 -152 -119 53 -67 -192 57 14 -217 60 238 -120 -38 264 37 -175 304 304 -178 41
2292D1J97l74J1L40j65k61K78j5k61J77J00j74K2Q3j21kL23k35k18K76J20k95
$$ 41 238 -136 -125 215 50 -211 67 52 -209 -32 68 -106 -84 -1 -122 -124 199 -36 -254 22 142 -153
2314a53J07K20j05k34K11J72j71j26J89O1k64J03Q6m1j43J16l6J6J1n3j7J28j22
$$ -153 -46 174 69 -165 46 218 47 -79 110 171 -93 10 96 55 -88 28 -8 8 19 -34 -51 77 -45
2337d5j25K56Qk26N6J67p9j63J41J35j45o5Q8J27o6j64K50l9k04J42O4q2n9Q9
$$ -45 -170 86 94 -132 -76 91 12 -151 -10 125 -20 -85 3 130 64 -100 150 111 -93 49 113 31 -28 61
2361F1p5q2J04p0q7J94j13o1J52J40l12J4L04k69j20L51L4l44J61K23k19p5K95
$$ 61 -14 -96 8 -62 -149 45 -68 -129 23 163 -149 -135 169 -100 -220 131 165 -179 -18 205 -14 -89 206
2384B06m3k81J12K66k91j3K05j40j62J89L8j71N8J28k41L2J99j25j68K16J10m02
$$ 206 163 -118 -6 260 -31 -44 161 21 -141 48 86 -85 -27 101 -140 -108 91 -34 -202 14 124 -278
2406b78J47M11k92k94M21R8m41J54L67k86j25L30r0k36J65K6j82J22J09l14J90
$$ -278 -131 280 -12 -306 115 213 -228 -74 293 7 -118 212 122 -114 51 77 -105 17 126 -188 2
2427BJ32k12n7K16j61q8J36N5r3q5J41J34j97q2K71Jk36J8K72j35r3K33n0k33
$$ 2 134 -78 -135 81 -80 -168 -32 23 -70 -155 -14 120 -77 -159 112 113 -123 -105 167 32 -61 172 122 -111
2451a11K63Mk64J46Q2k76J04K23k31j07K78m7k46J74J43k28j7J87j9k00J72M5
$$ -111 152 156 -108 38 120 -156 -52 171 -60 -167 111 64 -182 -8 135 -93 -110 77 58 -142 30 75
2473G5j12q0J50M2j66J41O1j84qK44j24j29K28ml66K58J96m12J41L10l53j41L85
$$ 75 -37 -117 33 75 -91 50 111 -73 -81 163 39 -90 138 134 -232 26 222 -190 -49 261 -92 -233 152
2496A52n9l67K97J86m21J16K98k42k07L64n5j73J38Q8j17J1N0j2l2K1Q4o0m1M8
$$ 152 93 -274 23 209 -212 -96 202 -40 -247 117 62 -111 27 115 -2 9 59 47 15 36 120 60 19 67
2520F7j9j15R1L2j80K5K83k10j84K85ml70K18K49k47l5K21j83pJ94q3o2J33m0
$$ 67 48 -67 24 56 -124 -99 184 -26 -210 75 71 -299 -81 168 -79 -114 107 -76 -83 111 28 -34 99 59
2544E9j37J27J12k26oK36j08j07P6O4n9r5L3Q2q8j89L02M4m17J85L02l33p3L57
$$ 59 -78 49 161 -65 -71 165 57 -50 26 90 31 -64 -31 51 -37 -226 76 120 -297 -112 190 -143 -216 141
2568A41j55j31K91n3k66K53J34l60R0L10l16j03M66k18k87K35K03l19K0L01k36
$$ 141 -14 -145 146 93 -173 80 214 -146 -56 254 -62 -165 301 83 -204 31 234 -85 -65 236 0
2589@j49J77O4k16L3J80r2j43R1J30j83K2K12j36j18K16Kj71J40O8k01N6K49k99
$$ 0 -149 28 92 -124 -91 89 -3 -146 -55 75 -108 -86 126 -10 -128 88 90 -81 59 127 -74 -18 231 -68
2613f8m0K92j23k82K72J66l64J1L79k30k62K97N6k40K0K20j41q2J62m0l3N6L7
$$ -68 -108 184 61 -221 51 217 -147 -136 243 13 -249 48 104 -136 -116 104 -37 -119 43 3 -30 26 63
2636F3j21J04L4j03k1J52J6k04L7K58j92j94K61O7k75M4K31j67j78K23K9k32O9
$$ 63 -58 46 80 -23 -44 108 124 -80 -43 215 23 -171 90 157 -118 -74 157 -10 -188 35 64 -168 -99
2659i9K10j87o6J95k5k41K44J28l11J37J57j96m0K79j80j27J84J44k92P7K36k11
$$ -99 111 -76 -142 53 28 -213 31 159 -152 -15 142 -54 -94 185 5 -122 62 206 -86 -9 227 16
2681A6j25K78n3k60J40J48j57j05K11j08j71J96N2k26J05J39j11j47K59rj98J69
$$ 16 -109 169 116 -144 -4 144 -13 -118 93 -15 -186 10 62 -164 -59 80 -31 -178 81 72 -126 43
2703D3J38k49pK49j23j71J85J21k84R0J39p7j96J92M0j89L2J87j35j05J23j5j10
$$ 43 181 -68 -75 174 51 -120 65 186 -98 -8 131 54 -142 50 90 -99 -67 120 -15 -120 3 -12 -122
2726a22J04J6j95J71P9p6m2J57m8j43J10J64k20MJ54j9j69N7J18j03q6J43L1j54
$$ -122 -18 -2 -197 -26 53 -23 -65 92 44 -99 11 175 -45 -41 113 94 -75 -18 100 -3 -89 54 85 -69
2750f9M8R3q5n6J03n4p3J27j0j18R2J17k21O6J75j31j47K21J32k92kK86j64j59
$$ -69 -21 72 -13 -69 34 -20 -93 34 24 -94 -2 115 -106 -40 135 4 -143 78 210 -82 -84 202 38 -121
2774a21K52j9k20Q3J15j52M3Q4j13p6J69k3j55J80M2j86L5J72j97j5J79L4k09
$$ -121 131 112 -108 -25 90 -62 -19 65 -48 -124 45 22 -133 47 89 -97 -62 110 -87 -102 77 111 -98
2797i8J13J05p9j49K05rj36M0J24m7p4Q0n0k6J7L8q0pJ33j46p6J90n2j92K20J7
$$ -98 15 120 41 -108 97 88 -48 -8 116 69 -5 75 25 -1 16 54 -26 -33 100 -46 -122 68 16 -176 44 61
2823F1j70L1J66j26o4J96k5k27J11J97j92k4J69j4j01%J08n4n2N1M7r2mL1j2k0
$$ 61 -109 -78 88 -38 -102 94 69 -158 -47 150 -42 -66 103 89 -12 -12 96 42 -10 41 88 -4 -8 23 11 -9
2849iK0k7m6P4Oj49J20J05k22j4K51q8k04J75J39k08M5J40n7j00Q5L4o7L4K4m4
$$ -9 11 -16 -62 12 18 -131 -11 94 -128 -142 109 21 -183 -8 131 -77 -32 108 51 -49 36 70 3 37 61 17
2875A7K9J8r2LN7Jj33J08O8j37j8J04Qj92J41J47k34NJ26O7j89J05N1j24M4J43
$$ 17 46 64 -28 -25 32 33 -100 8 76 -61 -79 25 33 -159 -18 129 -105 -100 26 93 -96 9 60 -64 -20 123
2901A23j92L1J59r1j25J90l2j84Q7R7j32p9K42j04r5J01l6J2k2Q5l3o2K1J29n0
$$ 123 -69 -38 121 30 -95 95 63 -121 -34 63 -69 -148 94 -10 -105 -4 -40 -28 -50 35 2 -60 -39 90 40
2926D0p7Q3M3j54J20O3j78R7R6j00m7R2j2j16O7J03k11R4P1j45p8K19l8j95J01
$$ 40 -37 46 89 -65 55 118 -60 37 133 33 -14 78 66 -50 17 120 -91 3 74 -71 -149 70 32 -163 -62
2951f2J02o2o5M1Q2m8j2R8n2n8L2K7l2N3K2o7M5Mp0L6P1q0j04J14P6j59J2J80
$$ -62 40 -22 -87 -46 36 -12 -24 74 22 -36 -4 23 -9 44 66 -1 44 48 -22 14 85 5 -99 15 91 -68 -56 124
2979A24j18j62J49O9j93J13R1j64N6N4Kq5J26m3j08J14O5j58Q2Q1r7j13J51Q3
$$ 124 6 -156 -7 62 -131 -18 73 -91 -35 19 21 -64 62 19 -89 25 90 -68 14 95 -2 -115 36 119
3003A19j15l7J02l1j50J48Pj57N3J47j03p4J41oj36J28mq8O1J32j22j10J68p2
$$ 119 4 -33 69 38 -112 36 43 -114 -61 86 -17 -91 50 44 -92 36 32 -56 5 137 15 -95 73 1
3027Ao7J73j1j22L3N4p3n5J52rj15n9J49l8j07J07K3p4k0J13m8q6P2P1r3K9M5
$$ 1 -66 107 96 -26 7 61 -12 -67 85 76 -39 -98 51 13 -94 13 36 -38 -58 55 7 -79 -7 64 -29 0 45
3054D5k0q1J58j20l3J54m9j23J16R9j89oK11j52j24K23n6j67O7J55j51n7Q1J01
$$ 45 25 -56 102 -18 -51 103 54 -69 47 146 -43 -49 162 10 -114 109 53 -114 -47 108 -43 -100 -19 82
3078H2r3l5Q0q5p0J05k2N5M9n1j4nJ18r9r8J64L1j98J01J32j54q5K53r7k12J51
$$ 82 -11 -46 34 -51 -121 -16 -38 17 66 15 1 -4 114 15 -83 81 112 -86 15 147 -7 -92 161 64 -148 3
3104CJ07j52j5K00j40p2K04j85m3J48l6j20Q4J04q7n4N2K4r9N2R1q5lP9Kq8jJ38
$$ 3 110 -42 -57 143 3 -69 135 -50 -93 55 19 -101 -17 87 0 -54 -2 22 -77 -25 66 -19 -22 57 59 -29 -30 108
3132A08r2o0N2k9l5M4R2j29o5K16p3j43J28P2j85Q1J28j62%J48j17r6J73Lj56
$$ 108 16 -44 8 -21 -56 -12 80 -49 -114 102 29 -114 14 86 -99 -18 110 -52 -52 96 -21 -117 56 59 -97
3157i7J14R6j45l0J33l8r6Q3P6j06m5R6J1j30L6J51j37k0J04j03k9J24L9j77O6
$$ -97 17 113 -32 -62 71 33 -63 20 96 -10 -55 41 52 -78 -42 109 -28 -48 56 -47 -76 48 87 -90 -24
3182b4J50j62k6J59k9j83P9J82k15J0J81n8j65J30L1j38N8J07j37k3Q3J6l3Q8
$$ -24 126 -36 -62 97 68 -115 -36 146 -69 -59 122 64 -101 29 60 -78 -20 87 -50 -73 10 26 -7 81
3206H1o1p6jJ38j26n5J85l2r8jJ50j36l3J43J3j11M6N7o8j7J11n8j09R0m4Ojj2
$$ 81 20 -56 -57 81 -45 -100 85 53 -45 -46 104 -32 -65 78 91 -20 26 83 15 -2 109 51 -58 32 -12 -6 -7 -19
3234a9k4o2J34qj05P3M5o5J0O3l7j08J47L3j37M4J44j23o0J24j6j77J27R7j29
$$ -19 -43 -105 29 21 -84 -11 34 -31 -21 42 5 -103 44 77 -60 -16 128 5 -55 69 53 -124 3 100 -29
3259b9j4J52j25q1J88j17KM3K7r2qJ63j09q0J95j31q2L6J03j05o1J87j3j38N3
$$ -29 -43 109 -16 -97 91 -26 -24 19 46 -46 -54 109 0 -80 115 -16 -98 -62 41 -64 -125 62 49 -89 -36
3284c6J02o5l6P2L5q1jK0q7L8J17p6n4J19rj41O6P0j16L0J12m0j56J48N6j33r
$$ -36 66 1 -35 37 72 -9 -10 10 -77 -39 78 2 -52 67 58 -83 -17 53 -63 -33 79 39 -117 31 87 -46 -55
3311e5J42r8l9N4J6p6N1L9n6J07p0n2K6M3j7mo9J34r6kJ00m6r7M0P7r9jJ51j12
$$ -55 87 -11 -50 4 20 -56 -5 34 -22 85 15 -37 -11 32 15 11 -58 76 -20 -22 78 32 -65 -25 52 -47 -48 103 -9
3340ij20J62k1o2M9N8p8k6P5Qr3R3Kk6o2J21p0rM4lj2j9J7Nq2Q1k8o9P6P6j35
$$ -9 -129 33 12 -50 -1 57 -21 -47 28 36 -57 36 38 12 -50 71 1 -8 36 33 21 2 19 24 -58 23 -5 -74 2 78 -57
3371e7k1J52j14k7Q7N1j22KJ73o2j42R4N8p0K8O9j20j4J20q4n5J49q1k6J8L8j08
$$ -57 -78 74 -40 -67 20 71 -51 -49 124 62 -80 14 72 2 30 99 -21 -35 85 1 -54 95 14 -12 6 44 -64
3398f4J1J12l9j24Q3M7o9J7L5K7o6k3O8p9J4Q2l8k6P3m2n3J00M8j01m4J09J3j72
$$ -64 -53 59 20 -104 -21 26 -43 -26 9 36 -30 -53 15 -64 -50 32 -6 -32 41 -1 -54 46 94 -7 -51 58 71 -101
3426a01J98l1j43M1Q2r6MJ01m7n6Q0p1LK9L1j5lM3k4m2k2K1N2o5L9J02j54O8P5
$$ -101 97 66 -77 -36 46 -50 -46 55 8 -48 32 -39 -36 -7 24 9 6 49 25 -17 -39 -18 34 -31 8 110 -44 24 99
3455I9j39l0R7k1j7N5Nj68J24J5m7p6R4M0j23N1Q4q2%J21j04K7N2l6kjKl6M2L0
$$ 99 -40 -70 27 6 -11 44 49 -119 5 20 -27 -103 -9 31 -92 -41 43 -39 -39 82 -22 5 57 21 19 18 20 -16 26 56
3485E6K2q7J8N6j02m5J29J0j27R4Q4j39k9R2p5l4J13j4r5L8K4l7P6M9j47j2J74
$$ 56 78 -9 9 65 -37 -82 47 57 -70 24 108 -31 -60 32 -43 -77 36 22 -73 -35 -11 -48 28 77 -70 -82 92
3512I2j64N2Q2K8q7lL9n4j7P4M4j39O5j4J5j9pN0m4j8J7j7qJ08l9j25J90m6j03
$$ 92 -72 -20 62 90 3 0 39 -15 -32 42 86 -53 12 -2 13 -6 -13 37 -7 -25 -8 -25 -33 75 36 -89 101 55 -48
3541d8RJ08j02J6P9kj20J19K0o5L3K9m8j05N9M8oM3p3K6l3OL7n7J3N4l3m8O0N7
$$ -48 -39 69 -33 -17 62 60 -60 59 79 14 47 76 28 -77 -18 30 24 67 -6 20 -13 -7 30 -27 -14 40 7 -41 19 76
3571G6j11J5M0q7%J66j07o6R2Lr7P2O8j32l2J92m9r0M7k6K0J8J3o5jO0j4n1L1
$$ 76 -35 -20 20 -67 -67 99 -8 -74 18 21 -76 -4 64 -68 -100 92 43 -47 0 -26 -6 12 25 -40 -41 19 5 -46 -15
3600a5L2j27N2J11p8K7O3p4MJ0N9q6K7K4L1q9L2N9l8j5M2l4j24J12l8m3M5O2l3
$$ -15 17 -110 -58 53 -25 2 65 -9 -5 5 64 -22 5 29 60 -29 3 62 24 9 51 17 -107 5 -33 -76 -31 31 -2
3629bm8J16q6l7O3N3j64O7J14j04pO8ll2K5L6o9OQ4k3q7J0M5m6K8J8k0qk9N7o6
$$ -2 -50 66 -20 -57 6 59 -105 -38 76 -28 -35 33 30 -2 23 59 -10 -4 80 57 -30 -20 25 -21 7 25 5 -3 -32 25 -41
3660d1N0N5q8j7M8L8j31Q8L6p9j4Q3m0n7M3O3r6L4R6p4k6J3J8m6N2P3o7j8Q0j29
$$ -41 9 64 -24 -41 7 45 -86 2 38 -41 -55 28 -12 -69 -26 37 -59 -25 71 -3 -29 -16 2 -44 8 81 14 -4 76 -53
3690e3K9O7Nn9MM5k9lM4p9n9J07K9o4NL4J6j05Q5K4o0lJ1k1O4N9m6p3P3o1k1M0
$$ -53 -24 43 48 -11 -7 38 9 6 50 -29 -88 19 48 -16 -11 23 39 -66 19 43 -17 -20 -9 -30 34 93 47 -26 47 -14 -35 5
3722ENj04K7Q6lj04O7Q4j26J0O1Kj05R8N6j9k4K6m1K3J4J4o6R2l7j08J10k7m6
$$ 5 10 -94 -67 19 16 -88 -21 63 -63 -53 8 10 -95 3 59 40 16 42 1 24 38 52 -14 78 41 -67 43 16 -30
3751c0l1M4N5p8J1O2q2j1J00o7j1L4N2o4qJ9rj0M8kJRL1o6l4P1M0q9J8O5n0m9
$$ -30 -61 -17 38 -40 -29 33 -49 -60 40 -27 -38 -4 48 -16 -24 -5 -14 -24 24 22 23 32 63 -3 -37 34 74 -15 3 68 18 -31
3783c1Q4l5p4O6J9o7j4Q2q2n9J69r2l2O9Pq4L8P4m6K7j1K7j33Q5O6m2k6K9L1q8
$$ -31 53 18 -56 10 29 -38 -52 30 -52 -111 58 -34 -66 3 10 -74 -36 38 -8 19 8 35 -98 -13 53 11 -15 14 45 -43
3813d3K9R3o1k9K6k7j1RQ6j29qJ33p1q0J07J5r3O2O3j04L3M2m1l4J04m7q6Q8j5
$$ -43 -14 79 18 -11 15 -12 -23 -14 72 -57 -65 68 -3 -83 24 39 -54 8 71 -33 0 42 1 -33 71 24 -62 26 11
3842A1n4M5K8rq1L2L0l2k5P4l1k4RM9q3M7j1O1j5l5N8j31N3Q8q6K2Q8n8m7L3L5
$$ 11 -43 2 30 21 -60 -28 2 -30 -55 19 -12 -36 -27 22 -61 -14 -25 36 21 -14 44 -87 -34 54 -32 -10 78 20 -27 6 41
3873D1p4P4K7n6m1O7j7k9PK1k6MO0j01l5P5n6K3L7J3J4j18J29l1k0rJ23q6l4J18
$$ 41 -33 41 68 12 -29 38 21 -8 -1 20 -6 -2 58 -43 -78 -3 -59 -36 1 14 28 -90 39 8 -12 -21 102 16 -18 100
3903A00n0j33J19J5p7L1M9n6k4K2po5J21pl7Om9N6Jq4O9mm2J3MJ1J3L8o7O2J3
$$ 100 50 -83 36 51 -26 5 54 -2 -26 -4 -11 -76 45 38 1 7 -42 14 15 -69 0 -4 -46 -33 -29 -18 -5 33 -34 28 41
3934D1j5j1K3j9m5P1J6q7PN7o0j8J6O2r6PP6o1N3Nk3K2M3o7NM9J9n0n0L0K6m1
$$ 41 26 15 38 19 -26 45 61 -26 -19 38 -22 -40 -24 38 -58 -51 25 -36 17 22 -1 21 64 -3 2 51 70 20 -30 0 26 -15
3966a5L9K2k1n8J7K6l3M2m4L6n8J20q2rK0lJ0m1J07r9k0L9j8L1K9j8j04J30p2
$$ -15 24 46 25 -33 -16 10 -23 19 -25 11 -47 73 -9 -18 2 -1 9 -32 75 -24 -44 -5 -23 8 37 19 -85 45 -27
3995b7N4n7L8l7j9K1M8k4k%Nm3N2L3r5M8J3k7j6N0oq6K1M4Rj4R9o5l3k7K9l1N3
$$ -27 27 -30 8 -29 -48 -27 21 -3 -5 -5 0 -43 9 42 -53 -5 8 -19 -35 15 9 -77 -56 -12 -3 -17 82 17 -16 -43 -14 -45 8
4028HN1j13J4J23l6q1M1M0m8j4P0m0n0O2k4qL1m2nj3M6n0K2k0J26r9j3J01m9m9
$$ 8 59 -54 -40 83 47 -34 7 47 -1 -15 55 15 -35 27 3 -5 26 -16 -21 -34 12 -38 -16 -36 90 -9 -22 79 30 -19
4058a9L4J4r7R9L9q6m3R1J9p1P1K7p0Oj7rMJ8%j4n5M6mk9P6k8n7J3P1j6r2N5K6
$$ -19 15 29 -68 31 70 -16 -59 32 51 -20 51 78 8 14 -3 -12 -8 10 10 -4 -59 -13 -17 -46 30 2 -55 -42 29 13 -79 -24 2
4091BL%L5k2L%K7m9J5l4j8M0M3r5rJ28r3n5J06K1r3N7qm7j4J25o0l3P6j7n7L6
$$ 2 5 5 40 18 21 21 48 -1 14 -20 -38 2 45 -50 -59 69 -24 -79 27 48 -45 12 4 -43 -57 68 8 -25 51 34 -23 13
4123A3J5m8j8L5M5r8J7O4J0q1L3L9M2n1jl5K4J7q0M2J9j4l4M1L2m1rQ9l2q7O0
$$ 13 28 -20 -38 -3 42 -56 -39 25 35 -46 -13 26 68 17 16 -19 5 22 -58 -16 3 -11 -45 -4 28 -13 -22 67 35 -52 8
4154Hk3Ml9Q6N0r7L4j6q2R1M2p1p0J28m5j6N2lq7J4nRk1M3N4m9PM4l4o0J02m0
$$ 8 -15 -11 -50 36 86 -11 23 7 -75 16 58 -13 -83 45 0 -16 36 33 -54 -40 -45 -36 -57 -14 40 -9 -2 42 8 -52 50 10
4186A0K9n4N6J5l3O0j02RN0l5j2J3O3m9lN0m0n0K0K2m8O7M3r6K6n7L3k6M2J7p
$$ 10 39 -15 41 56 23 83 -19 -10 40 5 -7 6 69 20 17 67 27 -23 -3 19 -29 38 81 -15 11 -46 -13 -39 3 20 13
4217A3m2K4K3m3M2P5r3kJ7m0m3J07j1j5L4Mp8P3l0l7K8M5J3j21P2m5R9r4L0j3
$$ 13 -29 -5 18 -25 17 92 -1 -3 14 -26 -69 38 27 12 46 50 -28 45 15 -22 6 51 64 -57 15 -30 69 -25 5 -8
4247hj5N9l3k1k0J02r1qK9P1o7J9K4j7k0Jj1k8L4K2m2l1R0j9j09R9o1O5K8j7k
$$ -8 -23 36 3 -18 -38 64 -27 -35 -6 65 -2 17 41 24 4 5 -6 -34 0 22 -20 -51 39 20 -89 10 -51 14 42 25 23
4278B3l3J4k8PL2Lq4Q7K1n0jK1rJ7k9P4n1n7J17k6l3oJ5q6k4J18k7o4J38k0r5
$$ 23 -10 4 -24 -17 15 18 -66 21 42 -8 -9 12 3 20 -9 65 14 -43 74 48 15 9 24 -62 -86 32 5 -59 79 59 -36
4309c6M4k0L8j9K1l0j2L4L7q7j7P2l0j2L4j6o2Q8j0l7K9M8J9m9l7L1n3J1L5k2
$$ -36 8 -12 26 7 28 -2 -14 20 57 -30 -47 25 -5 -17 17 1 -61 27 17 -20 9 57 76 27 -10 21 -32 -21 14 -8
4339hJ7J6l2K3k4Pm0L9m5P5q5M9M4k9j7O7m5l9J01mq2j6L6pP1q9J9r2P8J3r%J8
$$ -8 9 25 -7 16 -8 -1 -41 -2 -47 28 -57 -8 36 7 -10 57 12 -27 74 70 -12 -28 8 1 72 -17 2 -90 -12 1 -8 -8 10
4372A0J3J5j3J3p7J8J02n1n5J8L8l2M1J7p5QN4k7q7Q3J4n1RoK3n3N1l5mO3nl7
$$ 10 23 38 25 38 -39 -21 81 30 -25 -7 31 -1 40 57 -18 -10 44 17 -70 13 27 -24 -15 -21 2 -51 0 -35 -39 24 19 -18
4404a8j7L1k0N1j5Pnk5lL3l8L0M6j11J11l0Qk8K5pppL6m2lk2O3o9L2n2K5J0Mo4
$$ -18 -35 -4 -24 27 12 19 14 -11 -14 19 -19 11 57 -54 57 27 35 7 32 25 18 11 47 5 2 -20 43 -26 6 -46 -21 -11 -7 -71
4438g1N3R0j07j9O3kn8J8N4l1L8M0q2QK2p1M1MM2l0j9M5Rp2K0LK9m4jmj9P7K3
$$ -71 -18 72 -35 -54 9 7 -51 -33 21 -10 28 68 -14 -6 16 -55 -14 -10 32 2 -17 28 37 -35 -15 -12 17 -27 -28 -32 -51 26 49
4471D9l9NOp8Q3k3L7j46J07mLJ1K1L2p0J4lL2K4n2M2j8pk3l2M0o4L5KK2L3r8Q6
$$ 49 10 15 21 -57 26 3 40 -106 1 -3 0 11 32 64 -6 8 5 37 61 9 51 33 26 3 -29 11 -53 -18 -16 6 39 -59 27
4504B7k8j8j5Q2o8k5M9O5j01mN8j9j7K9l9J7P3l1j8j2J7m0n4Q5k1j4P0l7l9L1
$$ 27 -1 -19 -34 48 -20 -45 4 69 -32 -36 22 3 -14 15 -24 -7 66 35 17 5 22 -18 -72 13 -8 -22 48 11 -28 3
4534CK9J2o5N9k0q4L3O0k9K7J3Oq4J16m9q0O6L4l5l0K9j0m7M9P0q5l0R3l9j2k
$$ 3 32 44 -21 38 18 -66 -33 27 -2 25 38 44 -40 76 27 -53 13 47 12 -18 11 1 -46 3 73 -12 -42 51 12 0 -2
4565bL2n8O3j5l2J2rlL4o1P2j1m4K2N1k4K7k8m2k2j1O8j3K4M0j06LN3l2l1P3m3
$$ -2 30 -28 35 20 -12 0 -9 -12 22 -39 33 22 -22 0 51 27 54 26 -16 -38 -49 19 6 30 70 -36 -33 20 -12 -43 30 -13
4597a3j5M4j8J8l9J3N4o0K4M2q4L5N4n4J3j7j8M2m4M9j6j2L4l4rmQ2q0O5l8L0
$$ -13 -28 16 -2 16 -23 -10 44 -16 8 50 -34 1 55 1 14 -3 -21 21 -23 26 10 -2 32 -2 -11 -15 67 -13 52 14 44
4628D4j14M3Q7o3L8K0r7M7J4rJ3Nl2m2N9J8orkj7j6O8q6j6L7P9p5l7O2m7k6N1
$$ 44 -70 -27 60 -3 35 55 -42 5 19 10 23 28 -4 -46 13 31 25 16 14 -3 -19 49 -37 -53 -16 63 -12 -49 13 -34 -60 -9
4660iJrJ9j9j3JM3J7%m1l9J01n1J3K3k6k5P8k3n4J1j1l5M4ml3lN9K5p2Q5q2J5
$$ -9 -8 -17 2 -17 -30 -29 14 31 31 -10 -49 52 1 14 37 11 -14 64 41 -13 -2 -13 -48 -4 -8 -41 -44 15 40 -32 53 -29 -14
4693a4j1L3l0J4%M5l5j3K6qkj5J2J6L6n7L7KJ0m6MQk9oL7N4o2j8L7l2OL7k0k9
$$ -14 -25 8 -22 -8 -8 37 2 -11 15 7 5 -10 2 18 54 -3 34 36 46 0 4 12 -17 -23 14 68 6 -12 25 -7 -1 36 16 -13
4727a3l4J0K6pK6m8m4P6N7p3M4M4p3jN1mo2OJ06m7j7l9LN9m1L2n6N4Po7o2R4K4
$$ -13 -47 -37 -11 -18 8 -40 -84 -8 49 -24 20 64 -9 -10 41 37 -25 -19 87 40 23 -16 -13 46 5 37 -19 35 42 -25 -87 7 31
4760C1n3M1k3Lk2J2M5l4J9k7j0j3L2j8qJ3K3l1K1K6k5kM2n8j9P9q8O1km7N0m7
$$ 31 -22 19 -4 -1 -23 -11 34 0 19 -8 -18 -31 1 -17 -25 -12 11 -20 1 27 2 0 42 -16 -35 44 -44 17 15 -32 18 -29
4792b9K7M4p4N0%k9L8k3M6o5l1N5r1M0M7j2J1n5OK7J0j7J2m1P4J9m6l4K3K7N8
$$ -29 -2 42 -32 18 18 -11 27 4 50 -15 -46 9 -82 -42 5 -7 4 -51 -45 -18 -8 -25 -13 -54 20 39 -7 -41 -18 9 67
$$ [...]
8191i
##END NTUPLES=NMR FID
##END=
