##TITLE=1H_2PBDP1301
 CDCl3
 8 sc, 
 16.1.2023
##JCAMPDX= 6.0         $$ Bruker NMR JCAMP-DX V2.0
##DATA TYPE= NMR FID
##DATA CLASS= NTUPLES
##ORIGIN= UXNMR, Bruker Analytische Messtechnik GmbH
##OWNER= root
$$ XWIN-NMR		Version 3.5
$$ Mon Jan 16 13:56:41 2023 Russian Standard Time (UT+4h)  she@DPX200
##.OBSERVE FREQUENCY= 200.13135
##.OBSERVE NUCLEUS= ^1H
##.DELAY= (6, 6)
##.ACQUISITION MODE= SIMULTANEOUS
##.ACQUISITION SCHEME= undefined
##.AVERAGES= 8
##.DIGITISER RES= 18
##SPECTROMETER/DATA SYSTEM= spect
##.PULSE SEQUENCE= zg30
##.SOLVENT NAME= CDCl3
##.SHIFT REFERENCE= (INTERNAL, CDCl3, 0, 15.7039)
##AUDIT TRAIL= $$ (NUMBER, WHEN, WHO, WHERE, WHAT)
$$ ##TITLE= Audit trail, XWIN-NMR		Version 3.5
$$ ##JCAMPDX= 5.01
$$ ##ORIGIN= Bruker BioSpin GmbH
$$ ##OWNER= she
$$ F:/spectra/data/she/nmr/H-F/1/audita.txt
$$ ##AUDIT TRAIL=  $$ (NUMBER, WHEN, WHO, WHERE, WHAT)
(   1,<2023-01-16 13:54:14.25 +0400>,<she>,<DPX200>,
      <created by zg, POWCHK disabled, PULCHK disabled
       configuration hash MD5:
       00 E9 B6 7A A2 85 ED C7 34 08 36 98 17 FE 4E 26
       data hash MD5: 16K
       FF C7 4E CA D1 B4 3C 60 4D 0B 71 94 09 52 ED 5E>)
$$ ##END=
$$ 
$$ hash MD5
$$ 9C 53 26 35 E8 AD AA 78 C2 AD A0 B3 25 35 F1 F3
##$RELAX= 
##$RELAX= 
##$RELAX= 
##$RELAX= 
##$RELAX= 
##$RELAX= 
$$ Bruker specific parameters
$$ --------------------------
##$DU= <F:/spectra>
##$EXPNO= 1
##$NAME= <H-F>
##$PROCNO= 1
##$TYPE= <nmr>
##$USER= <she>
##$AMP= (0..31)
100 100 100 100 100 100 100 100 100 100 100 100 100 100 100 100 100 100 
100 100 100 100 100 100 100 100 100 100 100 100 100 100 
##$AQSEQ= 0
##$AQ_mod= 1
##$AUNM= <au_zg>
##$AUTOPOS= <>
##$BF1= 200.13
##$BF2= 200.13
##$BF3= 200.13
##$BF4= 200.13
##$BF5= 200.13
##$BF6= 200.13
##$BF7= 200.13
##$BF8= 200.13
##$BYTORDA= 1
##$CFDGTYP= 0
##$CFRGTYP= 5
##$CHEMSTR= <none>
##$CNST= (0..31)
1 1 145 1 1 1 1 1 1 1 1 1 1 1 1 1 1 1 1 1 1 1 1 1 1 1 1 1 1 1 1 1 
##$CPDPRG= <>
##$CPDPRG1= <>
##$CPDPRG2= <>
##$CPDPRG3= <>
##$CPDPRG4= <mlev>
##$CPDPRG5= <mlev>
##$CPDPRG6= <mlev>
##$CPDPRG7= <mlev>
##$CPDPRG8= <mlev>
##$CPDPRGB= <>
##$CPDPRGT= <>
##$D= (0..31)
0 1.2 0 0 0 0 0 0 0 0.06 0 0.03 0 0 0 0 0.0002 0 0 0 0 0 0 0 0 0 0 0 0 
0 0 0 
##$DATE= 1673862853
##$DBL= (0..7)
120 120 120 120 120 120 120 120 
##$DBP= (0..7)
150 150 150 150 150 150 150 150 
##$DBP07= 0
##$DBPNAM0= <>
##$DBPNAM1= <>
##$DBPNAM2= <>
##$DBPNAM3= <>
##$DBPNAM4= <>
##$DBPNAM5= <>
##$DBPNAM6= <>
##$DBPNAM7= <>
##$DBPOAL= (0..7)
0.5 0.5 0.5 0.5 0.5 0.5 0.5 0.5 
##$DBPOFFS= (0..7)
0 0 0 0 0 0 0 0 
##$DE= 6
##$DECBNUC= <off>
##$DECIM= 32
##$DECNUC= <off>
##$DECSTAT= 4
##$DIGMOD= 1
##$DIGTYP= 9
##$DL= (0..7)
0 120 120 120 120 120 120 120 
##$DP= (0..7)
150 150 150 150 150 150 150 150 
##$DP07= 0
##$DPNAME0= <>
##$DPNAME1= <>
##$DPNAME2= <>
##$DPNAME3= <>
##$DPNAME4= <>
##$DPNAME5= <>
##$DPNAME6= <>
##$DPNAME7= <>
##$DPOAL= (0..7)
0.5 0.5 0.5 0.5 0.5 0.5 0.5 0.5 
##$DPOFFS= (0..7)
0 0 0 0 0 0 0 0 
##$DQDMODE= 0
##$DR= 18
##$DS= 0
##$DSLIST= <SSSSSSSSSSSSSSS>
$$ [...]
##$SUBNAM2= <"">
##$SUBNAM3= <"">
##$SUBNAM4= <"">
##$SUBNAM5= <"">
##$SUBNAM6= <"">
##$SUBNAM7= <"">
##$SUBNAM8= <"">
##$SUBNAM9= <"">
##$SW= 18.05172834244
##$SWIBOX= (0..15)
0 0 2 0 0 0 0 0 0 0 0 0 0 0 0 0 
##$SW_h= 3612.71676300578
##$TD= 16384
##$TD0= 1
##$TE= 0
##$TE2= 300
##$TE3= 300
##$TEG= 300
##$TL= (0..7)
0 120 120 120 120 120 120 120 
##$TP= (0..7)
150 150 150 150 150 150 150 150 
##$TP07= 0
##$TPNAME0= <>
##$TPNAME1= <>
##$TPNAME2= <>
##$TPNAME3= <>
##$TPNAME4= <>
##$TPNAME5= <>
##$TPNAME6= <>
##$TPNAME7= <>
##$TPOAL= (0..7)
0.5 0.5 0.5 0.5 0.5 0.5 0.5 0.5 
##$TPOFFS= (0..7)
0 0 0 0 0 0 0 0 
##$TUNHIN= 0
##$TUNHOUT= 0
##$TUNXOUT= 0
##$USERA1= <user>
##$USERA2= <user>
##$USERA3= <user>
##$USERA4= <user>
##$USERA5= <user>
##$V9= 5
##$VALIST= <valist>
##$VCLIST= <CCCCCCCCCCCCCCC>
##$VD= 0
##$VDLIST= <DDDDDDDDDDDDDDD>
##$VPLIST= <PPPPPPPPPPPPPPP>
##$VTLIST= <TTTTTTTTTTTTTTT>
##$WBST= 1024
##$WBSW= 4
##$XGAIN= (0..3)
0 0 0 0 
##$XL= 0
##$YL= 0
##$YMAX_a= 359079
##$YMIN_a= -279439
##$ZGOPTNS= <>
##$ZL1= 120
##$ZL2= 120
##$ZL3= 120
##$ZL4= 120
##$ABSF1= 10
##$ABSF2= 0
##$ABSG= 5
##$ABSL= 3
##$ALPHA= 0
##$AQORDER= 0
##$ASSFAC= 0
##$ASSFACI= 0
##$ASSFACX= 0
##$ASSWID= 0
##$AUNMP= <proc_1d>
##$AZFE= 0.1
##$AZFW= 0.1
##$BCFW= 1
##$BC_mod= 2
##$BYTORDP= 1
##$COROFFS= 0
##$CY= 11.3945322036743
##$DATMOD= 1
##$DC= 2
##$DFILT= <>
##$DTYPP= 0
##$F1P= 2.36226072786647
##$F2P= -0.459571619588291
##$FCOR= 0.5
##$FTSIZE= 0
##$FT_mod= 4
##$GAMMA= 1
##$GB= 0.15
##$INTBC= 1
##$INTSCL= 1
##$ISEN= 128
##$LB= 0.24
##$LEV0= 0
##$LPBIN= 0
##$MAXI= 10000
##$MC2= 0
##$MEAN= 0
##$ME_mod= 0
##$MI= 1.114404
##$NCOEF= 0
##$NC_proc= 0
##$NLEV= 6
##$NOISF1= 3.799351
##$NOISF2= 2.8
##$NSP= 1
##$NTH_PI= 0
##$NZP= 0
##$OFFSET= 15.70392
##$PC= 1
##$PHC0= -19107.23
##$PHC1= 14.40073
##$PH_mod= 1
##$PKNL= yes
##$PPARMOD= 0
##$PSCAL= 0
##$PSIGN= 0
##$REVERSE= no
##$SF= 200.130013532006
##$SI= 16384
##$SIGF1= 3
##$SIGF2= 2
##$SINO= 400
##$SIOLD= 16384
##$SREGLST= <1H.CDCl3>
##$SSB= 0
##$STSI= 0
##$STSR= 0
##$SW_p= 3612.71676300578
##$SYMM= 0
##$S_DEV= 0
##$TDeff= 0
##$TDoff= 0
##$TI= <>
##$TILT= no
##$TM1= 0
##$TM2= 0
##$TOPLEV= 0
##$USERP1= <user>
##$USERP2= <user>
##$USERP3= <user>
##$USERP4= <user>
##$USERP5= <user>
##$WDW= 1
##$XDIM= 8192
##$YMAX_p= 0
##$YMIN_p= 0
$$ End of Bruker specific parameters
$$ ---------------------------------
##NTUPLES= NMR FID
##VAR_NAME=  TIME,          FID/REAL,        FID/IMAG
##SYMBOL=    X,             R,               I
##VAR_TYPE=  INDEPENDENT,   DEPENDENT,       DEPENDENT
##VAR_FORM=  AFFN,          ASDF,            ASDF
##VAR_DIM=   8192,          8192,            8192
##UNITS=     SECONDS,       ARBITRARY UNITS, ARBITRARY UNITS
##FACTOR=    0.0002768,     1,               1
##FIRST=     0,             0,               0
##LAST=      2.2672688,     0,               0
##MIN=       0,             -279439,         0
##MAX=       2.2672688,     359079,          0
$$ Real data points
##PAGE= N=1
##DATA TABLE= (X++(R..R)), XYDATA
$$ [...]
1469c30n85J840p49j416J549M1j494P64J231j536j68J804r15r41J508K24j591
$$ -330 -915 925 176 -1240 309 350 -1144 -380 851 -685 -853 951 36 -905 603 827 -764
1486g64O85J167j273k28J348o69j033J154M44j562L80J219j025p70J678l87j147
$$ -764 -79 1088 -185 -413 935 266 -767 387 831 -731 -351 868 -157 -927 751 364 -783
1503g83J003M33j294J82J094q69m20J046k67q00P82L52r11L17P34o74k34Q97k29
$$ -783 220 653 -641 -459 635 -234 -654 392 125 -675 107 459 -452 -135 599 -75 -309 588 359
1522C59n29M00P2n22K46M29o47L2L91k17l14J94K35l36K48P8l29R6K19l66n2L40
$$ 359 -170 230 302 -220 26 455 -192 -160 231 14 -300 -106 129 -207 41 119 -210 -114 105 -261 -313 27
1544B7j62j63M31k29m69P10L23n95K16M31p97K73P13m50o41R22m22l89M63J70
$$ 27 -135 -298 133 -96 -565 145 468 -127 89 520 -277 -4 709 259 -382 540 118 -271 192 362
1564C62o93Q7N85n75j32O99l14m94N46J43q26K04Q53o39k25P61l15n07N57M93
$$ 362 -331 -244 341 -234 -366 333 19 -475 71 214 -612 -408 445 -194 -419 342 27 -480 77 570
1584E70q86N11L68n83m35R57k28n04M93J67p20L75K53m93l1L40n09j91O90m9n88
$$ 570 -316 195 563 -20 -455 502 274 -230 263 430 -290 85 338 -155 -186 154 -355 -546 144 95 -493
1605d93M03K14m04K3K68j07lJ59k32RL12j3m6J00R7m03J08K56j32l7J03K9m41
$$ -493 -90 124 -280 -257 11 -96 -99 60 -172 -163 149 136 90 190 287 -116 -8 248 116 79 182 211 -230
1628b30M47j73k28J35K25l22j78M67l96j04N67l75l45P16Q4q46M92O31q51p6Q50
$$ -230 217 44 -184 -49 176 -146 -324 143 -253 -357 210 -165 -510 206 290 -556 -64 567 -284 -360 490
1649D90k61p07Q67op39M34M95r01L09N10m53m64O72K17j008K37P48o82k95O45
$$ 490 229 -478 389 383 -356 78 573 -328 -19 491 38 -426 246 463 -545 -308 440 -242 -537 108
1669A08j94o61P08M18p90q3R23n12l55O75rp31O37L79r92L71N91n21m87J037k20
$$ 108 -86 -747 -39 379 -411 -494 429 -83 -438 237 228 -503 134 513 -479 -108 483 -38 -525 512 292
1690B92p18N99L37p65L8M93n10k59N58l1l84L04K00l92R5K30j94k35K96L36m70
$$ 292 -426 173 510 -255 -217 276 -234 -493 65 34 -350 -46 154 -238 -143 87 -107 -342 -46 290 -180
1711a80J12M78l53n9K20pk40K98R1n05J52N6j3j02K11k63p7K87k38mM10n07N6
$$ -180 -68 410 57 -2 218 211 -29 269 360 -145 7 63 50 -52 159 -104 -181 106 -132 -136 274 -233 -177
1734a77K24l13m4N02l05k34L65J04m21K72K41k37j86N23m53j22L96J10m55L60
$$ -177 47 -266 -310 192 -113 -347 18 122 -299 -27 214 -23 -209 314 -139 -261 135 245 -210 150
1754A50L08o45j34M42j46j11J38J60m32O0M84m16k16K36L91o84L35J88l00j31
$$ 150 458 -187 -321 121 -25 -136 2 162 -270 -210 274 -142 -358 -122 269 -415 -80 108 -192 -323
1774c23N94j3n23K78J59m23N47N9m16J43L24l16k40K76m2k78J81M1j15q3L04n0
$$ -323 271 258 -265 13 172 -251 296 355 -61 82 406 90 -150 126 84 -194 -13 28 -87 -170 134 84
1796H4l78K43K6j42Q1j8N3j33K59j55J1M0J6J6K17j18r3J68J00k51k3J93j92J2
$$ 84 -294 -51 -25 -167 -86 -104 -51 -184 75 -80 -69 -29 -13 3 220 102 9 177 277 26 3 196 4 16
1820A6K7n6j03K37j58j88K45P9m60K70J56k65O1K11j28k29L50O5l47J26J78l94
$$ 16 43 -13 -116 121 -37 -225 20 99 -361 -91 65 -200 -139 72 -56 -285 65 130 -217 -91 87 -307
1842c07K88L17j31k57K70L8l74J16M22l18k88N67k67l64M44j60k51K03K17m54
$$ -307 -19 298 167 -90 180 218 -156 -40 382 64 -224 343 76 -288 156 -4 -255 -52 165 -289
1862b89j43O65k03m27K81K45m71K52L29m54m6N61l13j8K63j10k17K10K87n57L2
$$ -289 -432 233 30 -397 -116 129 -342 -90 239 -215 -261 300 -13 -31 232 122 -95 115 402 -155 -123
1883a23L58j25l24J59J65k02m0K30k47m2K39q2j01J77r7k15J54L63k74k06K20
$$ -123 235 110 -214 -55 110 -92 -132 98 -149 -191 48 -34 -135 42 -55 -270 -116 247 -27 -233 -13
1904a3P9l03L16Pj05J8K94m06K87O3k64K7J34j7l34J48L8l4Jj58Q5R2J29l09J63
$$ -13 66 -237 79 86 -19 -1 293 -113 174 237 -27 0 134 117 -217 -69 -31 -65 -64 -222 -137 -45 84 -225 -62
1929f2J71j37j36K64j70j80M57m4k26J32j42N9K9k1l5j05L57m4j85P0J16p7j60
$$ -62 109 -28 -164 100 -70 -250 207 163 -63 69 -73 -14 15 -6 -41 -146 211 167 -18 52 168 91 -69
1952f9J70k31JJ72l7j42J40ok48J10J98p6k21K56r3j36L77J53l67o6K10L1l70
$$ -69 101 -130 -129 43 6 -136 4 -2 -250 -140 58 -18 -239 17 -76 -212 165 318 -49 -115 95 126 -244
1975b44L15K38l17K08O3k68o8L48j67l22K39n1j84J07J63k04q3K44j5l18K22O3
$$ -244 71 309 -8 200 263 -5 -73 275 108 -214 25 -26 -210 -103 60 -144 -227 17 2 -316 -94 -31
1997c1j98J46K27l15J92M3R6n2Q0q2k71L83k64L0J4K06k62k03J41J52k84L53k48
$$ -31 -229 -83 144 -171 21 64 160 108 188 106 -165 218 -46 -16 -2 204 -58 -261 -120 32 -252 101 -147
2020a47p7P1P7l9l4J36j26oK32l00%L24J01m09J81J35l59R8M24l51p1L54r7k37
$$ -147 -224 -153 -76 -115 -149 -13 -139 -145 87 -213 -213 111 212 -197 -16 119 -240 -142 282 -69 -140 214 117 -120
2044a20L23mm69K09K44k06j17L35k55k98L85Qn6j20K49r4k95L53kl45K16L32l64
$$ -120 203 199 -270 -61 183 -23 -140 195 -60 -358 27 35 -21 -141 108 14 -281 72 70 -275 -59 273 -91
2067i1o9N04l68j67M62Q9m43l3M77m14m0K07Q0l94L90K57p30K60L60m69k01L59
$$ -91 -160 344 -24 -191 271 360 -83 -116 361 -53 -93 114 194 -200 190 447 -283 -23 337 -132 -333 26
2089B6j72q4K71o8k30L49J14l29n4K60o3j94M52l17Q3q9K26l7j44J40o6k1j0J17
$$ 26 -146 -230 41 -27 -257 92 206 -123 -177 83 20 -174 278 -39 44 -45 181 144 0 140 74 53 43 160
2113A60k13K38p8k81l3K25Mj6q4j20P5J48p5L3J14m0l4J52k63p2R7K11j71J23
$$ 160 -53 185 107 -174 -207 18 22 6 -78 -198 -123 25 -50 -17 97 57 23 175 -88 -160 -63 148 -23 100
2137A00R4k84l5L19K6k98K78j06l00K28R5k04L1O9j76L8J10J1j94L3K91k38k38
$$ 100 194 -90 -125 194 220 -78 200 94 -206 22 117 -87 -56 13 -163 -125 -15 -4 -198 -165 126 -112 -350
2160c50L79j2L9j29J31q8p1K41l9k76L18o1l20M84J5l95M2K23k31K1J27j52p5
$$ -350 29 17 56 -73 58 -30 -101 140 101 -175 143 82 -238 246 261 -134 -92 131 -100 -79 48 -104 -179
2183a79J63J63k18L6N8q3l3O7J13j66J61N3j14O8j11L0JR5r2R6j02J05j27Q3J56
$$ -179 -16 147 -71 -35 23 -60 -93 -26 87 -79 82 135 21 89 -22 8 9 104 12 108 6 111 -16 67 223
2208B23l17J58L6m3q8J7k2j26N9J73j76J56O5j90r6K11n8P5j41J41m7L3J02l77
$$ 223 -94 64 100 57 -31 -14 -36 -162 -103 70 -106 50 115 -75 -171 40 -18 57 -84 57 10 43 145 -232
2232b32L24K29k15j09K08k06r8K08q0j7j60J85k48J43J55j53k23L85o3k79K77
$$ -232 92 321 106 -3 205 -1 -99 109 29 12 -148 37 -211 -68 87 -66 -289 96 33 -246 31
2253C1R6l53k4M38j18l14K80k8k06K38Q8k45M0J77J09l32K99R8j98o7J71j68q7
$$ 31 127 -226 -250 188 70 -244 36 8 -198 40 128 -117 -77 100 209 -123 176 274 76 9 180 12 -75
2276g5K64j92l10L37O9l54J40J79l04p8L62k2j37LJ84j29M1K6k7l4J76J0N9j16
$$ -75 189 -3 -313 24 93 -261 -121 58 -246 -324 38 16 -121 -118 66 -63 -22 4 -23 -57 119 129 188 72
2300G2J23k33L2K26k77M2M8q1Q0J4j40KQ3q0o0M7J14j97J89J01l40J31L6L9q4
$$ 72 195 -38 -6 220 -57 -15 33 -48 32 46 -94 -92 -9 -89 -149 -102 12 -185 4 105 -235 -104 -68 -29 -113
2325a13L17l68jL81n4j00p2J09j28J25J41k79j46K90k9k30J55J7j18q0K26Jj08
$$ -113 204 -164 -165 216 162 62 -10 99 -29 96 237 -42 -188 102 73 -157 -2 15 -103 -183 43 44 -64
2348f4K73k20k08K53K45m71LL53j36k24L10Kj91J8J19j56M6K42j91j30K35Pk17
$$ -64 209 -11 -219 34 279 -192 -189 164 28 -196 114 116 -75 -57 62 -94 -48 194 3 -127 108 115 -102
2371a02J74q8qj04R6j0J3K2L2j33J4J86p7j12K19j73P3P6j03pJ6O2r0KJ38o9r5
$$ -102 72 -16 -24 -128 -32 -42 -29 -7 25 -108 -94 92 15 -97 122 -51 22 98 -5 -12 4 66 -24 -22 116 47 -48
2398d8J21J0q8J61j82j02L20k16Q3o4K8jj18K39k5l04L27j10j42K22j76L4n5K65
$$ -48 73 83 -5 156 -26 -128 192 -24 59 -5 23 22 -96 143 118 -186 141 31 -111 111 -65 -31 -86 179
2422A79k18o6O1J76n3L5j25j72K20L7j61n4L10p5j31K1J03k59J28P3k70J29J26
$$ 179 -39 -105 -44 132 79 114 -11 -183 37 74 -87 -141 169 94 -37 -16 87 -172 -44 29 -241 -112 14
2445A4J4l75N02o4k13R3L00m00J06P5Jk19K47J94k13j55J94r6l9L25l16j29J53
$$ 14 28 -347 155 91 -122 -29 271 -129 -23 52 53 -166 81 275 62 -93 101 5 -34 291 -25 -154 -1
2468aN4p9j7l0J31j07K23l57rK43M9k02QJ66j56J44J06k28l6J59r9mJ39k70K02
$$ -1 53 -26 -43 -73 58 -49 174 -183 -192 51 100 -102 -94 72 -84 60 166 -62 -98 61 -38 -42 97 -173 29
2493B9k0J85q5j58J92l7l3l1j51M8n9k0L09k67o4K43o3M2j58Q1K1j45J46J50j75
$$ 29 9 194 109 -49 143 106 73 42 -109 -61 -120 -140 169 -98 -162 81 18 60 -98 -17 4 -141 5 155 -20
2518b0j8l2J92j21J84j91M4J0L9J7j31O1J85l28J53L3k08M5J68n6j33L4R9n3r6
$$ -20 -38 -70 122 1 185 -6 38 48 87 104 -27 34 219 -109 44 77 -131 -86 82 26 -107 -73 26 -27 -123
2543a23Q0n7j26M34j86k14O9K39j13j04J05k2P7nK04k79p1M23l03q4K06j36j07
$$ -123 -43 -100 -226 208 22 -192 -123 116 3 -101 4 -18 59 54 258 -21 -92 331 28 -56 150 14 -93
2566i3NK80l08R6K29k49k76L48j49j92M95j35j89M3K31k99J91n2p8M1J17k0k7
$$ -93 -88 192 -116 -20 209 -40 -316 32 -117 -309 186 51 -138 -95 136 -163 28 -24 -102 -61 56 36 9
2589IO9m6N6J37k94o8J82J71l39jJ33m6j29J47q4m7K23N0j58j4O7j07n9J54n3
$$ 9 78 32 88 225 -69 -137 45 216 -123 -124 9 -37 -166 -19 -103 -150 73 123 -35 -49 18 -89 -148 6 -47
2614d7kJ38o8r0P8J53j68n8P6K4j68L18j27j85J40J05j43q0J87M1j45r0J27k24
$$ -47 -49 89 21 -69 9 162 -6 -64 12 36 -132 186 59 -126 14 119 -24 -104 83 124 -21 -111 16 -208
2638b08K90Q5m36J77J26o9Q9o7l8j29J62J17j08j12N9J06j75K12P0j64M2J77j64
$$ -208 82 167 -269 -92 34 -35 54 -13 -51 -180 -18 99 -9 -121 -62 44 -131 81 151 -13 29 206 42
2661D2oJ16r3k86J75Q2J51j43q2j86M8J08J29k08N2Ql1K45o9J9j74J90j05n7L07
$$ 42 36 152 59 -227 -52 30 181 38 -44 -230 -182 -74 55 -153 -101 -93 -124 121 52 71 -103 87 -18 -75 232
2686B32j81K2J6k55J29M2j3j63K73J5k21O2J72k31M9J95k93K3J46M8J4p7M9j66
$$ 232 51 73 89 -166 -37 5 -8 -171 102 117 -104 -42 130 -101 -52 143 -150 -127 19 67 81 4 53 -113
2710a13p1K12k0j23J25J43j46o7J81jk33J22oj72L78l01M6L0N3j35L4Q4k8k71
$$ -113 -184 28 8 -115 10 153 7 -60 121 120 -113 9 3 -169 209 -92 -46 -16 37 -98 -64 20 -8 -279
2734b79L05p1j69K67j35K27k55J97j28o3J02J04k54M9J34k10J39K35r9j67J36
$$ -279 26 -45 -214 53 -82 145 -110 87 -41 -104 -2 102 -152 -103 31 -179 -40 195 96 -71 65
2755F5k1j76J09J77k08J44K6k9j74K38j74r4R8jn9q7J70q3J03J5K2p0j72J17P9
$$ 65 44 -132 -23 154 -54 90 116 87 -87 151 -23 -117 -19 -20 -79 -166 4 -79 24 39 61 -9 -181 -64 15
2780A5o1j24J54K4R5q6J3l6o1j28J48J35n0N9j35O5k2Q2j02N3j22p2J63P6J09
$$ 15 -46 -170 -16 8 103 17 30 -6 -67 -195 -47 88 38 97 -38 27 5 87 -15 38 -84 -156 7 83 192
2805A92l34l1J6J94Q4j31P1ML1j38k07L44J30j15p9J5Q1k50J31Oj15nM2j42O7
$$ 192 -142 -173 -157 37 121 -10 61 65 96 -42 -249 95 225 110 31 46 127 -123 8 14 -101 -106 -64 -206 -139
2830a39K25k06PK62k33O7q7Q5q6K7J65n5j68R7J52l2J17j63L7N2N6k67MJ64oJ23
$$ -139 86 -120 -113 149 -84 -17 -104 -19 -105 -78 87 32 -136 -39 113 81 198 35 72 124 180 -87 -83 81 75 198
2856A98j63Q4r0Nm5j03J73j42Q1j38J27j10N6k6N6l3J53L9j18j5J25m9k5j31P8
$$ 198 35 119 29 34 -11 -114 59 -83 -2 -140 -13 -123 -67 -93 -37 -70 83 122 4 -11 114 65 40 -91 -13
2881a3r6J85l4o1J03r3J34k10K60j39j68J89O5k65J4J68m8j37R6K05j63Q8J49
$$ -13 -109 76 42 -19 84 -9 125 -85 175 36 -132 57 122 -143 -129 39 -9 -146 -50 155 -8 80 229
2904B29j84k3Q9j58L7L5j6j08L10p6j80J33J63k32j09K86o9j58J87j63j54J98
$$ 229 45 22 111 -47 -10 25 9 -99 211 135 -45 88 251 19 -90 196 127 -31 156 -7 -161 37
2926C7m3K4L4m0Jk76L55j9k80K93pj97k1J63j44K69k11J14j61K21q6j57L07j57
$$ 37 -6 18 52 12 13 -263 92 73 -207 86 79 -118 -139 24 -120 149 -62 52 -109 112 26 -131 176 19
2950A9j09K9J14k7NJR4j33NJ33k62K36p8j29M0m4K05k07J0Q8L0J2L9n7l5m8j2
$$ 19 -90 -61 53 26 31 32 126 -7 -2 131 -131 105 27 -102 -62 -106 99 -108 -98 -10 20 32 71 14 -21 -69 -81
2977h1l8J43nQn8Q6k13J27o6J70n1J66k01j23J21N1M8m5J44j70J1j00o1o1K16
$$ -81 -119 24 19 27 -31 55 -158 -31 -97 73 22 188 -13 -136 -15 36 84 39 183 13 24 -76 -137 -198 18
3002A8k4q7R3K39j25j69L80k44j23J94j33j51O3K01k22Q9K7K8n2q8m7l5K08M1
$$ 18 -6 -93 0 239 114 -55 325 81 -42 152 19 -132 -69 132 -90 -1 26 54 2 -86 -133 -168 40 81
3026H1j56Pn9Q5j38L9k2K03j0q0J76m1J09j94M0M9n1Q8j17J02k16P9kL0k10L53
$$ 81 -75 -68 -127 -42 -180 -141 -163 40 30 -50 126 85 194 0 40 89 38 126 9 111 -105 -26 -28 2 -208 145
3052A45j46M0L2j09m2J10j35Pj7J76q3n1J44N4k7k7j1j08J60r4j70J43ON2M2k6
$$ 145 -1 39 71 -38 -80 30 -105 -98 -115 61 -22 -73 71 125 98 71 60 -48 112 18 -152 -9 -3 49 91 65
3078F5k0n3Q0L3kj12O2k61K51K9j62J81j17p0J97j28RQ6r7J84k20J6J38p9R8r6
$$ 65 45 -8 72 105 103 -9 53 -208 43 72 -90 91 -26 -96 101 -27 -18 68 -29 155 -65 -49 89 10 108 12
3104A2R0j67Q1N4j07j08L08r7k36J31m6J43r1O8J0o7n4rj35J55K17k27k7J03j50
$$ 12 102 -65 16 70 -37 -145 163 66 -170 -39 -85 58 -33 35 45 -22 -76 -85 -220 -65 152 -75 -102 1 -149
3129a49N5K46r3k02J47kJ01o6q2m5J02k3K20k27n1O6Q1o7N5j8Lj16J64j1N8n5
$$ -149 -94 152 59 -143 4 2 103 37 -45 -90 12 -11 209 -18 -69 -3 78 11 66 48 51 -65 99 88 146 91
3155I1k04OJ91o2J4j07J35k34K63j96QJ27q6J08L6J15k45Q5R2j07%K15l28L9J55
$$ 91 -113 -107 84 22 36 -71 64 -170 93 -103 -95 32 -54 54 90 205 -40 45 137 30 30 245 -83 -44 111
3180A11r3or5m1J00k02K10l4k5L0R1k20J14J09j27P4J3q4m8N6K65j22j30J61j51
$$ 111 18 12 -83 -124 -24 -226 -16 -50 -75 -45 46 -174 -60 49 -78 -4 9 -75 -123 -67 198 76 -54 107 -44
3205d4q4R9J12k28J07p0R9K11k22m1K7J01j84M2J62p1K1Rq5l3J08j80J32k1R0
$$ -44 -128 -29 83 -145 -38 -108 -9 202 -20 -61 -34 67 -117 -75 87 16 37 46 -39 -72 36 -144 -12 -33 57
3230E7K21l12J0K16k83J66j27QN7L4n0R4k4Lj07rKj41K12k82J11J71j15N7j42
$$ 57 278 -34 -24 192 -91 75 -52 -44 13 47 -3 91 67 70 -37 -46 -44 -185 27 -255 -144 27 -88 -31 -173
3255a73J76q8J39o6OO8L3j74j76L59j81P9J33P9j77K3k8J53j09r6K3j16J23R4
$$ -173 3 -85 54 -12 -6 62 95 -79 -255 104 -77 2 135 214 37 60 32 185 76 -20 3 -113 10 104
3279A04j30j61J24J11J7j61M7o5jL4P5j34J18L2m5L4R9r1m4J00M4m2j02O2j63
$$ 104 -26 -187 -63 48 65 -96 -49 -114 -115 -81 -6 -140 -22 10 -35 -1 98 7 -37 63 107 65 -37 25 -138
3304a38O4M9P8p4N6q3O8J74n1j70pJ57j43j76J19K09q1k1M8j78PJ60n1J7m0J56
$$ -138 -74 -25 53 -21 35 -48 20 194 143 -27 -34 123 -20 -196 -77 132 51 30 78 -100 -93 67 16 33 -7 149
3330A49j02O4k1j44O0p8J8J54qk68K03N4k40k6K55L0m6j54r3P8L32j00r3j79K91
$$ 149 47 111 90 -54 6 -72 -54 100 92 -176 27 81 -159 -185 70 100 54 -100 -193 -115 217 117 24 -155 136
3355A36k11L8q2K74k69P2K9KMJ9r7kK71q6k49K79q7q6%l3M9R5J8l3p9O2k1j33
$$ 136 -75 -37 -119 155 -114 -42 -13 -11 -7 12 -85 -87 184 98 -151 128 41 -45 -45 -78 -29 66 84 51 -28 34 13 -120
3383a20K60k39O3om8N8L8M5j62R0L6J29j55J54k16J48j24J17m6L7j6j35J29q6
$$ -120 140 -99 -36 -42 -90 -32 6 51 -111 -21 15 144 -11 143 -73 75 -49 68 22 59 43 -92 37 -49
3407d9J3m8Q9q8J30j23o5K39j19O5k32K32j68K32r7L7J09j87P6o9R5k40J15mL4
$$ -49 -36 -84 5 -83 47 -76 -141 98 -21 44 -188 44 -124 108 11 48 157 -30 46 -23 72 -168 -53 -57 -23
3432b3l4J0M5l7j0N1J39k34J75j00o7M3j91L26j18l2p3R8o3J36j76O9P3q3pm8
$$ -23 -57 -47 -2 -39 -49 2 141 -93 82 -18 -85 -42 -233 93 -25 -57 -130 -32 -95 41 -135 -66 7 -76 -83 -131
3458a31J3J36Q7j87J35O4q4l0j3J06n3J39k04J37l7m2K7k34K57r2p2Q7J17j90
$$ -131 -118 18 105 -82 53 117 33 3 -10 96 43 182 -22 115 78 36 63 -171 86 -6 -78 9 126 -64
3482f4R6O7p7k50L65p8p2O1l0O4n5q7L6j5J65j59O6qn2j07J5J58mm4K7m9n6Q0
$$ -64 32 99 22 -228 137 59 -13 48 18 82 27 -60 -24 -39 126 -33 33 25 -27 -134 -119 39 35 -9 18 -31 -87 -7
3510gl5p7J54q8k1P2j04j2l4J50O6ol7q8J05j91J18J56j16M0r9Q4O0p8o7j2L5
$$ -7 -42 -119 35 -53 -74 -2 -106 -118 -152 -2 64 58 21 -67 38 -153 -35 121 5 45 -54 30 90 12 -55 -67 -32
3537c2J3l4j16J19j19K18j06K5p5J34r8QM0J1j81J18j6K35k53J64j81K46j11J52
$$ -32 -19 -53 -169 -50 -169 49 -57 -32 -107 27 -71 -63 -23 -12 -193 -75 -91 144 -109 55 -126 120 9 161
3561A61r9j11Rj04K34j87On2J37j43J87j26O1L1J0o0J09r8J41k66M9q3J43K5l2
$$ 161 62 -49 -40 -144 90 -97 -91 -143 -6 -149 38 -88 -27 4 14 -46 63 -35 106 -160 -111 -194 -51 -26 -58
3586e8J36j18J79k14J21Jk6N0k20J92n1J0J4K02l42Q6K4j19J08l9J24o3n7j00
$$ -58 78 -40 139 -75 46 47 21 71 -149 43 -8 2 16 218 -124 -38 -14 -133 -25 -64 60 -3 -60 -160
3610a60Q6j40J8P3J32n3JO0J78k62J13R7j49QONJ33Mj91K2m2j5J00l7K4R1j84
$$ -160 -74 -214 -196 -123 9 -44 -43 17 195 -67 46 143 -6 2 8 13 146 150 -41 -19 -61 -76 24 -13 11 102 -82
3637h2J24j13J06k99J52K3R4M6k8j29P7N7j08l7J83J9J8j82M7r0J91j7J42j75
$$ -82 42 -71 35 -264 -112 -89 5 51 23 -106 -29 28 -80 -117 66 85 103 -79 -32 -122 69 52 194 19
3661A9J25j30j7R5K0r4M4j99J93j32J97o5j24M1L2r0K9M1j80L82q0j01K4n6l8
$$ 19 144 14 -3 92 112 18 62 -137 56 -76 121 56 -68 -27 5 -85 -56 -15 -195 187 107 6 30 -26 -64
3686f4J05k4O6k48J35J88j75j78J38R9J3R5j5j38M9j12JQ4O7J6j30j41R8%L4m4
$$ -64 41 17 83 -165 -30 158 -17 -195 -57 42 55 150 135 -3 46 -66 -65 19 86 102 -28 -169 -71 -71 -37 -81
3712h1J67n1n8P6j8p4n0j14K16r9J46p3Q6n2j1Q4j17K3J2j24L19k99rJ24J6r0
$$ -81 86 35 -23 53 35 -39 -89 -203 13 -86 60 -13 73 21 10 94 -23 0 12 -112 207 -92 -101 23 39 -51
3738e1L07l49J30L5j29J77j55j15J44J63l2o4j42J77j17L5m2J01k0j02K5K74k61
$$ -51 256 -93 37 72 -57 120 -35 -150 -6 157 125 61 -81 96 -21 14 -28 73 53 -49 -24 250 -11
3761a1J27k3j35L6k7M6k09J63j69J82q2R3J4j62M6Q9L5k4O2l5j15K30l3M8j74
$$ -11 116 93 -42 -6 -33 13 -196 -33 -202 -20 -102 -9 5 -157 -111 -22 13 -11 51 16 -99 131 98 146 -28
3786b8k6J81j12K01k63O5J14j04m8J5M7j1j27nO1L1j05Q0l6L1M5k2J45j31J1r2
$$ -28 -54 127 15 216 -47 18 132 28 -20 -5 42 31 -96 -101 -40 -9 -114 -34 -70 -39 6 -16 129 -2 9 -83
3812h3K25j35rM7o0Jj44J02m6J34J3J01j66J5p3J27J3N2r5j06K3J52j25Q0J6p2
$$ -83 142 7 -2 45 -15 -14 -158 -56 -102 32 45 146 -20 -5 -78 49 62 114 19 -87 -64 88 -37 43 59 -13
3838a3p5J65p8l6j33J86q5J14j01J04r6N3M9j79J22K09l2l78P8N5J68k35J93n2
$$ -13 -88 77 -1 -37 -170 16 -69 45 -56 48 -48 5 54 -125 -3 206 174 -204 -126 -71 97 -138 55 3
3862CJ77j25j23k3p3K97l26K18j6k8m7j24J71k5J36j61R6k3K32j72K8j53N8j51
$$ 3 180 55 -68 -91 -164 133 -193 25 9 -19 -66 -190 -19 -44 92 -69 27 4 236 64 92 -61 -3 -154
3886a54J32j5J16M2m6o2p7O5L5p0l9K0k7M1M6p2P2k94K02q5J06J02m2R7j33K26
$$ -154 -22 -37 79 121 75 13 -64 1 36 -34 -73 -53 -80 -39 7 -65 7 -287 -85 -170 -64 38 -4 93 -40 186
3912A86k20R2j96Q2J9j3L8mJ74j01m2J6K9N6q6j36P9M0o5P0p6L3J11k35Q1j29
$$ 186 -34 58 -138 -56 -37 -50 -12 -16 158 57 15 31 60 116 30 -106 -27 13 -52 18 -58 -25 86 -149 -68 -197
3938a97J59o5R5J17j14M8n9m3J67m6j45J62K6k01R4m9J05m4j22K14Pk79J90M9
$$ -197 -38 -103 -8 109 -5 43 -16 -59 108 62 -83 79 105 -96 -2 -51 54 10 -112 102 109 -170 20 69
3962F9j62l3J72J08k58R8j11J51m6j3O0k67J50J0K9J52k51L11j45J13l00J01M3
$$ 69 -93 -126 46 154 -104 -6 -117 34 -12 -25 35 -232 -82 -72 -43 109 -142 169 24 137 -163 -62 -19
3985a9Q4q6K9jk02O7M7K34k74J20j17J5J9L7O9k30L22p6j74J41j66J26j8J46j00
$$ -19 65 -21 8 7 -195 -128 -81 153 -121 -1 -118 -103 -84 -47 22 -208 114 38 -136 5 -161 -35 -53 93 -7
4010gk5O6k0P9r3j46lJ30j32Q9l9J27r7Q1j40K09j27o3J45O2k3m9j29L6K22mj69
$$ -7 -32 34 14 93 0 -146 -149 -19 -151 -62 -101 26 -71 10 -130 79 -48 -111 34 96 73 24 -105 -69 153 149 -20
4037b0L2j35J19L7j62L8K3o1O7k2R8j1P4j05p3Q5Q0j81O5l0J82k49J76n1j42J90
$$ -20 12 -123 -4 33 -129 -91 -68 -129 -62 -84 14 3 77 -28 -101 -16 64 -117 -52 -82 100 -149 27 -24 -166 24
4063B4jr3n1J18j17P7M4j09Q2J47k3j7j74J0k4K72l8n4j66K92k61J08r2J82j99
$$ 24 23 -70 -121 -3 -120 -43 1 -108 -26 121 98 81 -93 -83 -107 165 127 73 -93 199 -62 46 -46 136 -63
4088f3J86k37O7P2P9j5q6n1Q9n8l9l2J3M5kJ46j06O7j80O8j09L31k45L3K36j96
$$ -63 123 -114 -47 25 104 89 3 -48 41 -17 -56 -88 -75 -30 -32 114 8 75 -105 -37 -146 185 -60 -27 209 13
4114A3J58q2k4j12Q6m1K6P0q7j12L8p2K13j00J30j58R1j62J47j29J11N2j36q8
$$ 13 171 89 65 -47 39 -2 24 94 7 -105 -67 -139 74 -26 104 -54 37 -125 22 -107 4 56 -80 -168
4138a68J45M8Q9k9o0j11K4lK58l1Ol8j77N6L3q4j61J94j00k6K6J85j11k5l5Q3
$$ -168 -23 25 114 85 25 -86 -62 -65 193 162 168 130 -47 9 42 -42 -203 -9 -109 -135 -109 76 -35 -60 -95 -12
4164a2J12m5j04P7l26L30K0J7k8l9j63R1J38m4Nj18KJ24Ko9R8j25J15j16Q7j34
$$ -12 100 55 -49 28 -298 32 52 69 41 2 -161 -70 68 24 29 -89 -87 37 39 -30 68 -57 58 -58 29 -105
4190a05L11k77q5OL40k37k6J23p0k4r7J85q2p6P5K34l64L18k10L6J51k75K38k29
$$ -105 206 -71 -156 -150 190 -47 -73 50 -20 -44 -141 44 -38 -114 -39 195 -169 149 -61 -25 126 -149 89 -140
4214a40J96q6R8L4k36K00O4j32J4R6j26n4M6L4N8n8q3M6R9m9l7O6j05J7L4j1M8
$$ -140 56 -30 68 102 -134 66 130 -2 12 108 -18 -72 -26 8 66 8 -75 -29 70 21 -16 50 -55 -38 -4 -15 33
4241C3k4p9n5M7J13j15N1L5J0J71k43J82k13K1J1j29K53m6l6J18j29O1L4Jr9p5
$$ 33 9 -70 -125 -78 35 -80 -29 6 16 187 -56 126 -87 -66 -55 -184 69 23 -13 105 -24 37 71 72 -27 -102
4267a02j2J30M3m3Qj12J65j62K01k11O3M5J7K4L0q0J36p4k11P8r2N7L6J17k0q
$$ -102 -114 16 59 16 24 -88 77 -85 116 -95 -32 13 30 54 84 4 140 66 -145 -67 -159 -102 -66 51 31 23
4293B3k8O1K6j05O2j84K36j04O5j43P4O1J21j32Rj51K23j29M0Q7j31R7O2p1j08
$$ 23 -5 56 82 -23 39 -145 91 -13 52 -91 -17 44 165 33 42 -109 114 -15 25 112 -19 78 140 69 -39
4318c9R1M1j68J01L1p0pP1k0n9K0J3r5K12j37m1J68r4O7o0OM4m8o3j1J35j53p7
$$ -39 52 93 -75 26 57 -13 -20 51 31 -28 -8 5 -90 122 -15 -56 112 18 85 25 31 75 27 -36 -47 88 -65 -142
4346a42J83l8j8q8K14j60lJ2R5j70R3O0j33k7P8p5R2P9m5j1k5n9Q2J76k71J07
$$ -142 41 3 -15 -103 111 -49 -52 -40 55 -115 -22 38 -95 -122 -44 -119 -27 52 7 -4 -29 -88 -6 170 -101 6
4372FJ02j33km4j1Q4l8N7%r1no0J81J1%N1j96PJ76j58l6lm4J68n0p4J91L4j96
$$ 6 108 -25 -27 -71 -82 2 -36 21 21 -70 -75 -135 46 57 57 108 -88 -81 95 -63 -99 -102 -146 22 -28 -102 89 123 -73
4401g3P4o1n3J23q7NJ25N6Mj12l4J29j50O6l0Q6K5k0j18q1J38K1j92N1J44p5L04
$$ -73 1 -60 -113 10 -77 -72 53 109 113 1 -33 96 -54 12 -18 68 93 73 -45 -126 12 33 -159 -108 36 -39 265
4428B65l36J18j17R9k4k12L37j07j39q4J34J0l5J01j57J61rq1R4j42N1K5J61j96
$$ 265 -71 47 -70 29 5 -207 130 23 -116 -200 -66 -56 -91 10 -147 14 5 -76 18 -124 -73 -48 113 -83
4452h3q5K5J71l1j62J82p8J90j55k6o0K06j15O2k05K2J25J43j04m2j26J94Pq9
$$ -83 -168 -143 28 -3 -165 17 -61 129 -26 -52 -112 94 -21 41 -164 -142 -17 126 22 -20 -146 48 55 -34
4476c4J03j93J92j30J61j93J92m9p0J90j70q9Q2J3O8M1j99P2PO7M7j41J7J7p4
$$ -34 69 -124 68 -62 99 -94 98 49 -21 169 -1 -90 -8 5 73 114 -85 -13 -6 61 108 -33 -16 1 -73
4501g3J44J7j12L8m0L8j40n6K75n3j80K64j39k2P2K4r4mk7M2l1p7J72om8p0k8
$$ -73 71 88 -24 14 -26 12 -128 -184 91 38 -142 122 -17 -39 33 57 -37 -41 -68 -26 -57 -134 38 32 -16 -86 -114
4528a14K54j55N7M1p2j77R9L6oj37K74j20O7k0M8J01o5p6j59K19Nj41K57j48O6
$$ -114 140 -15 42 83 11 -166 -67 -31 -37 -174 100 -20 47 27 75 176 111 35 -124 95 100 -41 216 68 134
4553A34j1k04L1Q1J42l48K47q3k7J02p8J59j93K6j2j06K36j95J92P7j77%J8j15
$$ 134 123 -81 -50 31 173 -175 72 -11 -38 64 -14 145 -48 -22 -34 -140 96 -99 93 170 -7 -7 11 -104
4577a04K40n0k76K21J42j47l9M4j23J59J21j39j22J0J77j36M9p9QN3l9L2n8J16
$$ -104 136 86 -190 31 173 26 -13 31 -92 67 188 49 -73 -63 114 -22 27 -52 -44 9 -30 2 -56 60
4601F0M1j90J16rJ50k01m0L8p4J04j32N6j43J09O6j2N8j06%j90K49K4O7K5k2n5
$$ 60 101 -89 27 18 168 -33 -73 -35 -109 -5 -137 -81 -224 -115 -49 -61 -3 -109 -109 -299 -50 -26 41 66 44 -11
4627a1R7O1j84m2m6P9J36j66J9k0NJ2k0J7L2O4l5mJ81j77k32K36N1r7J14j12M9
$$ -11 86 147 -37 -79 -125 -46 90 -76 -57 -77 -72 -60 -80 -63 -31 33 -2 -6 175 -2 -234 2 53 -44 70 -42 7
4654Gl4j85L28j66M7Rj56R5J25j6j64J2N2J38p7o2J36n0l2J7N3k69Q2R2k7J61
$$ 7 -27 -212 116 -50 -3 6 -150 -55 70 54 -110 -98 -46 92 15 -47 89 39 7 24 77 -192 -110 -18 -45 116
4680A16n5N9o0j65L21j05p7j25K7L6O2J04p0j04K5Q8p4qP7m6q7J1Q7j2l7j09Q3
$$ 116 61 120 60 -105 216 111 34 -91 -64 -28 34 138 68 -36 -11 77 3 -5 72 26 -61 -50 37 25 -12 -121 -38
4707c8m0P7M6j14n5J08O9LJ5j61J99j76J75M4q7M1m1K4m3j3j06j31J84L0j16K48
$$ -38 -78 -1 45 -69 -124 -16 53 56 71 -90 109 -67 108 152 65 106 65 89 46 33 -73 -204 -20 10 -106 142
4733A42j75n0Q0P7q3n9J81k16R1q6J70j6n9R8j52L6Q3j4o6J30j7j40n6j63K73
$$ 142 -33 -83 -3 74 -9 -68 113 -103 -12 -98 72 56 -3 95 -57 -21 62 48 -18 112 95 -45 -101 -264 9
4758IMLj56K40j50N1K04j65j42O8j09O7M0l7P6Q2l2Ml8m0j72J24P7j10K25j27
$$ 9 13 16 -140 100 -50 1 205 40 -102 -34 -143 -76 -36 -73 3 85 53 57 19 -21 -193 -69 8 -102 123 -4
4784dj86J02J59l9K05k31qJ21n9n9q6J54N8j20K5K2L7j5o8jP0k07J11j48J16o6
$$ -4 -190 -88 71 32 237 6 -2 119 60 1 -85 69 127 7 32 54 91 76 8 7 77 -130 -19 -167 -51 -117
4810a17K03j04l6j26J74o2J0J62j73J07j12P9J25j41J66j24JK7N0r8NM8m6l7L0
$$ -117 86 -18 -54 -180 -6 -68 -58 104 -69 38 -74 5 130 -11 155 31 32 59 109 11 16 64 18 -19 11
4835A1O6k66L35l13K01l1R1Pk27J11q3J27k0J8M7j05j08J39L2J17k47R9J1J7R3
$$ 11 77 -189 146 -167 34 3 94 101 -126 -15 -98 29 9 27 74 -31 -139 0 32 149 -98 1 12 29 122
4860A22j26R8j55J7n2J55P9j75R0p1k1Q0j45p7L00j57j5L6j47K24M1j4j32K03
$$ 122 -4 94 -61 -44 -96 59 138 -37 53 -18 -39 41 -104 -181 119 -38 -53 -17 -164 60 101 87 -45 158
4884A58p5j05o3J68J12j09j46J49o7j6J60l12%K51r7J17r2Qj17j3N3rm7N6M1N9
$$ 158 83 -22 -85 83 195 86 -60 89 22 6 166 -146 -146 105 8 125 33 41 -76 -89 -36 -45 -92 -36 5 64
4910F4j65Q3j50J27kQ7K9n8j29K17j48J69j65L1M8o1j6J4k9j16K54L1q0N3j15
$$ 64 -101 -18 -168 -41 -43 44 73 15 -114 103 -45 124 -41 -10 38 -23 -39 -25 -54 -170 84 115 35 88 -27
4935b7L0J88j55n7m7P9j38L4p3J14J65k48l9K21o3RP2o9N7l3R5jj50M3p2Ro3N3
$$ -27 3 191 36 -21 -68 11 -127 -93 -166 -52 113 -135 -174 47 -16 -7 65 -4 53 20 115 114 -36 7 -65 -56 -119 -66
4963f6k3J81l34K27N1p6p1j9K28K5j58M0j5O4j5j04mJ66q7m2J47j15M8j43P8l
$$ -66 -89 92 -242 -15 36 -40 -111 -130 98 123 -35 5 -10 54 39 -65 -69 97 10 -32 115 0 48 -95 -17 -20
4989b0J5J85j16j23O1R7j04j07K22p1Q6n5k6j86P9M6J70j44j08L3m8K57p5q2M2
$$ -20 -5 180 64 -59 2 99 -5 -112 110 39 125 70 44 -142 -63 -17 153 9 -99 -66 -114 143 68 -14 28
5014B8M8j43Q9m6k0L2L6qm4J14k30K19Km4l7J77k24R1Q1k13J20M3K5j03Nl7J70
$$ 28 76 -67 22 -24 -44 -12 24 16 -28 86 -144 75 77 33 -4 173 -51 40 121 -92 28 71 96 -7 -2 -39 131
5041A31m3j92o1Q1J15k1k9Pk9R8k21L66j09j13m2J30j30N3q3J83p5O2j68J24j09
$$ 131 88 -104 -165 -84 31 10 -19 -12 -41 57 -164 202 93 -20 -62 68 -62 -9 -92 91 16 78 -90 34 -75
5066g5Q9P7kk8p4J52j32J14l8j13J02l02K75k64K03O5k16J18J8p1P8O9lj53K03
$$ -75 14 91 89 61 -13 139 7 121 83 -30 72 -230 45 -219 -16 49 -167 -49 -31 -102 -24 45 42 -111 92
5091I2j18J01Q5j74L2p4o2K52l07L0K76Mj79K4J0k0J61j46K9q9O5o5J65L0r5Q
$$ 92 -26 75 160 -14 18 -56 -118 134 -173 -143 133 137 -42 -18 -8 -28 133 -13 16 -73 -8 -73 92 122 27 35
5117C5k2j67R8j4J32j63j38M23j69k9L7m6P0j83j24L90k66J3J19j28J19L6j8O8
$$ 35 13 -154 -56 -70 62 -101 -239 184 15 -14 23 -23 47 -136 -260 130 -136 -123 -4 -132 -13 23 5 73
5141G3j87N6p7J58l9K24j27j57J44o8k1k3j7N5J5j08M5J00q8q3J72N8j26J79k42
$$ 73 -114 -58 -135 23 -16 208 81 -76 68 0 -21 -44 -61 -6 9 -99 -54 46 -42 -125 47 105 -21 158 -84
5166h4J16j39J66k00l3J88n6K40k57Q8nn2L5j34J35Om8j19N4K7l2J69J46j05k14
$$ -84 32 -107 59 -141 -174 14 -42 198 -59 29 24 -28 7 -127 8 14 -34 -153 -99 -72 -104 65 211 106 -108
5191a08O5J85o0j74J76j90J49p9j7l4O7j56K23p6J25p2o8L8J37j49J88l11J55
$$ -108 -43 142 82 -92 84 -106 43 -36 -53 -87 -20 -176 47 -29 96 24 -44 -6 131 -18 170 -141 14
5214A4m6l3R0j16J63n1j7nK32k49K41l13J15j83J04J57k61J64p5P6O4j50J11m3
$$ 14 -32 -65 25 -91 72 21 4 -1 231 -18 223 -90 25 -158 -54 103 -158 6 -69 7 71 -79 32 -11
5238a1J0Nj09J50p8M8Q5O9j01j27J5MK32k41P3rk2j2n7M4J40j56j07K67j24M3
$$ -11 -1 4 -105 45 -33 15 100 169 68 -59 -44 -40 192 -49 24 15 -7 -19 -76 -32 108 -48 -155 112 -12 31
5264C1j03P6j3K36k11o0RL0J14ro3j40Q0m6K04j41l8K0j1J02jo0N2N2j79K82j95
$$ 31 -72 4 -9 227 16 -44 -35 -5 109 100 37 -103 -23 -69 135 -6 -44 -24 -35 67 66 6 58 110 -69 213 18
5291A8j87K20o3Qp9J76k1o9n3J00m6Q3j20J51j11j50J67M0j58K04k13j90L50j20
$$ 18 -169 51 -12 -4 -83 93 72 3 -50 50 4 87 -33 118 7 -143 24 64 -94 110 -103 -293 57 -63
5315f3J56k04J41j30J05K9M9kL3j30j66J33R0qP0j10Jm7J67j86k6J88p0m1l5J29
$$ -63 93 -111 30 -100 5 34 83 81 114 -16 -182 -49 41 33 103 -7 -6 -53 114 -72 -98 90 20 -21 -56 73
5341G3q4k29J79R7m8p7Q0j0O2j71J79p4P4M4j96J09j35N5J18p9j16J8J08JJ11
$$ 73 -11 -240 -61 36 -12 -89 -9 -19 43 -128 51 -23 51 95 -101 8 -127 -72 46 -33 -149 -131 -23 -22 89
5366H9n2k30K13M9o7n4J56j20q7n4J80j8N2R4j33l3J15o6j05L9j38K95k01N5N1
$$ 89 37 -193 20 69 2 -52 104 -16 -103 -157 23 5 57 151 18 -15 100 34 -71 -32 -170 125 -76 -21 30
5391C0oj23J03J3q7J63q7N3KrJ9Kk90M00k17l3K36l32M00j85j02J60r1m1Pl9R3
$$ 30 24 -99 4 17 -70 93 6 59 61 52 71 73 -217 183 -34 -67 169 -163 237 52 -50 110 19 -22 -15 -54 39
5418C9Mj03M8j26K45j12N1K3n1j68K10P8k63J17K16k75Q4j27J23N0p1r4M0j03
$$ 39 43 -60 -12 -138 107 -5 46 69 18 -150 60 138 -125 -8 208 -67 17 -110 13 63 -8 -102 -62 -165
5442a65P3K5l0r3K01l5L1o0k2j32J66p7J64J5M1j92J64o0j6O3j60J82n3j61J86
$$ -165 -92 -67 -97 -190 11 -24 7 -53 -75 -207 -41 -118 46 61 102 -90 74 14 -2 61 -99 83 30 -131 55
5467E5j87K30j21lr2J32K2j0j2L1m5%J20j48K0j15R3l1J00O5l7r5J05j46M6%N5
$$ 55 -132 98 -23 -26 -118 14 36 26 14 45 0 0 120 -28 -8 -123 -30 -61 39 104 67 -28 77 -69 -23 -23 32
5494C2K1M4k50J99o7J88j27L9j35lJ64k21J08m1P7l5J14k45J58J56j15q0L0O8
$$ 32 53 97 -153 46 -21 167 40 79 -56 -59 105 -116 -8 -49 28 -7 107 -138 20 176 61 -19 11 79
5518G9N4j53j05J14q9J07q7J63j1O1k49R1J03m3M3qk5j81J10p2J17n1QKL3R8p2
$$ 79 133 -20 -125 -11 -100 7 -80 83 72 133 -116 -25 78 35 78 70 45 -136 -26 -98 19 -32 -24 -22 11 109 37
5545C7m1j22K29k13J7K45o7m0O2p8K0l0j64J01kM5pK8q3J17k0j60L19k67J63r7
$$ 37 -4 -126 103 -110 -93 152 85 45 107 29 49 19 -145 -44 -46 -1 -8 20 -63 54 34 -126 193 -74 89 -8
5571hK0M3k01K74j20J8L0m9Lk7p7J75o2lj67P1o7J7R3o5K40k25J27Q9j39j07J1
$$ -8 12 55 -146 128 8 26 56 7 10 -17 -94 81 19 16 -151 -80 -147 -130 -37 -102 138 -87 40 129 -10 -117 -106
5598a06M9J26k6P4j52P9n9j05K93k64J08n7p0J72%p6P7k9K0J6j81RJ36r9o6K25
$$ -106 -57 69 43 117 -35 44 -15 -120 173 -91 17 -40 -110 62 62 -14 63 34 54 70 -111 -102 34 -65 -131 94
5624I4j56Q5J2j56L37j43Mj51J32k5j10K33l9j13j63P1J03P7n5Nr0J09j82J08
$$ 94 -62 23 35 -121 216 73 77 -74 58 33 -77 156 117 4 -159 -88 15 92 37 42 -48 61 -121 -13
5648a3ll4p2K6J55J23M2k82Q6j18J46j39q5J28J79m5Jq3j31Q9M5J59k35J97n4
$$ -13 -16 -50 -122 -96 59 182 224 -58 28 -90 56 -83 -168 -40 139 94 95 12 -119 -30 15 174 -61 136 82
5673H2J8q7j6R8j4j19J4O6k1j76J40J7Q4J05k53Q7j9O0jm1j06J9Q0jJ09j81l7
$$ 82 100 13 -3 95 81 -38 -24 42 21 -155 -15 2 86 191 -62 25 6 66 65 24 -82 -63 17 16 125 -56 -93
5700i3J05j3j6j13J44m4L9l7O1j25MP7Q5j10m9L3pJ5P7p5J87j23k8%J23k03M0
$$ -93 12 -1 -17 -130 14 -30 9 -28 33 -92 -88 -11 74 -36 -85 -52 -59 -44 33 -42 145 22 -6 -6 117 -86 -46
5727d6qM8J20j32J21k04m8J87L7p2L9p3K21j31j38N9oj26J32o2j4R1J27o1O7L3
$$ -46 -54 -6 114 -18 103 -101 -149 38 75 3 42 -31 190 59 -79 -20 -26 -152 -20 -82 -96 -5 122 61 128 161
5753A61q5o1n9L2l9J07k6r6j9K96j41l5Jl4j44J67o4j31J44P7Mj65Q1k3o3J34
$$ 161 76 15 -44 -12 -51 56 30 -66 -85 211 70 35 36 2 -142 25 -39 -170 -26 51 55 -110 -29 -52 -115 19
5779A9j30J30j37NJ72j28p7J86J1j46J12o7J91p0j23L24l40J20j35P3K3k6L2p3
$$ 19 -111 19 -118 -113 59 -69 -146 40 51 -95 17 -50 141 71 -52 272 -68 52 -83 -10 13 -13 19 -54
5803e4Q0O1m9m4Q7j89Q8r2K35l7k73K18Nr8J76n0j55m3L04k16L7j6M3m4q7M4n5
$$ -54 26 87 38 -6 81 -108 -20 -112 123 86 -187 31 36 -62 114 64 -91 -134 170 -46 -9 -25 18 -26 -113 -69 -124
5830a24P2R8n3Jj7K5nJ09j19J05n6O0j79J07L5Oj8ol8N0L2q3j42Q5k5j5J57p5
$$ -124 -52 46 -7 -6 -23 2 -3 106 -13 92 36 96 -83 24 59 65 47 41 3 53 85 2 -140 -55 -80 -95 62 -13
5858a3R4kJ2k1Rj9Pr7Q6J9j14K8J0J38j00j57Q7J08l1n5M3j21Q1J3J9j36j1J76
$$ -13 81 79 91 70 79 60 67 -30 56 75 -39 -11 -1 137 37 -120 -33 75 44 -11 32 -89 -8 5 24 -112 -123 53
5886E3R0j67Q9j85J66J11k08k7KJ7L1k2K9Mj06K41j91J96k04L2R3j27Q3J5j1m3
$$ 53 143 -24 65 -120 46 157 -51 -78 -76 -59 -28 -50 -21 -17 -123 118 -73 123 -81 -49 44 -83 0 15 4 -39
5912c9K5l5J79j30J4k02M3K88o1j84o2K36qj17J27l7L4k56J84l6J50k06J15j06
$$ -39 -14 -49 130 0 14 -188 -145 143 82 -102 -164 72 64 -53 74 37 71 -185 -1 -37 113 -93 22 -84
5936h4P0K0M2m8k5P7M7j83J12j02P0ok8JR4%o6L0j5J21k16K56j10p8j1J02m0j61
$$ -84 -14 6 48 0 -25 52 99 -84 28 -74 -4 -10 -38 -37 57 57 -9 21 6 127 -89 167 57 -21 -32 70 30 -131
5964a31J02j28L5K66j97P6j98J92n0K18J2k22M1j50J45P9j03j48K32p4k07L08
$$ -131 -29 -157 -122 144 -53 23 -175 17 -33 185 197 -25 16 -134 11 90 -13 -161 71 -3 -210 98
5986I8j35O6j21J75j62Q2r8Q1Ml4l2J28K7j55J44n1Q3m9m4q1O4J41k23J31P6n8
$$ 98 -37 29 -92 83 -79 3 -95 -14 -10 -44 -76 52 79 -76 68 17 100 51 7 -74 -10 131 -92 39 115 57
6012E7L8k1k34O0J15rQo5O3LQ2j04P7j42J70j18j3J07j01j30M8J38j71L9R1J62
$$ 57 95 74 -160 -100 15 6 14 -51 12 15 97 -7 70 -72 98 -20 -33 74 -27 -157 -109 29 -142 -103 -12 150
6038A50m7j69J31J4k02K01k47J07P9j70K07m7O3j16K9L5r1K34l03J03L5J01j85
$$ 150 103 -66 65 79 -123 78 -169 -62 17 -153 54 7 70 -46 -17 18 -73 161 -142 -39 -4 97 -88
6061h8O7PJ14k21R0j3J9k0k2J33m0k9P0k24m3K6l9K80m4M7j19j0p1Q2M5P3j31
$$ -88 -21 -14 100 -121 -31 -44 -25 -45 -67 66 26 -3 67 -157 -200 -174 -213 67 23 70 -49 -59 -130 -48 -3 70 -61
6088f1KN3Qm8R3j51P3M5j57R5J48r9j07J99j69l2R5Lj0j91J99O1j47N1J39j39
$$ -61 -59 -6 2 -46 47 -104 -31 14 -143 -48 100 1 -106 93 -76 -108 -13 -10 -20 -211 -12 49 -98 -47 92 -47
6114d7J23j8n4L7k12J99J9q6m6K1J27m1k6k1m5O8j7J56k98R2J8Q7j18O0n2n8M5
$$ -47 76 58 4 41 -171 28 47 -39 -85 -64 63 22 -4 -25 -70 -2 -19 137 -161 -69 -51 36 -82 -22 -74 -132 -87
6141h7J6K71k16J46j46J48p2j06P2J23r0k9j99J95J15j65l1J23l8J5k07P3J8N3
$$ -87 -71 200 -16 130 -16 132 60 -46 26 149 59 30 -169 26 141 -24 -55 68 30 45 -162 -89 -71 -18
6165a8J12j75J16l7O3Jj58K2J31j00r5K22o9m9J75j57L1K3r2Q0O4rj20K13j50
$$ -18 94 -81 35 -2 61 62 -96 -74 57 -43 -138 84 15 -34 141 -16 15 38 -54 26 90 81 -39 174 24
6190B4N4m6j50K49n0m2Jo7J4p1pJJ38j00q8KK85j63Lo9n5J3R8J05l3J7k12J07
$$ 24 78 32 -118 131 81 39 40 -27 -13 -84 -91 -90 48 -52 -140 -138 147 -16 -13 -82 -137 -124 -26 79 46 63 -149 -42
6218d2L37k83M5J47k55R5O7j49J32q9J78j76l7oK26r3j25K16j62jM2j73MM0N7
$$ -42 295 12 57 204 -51 44 111 -38 94 5 183 7 -30 -36 190 97 -28 188 26 25 67 -106 -102 -62 -5
6243eL5r0K24j50J3j74K09%l8j22j74L59r1jp7P0J9p7JK1P7k5n7J70j25q9J6J06
$$ -5 30 -60 164 14 27 -147 62 62 24 -98 -272 87 -4 -5 -82 -12 7 -70 -69 -48 29 4 -53 117 -8 -97 -81 25
6271B5r3l6M1J5J20j53K43j22J69k64J36p0J33j60k8kK2N1j3O5j0O1j90P2P6o4
$$ 25 -68 -104 -63 -48 72 -81 162 40 209 -55 81 11 144 -16 -44 -46 -24 27 14 79 69 130 -60 12 88 24
6297B4l2L8j14Q5o1J32j95J6N6J63j17P5j23J1J11oj53J52j7O1j80J45j33KM8
$$ 24 -8 30 -84 1 -60 72 -123 -107 -51 112 -5 70 -53 -42 69 63 -90 62 45 106 -74 71 -62 -60 -12
6322a2m8MK1Q4n8rk78K78l3N8j02K48j18j27J78or9N3N9j03p5J67j50J46q0r8
$$ -12 -60 -56 -35 49 -9 -18 -296 -18 -51 7 -95 153 35 -92 86 80 -19 34 93 -10 -85 82 -68 78 -2 -100
6348a00m9L26r4j64K11j27j34J73k7q5MQ0o5L0n1J29j82K9J34O9o6j2O2rJ00k68
$$ -100 -149 177 83 -81 130 3 -131 42 15 -70 -66 14 -51 -21 -72 57 -125 -96 38 107 41 29 91 82 182 -86
6374h6J83j68M1k7J71R7r9k42L20j86pj03R4j75J63O2lj12N6q0M3M9j05J00K3
$$ -86 97 -71 -30 -57 114 211 112 -130 190 4 -3 -106 -12 -187 -24 38 35 -77 -21 -101 -58 -9 -114 -14 9
6399In3k19L40j43O0MJ1N5m0M9q3J69k09J2j7op6K52k30KN8K8r9J12o7O6l0k4
$$ 9 -44 -263 77 -66 -6 -2 9 64 24 73 -10 159 -50 -38 -55 -61 -137 115 -115 -113 -55 -27 -126 -14 -81 -15 -45 -69
6427f9p9M5N4k5J10j8k33L06k8M1j5q5L1j11J8R2K3j9J4j40O7O4L8n0kj06R6L2
$$ -69 -148 -103 -49 -74 36 18 -215 91 63 104 89 4 35 -76 -58 34 57 38 52 -88 -21 43 81 31 29 -77 19 51
6455E1l1O9j79J66r6J9J44k48N4l3K8J08K0j83J40p3P7j14J19pn2l4R5k32J28
$$ 51 20 89 -90 76 -20 -1 143 -105 -51 -84 -56 52 72 -111 29 -44 33 -81 38 31 -21 -55 40 -192 -64
6480f4Q8N0j90J20O8k85K51j01J23r4j51L71r7r3j16J77j4n8p5L0J45j48J06J56
$$ -64 24 74 -116 4 72 -213 38 -63 60 -34 -185 186 89 -4 -120 57 43 -15 -90 -60 85 -63 43 199
6504A99k25j05R6K05j31j1j01Oo0r3J94J72j39j36J64PJ9m1j90N6Q3kJ60o9p3
$$ 199 -26 -131 -35 170 39 28 -73 -67 -127 -220 -26 146 7 -129 35 42 61 20 -170 -114 -31 -33 127 58 -15
6529a5n9Q3P2l9n1k3J10K3M8n0Mj76J19m4R8o7jO2n4J1j14N4p8M1q0K1j4R3P6
$$ -15 -74 9 81 42 -9 -32 78 101 149 99 103 -73 46 2 100 33 32 94 40 51 -63 -9 -87 -46 -126 -105 -119 -26 50
6558E0p6K0k04J77j1n6Q7L0j17O5mr2R3P2n6m7R2R1R4j44l7K3p5l9J57o1j10O5
$$ 50 -26 -6 -210 -33 -44 -100 -13 17 -100 -35 -39 -131 -38 34 -22 -69 23 114 208 64 27 50 -25 -64 93 32 -78 -13
6586a3J20l1P2q7M9l8j98L11l20P7j7K12j47l4m9p0J54J0p3O6P9Rn9J73j01l2
$$ -13 107 76 148 61 110 72 -126 185 -135 -58 -75 137 -10 -44 -93 -163 -9 1 -72 -6 73 82 23 196 95 63
6612F3q5O8N7k9j70jl2J35q7N2j32O1j18Q7RJ10J05j35J19J4j48K0r2J94j10J34
$$ 63 -22 46 103 74 -96 -97 -129 6 -81 -29 -161 -100 -218 -131 -122 -12 93 -42 77 91 -57 -37 -129 65 -45 89
6638H9k95K13L2n3j30J25m2o4J59j18J36j8M2R2j36j86K87j34M3n4P1p2J15j60
$$ 89 -206 7 39 -14 -144 -19 -61 -125 34 -84 52 34 76 168 32 -154 133 -1 42 -12 59 -13 102 -58
6662e8J68m9j21j34K23l05L91k22J47j0j7o5j05J71O6j68L0J4n3J34j22K09P1
$$ -58 110 61 -60 -194 29 -276 115 -107 40 30 13 -52 -157 14 80 -88 -58 -44 -97 37 -85 124 195
6685A95k40n4O8P2j60J55L2j01P9j31N6J11j83J71j42J00k31N5J54O3j15J58j84
$$ 195 -45 -99 -31 41 -119 36 68 -33 46 -85 -29 82 -101 70 -72 28 -203 -148 6 69 -46 112 -72
6708g2O7O3l1J1l8J23q0J9j14p8m2L88k63J40r4pO8j7j15om6P7J02j55K13o8L0
$$ -72 -5 58 27 38 0 123 43 62 -52 -130 -172 216 -47 93 -1 -8 60 43 -72 -78 -124 -47 55 -100 113 45 75
6735G5L3k92J55pk5O5j26J4Q1l5Q1k2R2j22j1N0O6j20J81k07Q9o4Q9R6N6j92L9
$$ 75 108 -184 -29 -36 -61 4 -122 -108 -27 -62 19 -3 89 -33 -44 6 72 -48 133 -74 15 -49 40 136 192 0 39
6762C9J37r7q3j8j46R0J19r5L3r4J5J58m0j34L48r7o4Ro9j29M7N1J69j57kO1J30
$$ 39 176 79 -4 -22 -168 -78 41 -54 -21 -115 -100 58 18 -116 232 135 71 80 11 -118 -71 -20 149 -8 -10 51 181
6789A81k84N6K8NJ35r5k2%J63j58R2j31O4J4k3n2J3P5M0k63K07jJ81k26q4J55
$$ 181 -103 -47 -19 -14 121 26 4 4 167 9 101 -30 34 48 25 -27 -14 61 101 -162 45 44 225 -1 -85 70
6815G0K9j32K50k58j29J01J9J22j52NJ71j56RM9K2m0l8m3J42n2k8m5P3l5J47j91
$$ 70 99 -33 217 -41 -170 -69 -50 72 -80 -75 96 -60 -51 -2 20 -20 -58 -101 41 -11 -39 -84 -11 -46 101 -90
6841i0J39J91j06k34j21L79l33K32L7j66O0J33j29j12O5O7j28Q0J75r3MK1k08
$$ -90 49 240 134 -100 -221 158 -175 57 94 -72 -12 121 -8 -120 -55 12 -116 -36 139 46 50 71 -137
6864a37K9Q7J54j87n8Q2J32o4j38Pl6J59l10J67J13J65k04P5M2k21K73k47J47
$$ -137 -108 -21 133 -54 -112 -30 102 38 -100 -93 -129 30 -280 -113 0 165 -39 36 78 -143 130 -117 30
6887C0K0J0l2pO5o6L8ql5j14L6N2J42j59P1j98N8J64o8o3J29n3o1J46k3j54O5
$$ 30 50 60 28 21 86 20 58 50 15 -99 -63 -11 131 -28 43 -155 -97 67 -1 -64 65 12 -49 97 74 -80 -15
6914a5mJ9o3J78j53J04N7m7n5M1j11o8N3L8M6P3j36J86k10R0J9l9nL0l8J7R6k44
$$ -15 -19 0 -63 115 -38 66 123 76 21 62 -49 -117 -64 -26 20 93 -43 143 -67 23 42 3 -2 28 -10 7 103 -141
6942a41K59Kk01M0J26j68J19k3m0J47k43J49j46K29o8r4N1m9J98j43P6N8o4j4
$$ -141 118 120 -81 -41 85 -83 36 13 -27 120 -123 26 -120 109 41 -53 -2 -51 147 4 80 138 74 60
6966F0j41R3m8o0K4O9j3j8r1J49ro2P5J01j42K2k2JOq8J54n3l9L3O3O0j44j18
$$ 60 -81 12 -36 -96 -72 -3 -16 -34 -125 24 15 -47 28 129 -13 9 -13 -12 -6 -94 60 7 -32 1 64 124 -20 -138
6994a38J27j94K20k5n0o1P7K6n7J14j42P7j1pJ31p3M8k3m7j44j6K14m2q8J73j26
$$ -138 -11 -205 15 -10 -60 -121 -44 -18 -75 39 -103 -26 -37 -44 87 14 62 39 -8 -152 -168 46 4 -84 89 -37
7020c7Q0l7L6n7j61L04q6k47J90L2L8J19k51Q7m8R6l5j12O8M5k1j33K64j94o4
$$ -37 43 6 42 -15 -176 128 42 -205 -15 17 55 174 -77 10 -38 58 23 -89 -21 24 3 -130 134 -60 -124
7045a24K18j85J5M6o6J45k0j02J43l9Rl3K05k93L9J37p5j03Q0Q9j74K2K21j02
$$ -124 94 -91 -76 -30 -96 49 29 -73 70 31 40 7 212 -81 -42 95 20 -83 -3 86 -88 -66 155 53
7069E3o7J01j39K4n2QN6j4J8N0o7j05J1O9j6M2O1J55m8k25L2P0O3o1L8j2R7j20
$$ 53 -14 87 -52 -28 -80 -72 -16 -30 -12 38 -29 -134 -123 -54 -70 -28 33 188 140 -85 -53 17 80 19 57 45 142 22
7097B2n0l5Q3k9K4j31m3N9J85j59Q7j15L18k61K6M4O5j03M3j40J0P9k9K50k13
$$ 22 -28 -63 20 -9 15 -116 -159 -100 85 -74 13 -102 216 -45 -19 25 90 -13 30 -110 -100 -21 -50 200 -13
7122a3O5M1n7n3k7rP6j73K21k03K64n3o6j8q5O2j63P3N5O4r6K33q2j74L07j71
$$ -13 52 93 36 -17 -44 -53 23 -150 71 -132 132 79 13 -5 -90 -28 -191 -118 -63 1 -95 138 56 -118 189 18
7148A8k05K46o3j27J27J1j12J22n3k7J70j77O0Q8j57K56k12n6J21p9J42p3p1O5
$$ 18 -187 59 -4 -131 -4 7 -105 17 -36 -63 107 -70 -10 78 -79 177 -35 -91 30 -49 93 20 -51 14
7172A4m7P4j00K6L9k9N2M5N8j51J08m6k1nj47J18j9O6O1k06J91j26k34M26j76
$$ 14 -33 41 -59 -33 6 -23 29 74 132 -19 89 43 22 17 -130 -12 -31 35 96 -110 81 -45 -279 147 -29
7197b9Q3k07J91j75K09j44K5m3N3J43k87K45lJ53k19p2J59j08P0j51K51k03J22
$$ -29 54 -153 38 -137 72 -72 -47 -90 -37 106 -181 64 61 214 -5 -77 82 -26 44 -107 144 -59 63
7220F3o5L8p9J26q5o6M6M3J41k32J21j67J27j09K32m6k47J32Q3j01J80p0k9m2
$$ 63 -2 36 -43 83 -2 -68 -22 21 162 -70 51 -116 11 -98 134 88 -159 -27 56 -45 135 65 36 -6
7244fr8J63l1j2j32J59L9r4n3J36j95J87r9m9J30l3jJ2l0J83q2jj87J88k12K32
$$ -6 -104 59 28 16 -116 43 82 -12 -65 71 -124 63 -36 -85 45 12 11 23 -7 176 94 93 -94 94 -118 114
7270A14p8m5o9J9M2K29l4l98L04j35J66M5p8o0O0q7P3r7o5Q7j26J57l0Mk6m0k9
$$ 114 36 -9 -78 -59 -17 212 178 -220 84 -51 115 160 82 22 82 -5 68 -29 -94 -7 -133 24 -6 -2 -28 -68 -97
7297i7K14j09M8Jr6K08j42k5m7J24j50j5m6K51j08o0N7Q4j45Q1Q5p2PN6q6r6K83
$$ -97 117 8 56 57 -39 169 27 2 -45 79 -71 -86 -132 119 11 -49 8 92 -53 28 113 41 48 104 18 -78 205
7324B05k20l4jl8K1J25J1n2j34J05q0K24m6J5k51l7J63j7k6J30j60N6l7J09r7
$$ 205 -15 -49 -50 -88 -67 58 69 17 -117 -12 -92 132 86 101 -150 -187 -24 -41 -67 63 -97 -41 -78 31 -66
7349f6K08r6l6k9J1k6N4PL8j25OJ05n1m0J95k05N7O7p0j21L1J88k39J86j42K5
$$ -66 142 46 10 -19 -8 -34 20 27 65 -60 -54 51 0 -40 155 -50 7 74 4 -117 -86 102 -137 49 -93 -68
7375f8Q3n9m9O2N9q3R8r5J13j85L02j42jj46M2J71j63J32J0j35J06n8M4k1N5k91
$$ -68 15 -44 -93 -31 28 -55 43 -52 61 -124 178 36 35 -111 -69 102 -61 71 81 -54 52 -6 38 17 72 -219
7401b19J96M0Q6J02j25k01J29N9j57P7M6L3n5k3J48p9m7n9J15P7j33rk3M6p3Q2
$$ -219 -23 17 103 205 80 -121 8 67 -90 -13 33 66 11 -12 136 57 10 -49 66 143 10 1 -22 24 -49 33
7427C3k1pj23L00k33R6j51j52L60K8l05J55q6j3J85K4j53l9J33p6N9NP5k80K41
$$ 33 12 5 -118 182 -51 45 -106 -258 102 130 -175 -20 -106 -119 66 90 -63 -102 31 -45 14 19 94 -186 55
7452E5n0MN7k7n0J2K5p1M8N2J9l9k1l5m0K3K07j63j92K82l2N9k73L13m2q5Q1p0
$$ 55 5 9 66 39 -11 1 26 -45 3 55 74 35 14 -21 -61 -38 169 6 -186 96 64 123 -150 163 121 36 117 47
7480D7k16O8K11j46L3j6J58k41J19m4o3J9J09j24Q7r2J10n7j7O8L2R7j18J6Ol1
$$ 47 -169 -101 110 -36 -3 -19 139 -102 17 -27 -90 -71 38 -86 1 -91 19 -38 -55 13 45 142 24 40 46 15
7506A5O0J09k57J02j24P0l5LJ47j28J4PP7j0o4j27R7MO4Q4j96J82j34J63k16J23
$$ 15 75 184 -73 29 -95 -25 -60 -57 90 -38 -24 -17 60 50 -14 -141 -44 -40 24 108 -88 94 -40 123 -93 30
7532C0J42j94o9J21L5m9Q4j79K41q1P0j03j2p4J17q1R7j70M7J01n3J2J1r0lk5
$$ 30 172 -22 -91 30 65 16 100 -79 162 81 151 48 36 -38 79 -2 95 -75 -28 73 20 32 43 -47 -50 -75
7558g5Q8J6m0NJ35j25M5N4j07M6j3Rj5k10J34J4K2Q9q3LO1M3j18P1J05m1r9O4
$$ -75 13 29 -11 -6 129 4 49 103 -4 42 29 38 23 -187 -53 -39 -17 72 -11 -8 53 96 -22 49 154 113 14 78
7586G8j86J01l6J36k03J40j53J44q4o4O4n2J25r0J36l4Q1j62J39Pk5j71R1J27
$$ 78 -108 -7 -43 93 -110 30 -123 21 -63 -127 -63 -115 10 -80 56 22 103 -59 80 87 62 -109 -18 109
7610A09j20r3J74j10R6n9K1l1R6k74J35K57r9j28L3O3j17l2PO1j10n2K98J00l31
$$ 109 -11 -104 70 -40 56 -3 18 -13 83 -191 -56 201 102 -26 7 70 -47 -79 -72 -11 -121 -173 125 225 -106
7635a06J34j03K10l9q7r1J86l4j25m5J06j0J74j36J12q8j2r5J52k8j29m4k3P2
$$ -106 28 -75 135 96 9 -82 104 70 -55 -100 6 -4 170 34 146 58 46 -49 103 75 -54 -98 -121 -49
7659d9M6r1J51m9K24k09O0p8K3Q1m0j29J06p1Q6jr9J76j65N5Q3J13l54J69qM9
$$ -49 -3 -94 57 8 232 23 83 5 28 109 69 -60 46 -25 61 60 -39 137 -28 27 110 223 -131 38 30 79
7685G9N5o7l5k5n3n2k0J98l1j5m5M5mPn2r8M3Q9J82j71K2K41l66O9p1N1K41j94
$$ 79 134 67 32 7 -46 -98 -118 80 49 34 -11 34 30 37 -15 -113 -70 19 201 30 52 293 -73 -4 -75 -24 217 23
7713B3J01l08j0K52q4J25j15N1L9j6n2M1j10J2N0M8j71K5P9NR2q5j02J95l0o5
$$ 23 124 -184 -194 58 -26 99 -16 35 74 58 6 47 -63 -51 -1 47 -124 -99 -20 -15 77 -8 -110 85 55 -10
7739a0K14p7j91J33l9O3l7M3k2j20K8m1N2q9J58Q2k15K66k84p0K57j65r0J94n8
$$ -10 204 127 -64 69 30 93 56 99 77 -43 -15 -56 -4 -93 65 147 -68 198 -86 -156 101 -64 -154 40 -18
7764a8j6p4J87J4q2j29l6K34Nq6L7J9j23K0r3J59m0n2JJ61j88M6J16J03r2m3P7
$$ -18 -34 -108 79 93 11 -118 -154 80 85 -1 36 55 -68 -48 -141 18 -22 -74 -73 88 -100 -54 62 165 73 30 107
7791A07O2k64J28O7q3O6J2l1j45M0M6J36j24n9M1r4N4J30j70k9J37j22J17j33
$$ 107 169 -95 33 100 17 83 95 64 -81 -41 5 141 17 -42 -1 -95 -41 89 -81 -110 27 -95 22 -111
7815a11L3J32P5m1j27oM1O3q7M4m3n6J18M6j32P0j54J92K6j00J08j73K88j97J72
$$ -111 -78 54 129 88 -39 -45 -4 59 -28 16 -27 -83 35 81 -51 19 -135 57 83 -17 91 -82 206 9 181
7840A81k01OO4j60J63j60O8J06l9l8R4J8j90p3m1K55q7Q8oQo2j46J61J14j84J09
$$ 181 -20 -14 50 -110 53 -107 -39 67 28 -10 84 102 -88 -161 -202 53 -34 54 48 56 -6 -152 9 123 -61 48
7866D8jK2o3r8J95K6j16Rj10J59j60Q7j88J60q7N8P7k1j9J99r6j53P7J24m7q1
$$ 48 47 69 6 -92 103 129 13 22 -88 71 -89 -2 -190 -30 -117 -59 18 -3 -22 177 81 -72 5 129 82 1
7892AO9M6n2q6P4Q0n8j31Q1o7Q3Q5k17O0j66L07J14j50n1j19J48o1m5k0N6L6l6
$$ 1 70 116 64 -22 52 132 74 -57 24 -43 40 125 -92 -32 -198 109 223 73 22 -97 51 -10 -55 -75 -19 17 -19
7919a9N9J2jm1J56j55j28JN8k2J01L2L0J6r5L8j72K2J36n4Q9Q4j30KP4o6j79J21
$$ -19 40 52 51 10 166 11 -117 -116 -58 -80 21 53 83 99 4 42 -130 -108 28 -26 63 147 17 19 93 27 -152 -31
7947c1J00j67K66m5k39K4J34o4J4R8j29O8J01k35J12K8j73K28j20O7J30j61r8
$$ -31 69 -98 168 123 -116 -92 42 -22 -8 90 -39 29 130 -105 7 35 -138 90 -30 37 167 6 -92
7970i2L1P4J4j5J11j73J29J18k40lMKK4J7N8j39P9Q4r8J34j89K18p7j67K1L3J57
$$ -92 -61 13 27 12 123 -50 79 197 -43 -46 -42 -40 -16 1 59 -80 -1 83 -15 119 -70 148 71 -96 -75 -42 115
7997A15j64q1O8J30k7ml5j34J19o7R4O7N0j02j59J77K5L0j67M1J41j39l4K7K02
$$ 115 -49 -130 -62 68 41 37 2 -132 -13 -80 14 81 131 29 -130 47 72 102 -65 -24 117 -22 -56 -29 173
8022A73j00q3j01J42l6j16K29p4j23L3o0J12K2m4M5j2m5n0R7l5rO5j09L5n3J81
$$ 173 73 -10 -111 31 -5 -121 108 34 -89 -56 -116 -4 18 -26 19 7 -38 -88 9 -26 -35 30 -79 -44 -97 84
8048H4j21l8J28n3j05K6J18n3J08j22J1j3P7j5J52l01K07r7O9P6k10J76k20O7
$$ 84 -37 -75 53 0 -105 -79 39 -14 94 -28 -17 -30 47 32 184 -117 90 -7 62 138 -72 104 -116 -49
8072d9L1Q7j9j5n9r0J53j33J19o3K3Q2j63J35q6k2Mj7J11J55j27r3J07l7Q1q5
$$ -49 -18 69 50 35 -24 -114 39 -94 25 -38 -15 67 -96 39 -47 -69 -65 -82 29 184 57 -36 71 34 115 30
8098C0p5Q5L0j72R3L9l4l5J8k4j7J66R8j32j92Q9J04j60RK0J44q9p5J13o1J72
$$ 30 -45 40 70 -102 -9 30 -4 -39 -21 -45 -62 104 202 70 -122 -33 71 -89 -80 -60 84 -5 -80 33 -28 144
8124A44P7k91j13J41l1O5M8j50N4O3M5j22m9O2p7J06qQ9K8l9P0o2j13r2l3K38
$$ 144 221 -70 -183 -42 -73 -8 40 -110 -56 7 52 -70 -119 -57 -134 -28 -36 53 81 42 112 50 -63 -155 -188 50
8150E0q0N4l6J86q2P4j25N8k57K51M1Q5o5r1MN2m5q1J02j75J7n5J14j38L14j72
$$ 50 -30 24 -12 174 92 166 41 99 -158 93 134 219 154 63 67 119 74 -7 95 -80 -63 -118 -4 -142 172 0
8176@q6J87k21K75j02oO5j2N6o4k5j70K12N5j46
$$ 0 -86 101 -120 155 53 47 112 100 156 92 67 -103 109 164 18
8191A8
$$ Imaginary data points
##PAGE= N=2
##DATA TABLE= (X++(I..I)), XYDATA
0@%%%%%%%%%%%%%qJ6j6J6j6K4l2L2m0M8n6O5p3Q8j01J14j30J49j70J91k15K44
$$ 0 0 0 0 0 0 0 0 0 0 0 0 0 0 -8 8 -8 8 -8 16 -16 16 -24 24 -32 33 -40 48 -53 61 -69 80 -90 101 -114 130
35A30k75L07l44L82m24M73n24N80o44P11p83Q64r51J047j153J270j401J545j707
$$ 130 -145 162 -182 200 -224 249 -275 305 -339 372 -411 453 -498 549 -604 666 -735 810 -897
54h97J889k094K330k601K920l302L764m339N076o055P420r452J2775j9064L4711
$$ -897 992 -1102 1228 -1373 1547 -1755 2009 -2330 2746 -3309 4111 -5341 7434 -11630 23081
69B3081j36708j65812M91534o3625k78056L40788R7575l54317J21454J64189k69102
$$ 23081 -113627 -279439 212095 148470 -129586 211202 308777 -45540 75914 240103 -28999
80b8999k4722J77681j65353r6522J50272l4905j01441R9403M3325p9486J3103
$$ -28999 -53721 123960 -41393 -137915 12357 -22548 -123989 -24586 18739 -60747 -47644
91d7644P1813k3399m4917M9355L7404q0474j3028R1786l2403m8911J17888J6502
$$ -47644 24169 770 -44147 5208 42612 -37862 -50890 40896 8493 -40418 77470 93972
103I3972j09766O4366N5778j20741J5766Q4381j14005m8961Q5261p3188o3045
$$ 93972 -15794 48572 104350 -16391 -625 83756 -30249 -79210 6051 -67137 -130182
114a30182J04926j0577o6427R3704L0761o3609P3196N8003o7626K3267M8177p4968
$$ -130182 -25256 -35833 -102260 -8556 22205 -41404 31792 89795 22169 45436 93613 18645
126A8645j5370N5213n1685m1069N2313k2017n7209M5728K6995m9934J6126M8443
$$ 18645 3275 58488 6803 -34266 18047 -3970 -61179 -15451 11544 -38390 -22264 26179
138B6179l8317k5834N1304o12m8470K9381L2875n3175m621O6455j9132l6474O5659
$$ 26179 -12138 -37972 13332 12720 -35750 -6369 26506 -26669 -31290 35165 16033 -20441 45218
151D5218J1404p5778L1113N0671p5976j3801P6652n5383o6984P8762o53q7935
$$ 45218 56622 -19156 11957 62628 -13348 -27149 49503 -5880 -72864 5898 5245 -82690
163h2690O2417N8192q8127J5959R3417o1633l3416R6707k4756p6395P1477J9410
$$ -82690 -20273 37919 -50208 -34249 59168 -2465 -35881 60826 36070 -40325 31152 50562
175E0562q7018L5885N2709p7282r070O8085m1959l5066O5845l751n2300L5886
$$ 50562 -36456 -571 52138 -25144 -34214 33871 -8088 -43154 22691 18940 -33360 2526
187B526K0732m6912Q893L5998k6320j3196L0274p088k2933J9787J1514k2571L963
$$ 2526 23258 -23654 -14761 21237 -5083 -18279 11995 4907 -18026 1761 13275 -9296 -5333
200e333K0848j6086j0274K4460m241k4040J8551R320k9238J0639K5319k7598m376
$$ -5333 15515 -571 -10845 13615 9374 -14666 3885 13205 -16033 -5394 19925 -7673 -12049
213a2049L3734k1238k0879L8474n599l6034L2736J2064m6674J7802L3293m3844
$$ -12049 21685 447 -20432 18042 12443 -23591 9145 21209 -25465 -7663 25630 -18214
225a8214m601M9263k8905l0410N0848q94m7872L4608K7702n0711O015M7220l5638
$$ -18214 -22815 26448 -2457 -32867 17981 17087 -30785 3823 31525 -19186 -13171 34049 -1589
238a589k4172N1412r033m7732L7560K3273n4552Q875M9107m1109k6249N6465r241
$$ -1589 -25761 25651 16618 -31114 6446 29719 -24833 -15958 33149 -7960 -34209 22256 13015
251A3015n1488M1649K6765n7167J0857N1974m1185k3219N8038j1771m8504M2550
$$ 13015 -38473 3176 29941 -27226 -16369 35605 -5580 -28799 29239 17468 -31036 11514
263A1514K0134n6364J4552M4116m4738j7565N2708j8118m1121M3378J3243n0056
$$ 11514 31648 -24716 -10164 33952 -10786 -28351 24357 6239 -34882 8496 21739 -28317
275b8317J9668L7709m0421q231M6121j9228l0425L7524M009l8675K0618K2083
$$ -28317 -8649 29060 -11361 -19592 26529 7301 -23124 14400 18409 -20266 352 22435
287B2435l5269J251L1407k3677j5960L2113o752k7045K3871J0838k9411R787K2216
$$ 22435 -12834 -11583 19824 -3853 -19813 12300 5548 -21497 2374 13212 -16199 -6412 15804
300A5804k2790m950K6458j1907j5412K4490k3k3455J7142J1889k7065N401K2779
$$ 15804 -6986 -11936 14522 2615 -12797 11693 11670 -11785 5357 17246 -9819 -4418 18361
313A8361k2832j0042K8626j1249k4475K6283N927l2077J5464K3329l0665j524
$$ 18361 -4471 -14513 14113 2864 -21611 4672 10599 -21478 -6014 17315 -13350 -14874
325a4874L4338j9189k0736L5567n36l4405K4678J9896l7900M255L4902k8143j8894
$$ -14874 19464 275 -20461 15106 14570 -19835 4843 24739 -13161 -8906 25996 -2147 -21041
338b1041L9058p678l5927K9168J6290m0534Q673L4925l0246j5402M0964r114l3666
$$ -21041 18017 10339 -25588 3580 19870 -20664 -11991 22934 -7312 -22714 18250 9136 -24530
351b4530L1062J5154l9759J0070L3211l0603j3949L8189j0350l1966K9681J2701
$$ -24530 6532 21686 -18073 -8003 25208 -5395 -19344 18845 8495 -23471 6210 18911
363A8911l7236J0768K9660k9175j0502L5004j1816k6706K8353P993l2818J3261
$$ 18911 -18325 -7557 22103 -7072 -17574 17430 5614 -21092 7261 15254 -17564 -4303
375d303K3166k7256m431K9796j4106j8374K6114M53k4799J5545J2696k4573K921
$$ -4303 18863 -8393 -12824 16972 2866 -15508 10606 11059 -13740 1805 14501 -10072 -7151
388g151K0429j8099r100K2874o870j7466J8382N631j9857R993J4339j7982r6J8451
$$ -7151 13278 -4821 -13921 8953 2083 -15383 2999 8630 -11227 -1234 13105 -4877 -4973 13478
402A3478j2524j0096J9323m028j8409J5870O928k2277O775J8276j8575o176K3536
$$ 13478 954 -9142 10181 6153 -12256 3614 10542 -11735 -4960 13316 -5259 -11435 12101
415A2101r149j7391K0883L771k4101J1747J5828k3762p83K4797j5967j4475K7239
$$ 12101 2952 -14439 6444 10215 -13886 -2139 13689 -10073 -10856 13941 -2026 -16501 10738
428A0738k008k5259K0020J4097k8068M744K5462k1402j2528K8381o834k4281K1011
$$ 10738 8730 -16529 3491 17588 -10480 -5736 19726 -1676 -14204 14177 7343 -16938 4073
441D073R192k7490P527K1603k0818p351K5157q057k0025J9903P980k3977P010
$$ 4073 13265 -14225 -6698 14905 -5913 -13264 11893 3836 -16189 3714 11694 -12283 -5273
454e273J9726j8473q725K3894m384k0372J8089R722k3452M849K0336j8300q384
$$ -5273 14453 -4020 -12745 11149 6765 -13607 4482 14204 -9248 -4399 15937 -2363 -10747
467a0747K3279q274j9594J9375M528k2664J0857J5360k1017j070K0636j2133r971
$$ -10747 12532 4258 -15336 4039 8567 -14097 -3240 12120 -8897 -9967 10669 -1464 -11435
480a1435K0163k427j6205J2701O219j5422N134J0928j1914k590J1541o166o727
$$ -11435 8728 6301 -9904 2797 9016 -6406 -1272 9656 -2258 -4848 6693 527 -6200
493f200J0140N2r737N264M920r406Q48R677n960n590R880j440r820R350N569j2493
$$ -6200 3940 3992 -5745 -481 4439 -4967 -4119 5558 -402 -5992 3888 2448 -7372 1978 7547 -4946
509d946L946J0274j2921k456J5546q645j0380J6130k438j7419J4077Q001j9237
$$ -4946 -1000 9274 -3647 -6103 9443 798 -9582 6548 4110 -13309 768 8769 -10468
522a0468O345J6233j7771m631K0880q213j2778J8075J047j8845R974J1681j6147
$$ -10468 -4123 12110 -5661 -10292 10588 2375 -10403 7672 8719 -10126 -152 11529 -4618
535d618j77J6146r457j1692J4607K282j5955P195J1476j5229m853J6750n943j3338
$$ -4618 -4795 11351 1894 -9798 4809 7091 -8864 -1669 9807 -5422 -10275 6475 532 -12806
549a2806J5726M644j9069P688J5065j6464k273K1091r755j4230J8433M86j8583
$$ -12806 2920 7564 -11505 -3817 11248 -5216 -7489 13602 3847 -10383 8050 8536 -10047
562a0047J2552R995j9628J887J5422j3829n872J7589m672j3584J2250L808j4189
$$ -10047 2505 12500 -7128 -5241 10181 -3648 -9520 8069 3397 -10187 2063 5871 -8318
575h318N558J0825j0946l354J1145n068p631J0568K457j0617N235P313j0591l70
$$ -8318 -2760 8065 -2881 -6235 4910 -158 -7789 2779 5236 -5381 -146 7167 -3424 -3794
589c794J2056o323p647J1537j730j2915R396O680j4060L132J2078j2513m455J6282
$$ -3794 8262 1939 -5708 5829 4099 -8816 580 7260 -6800 -3668 8410 -4103 -8558 7724
603G724n288j0785J4473J024j6392R455R453j6061J606J4886j2893q158J6866
$$ 7724 2436 -8349 6124 7148 -9244 211 9664 -6397 -4791 10095 -2798 -10956 5910
616E910k833j3815J2964O501j6287L439J3658j1125n091J5243m202j3649J1227
$$ 5910 3077 -10738 2226 8727 -7560 -4121 9537 -1588 -6679 8564 4362 -9287 1940
629A940N744j4815L589J3461j1693p232J5716k137j4037J1705P799j6965J821
$$ 1940 7684 -7131 -3542 9919 -1774 -9006 6710 4573 -9464 2241 10040 -6925 -5104
642e104J4821j1950p435J6670l405j4741J2359O006j5913N564J3478j3184l966
$$ -5104 9717 -2233 -9668 7002 3597 -11144 1215 7221 -8692 -3128 10350 -2834 -6800
655f800J5432o577j0075J3184J446j3415O545P131j1265K75J0101o416m761Q866
$$ -6800 8632 2055 -8020 5164 6610 -6805 -260 6871 -4394 -4119 5982 -434 -5195 3671
669C671j755o879O009L053p042J779M925n408k184O357k019m338M843R46n806
$$ 3671 1916 -4963 1046 4099 -2943 -1164 3761 -1647 -3831 2526 507 -3831 1012 1958 -3848
684c848L245M610n751K00O579n193l412P828k335o611P278J643r759N077O103
$$ -3848 -603 4007 -1744 -1544 5035 -158 -3570 4258 1923 -4688 2590 4233 -5526 -449 5654
699E654r923J083R728p901m606J1359l368r439J0085K568j2058N177Q322j0751
$$ 5654 -4269 -3186 6542 -1359 -5965 5394 2026 -7413 2672 5240 -6818 -1641 6681 -4070
713d070j067J1596o073p068J0205Q15j0286N956O876r654p61R875n438o985R176
$$ -4070 -5137 6459 386 -6682 3523 4338 -5948 8 6884 -2770 -3531 6344 906 -6079 3097
728C097J364j0422M900P505r915j868J1337m893q512J0229K085j1607N460Q260
$$ 3097 4461 -5961 -1061 6444 -3471 -5339 5998 1105 -7407 2822 4907 -6700 -1240 7020
742G020j0797q77J1096o414o950J1143l99j0489P849N033j0873J892R542p474
$$ 7020 -3777 -4654 6442 28 -6922 4221 3822 -6667 1182 6215 -4658 -2766 6776 -698
756f98m273R704k085p863O849K908q164K252N824o177j651O799k924m739N951
$$ -698 -4971 4733 2648 -5215 1634 4542 -3622 -1370 4454 -1723 -3374 3425 501 -4238 1713
771A713M74o330L573L827n841q1O115l969l284O264n76n539M672K454o000J996
$$ 1713 2187 -4143 -570 3257 -2584 -2665 3450 -519 -3803 2461 1885 -3654 1018 3472 -2528 -532
787e32M718n607q10O500l654m233O717m44p093N226L252p737J463O569n988k660
$$ -532 4186 -1421 -2231 4269 615 -3618 3099 2655 -4438 788 4040 -3697 -2234 4335 -1653 -4313
803d313P736k773n844O785J445p766L582N710p212o90Q095m131n399P798O60q293
$$ -4313 3423 650 -5194 1591 3036 -4730 -1148 4562 -2650 -3340 4755 624 -4775 3023 3683 -4610
819d610M562N539p768p57Q187m388n766P680N45q071M424N384p930l10P856m674
$$ -4610 -48 5491 -2277 -3034 5153 765 -5001 2679 3224 -4847 -423 4961 -2969 -3279 4577 -97
835i7m987P841j72p842N169M631p913K81P742n078m408P676l07o862M961L700
$$ -97 -5084 2757 2585 -5257 -88 4543 -3370 -3089 4653 -425 -4833 2843 2536 -4326 635 4335
851D335o978J017N799m441k624O058j500n108M711J794n664J696M205m646r59
$$ 4335 -2643 -1626 4173 -268 -2892 3166 1666 -3442 1269 3063 -2601 -905 3300 -1346 -2305
866b305M905k254l439M261L24m459K769K256m159Q23L413l310q00M179j950k477
$$ -2305 2600 346 -3093 1168 1492 -2967 -198 2058 -2101 -1278 2135 -1175 -1975 2204 254 -2223
882b223M034j18l827K994K104m799J060M091m131j659N279k105l947M458Q74n375
$$ -2223 1811 1693 -2134 860 2964 -1835 -775 3316 -815 -2474 2805 700 -3247 1211 2085 -3290
898c290K570L753n117m88N798l262l880N988L42o283L643M184o352k48P169m119
$$ -3290 -720 3033 -2084 -2572 3226 -36 -3916 2072 2414 -3869 -226 3958 -2394 -2642 4527 408
914D08m458O982R7p202M456M415p376N9P243m815m239P237o17o841M871L656p216
$$ 408 -4050 2932 3029 -4173 283 4698 -2678 -2619 4624 -191 -4430 2807 2190 -4651 220 3876 -3340
931c340J193O323m895k994O723r71o059M459K924o086P77N158l565k852N022k76
$$ -3340 -2147 4176 -719 -3713 3010 2039 -4020 439 3363 -2723 -1946 3212 -353 -3205 1817 1541
947A541m365L313K272m494O95M172l373j875M723j107m289L438J756m543J391
$$ 1541 -2824 489 2761 -1733 -1038 3134 -239 -2114 2609 1502 -2787 651 2407 -2136 -745
962g45L337l751p79L954k264k202L646n15l126K926P95l681J927K474l432M80
$$ -745 2592 -1159 -1938 2016 -248 -2450 1196 681 -2445 481 1276 -2405 -478 1996 -1436 -956
978i56L404k599j408L458n89k835K549J138l562Q46K415k412j016K930j319k851
$$ -956 2448 -151 -1559 1899 1310 -1525 1024 2162 -1400 -554 1861 -551 -1567 1363 44 -2807
994b807L171J106l980J501L424l723j453N198j353m189M455J471n578K235L929
$$ -2807 364 1470 -2510 -1009 2415 -1308 -2761 2437 1084 -3105 1350 2821 -2757 -522 3407
1009C407m698l76N158l157l505N379k46m980L762K272n265O74M371l457j974M778
$$ 3407 -1291 -1667 3491 334 -3171 2208 1962 -3018 744 3016 -2249 -1575 2796 -661 -2635 2143
1025B143j082l629K529J646l288Q66K859k107j600K622k92k352J836J491k506
$$ 2143 1061 -2568 -39 1607 -1681 -815 2044 -63 -1663 959 667 -1685 151 1642 -864
1040h64l61K429j234j618K548L79k522J224J550k425M47K429j744p76J859j192
$$ -864 -1225 1204 -30 -1648 900 1279 -1243 -19 1531 -894 -447 1982 238 -538 1321 129
1056A29j344K225l31j686J248J4j777J173R92j708N24J308j751j14K072j278p83
$$ 129 -1215 1010 679 -1007 241 255 -1522 -349 643 -1065 -541 767 -984 -1098 974 -304 -1087
1073a087K405q67j862K092O93k217R97J834k071r38K472q17j837J949P14k770
$$ -1087 1318 451 -1411 681 1374 -843 154 1988 -83 -1021 1451 634 -1203 746 1460 -1310
1089a310K20K783k320j389L205l45l505K423K270m111N86M410l330k399M752k85
$$ -1310 -1090 1693 -627 -2016 1189 844 -2661 -238 2032 -2079 -1493 2917 -413 -2812 1940 1655
1105A655m628L924K272n246J023M053l856j627N143j433m227L990J283m951J500
$$ 1655 -2973 951 3223 -2023 -1000 3053 -803 -2430 2713 1280 -2947 1043 2326 -2625 -1125
1120a125L846l283j766L911q72l421K838J837l318K97K768k176j580L208J16k956
$$ -1125 2721 -562 -2328 1583 711 -2710 128 1965 -1353 -1056 1712 -464 -2044 1164 1280 -1676
1136a676J599J937l169N3L207j811j711K850k53k902K018J641k797N42K083j982
$$ -1676 -77 1860 -1309 -1256 1951 140 -1571 1279 1026 -1876 142 1783 -1014 -472 1611 -371
1152c71n44K175j166j017J661l22j490J303K40j201N27R95j474J5J090p12k67
$$ -371 -915 1260 94 -923 738 416 -1074 229 469 -732 -205 790 -684 -669 421 -291 -558
1169e58J164o09p51R66M81j146M75J313j631j85J689o30j665J801P36k717R26
$$ -558 606 -3 -754 212 693 -453 22 1335 -296 -481 1208 578 -1087 714 1450 -1267 -341
1186c41J855k233q98L091j397k268K842L24l098J825K192l179m3L105j996j489
$$ -341 1514 -719 -1617 1474 77 -2191 651 975 -2123 -298 1894 -1285 -1328 1777 -219 -1708
1202a708L150j47k925J739J928l001J70K698j513j759K309K45k587J102J662k308
$$ -1708 1442 1295 -1630 109 2037 -964 -794 1904 391 -1368 941 1186 -1401 -299 1363 -945
1218i45k73K167j011j555J937K37k026J028J582k087O1J975q42j240J858k40j677
$$ -945 -1218 949 -62 -1617 320 557 -1469 -441 1141 -946 -885 1090 248 -992 866 626 -1051
1235a051J384O33j592N61J103j354J46J031q65n99J314n24q10J052K8j187R45
$$ -1051 333 966 -626 -65 1038 -316 -170 861 -4 -603 711 187 -623 429 457 -730 215
1252B15J77j146L20J170j419J1J430q24j025J541j7j243P21J040j392k91J713
$$ 215 392 -754 -434 736 -683 -672 758 -66 -1091 450 433 -810 -89 951 -441 -732 981
1269I81q99r94J719J68k118J142J516k280P3K144j244j630K308J16k620J480J596
$$ 981 82 -912 807 975 -1143 -1 1515 -765 -692 1452 208 -1422 886 1002 -1618 -138 1458
1286A458k365l57K480j353j596K475Mk513J863J267k389K27K249j381j399K430
$$ 1458 -907 -1264 1216 -137 -1733 742 746 -1767 96 1363 -1026 -799 1450 69 -1330 1100
1302A100j46k019J264J174k061j01K137j132j239J851j91j568J023R16j774L9
$$ 1100 954 -1065 199 1373 -688 -789 1348 216 -1023 828 637 -931 92 1008 -766 -727
1318g27J650j090r53J718j77j869J454P27j587K41J382j006p91J671m52p78J013
$$ -727 923 -167 -1120 598 421 -1448 6 733 -854 -613 769 -237 -1028 643 191 -587 426
1335D26J18j129P61O61r82J66P41o06m17R44k46j004P87K2o84L35M09p58K19N55
$$ 426 544 -585 176 837 -145 21 762 156 -261 683 437 -567 220 242 -442 -107 302 -456 -237 318
1355C18q35mR36n01p07J144o9j020P12R73j186j50J238o17r39J374N5j293P75
$$ 318 -517 -521 415 -86 -793 351 282 -738 -26 947 -239 -389 849 232 -707 667 722 -571 204
1374B04R76j618K4J483j269p71J719k40j738J325Q95k101M31J616j247q44J952
$$ 204 1180 -438 -414 1069 -200 -971 748 508 -1230 95 990 -1111 -680 936 -311 -1155 797
1391G97l18j605J321O38j389K13J474j009p54J342j65j467J038O86j362L0J552
$$ 797 479 -1126 195 833 -556 -343 1131 122 -632 710 545 -922 116 802 -560 -530 1022
1408A022r30r79J421K2j415Q48P65j283n6J187p47m83J141k67q37O48J94q66M87
$$ 1022 92 -887 534 556 -859 -11 754 -529 -585 602 -145 -628 513 246 -591 57 251 -615 -128
1427a28N07o44J92N32m27j94N12k63j82L18k1k70L58J94o69K76K62m71k84O83
$$ -128 379 -265 -73 459 32 -162 350 87 -95 223 202 -68 290 484 -185 91 353 -118 -402 281
1447B81l13m27N85J9p22L15P14r24j24J176n47r04J349m8j215J068Q85j653Q6
$$ 281 -32 -459 126 145 -577 -262 452 -472 -596 580 33 -871 478 430 -785 283 1168 -485 -399
1466c99J491j045r02J664k26j494J223O59j720J78J612j301q49J750l36j578J269
$$ -399 1092 47 -855 809 583 -911 312 971 -749 -571 1041 -260 -1109 641 305 -1273 -4
1483dP32j493m7J774j020p81J423l8j213P70R55j423l8J304p05j079J556O9j271
$$ -4 728 -765 -812 962 -58 -839 584 546 -667 103 1058 -365 -403 901 196 -883 673 742 -529
1502e29N92O24j011J6J249q61q17J199j03j105N29P26q54j33P59n26l65P78j37
$$ -529 63 687 -324 -308 941 80 -737 462 359 -746 -217 509 -345 -478 281 -245 -610 168 31
1521C1m46M54N39o87j91Q43l51l07L72M7n49M39K06k46r1J89l38J3K64l44J10
$$ 31 -415 39 578 -109 -300 543 192 -115 257 304 -245 194 400 154 63 252 -86 -73 191 -153 -43
1542d3L11k76l75L35L7n99L71L03n05Q1N60l51j28P66k21p55R19j71n83O05K77
$$ -43 268 -8 -383 -48 -11 -610 -239 64 -441 -360 200 -151 -279 487 266 -489 430 259 -324 281 558
1563E58n87j90P67l57o24J007k70p75O39K27p97K83N58o53k44N42r2n57O20K77
$$ 558 -29 -219 548 191 -433 574 304 -471 168 395 -402 -119 439 -214 -458 84 -8 -565 55 332
1583C32q32rJ031o42l7N90o5q04N64L84r54K39P43n20j84O66n26k21M17K77q42
$$ 332 -500 -509 522 -120 -157 433 368 -436 128 512 -442 -203 540 20 -164 502 -24 -245 172 449 -393
1604c93L58L75o13rM24j34j08K03j59k08J69O3k71J15K42k25M6K27jk30K74M5
$$ -393 -35 340 -273 -282 142 8 -100 103 -56 -264 -95 -32 -303 -188 54 -171 -125 102 101 -129 145 190
1626A90j72J51K14l31j77M32m13o2O91m69l72M84J6r64O26M39p64K16O46q51k65
$$ 190 18 169 383 52 -125 307 -106 -168 523 54 -318 166 182 -782 -156 283 -481 -265 381 -470 -735
1647g35R23k4p29P75L40r60L27N14o00j96P63j41o94O75K53r69N44M66n47m87
$$ -735 188 164 -565 210 550 -410 -83 431 -169 -365 398 257 -437 238 491 -478 66 532 -15 -502
1667e02P48p4p66O94L52o75k63R03n13n37P80J69r46O11O03r66k68J055k79o80
$$ -502 246 172 -594 100 452 -223 -486 417 -96 -633 147 316 -630 -19 584 -382 -650 405 126 -554
1687e54R22K1q19N07P18j039P2O99k78n19N83j05n39J67M97l66k67M94j86l37
$$ -554 368 389 -430 77 795 -244 -172 527 249 -270 313 208 -331 -164 333 -33 -300 194 8 -329
1707c29K89K14k58k80N02k50m04P15j8l56P3K97l13l3L72q7j28J38O0q4R7mk48
$$ -329 -40 174 -84 -364 138 -112 -516 199 181 -175 -102 195 -118 -151 221 134 6 144 204 120 217 213 -35
1730c5J08L1j23j6Q9l33P3K70j92N4K02n07K45J63k95J02J57N9k32K84K05n27
$$ -35 73 104 -19 -35 54 -279 -206 64 -128 -74 128 -379 -134 29 -266 -164 -7 52 -180 104 309 -218
1752b18J05L83j98l87M55J46j80O4P0j60k46N91l00k67L09K30n90K00K97n64q2
$$ -218 -113 270 72 -315 140 286 106 170 240 80 -166 425 125 -142 167 397 -193 7 304 -260 -342
1773c42N59k38n25M65M48p31L71K87o28K22M30j66k98K20J27l34K57J89j99l20
$$ -342 217 -21 -546 -81 367 -364 7 294 -334 -112 318 152 -146 74 201 -133 124 313 114 -206
1793b06M58o7k47K62K6l06N7Rk7j63L12k83k1J99m3j41L8J67j66J86R4k19R5K39
$$ -206 252 185 -62 200 226 -80 -23 -14 -41 -204 108 -175 -196 3 -40 -181 -143 24 -142 44 138 -81 14 253
1817B53j15k57L33j19j97N6K90l29K01J41l30n1M42k96j20L35k80j12J20J89n38
$$ 253 138 -119 214 95 -102 -46 244 -85 116 257 -73 -124 318 22 -98 237 -43 -155 -35 154 -384
1838c84L13K08j96k08K40j30j40L84J32m69K20K32k73j63M88P3n63M64J46m04
$$ -384 -71 137 -59 -267 -27 -157 -297 87 219 -250 -30 202 -71 -234 254 327 -236 228 374 -30
1858c0M5J97j34j57M83k02k98J35R6k53k2L28l85j53M85j16l71L16K22k90NJ36
$$ -30 15 212 78 -79 404 202 -96 39 135 -118 -140 188 -197 -350 135 19 -352 -36 186 -104 -99 37
1880C7q6q4L80J04n01M14j28p0p6K66kl97K04j9j80P3K25l76J07K55j63j47K79
$$ 37 -49 -133 247 351 -150 264 136 66 -10 256 254 -143 61 42 -138 -65 160 -216 -109 146 -17 -164 115
1903A15k22l00N46j10k12r3K23k4J33J40j71j2J26j1r4J56Kj88J77j69n0j6K62
$$ 115 -107 -407 139 29 -183 -276 -53 -77 56 196 25 13 139 128 34 190 192 4 181 12 -38 -54 208
1926B08k14j85J83M5j00p8K24m64K23K15k60K46J08j51qJ18j48p9K68J47l30J8
$$ 208 -6 -191 -8 37 -63 -141 83 -381 -158 57 -203 43 151 0 -8 110 -38 -117 151 298 -32 -14
1948a4K73l15J77l0J48m63M14j76p7J94M4q0k02L53k20j18P8K37m44Q7K18k55
$$ -14 259 -56 121 91 239 -224 190 14 -63 131 175 95 -107 246 26 -92 -14 223 -221 -134 84 -171
1970a71o8K35o0j81K64R7j92j0K34m7j63J03J24j97M4J14p6l5J47k25o9L34k04
$$ -171 -239 -4 -64 -245 19 116 -76 -86 148 101 -62 41 165 -32 12 126 50 15 162 -63 -132 202 -2
1993bk44J90J42k21k2J62k25Q2J46lj94K56j28qJ16J89l10Q5m5J15J36k5j75M5
$$ -2 -246 -56 86 -135 -157 5 -220 -138 8 5 -189 67 -61 -69 47 236 -74 11 -34 81 217 192 17 62
2017F2J02K2j42j36K33j87nL7k04JK05J11k56J0K45l96J51K35j70k29K85M7k97
$$ 62 164 186 44 -92 141 -46 -51 -14 -218 -217 -12 99 -157 -147 98 -298 -147 88 -82 -311 -26 21 -276
2040b76L93Q0k84K31J15l58k8N40m05j62L84o1m09M58p2k82J93J09k10l2oK38
$$ -276 117 197 -87 144 259 -99 -127 413 8 -154 230 169 -240 218 146 -136 57 166 -44 -76 -82 156
2062A56m20L8L97l03l05M80%l25K34M02n97J05M69l02k29N42j92k29J03K24l82
$$ 156 -264 -226 171 -132 -437 43 43 -282 -48 354 -243 -138 331 29 -200 342 150 -79 24 248 -134
2083a34J64L14m76o6M10j31l49K22J68l25J06J18l38J69R7j79J52N4O5l9M2J03
$$ -134 30 344 -132 -198 212 81 -268 -46 122 -203 -97 21 -317 -148 -51 -230 -78 -24 41 2 44 147
2105A47j23LJ54j44J22j69K90k38L8J50l00R4J00q6m5PPK61k93j25k6R5O2j14
$$ 147 24 27 181 37 159 -10 280 42 80 230 -70 24 124 38 -7 0 7 268 -25 -150 -176 -81 -19 -133
2129a33K9l3L6K5J75k57Q6J93j17k15L24J19l17K11Mj07O5R5j27p4P6N0k22K22
$$ -133 -104 -137 -101 -76 99 -158 -72 121 4 -211 113 232 -85 126 130 23 88 183 56 -18 58 108 -114 108
2153A08K6j54n6N9n5j90L57j30m5J19J4l3j24k8J82l23J94M2j06L13k5j42j66
$$ 108 134 -20 -76 -17 -72 -262 95 -35 -80 39 53 20 -104 -132 50 -273 -79 -37 -143 170 145 3 -163
2176a63K78j02n8L97p4k73l0N6k39K59j03Q2r2J64j44m7J29p6Oj2J28j25j1k8
$$ -163 115 13 -45 352 278 5 -25 31 -208 51 -52 30 -62 102 -42 -89 40 -36 -30 -42 86 -39 -50 -78
2200g8KnJ56k87J83k5j9J23j77K76q9M4k0J5j38K2J40r5j15J91j81j3J23j07k2
$$ -78 -76 -81 75 -212 -29 -54 -73 50 -127 149 60 104 84 99 -39 -17 123 28 -87 104 -77 -90 33 -74 -96
2225i6k6J8R4J02n4k50J41J77k46K4M1J1k0J66N2j70J68Oj37O7J19j07j47L4J53
$$ -96 -122 -104 -10 92 38 -212 -71 106 -140 -116 -75 -64 -84 82 134 -36 132 138 1 68 187 80 -67 -33 120
2250A20k41L6K33l15r6K57jm15M99o2j28M0J71j50k13M20j55j87J65J81j96M7
$$ 120 -121 -85 148 -167 -263 -6 -7 -422 77 15 -113 -73 98 -52 -265 155 0 -187 -22 159 -37 10
2272A0J61j74j58L17j51j27K09J68k95k5J50j06j26K04J33m04J33K00j98j3J31
$$ 10 171 -3 -161 156 5 -122 87 255 -40 -65 85 -21 -147 57 190 -214 -81 119 -79 -92 39
2293C9q3j72K05k6l3l8K80k77K7J83n6q3k5J29j5o3J27l2o3K57j77J03k90p2J51
$$ 39 -44 -216 -11 -37 -70 -108 172 -105 -78 105 49 -34 -59 70 55 -8 119 87 24 281 104 207 -83 -155 -4
2318dJ0j91L80j99q8L3N6P1j37J8N6j08N6O2j77O8L54m24N8K54o4J4J8J65k87
$$ -4 6 -185 195 -4 -92 -59 -3 68 -69 -51 5 -103 -47 15 -162 -94 260 -164 -106 148 84 98 116 281 -6
2343fp3J31Q8m10K45J34l44J45K07k51l2J39P5j56P9N6j91J08J97j43j48J51J28
$$ -6 -79 52 140 -270 -25 109 -235 -90 117 -134 -166 -27 48 -108 -29 27 -164 -56 141 -2 -150 1 129
2366A29l37J65L03l79K1K45l00J24J22k15O1O8Q0k40J72k8j44j0K78k55mJ38j06
$$ 129 -208 -43 260 -119 -98 147 -153 -29 93 -122 -61 7 87 -153 19 -9 -153 -163 115 -140 -144 -6 -112
2389a12J05N7J4p9OJ90j96j32J42K8m3R8m5n7K09o1N0k40K44k48j2k0J74j56K27
$$ -112 -7 50 64 -15 -9 181 -15 -147 -5 23 -20 78 33 -24 185 124 174 -66 178 -70 -82 -102 72 -84 143
2414A43j79p8K04o3k81J80J10r8j00K11k3q5j1K29j53j24J58r2m3K67k6k14K82
$$ 143 -36 -114 90 27 -254 -74 36 -62 -162 49 26 -59 -70 159 6 -118 40 -52 -95 172 146 -68 214
2437B14K0j68q5K05k12R0J23n2l52Q0J84l1k8K58l03j25L21o7j97K62j62Q2k81
$$ 214 234 66 -19 186 -26 64 187 135 -217 -137 47 16 -12 246 -57 -182 139 72 -125 137 -25 57 -224
2460b24L97k19j61K39m3j89K38J98k83J7K94k26o8P3Kj70lK08j01j1M7o8O3J59
$$ -224 173 -46 -207 32 -11 -200 38 236 -47 -30 264 38 -30 43 45 -125 -128 80 -21 -32 15 -53 10 169
2484A69k41k1mMn8J1k4R0%J38j18R5QJ92j13j07M9n0KJ20j38J18m5pj21R8J1j31
$$ 169 -72 -93 -97 -93 -151 -140 -164 -74 -74 64 -54 41 49 241 128 21 70 20 22 142 4 122 77 70 -51 47 58 -73
2512g3K8R4j65k8J27P9j96k0K89q2oJ02q4o0M4k06N6J92m4j36J68N1l10K02J00
$$ -73 -45 49 -116 -144 -17 62 -134 -154 135 53 47 149 65 5 49 -157 -101 91 47 -89 79 130 -180 22 122
2537A22j88M2L33l82OJ53k5j29k3qj73J54K24j54j80L08j92j1R3Q5k65K80K12
$$ 122 -66 -24 309 -73 -67 86 61 -68 -91 -99 -272 -118 106 -48 -228 80 -112 -123 -30 55 -210 70 282
2560B82l89j3K58%k79K92Q5k47J06n3Nj26J96r0k13J87J61l28J28q3P6O1k34J29
$$ 282 -107 -120 138 138 -141 151 236 -11 95 42 47 -79 117 27 -186 1 162 -166 -38 -121 -45 16 -218 -89
2584h9r5J37M4j37J30j15J13M1J45k20m9J88j46l8J35j60J98L6r4j81r7K37K12
$$ -89 -184 -47 -3 -140 -10 -125 -12 29 174 -46 -95 93 -53 -91 44 -116 82 118 24 -157 -254 -17 195
2607A95l16N5j8KJ70j21j43J64J45l87N8J90o0k44M82k03j13K59j16j00k5J61
$$ 195 -121 -66 -84 -82 88 -33 -176 -12 133 -254 -196 -6 -66 -310 172 -31 -144 115 -1 -101 -126 35
2629C5J9K0N7l4k51K80l4k72P0L17k85l4R5J15k20PK26j72k00M28k15K48k47J89
$$ 35 54 74 131 97 -154 126 92 -180 -110 207 -78 -112 -17 98 -122 -115 111 -61 -261 167 -48 200 -47 142
2653A42j28Q4K5j61J1J86k94K37j4J9j97L5P7N8j60J77r8k72L61M1m4q9J06j19
$$ 142 14 98 123 -38 -27 159 -135 102 88 107 -90 -55 22 80 -80 97 -1 -273 88 129 85 -4 102 -17
2677a7J4pJ19k22P3L0j2K4J58l50J58R4j31J51j04p8J18M5Q4l02L4P4R8r2K93
$$ -17 -3 -10 109 -113 -40 -10 -22 2 160 -190 -32 62 -69 82 -22 -100 18 63 147 -155 -121 -47 51 -41 252
2702B52k25mJk07J56L4j6r7J21n0j73K36k6j47K7J00j1j8K36O1l46J41K5k41J65
$$ 252 27 23 24 -183 -27 7 -9 -106 15 -35 -208 28 2 -145 -118 -18 -29 -47 189 250 -96 45 70 -171 -6
2727fK64k91L8K5kj01K9L08m61J17J88k6j16J76n9k24J35L7n2L7k0N1j48Q3l2
$$ -6 258 -33 5 30 28 -73 -44 264 -197 -80 108 82 -34 142 83 -141 -6 31 -21 16 -4 47 -101 -18 -50
2752e0J4K04j07l14J48R6K3KL4n8n9J12q0J01r2J14k07J22K0%K6l6j74J32j29
$$ -50 -36 168 61 -253 -105 -9 14 16 50 -8 -67 45 -35 66 -26 88 -119 3 23 23 49 13 -161 -29 -158
2777a58J72J35j26m9j3K6p1o9QJ54Jj60J62R4j30J23l5j14nP6j26O6J39Ml11J34
$$ -158 14 149 23 -26 -39 -13 -84 -153 -145 9 10 -150 12 106 -24 99 64 -50 -55 21 -105 -39 100 104 -207 -73
2803g3K05j77l5n4Q5p6K51j02j23K28j43j01k1J95q1k2J7J08p9L5l6o4K34k9k37
$$ -73 132 -45 -80 -134 -49 -125 126 24 -99 129 -14 -115 -136 59 -22 -44 -27 81 2 37 1 -63 171 142 -95
2828i5J29M6m5k4KJ09j36J1J6n9k21J85N5l2N2Q5k32J74P8j34J83o5r1n5N5J41
$$ -95 34 80 35 11 13 122 -14 -3 13 -46 -267 -82 -27 -59 -7 78 -154 20 98 -36 147 82 -9 -64 -9 132
2854A32j48N9KO5q3L8k02J77LJ5J19O2l5j65O5j73J4K5J03o4j49j5K43r0Pk9L9
$$ 132 -16 43 45 110 27 65 -137 40 43 58 177 239 204 39 104 -69 -55 -30 73 9 -140 -155 88 -2 5 -24 15
2881A5J2Q1q8l9J16k44K0K88q7j84O6m0R6J13q7j5k32K06K0j00J40J07k66j38
$$ 15 27 108 20 -19 97 -147 -127 161 74 -110 -44 -84 12 125 38 23 -209 -3 17 -83 57 164 -102 -240
2905b40K29J71l45K53j15j62K52j19J16kJ29k36J12J11j07j39L43k31q2j31L00
$$ -240 -11 160 -185 68 -47 -209 43 -76 40 38 167 -69 43 154 47 -92 251 20 -62 -193 107
2926A07Nj74J76k02J15j9Q8mj41j8l6J1m9J52l5J45r0n3K2P8m6j44K37L3p1K4
$$ 107 112 -62 114 -88 27 8 96 92 -49 -67 -103 -92 -141 11 -24 121 31 -22 0 78 32 -112 125 158 87 111
2952A11m7r4J07M8j71N2J31j98n5K07l6m8k4o0K3L9J26j78q4J40o5J7j44K27j03
$$ 111 64 -30 77 125 -46 6 137 -61 -116 91 55 7 -17 -77 -54 -15 111 -67 -151 -11 -76 -59 -203 24 -79
2977g9Q6K5j51J56Q2r4p9J64j8j46J49p2r7M2K0n0J1K50k31k5J08j03O7Lj22P4
$$ -79 7 32 -119 37 119 25 -54 110 92 -54 95 23 -74 -32 -12 -62 -51 199 -32 -57 51 -52 15 18 -104 -30
3003c0qJ04j4j34J71jk02K30Q0k84J19q8L0N5K07q0j22j04J34j15J39L7j41J64
$$ -30 -38 66 52 -82 89 88 -114 116 196 -88 31 -57 -27 28 235 155 33 -71 63 -52 87 124 -17 147
3027A47j10oj87J62k8j42K6J76j7j93J82j65p6J76m3P6r5J19J14l0n6J8N8j19
$$ 147 37 31 -156 6 -22 -164 -138 38 21 -172 10 -155 -231 -55 -98 -22 -117 2 116 86 30 48 106 -13
3051a3J20k05R4r0l4J77K7m5j12K4l1j44J43J85p5l1K9L8j11J82o0j02R2p0O0
$$ -13 107 -98 -4 -94 -128 49 76 31 -81 -57 -88 -232 -89 96 21 -10 19 57 -54 128 68 -34 58 -12 48
3076D8J06L1j97J6k5J24j41Jj1J37m1j09P5Q8j83K69j65l2K6k0K2p3JJ23n9j92
$$ 48 154 185 -12 4 -21 103 -38 -37 -48 89 48 -61 14 102 -81 188 23 -9 17 -3 19 -54 -53 70 11 -181
3102a81J58J20j13k06L28j79k7J50j3O6m1L6j00j71L17j76k75L32k9n9P9J53l46
$$ -181 -23 97 -16 -222 106 -73 -100 50 37 103 62 98 -2 -173 144 -32 -307 25 -4 -63 16 169 -177
3125a77J17OKp8M4O3k2q8J89k16J63P3L9l20J54L9j2J35j60M2p7R5lj72J49J47
$$ -177 -60 -54 -52 -130 -86 -23 -45 -133 56 -160 3 76 115 -205 -51 -12 -24 111 -49 -7 -84 11 8 -164 -15 132
3151A32j97M0P2k9j23Q8j27l1J75o1J42j86k5K45k42O8N2q9P0K58j81j78J32p
$$ 132 -65 -25 47 18 -105 -17 -144 -175 0 -61 81 -105 -130 115 -127 -59 -7 -96 -26 232 51 -127 5 -2
3175bl3R4O3Ll9k25J67N3J36l47L01j35m2J08n2j35m6N1r2J17M1p2Q2j05J51J2
$$ -2 -35 59 122 125 86 -139 28 81 217 -130 171 36 -6 102 50 -85 -131 -80 -172 -55 -14 -86 -4 -109 42 54
3201E4k50K30j14N7J19r5Q0R7q4p5M3j3J1k10J98J8m3pO1p6N9p1M5j04L9r4RJ13
$$ 54 -196 34 -80 -23 96 1 81 178 94 19 62 49 60 -150 48 66 23 16 77 1 60 -11 34 -70 -31 -125 -116 -3
3229cp8Q7k63K98Q1j36J3j43J79JO2j21J08j7R0j96r0J33J88k11J72k1o3p2j88
$$ -3 -81 6 -257 41 122 -14 -1 -144 35 36 98 -23 85 68 158 -38 -128 5 193 -18 154 133 70 -2 -190
3254a90K80m4j33J46j89K38N4j54j86J90o2k9K11k80K47j70K04j39L3r6R8q0J04
$$ -190 90 46 -87 59 -130 108 162 8 -178 12 -50 -79 132 -148 99 -71 133 -6 27 -69 29 -51 53
3277E3m5L7l6j11J26j60J05l1J67o9N1qj54Q5M5j73K12j41P4j46J9M0J20%Rk62
$$ 53 8 45 9 -102 24 -136 -31 -62 105 36 87 79 -75 10 55 -118 94 -47 27 -119 -100 -60 60 60 69 -193
3303a93R6J05qk3l7q1Q5J25P5r6r1Q9N0j59KQ6k22Q0K00j59LJ94j14j11J08j06
$$ -193 -97 8 0 -23 -60 -141 -56 69 144 48 -43 46 96 -63 -61 25 -197 -117 83 -76 -73 121 7 -104 4 -102
3329a02N8q7K35q0O0n9P7k53J25J47k21R6l3J22q0o0J09j44L9J46j37J14j30J45
$$ -102 -44 -131 104 24 84 25 102 -151 -26 121 -100 -4 -37 85 5 -55 54 -90 -51 95 -42 72 -58 87
3353H7p9N7j61j50J89J9L3J38j07j00N0p3P7M1p7o2O0j08K44P1j25j67K34o5j62
$$ 87 8 65 -96 -246 -57 -38 -5 133 26 -74 -24 -97 -20 21 -56 -118 -58 -166 78 149 24 -143 91 26 -136
3378a36J37M6j11M0J57q8m7p8J18r0J39j86o3L72r5k97K11j91J69L0r5L05k50
$$ -136 1 47 -64 -24 133 45 -2 -80 38 -52 87 -99 -162 210 115 -182 29 -162 7 37 -58 247 -3
3401cJ30k20K02k18n7J49P8J4j6m8J27j02q0j5N2R2k43J32O4j7j3j9j1N7j28N4
$$ -3 127 -93 109 -109 -166 -17 61 75 59 11 138 36 -44 -59 -7 85 -158 -26 38 21 8 -11 -22 35 -93 -39
3427c9J20q3K8j18L8J80o8r0J73n6k29K14P7j08q3Nk6J01j60J26j36M02k79j98
$$ -39 81 -2 26 -92 -54 126 58 -32 141 85 -144 70 147 39 -44 -39 -65 36 -124 2 -134 268 -11 -209
3451b09J62j7LLqo1J21r0N7j04L9K01j35q5J05kn0K2K02j47K04j43l5r8M8L3J0
$$ -209 -47 -64 -61 -58 -66 -127 -6 -96 -39 -143 -104 97 -38 -123 -18 -20 -70 -48 154 7 211 68 33 -65 -17 16 26
3478B6j93L59j05j96J65k57J88k2P9o8MN4l06J82P9k0M9N6j43K8K31o8j94N6J33
$$ 26 -167 192 87 -109 56 -201 -13 -35 44 -24 -20 34 -272 -90 -11 -31 18 74 -69 -41 190 122 -72 -16 117
3503A17k61J19P7Pp8J56j11j2Pk7n7J3J62r3j49J73m0J4k0k8l2m5J04Om2J32L
$$ 117 -144 -25 52 59 -19 137 26 14 21 -6 -63 -50 112 19 -130 43 3 17 -3 -31 -63 -108 -4 2 -40 92 95
3530I5j94P7l6N7l3Q4m0l5LP0r3P1j8J01j53J76k14P8L8M0l0n0n3J09j7o8k4J7
$$ 95 -99 -22 -58 -1 -34 50 10 -25 -22 48 -45 26 8 109 -44 132 -82 -4 34 74 44 -6 -59 50 33 -35 -59 -42
3558d2%J26j27Q1J36j78o0k2rj7J55Q1n2o6r7J09k0K9K5k4J05j24M2j01J18k01
$$ -42 -42 84 -43 38 174 -4 -64 -86 -95 -112 43 124 72 6 -91 18 -2 27 52 28 133 9 51 -50 68 -133
3584a33J59R5k19J87j01r9J87k3j75J02R0J7n7K1j9m0K1J34j16r6K69j78m6J77
$$ -133 26 121 -98 89 -12 -111 76 53 -122 -20 70 87 30 51 32 -8 13 147 31 -65 204 26 -20 157
3608A57m45N28r9j11J2O7k09N1L5J45p4k24J41l7J79k76J56j30R8p3K40j25P7
$$ 157 -288 240 141 30 42 109 -100 -49 -14 131 57 -167 -26 -63 116 -160 -4 -134 -36 -109 131 6 83
3631H3o0J7JM0j58J18%j41J42o0J03j45J46j03p1m5J18j05J49k5R3r0m7j9K6J27
$$ 83 23 40 41 81 -77 41 41 -100 42 -18 85 -60 86 -17 -88 -133 -15 -120 29 4 97 7 -40 -59 -33 94
3657I4j35j0J7l1P1m9J47j31M4JP8k02J29k3k6j31K31j4m3J58j33l0Nj7n5q3N3
$$ 94 -41 -51 -34 -65 6 -43 104 -27 17 18 96 -106 23 0 -26 -157 74 60 17 175 42 12 17 0 -55 -138 -85
3684h5Q2M5pj9l4j36K74j54p8J21L3l8L0Mr8J85j62L9r8J74%n3J49j57j06J76
$$ -85 -3 42 35 16 -18 -154 120 -34 -112 9 42 4 34 38 -60 125 -37 2 -96 78 78 25 174 17 -89 87
3710H7k41K67j25o4J14O1j58L2j49J12L8rk0J66o9o7J29j73J6J46j15j1N3j14
$$ 87 -154 113 -12 -76 38 99 -59 -27 -176 -64 -26 -35 -55 111 42 -25 104 -69 -53 93 -22 -33 20 -94
3734i4L7K7J37r3O6j59rJ19k5J52j94J0R2k19R7J4j3jj2K81k05Nl7m4J8J37m0
$$ -94 -57 -30 107 14 80 -79 -88 31 6 158 -36 -26 66 -153 -56 -42 -55 -56 -68 213 8 13 -24 -68 -50 87 47
3761D7o6Q9j27K08p7R9j77L4Q8j03n4p8M3Q1J22j65q7K83oj13m5Q3j66jK0J05
$$ 47 -19 70 -57 151 74 173 -4 30 118 15 -39 -117 -74 7 129 -36 -123 160 154 41 -4 79 -87 -88 -68 37
3787C7p6K0K2J30k51K61j39N1p2J15O9j35l2l5M4q2M8L8q7Q9k0nL3q1K1R0L5j6
$$ 37 -39 -19 3 133 -118 143 4 55 -17 98 167 32 0 -35 9 -73 -25 13 -74 15 -5 -10 23 -58 -37 53 88 72
3815G2j41R4L2q5J1L3J76j47k7k3K3o6J53q4PJ40k42K3J18kJ9k10K42j05L5n8
$$ 72 -69 25 57 -28 -17 16 192 45 18 -5 18 -48 105 21 28 168 -74 -51 67 65 84 -126 116 11 46 -12
3841a2P4k8o9j34J54k3jL4j71J05M8J35k38J23L4j03P6K0j42Q1J77l24O9R8Mp7
$$ -12 62 34 -35 -169 -15 -38 -39 -5 -176 -71 -23 112 -126 -3 31 -72 4 24 -118 -37 140 -184 -115 -17 -13 -90
3867i0L3opl1Q1J00o7R7j20k4p7J92l12L12k9j99J48M4j8j24J74j63L8J48l9J
$$ -90 -57 -63 -70 -101 -20 80 13 110 -10 -34 -111 81 -231 81 52 -147 1 45 27 -97 77 -86 -48 100 61 62
3893F2L8p7m5P2j5p5n5P4R8j87R4K0J6J9j33R0N6j30L8M0q4J68r7l0R4j63J1o5
$$ 62 100 23 -22 50 35 -40 -95 -21 77 -110 -16 4 20 39 -94 -4 52 -78 -40 0 -84 84 -13 -43 51 -112 -101 -166
3921a66J49N5j41K9J21l28J49O8m0J80n5n5L3J42j42K09k70J9N0o5O5oJ9n5K7
$$ -166 -17 38 -103 -74 47 -281 -132 -64 -104 76 21 -34 -1 141 -1 208 -62 -43 7 -58 7 1 20 -35 -8
3946hJ53r9j09K8J3J29N5k6j21P4j91K38j28m8J83l9j21P1Q1m2l8lj26j3J32j6
$$ -8 145 46 -63 -35 -22 107 162 136 15 89 -102 136 8 -40 143 104 -17 54 135 93 55 52 -74 -87 45 29
3972B9k23K4J60J3k6j52K91k79K02j97K28jo4J5l5R7o8j33J41j23R7J03j36J25
$$ 29 -194 -170 -10 3 -23 -175 116 -163 39 -158 70 69 5 20 -15 82 14 -119 22 -101 -4 99 -37 88
3996H8n6m9Q2j62j2Q8j19J00j12P3ol1K17j80J20j20N7kJ13k71K62Q2o6j88L1
$$ 88 32 -17 65 -97 -109 -21 -140 -40 -152 -79 -85 -116 101 -79 41 -79 -22 -24 89 -182 80 162 96 -92 -61
4021f1MK61j74o6j7M8N1N0m4r0L5rq7J37k8p8J28q7M1J3r1J20p2L0J1m1P6j97
$$ -61 -57 204 30 -36 -53 -5 46 96 52 -38 -3 -12 -99 38 10 -68 60 -27 14 27 -64 56 -16 14 25 -16 60 -137
4049a37l3K66k39K08J06k03R9p5J54j24J17j45q7jN1R7m8j69J27l0N7J87j45O1
$$ -137 -170 96 -143 65 171 -32 67 -8 146 22 139 -6 -93 -94 -43 54 6 -163 -36 -66 -9 178 33 94
4073I4k34K8L9R3j31K01j08N1Jj34Q4j4K9P7j69Q9k0N6O6j18k8J32j39L6j89K57
$$ 94 -140 -112 -73 20 -111 90 -18 33 34 -100 -16 -30 -1 76 -93 -4 -24 32 98 -20 -48 84 -55 -19 -208 49
4099D9r8j39Q6O4M1j06K06l8q8l7R3j57J70L1K0m1j33P1R8o5Rk3j67J25J7o8j9
$$ 49 -49 -188 -102 -38 3 -103 103 65 -23 -60 33 -124 46 77 97 56 -77 -6 92 27 36 13 -154 -29 -12 -80 -99
4126i9Q3J72k33J22NJ02n4n5j11K39j15o9m3m6K8J88n0O5j03O9k06J07j02K9%
$$ -99 -16 156 -77 45 50 152 98 43 -68 171 56 -13 -56 -102 -74 114 64 129 26 95 -111 -4 -106 -77 -77
4151g7Q5O2j46K17l8q9Q9r1Jj04K27p7o7L9o0j37N9K3J64k64K11m6j46K13r2m6
$$ -77 8 70 -76 141 103 14 103 12 13 -91 136 59 -8 31 -29 -166 -107 -84 80 -184 27 -19 -165 48 -44 -90
4177i0K13o7M4k11K34k13J47j7L7L6j53N6l2Mo6K20o1j62K14l9r6kJ36j56J00
$$ -90 123 56 100 -111 123 -90 57 40 77 113 -40 16 -16 -12 -78 142 81 -81 133 94 -2 -4 132 -24 76
4202G6l5o7J56j70O0Op8J26r6J0K3N3l3l7K29j40r6j09K19p2j97K51q7J74k27
$$ 76 41 -26 130 -40 20 26 -52 74 -22 -12 11 64 31 -6 223 83 -13 -122 97 25 -172 79 -8 166 -61
4227f1N9p8o7K11j5n9o1j9J68j29M6J20k25MK15k01p4k3J76nmQM6o8L2J23k9n2
$$ -61 -2 -80 -147 64 49 -10 -71 -90 78 -51 -5 115 -110 -106 109 -92 -166 -189 -13 -18 -22 -14 32 -36 -4 119 90 38
4255C8j13L9N6J5p0J88q1k07J04N8NR3j28M7o6O2j33K8j7P7o2J61l11L44n2M9
$$ 38 -75 -36 20 35 -35 153 72 -135 -31 27 32 125 -3 44 -22 40 -93 -65 -82 -5 -67 94 -217 127 75 124
4281A24k19M4oJ7N7K6n2q6J03l7m0J09K8q3M5o5Po5O1J57l1j28k9L3rj39J46p1
$$ 124 -95 -51 -57 -40 17 43 -9 -95 8 -29 -69 40 68 -15 30 -35 -28 -93 -32 125 94 -34 -63 -30 -39 -178 -32 -103
4309a03N6O7q4P8Lj14J2M7k4N1j03J34K3j18J22j62J30j3j42J84n8K9R7j91J3
$$ -103 -47 20 -64 14 17 -97 -85 -38 -62 -11 -114 20 43 -75 47 -115 15 2 -140 44 -14 15 112 -79 -66
4334f6Q7P4j96K43j54k4J5J65%j53k3l0n2J74o8r6J35j5q3K01O6j78p4P4j67J21
$$ -66 21 95 -101 142 -12 -36 -21 144 144 -9 -32 -62 -114 60 -8 -104 31 16 -67 134 200 22 -52 22 -145 -24
4360b4j1or7K49j49j2j1J50k09J14K11j82m9K00j09k46L26j62Nk8J36j50J1Q9
$$ -24 -35 -41 -138 111 -38 -50 -61 89 -120 -6 205 23 -26 174 65 -181 145 -17 -12 -40 96 -54 -43 46
4384D6j66qm4K21j31o5K08j29k7J37j90p0K46p3J74k68J7O7J67j38l7Q1P8l06
$$ 46 -120 -128 -172 49 -82 -147 61 -68 -95 42 -148 -218 28 -45 129 -139 -122 -55 112 -26 -63 18 96 -210
4408b10K12m0Q0N2l3Ll6J54j24j00j28q1L02Mj29l7Q2J16r1K9J2Q9n6J5n6K9K1
$$ -210 2 -38 42 94 61 64 28 182 58 -42 -170 -251 51 55 -74 -111 -29 87 -4 25 37 126 70 85 29 58 79
4435G9r4j9lr0M3J54j99L01k56R4K4q3J9J7K0n3J5L0J2kLj0k4n0P8j22K66k11
$$ 79 -15 -34 -37 -127 -84 70 -129 172 -84 10 34 -49 -30 -13 7 -46 -31 -1 11 9 12 2 -22 -72 6 -116 150 -61
4463f1J72j57J46k0l5j04lJ26q4J13j34O0n5o1M6k7J07j04L4K11l80J70mJ04j58
$$ -61 111 -46 100 80 45 -59 -62 64 -20 93 -41 19 -36 -97 -51 -78 29 -75 -41 170 -210 -40 -44 60 -98
4488i8J38p4k15K36j95K43j82J41R6l6n5jNl9P3r8p5M3LK5j07J39K26k75K92j00
$$ -98 40 -34 -249 -13 -208 35 -147 -6 90 54 -1 -2 3 -36 37 -61 -136 -93 -90 -65 -172 -33 193 -82 210 110
4514A10j32n5J82J15k96J30j85J47k34J78J32p4j45N6q6J9J60MKK2j19QO0j40
$$ 110 -22 -77 105 220 -76 54 -131 16 -218 -40 92 18 -127 -71 -157 -138 22 26 28 50 -69 -61 -1 -141
4538a41J08JR0k48K55L4o1j36J85n8K8oo3O0q7J1M8q8N0K4k3j04P0J72j01K5R
$$ -141 -33 -32 58 -190 65 99 38 -98 87 29 57 51 -12 48 -39 -28 20 -68 -18 6 -17 -121 -51 121 20 45 54
4565E4q3M3On5K7p6M4J67M9j81J38j15Nm3pj7ON7P1j57qJ16m7j05mj7N4k1J28
$$ 54 -29 14 20 -35 -8 -84 -40 127 176 -5 133 18 23 -20 -27 -44 -38 19 90 -67 -75 41 -6 -111 -115 -132 -78 -99 29
4594B9M4j30RJ22j47P3j1K7q8N2q9J45J56k15M1j30N5Q7n1N6n7M9p0L8j14J36
$$ 29 73 -57 -48 74 -73 0 -11 16 -72 -20 -109 36 192 -23 18 -112 -57 30 -21 35 -22 27 -43 -5 -119 17
4620A7Qp9J66k04K10j73J59lj64L7Q1o0K7J4J04j77J25p3LM4n4r2R1K1n3K3N2
$$ 17 25 -54 112 -92 118 -55 104 101 -63 -26 55 -5 22 36 140 -37 88 15 18 62 8 -84 7 28 -25 -2 50
4647E0L2r7n9q0J24J54j24M2j56j0R1J08n0l6K2j00K14k19J59j09J33p6j11M8
$$ 50 82 -15 -74 -154 -30 124 0 42 -114 -124 -33 75 25 -11 11 -89 125 -94 65 -44 89 13 -98 -50
4671e0J9J8p1O6rJ06j25O4M2K5k39K26j31M1Q7p8j0k35J27J61O6k29Q5K9l8L5
$$ -50 -31 -13 -84 -18 -27 79 -46 18 60 85 -154 72 -59 -18 69 -9 -19 -254 -127 34 100 -129 -44 -15 -53 -18
4697a8J26m7J1Jm9k06J68j02R9M8j4n5J15j26J2O3k9M0Q4k53M4R2N6r5O8K5O6
$$ -18 108 61 72 73 24 -182 -14 -116 -17 31 17 -38 77 -49 -37 26 -3 37 121 -132 -88 4 60 -35 33 58 124
4724A24Q1l77J90n3J39j01L9J2j7J00l9p2op4q0P1RJ6j2L9J1J5O0m6r4qP0j46
$$ 124 205 -172 18 -35 104 3 42 54 37 137 98 26 20 -54 -134 -63 -54 -38 -50 -11 0 15 75 29 -65 -73 -3 -149
4752a49K85j26K3j29K68k73N1Mj26K06N5j48l8J04n8O4k7Qk2qP1r5j7O8j12J04
$$ -149 136 10 33 -96 172 -101 -50 -46 -172 34 89 -59 -97 7 -51 13 -14 -6 -28 -36 35 -60 -77 -9 -121 -17
4778a7n8L00l18N6J6p5J75r7j58K92ro0m8J13j79O2n5N7o1jR0K5n8m9M9j52J26
$$ -17 -75 225 -93 -37 -21 -96 79 -18 -176 116 107 47 -1 112 -67 -5 -60 -3 -64 -65 25 50 -8 -57 -8 -160 -34
4805c4J51j63J56o4nm2l5Q5j9r1J55k00K01j4p2p4J00m7J74m7l09Q9l0J11J8q
$$ -34 117 -46 110 46 41 -1 -36 49 30 -61 94 -106 95 81 9 -65 35 -12 162 115 -194 -105 -135 -24 -6 -14
4831a4j10J66N5R6l02K22l0k06K23q8j24P8K5RJ30k95J32K8j63J68Q0j46J96J06
$$ -14 -124 42 97 193 -109 113 83 -123 100 12 -112 -34 -9 0 130 -165 -33 -5 -168 0 80 -66 130 236
4855B36j66j78J11j20J19j4o4J14l7N0j17pJ72J8m7j28J17l8K5L9Q4k31l7K08
$$ 236 70 -108 3 -117 2 -12 -76 38 1 51 -66 -73 99 117 70 -58 59 21 46 85 169 -62 -99 109
4879A09j31m4M9O6O0j20m5m0L00k40r5P1K3r6R2J03j14k0m6K34j37o2J69L6j68
$$ 109 -22 -66 -17 49 109 -11 -56 -96 204 -36 -131 -60 -37 -133 -41 62 -52 -72 -118 116 -21 -83 86 122 -46
4904d6J2L7J27j98O4j68K97o6q7O2m9o0L8n1J16j13J45N0K2k3q7Rj67O3O4J69
$$ -46 -34 3 130 -68 -4 -172 125 59 -28 34 -15 -75 -37 -88 28 -85 60 110 132 109 22 31 -136 -73 -9 160
4930A60j43j20J31N4k0m1n3j07K36j80K16j07j7J12k62J94j15N0J14r7p7P4J8
$$ 160 17 -103 28 82 62 21 -32 -139 97 -83 133 26 9 121 -141 53 -62 -12 102 5 -72 2 20
4953B0K9n9o7jQJ24k6r5q0J14K73k64j03J47Q3o8r4K4mN4K0KL5lMJ8r1M2Q8k62
$$ 20 49 -10 -77 -78 -70 54 28 -67 -147 -33 240 -24 -127 20 103 35 -59 -35 -39 15 35 37 72 69 73 91 0 42 130 -132
4983a32O5n4J70K0P9j3k08M8q3K32o9m4o6K06j49N8m0L8j00Q0j3j48J09JL2o2
$$ -132 -67 -121 49 69 148 135 -73 -25 -108 124 55 11 -55 151 2 60 20 58 -42 38 25 -123 -14 -13 19 -43
5009d3J66j41j72L46j48j0j12J67M2N1j54p7J59j50J26k23J17j48L71l07J18M
$$ -43 123 -18 -190 156 8 -2 -114 53 95 146 -8 -85 74 -76 50 -173 -56 -204 167 -140 -22 -18
5031a8P9m2Q5l0J8l7k53L23j44mm9P8j18J54j25J42%j54M7mQ2J4M3j63K51j52
$$ -18 61 19 104 74 92 55 -198 125 -19 -23 -72 6 -112 42 -83 59 59 -95 -48 -52 30 44 87 -76 175 23
5057B3J36j38j17J27n1J45j70k4Q4R0j05k7N5J2k71L55j54n9J78q8j25O%J20n5
$$ 23 159 21 -96 31 -20 125 -45 -69 15 105 0 -27 28 40 -231 124 -30 -89 89 1 -124 -118 -118 2 -53
5082e3Q5j02J15L6o4LJ07lp2rj41M1P3Q5l15L22j89N4J45j85OO6K7j20j73J52
$$ -53 32 -70 45 81 17 20 127 124 52 43 -98 -57 16 101 -214 108 -81 -27 118 -67 -61 5 32 -88 -261 -109
5108a09j14J72L6L2R5j18Q2J50l15k5J66N6K7j24L9k77L22K3j31M6l6k9J6k9J34
$$ -109 -223 -51 -15 17 112 -6 76 226 -89 -114 52 108 135 11 50 -227 95 118 -13 33 -3 -32 -16 -45 89
5133H9lj83K43k85n9K29r3K15k42J46j03J17j2O9p6j44L25j59n3j08M0K27j10
$$ 89 86 -97 146 -139 -198 31 -62 153 -89 57 -46 71 59 128 52 -92 233 74 21 -87 -47 180 70
5156G0j75j9J90m2l4k1J38j38L9J44k78j29J87J07L1k00J96R6k04J11j05j53J77
$$ 70 -105 -124 66 24 -10 -31 107 -31 8 152 -126 -255 -68 39 70 -130 66 162 -42 69 -36 -189 -12
5179a2J12j1n6j04J42j97J50ln7P9m2J22o8j56K24j89L4M3K85l43J08j49K4J15
$$ -12 100 89 33 -71 71 -126 24 21 -36 43 1 123 55 -101 123 -66 -32 11 296 -47 61 -88 -64 51
5203E1j00MN6K8l9j12O2K05j97J01j71J27j1pP0j27J30Nj01K6r6Q1j0J51j20p8
$$ 51 -49 -45 11 39 0 -112 -50 155 -42 59 -112 15 4 -3 67 -60 70 75 -26 0 -96 -15 -25 126 6 -72
5229g2l6M7J28o5nj15L3L1q3K90r3k5q0m8J3J60j16J8j2J42J50q8p0j02j7o8J13
$$ -72 -108 -61 67 2 -3 -118 -85 -54 -137 153 60 35 -45 -93 -80 80 -36 -18 -30 112 262 174 104 2 -15 -83 30
5256C0j1Q2q3o0O9l0q1J52j47J50k22L7P7P4j4O7P3j73j13K07j21k2N1P1j37n9
$$ 30 19 101 18 -42 27 -3 -84 68 -79 71 -151 -114 -37 37 23 90 163 -10 -123 84 -37 -59 -8 63 -74 -133
5282a33N3Q6%n5J5Jp3J37R2j28k5l3J76j6R2j51j9m5j3J74k68K19q8nn5K04j26
$$ -133 -80 6 6 -49 -34 -33 -106 31 123 -5 -30 -63 113 97 189 38 19 -26 -39 135 -133 86 -2 -7 -62 142 16
5309A6J1J44j89k8P8k20J02N8j43R0K3k3j05K87R5k01N9p0J15n9PR8k64RM9j08
$$ 16 27 171 -18 -46 32 -188 -86 -28 -171 -81 -58 -81 -186 101 196 -5 54 -16 99 40 47 145 -119 -110 -61 -169
5335a69R8o3J98j87n1O3J76Rj02J08k14J22qJ09L9Jk41J8J62n8K7n8l7J09l01
$$ -169 -71 -134 64 -123 -174 -111 65 74 -28 80 -134 -12 -20 89 128 129 -112 -94 68 10 37 -21 -58 51 -250
5360b50K24lJ4j00O6m5O0Q1q1N1q6Q4jj4qm5J25j35JJ93j12q2Q4K0p3kLK5R7l4
$$ -250 -26 -29 -15 -115 -49 -94 -34 47 -34 17 -69 15 14 0 -8 -53 72 -63 -62 131 19 -63 21 41 -32 -34 -31 -6 91 57
5390E7j20R9j34J33N1N0k45R3nL4J07k40J84j86R5M0M7Qm3q0K26j64k8jQ3n6O
$$ 57 -63 36 -98 35 86 136 -109 -16 -21 13 120 -120 64 -122 -27 13 60 68 25 -55 171 7 -21 -22 61 5 11
5417A1J16m2j94P0p6jK47j28K6j91K21n6J7q0O5O8r2j39K51j13J03r2o0J41j36
$$ 11 127 85 -109 -39 -115 -116 131 3 29 -162 59 3 20 -60 5 73 -19 -158 93 -20 83 -9 -69 72 -64
5442f4J08k24N4N6o0K59k79K52J7j69R0r6n7K39q8j40J12J1qk6n9L8j8O8k0j28
$$ -64 44 -180 -126 -70 -130 129 -150 102 119 -50 40 -56 -113 126 38 -102 10 21 13 -13 -72 -34 -52 16 -4 -132
5468a32Q0j8O6n1K6mJ56j8P4q0r2l5J9k4J08q5N8m0M1jk8j53K22r0J25j98J16
$$ -132 -52 -70 -4 -55 -29 -33 123 105 179 99 7 -28 -9 -33 75 -10 48 8 49 48 20 -133 89 -1 124 -74 42
5495D2N4k85J54M5Ol1P9m7r0j9J84k0j97J25M4q6J71j62K24j47m0J53k24k7j31
$$ 42 96 -189 -35 10 16 -15 64 17 -73 -92 92 72 -125 0 44 -42 129 -33 191 44 4 157 -67 -94 -225
5520b25K56J1o1m0JJ18r1O2r2rJ73J8l60J46J50L7p4P3n2R8j07k38K27pJ7O4r4
$$ -225 31 42 -19 -59 -58 60 -31 31 -61 -70 103 121 -239 -93 57 94 20 93 41 139 32 -206 21 14 31 95 1
5547Al9J14r3j18K49j59jM6P7J6Oj57j4n6J76m6K0m4P1j5j29J00K2oq1r6K59J3
$$ 1 -38 76 -17 -135 114 -45 -46 0 77 93 99 -58 -72 -128 48 2 22 -22 49 34 -95 5 27 21 -60 -156 103 116
5575A16J06k28mnk1J33j52M4k6J5k4M8j12K37q8p5Q4k59K04J31j36j00K44o3J14
$$ 116 222 -6 -10 -15 -36 97 -55 -11 -37 -22 -46 2 -110 127 39 -36 48 -211 -7 124 -12 -112 132 69 183
5600A83k13k4J14p4J52j1n2j56J8M5N8l7L5j86J30n2M5J3J50j30p3J6n0R8J14
$$ 183 -30 -54 60 -14 138 127 75 -81 -63 -18 40 3 38 -148 -18 -70 -25 -12 138 8 -65 -49 -99 -1 113
5625A13j68k4o2kj1M0J49j51m3J86r5O9q4L62k44J9K4M0j43J02J09j98j47K17
$$ 113 -55 -79 -141 -143 -154 -114 35 -116 -159 27 -68 1 -83 279 35 54 78 118 -25 77 186 -12 -159 58
5649E8K1J5l01J75J32k25N7l5M3N0N1n3MK7N6j30L0P0P1j41r6J64L2o3k43K19
$$ 58 79 94 -207 -32 100 -125 -68 -103 -60 -10 41 -12 -8 19 75 -55 -25 45 116 -25 -121 43 75 12 -231 -12
5675a2j5M8J0K3l2l7J06j01j48J00mJ64l32J44J50j16P6k2J22l1j21j28P3qk3
$$ -12 -27 21 31 54 22 -15 91 -10 -158 -58 -62 102 -230 -86 64 -52 24 2 124 93 -28 -156 -83 -91 -114
5700a14Q0O4n8M7q9N8K6kk2M1r3P1N0l8K9j47ON1P3k0j5o1J02k42K35J25j92j1
$$ -114 -34 30 -28 19 -70 -12 14 12 -10 31 -62 9 59 21 50 -97 -91 -40 33 13 -2 -63 39 -203 32 157 -35 -46
5728d6n6J14j11MJ05j5Jj30J33j37Q3J28N8Nj11Q5j03knOL2j44J05pM8K7K1j94
$$ -46 -102 12 -99 -95 10 -5 -4 -134 -1 -138 -55 73 131 136 25 110 7 5 0 6 38 -106 -1 -8 40 67 88 -106
5756a06Q3p7J19r5OR9K5P2j60j1j11J80jn6J73j19N1k26J44M3p7J40j55J64l2
$$ -106 -23 -100 19 -76 -70 29 54 126 -34 -45 -156 24 23 -33 140 21 72 -154 -10 33 -44 96 -59 105 73
5781G3J9m6m9R3M1k03R2M0lr4J07k7M6k8j86J54L9r7l7J68k64J93k9J0R4p7oj19
$$ 73 92 46 -3 90 131 -72 20 60 57 -37 70 43 89 61 -125 29 68 -29 -66 102 -162 31 2 12 106 29 23 -96
5809i6K10j53O3j57K29j47O0J17j18j31J88m1j18J50j60J03Pn5RR4j19m7J50J00
$$ -96 114 -39 24 -133 96 -51 9 126 8 -123 65 24 -94 56 -104 -1 6 -49 -40 54 -65 -112 38 138
5833A38l08K8K50j06k1P5L4j94J65Q1k02J4L8O4jO5j30P0j73J12J38j67L5k6j2
$$ 138 -170 -142 108 2 -19 56 90 -104 61 142 -60 -46 -8 56 55 120 -10 60 -113 -1 137 -30 5 -21 -33
5858c3Q9k53J69l4J88j80J22j5J16k33O4m2J3k1J34ok06K58l2k31Q3K15j33n4
$$ -33 56 -197 -28 -62 126 -54 68 53 169 -64 0 -42 -29 -50 84 78 -128 130 98 -133 -50 165 32 -22
5882b2R8j66J14q4K58k04q8K03j09o3K9K82j37r7J07j40j3R4j31J22N7p2j19K3
$$ -22 76 -90 24 -60 198 -6 -94 109 0 -63 -34 248 111 14 121 -19 -32 62 -69 53 110 38 -81 -58
5906e8L8M4j7K3J18j11k4o2p3J84j89N4J76o0r7J8l8J05J7R7j52N1j1o0n9L6K11
$$ -58 -20 24 7 30 148 37 13 -49 -122 62 -127 -73 103 43 -54 -36 -74 31 48 145 -7 44 33 -27 -86 -50 161
5933A61k61o4K24k29J10L18k92r0J77j0j11P8k88K33K37k12q3O2O1j23J6R8J30
$$ 161 -100 -164 60 -169 -59 259 -33 -123 54 44 -67 11 -277 -44 193 -19 -102 -40 21 -102 -86 12 142
5956A42j81J00j71J96kl01L08j43R9j00Q0k23M06k07j46J10Qo0L1J03o1l1N3K7
$$ 142 -39 61 -110 86 84 -217 91 -52 47 -53 27 -196 210 3 -143 -33 -25 -85 -54 49 -12 -43 10 37
5980C7l8J37j92L1K78k73J2j9j77K69Pl8l5jJ38j21J59j34m3R2n9j25nO2j03L02
$$ 37 -1 136 -56 -25 253 -20 -8 -27 -204 65 72 34 -1 -2 136 15 174 40 -3 89 30 -95 -100 -38 -141 161
6006A61p6o5nJ22j34j6oQ5o7j21J05K3n7j1K0M0n2O8R8k29K91l27K59k40J02j02
$$ 161 85 20 15 137 3 -13 -19 66 -1 -122 -17 6 -51 -62 -42 -2 -54 14 112 -117 174 -153 106 -134 -32 -134
6032a34J52j3j73L1J74p8j2O8Kj72K90jk58K25j53j68J56Q7k19J22Q6N1j67kR1
$$ -134 18 5 -168 -137 37 -41 -53 15 17 -155 135 134 -124 101 -52 -220 -64 23 -196 -74 12 63 -104 -106 -15
6057a5K0L6r9Q6J65k20M4M4J98j53n4KJ2j09J19Nl28K30K7m3J71j98J05j03M0
$$ -15 5 41 -58 28 193 -27 17 61 259 106 52 54 66 -43 76 81 -247 -17 10 -33 138 -60 45 -58 -18
6082a8L6r7P9j9LP9K0o2j81K41r1O3jj55K22l82J91K4O6j81J9L8R0MJ15j2j39
$$ -18 18 -79 0 -19 -16 63 83 21 -160 81 -10 53 52 -103 119 -263 -72 -48 18 -163 -144 -106 -16 -12 103 91 -48
6109d8O0q3K34m15J79J93l1q2k6j2K2k05K32PJ47j14j0R7j55j29K43m8m7p2q0
$$ -48 12 -71 163 -252 -73 120 89 7 -19 -31 -9 -214 18 25 172 58 48 145 -10 -139 104 56 9 -63 -143
6134a43L6K59j59L4k01J86m3N6j04rLJ33k15J2K86j86L6k2K67k62J79k13J15j53
$$ -143 -107 152 -7 27 -174 12 -31 25 -79 -88 -85 48 -167 -155 131 -55 -19 -41 226 -36 143 -70 45 -108
6158a08J89r4P1m2o9j0K18j89KR9j28J17oj9O9j02J5j52P4J7K8j8J59j11p0O7
$$ -108 81 -13 58 16 -53 -63 155 -34 -32 67 -61 56 50 31 100 -2 13 -139 -65 -48 -20 -38 121 10 -60 7
$$ [...]
8191D7
##END NTUPLES=NMR FID
##END=
