##TITLE=1H_2PBDP-2
 CDCl3
 8 sc, 
 13.4.2023
##JCAMPDX= 6.0         $$ Bruker NMR JCAMP-DX V2.0
##DATA TYPE= NMR FID
##DATA CLASS= NTUPLES
##ORIGIN= UXNMR, Bruker Analytische Messtechnik GmbH
##OWNER= root
$$ XWIN-NMR		Version 3.5
$$ Thu Apr 13 14:26:47 2023 Russian Standard Time (UT+4h)  she@DPX200
##.OBSERVE FREQUENCY= 200.13135
##.OBSERVE NUCLEUS= ^1H
##.DELAY= (6, 6)
##.ACQUISITION MODE= SIMULTANEOUS
##.ACQUISITION SCHEME= undefined
##.AVERAGES= 8
##.DIGITISER RES= 18
##SPECTROMETER/DATA SYSTEM= spect
##.PULSE SEQUENCE= zg30
##.SOLVENT NAME= DMSO
##.SHIFT REFERENCE= (INTERNAL, DMSO, 0, 15.7039)
##AUDIT TRAIL= $$ (NUMBER, WHEN, WHO, WHERE, WHAT)
$$ ##TITLE= Audit trail, XWIN-NMR		Version 3.5
$$ ##JCAMPDX= 5.01
$$ ##ORIGIN= Bruker BioSpin GmbH
$$ ##OWNER= she
$$ F:/spectra/data/she/nmr/H-F/1/audita.txt
$$ ##AUDIT TRAIL=  $$ (NUMBER, WHEN, WHO, WHERE, WHAT)
(   1,<2023-04-13 14:25:45.82 +0400>,<she>,<DPX200>,
      <created by zg, POWCHK disabled, PULCHK disabled
       configuration hash MD5:
       00 E9 B6 7A A2 85 ED C7 34 08 36 98 17 FE 4E 26
       data hash MD5: 16K
       17 A7 A0 0E 36 ED 4B A9 98 DE 36 D7 45 CF E2 FA>)
$$ ##END=
$$ 
$$ hash MD5
$$ 68 03 25 24 A2 F0 64 F9 38 01 E8 DF 60 48 88 03
##$RELAX= 
##$RELAX= 
##$RELAX= 
##$RELAX= 
##$RELAX= 
##$RELAX= 
$$ Bruker specific parameters
$$ --------------------------
##$DU= <F:/spectra>
##$EXPNO= 1
##$NAME= <H-F>
##$PROCNO= 1
##$TYPE= <nmr>
##$USER= <she>
##$AMP= (0..31)
100 100 100 100 100 100 100 100 100 100 100 100 100 100 100 100 100 100 
100 100 100 100 100 100 100 100 100 100 100 100 100 100 
##$AQSEQ= 0
##$AQ_mod= 1
##$AUNM= <au_zg>
##$AUTOPOS= <>
##$BF1= 200.13
##$BF2= 200.13
##$BF3= 200.13
##$BF4= 200.13
##$BF5= 200.13
##$BF6= 200.13
##$BF7= 200.13
##$BF8= 200.13
##$BYTORDA= 1
##$CFDGTYP= 0
##$CFRGTYP= 5
##$CHEMSTR= <none>
##$CNST= (0..31)
1 1 145 1 1 1 1 1 1 1 1 1 1 1 1 1 1 1 1 1 1 1 1 1 1 1 1 1 1 1 1 1 
##$CPDPRG= <>
##$CPDPRG1= <>
##$CPDPRG2= <>
##$CPDPRG3= <>
##$CPDPRG4= <mlev>
##$CPDPRG5= <mlev>
##$CPDPRG6= <mlev>
##$CPDPRG7= <mlev>
##$CPDPRG8= <mlev>
##$CPDPRGB= <>
##$CPDPRGT= <>
##$D= (0..31)
0 1.2 0 0 0 0 0 0 0 0.06 0 0.03 0 0 0 0 0.0002 0 0 0 0 0 0 0 0 0 0 0 0 
0 0 0 
##$DATE= 1681381545
##$DBL= (0..7)
120 120 120 120 120 120 120 120 
##$DBP= (0..7)
150 150 150 150 150 150 150 150 
##$DBP07= 0
##$DBPNAM0= <>
##$DBPNAM1= <>
##$DBPNAM2= <>
##$DBPNAM3= <>
##$DBPNAM4= <>
##$DBPNAM5= <>
##$DBPNAM6= <>
##$DBPNAM7= <>
##$DBPOAL= (0..7)
0.5 0.5 0.5 0.5 0.5 0.5 0.5 0.5 
##$DBPOFFS= (0..7)
0 0 0 0 0 0 0 0 
##$DE= 6
##$DECBNUC= <off>
##$DECIM= 32
##$DECNUC= <off>
##$DECSTAT= 4
##$DIGMOD= 1
##$DIGTYP= 9
##$DL= (0..7)
0 120 120 120 120 120 120 120 
##$DP= (0..7)
150 150 150 150 150 150 150 150 
##$DP07= 0
##$DPNAME0= <>
##$DPNAME1= <>
##$DPNAME2= <>
##$DPNAME3= <>
##$DPNAME4= <>
##$DPNAME5= <>
##$DPNAME6= <>
##$DPNAME7= <>
##$DPOAL= (0..7)
0.5 0.5 0.5 0.5 0.5 0.5 0.5 0.5 
##$DPOFFS= (0..7)
0 0 0 0 0 0 0 0 
##$DQDMODE= 0
##$DR= 18
##$DS= 0
##$DSLIST= <SSSSSSSSSSSSSSS>
$$ [...]
##$SUBNAM2= <"">
##$SUBNAM3= <"">
##$SUBNAM4= <"">
##$SUBNAM5= <"">
##$SUBNAM6= <"">
##$SUBNAM7= <"">
##$SUBNAM8= <"">
##$SUBNAM9= <"">
##$SW= 18.05172834244
##$SWIBOX= (0..15)
0 0 2 0 0 0 0 0 0 0 0 0 0 0 0 0 
##$SW_h= 3612.71676300578
##$TD= 16384
##$TD0= 1
##$TE= 0
##$TE2= 300
##$TE3= 300
##$TEG= 300
##$TL= (0..7)
0 120 120 120 120 120 120 120 
##$TP= (0..7)
150 150 150 150 150 150 150 150 
##$TP07= 0
##$TPNAME0= <>
##$TPNAME1= <>
##$TPNAME2= <>
##$TPNAME3= <>
##$TPNAME4= <>
##$TPNAME5= <>
##$TPNAME6= <>
##$TPNAME7= <>
##$TPOAL= (0..7)
0.5 0.5 0.5 0.5 0.5 0.5 0.5 0.5 
##$TPOFFS= (0..7)
0 0 0 0 0 0 0 0 
##$TUNHIN= 0
##$TUNHOUT= 0
##$TUNXOUT= 0
##$USERA1= <user>
##$USERA2= <user>
##$USERA3= <user>
##$USERA4= <user>
##$USERA5= <user>
##$V9= 5
##$VALIST= <valist>
##$VCLIST= <CCCCCCCCCCCCCCC>
##$VD= 0
##$VDLIST= <DDDDDDDDDDDDDDD>
##$VPLIST= <PPPPPPPPPPPPPPP>
##$VTLIST= <TTTTTTTTTTTTTTT>
##$WBST= 1024
##$WBSW= 4
##$XGAIN= (0..3)
0 0 0 0 
##$XL= 0
##$YL= 0
##$YMAX_a= 250772
##$YMIN_a= -300242
##$ZGOPTNS= <>
##$ZL1= 120
##$ZL2= 120
##$ZL3= 120
##$ZL4= 120
##$ABSF1= 10
##$ABSF2= 0
##$ABSG= 5
##$ABSL= 3
##$ALPHA= 0
##$AQORDER= 0
##$ASSFAC= 0
##$ASSFACI= 0
##$ASSFACX= 0
##$ASSWID= 0
##$AUNMP= <proc_1d>
##$AZFE= 0.1
##$AZFW= 0.1
##$BCFW= 1
##$BC_mod= 2
##$BYTORDP= 1
##$COROFFS= 0
##$CY= 11.3945322036743
##$DATMOD= 1
##$DC= 2
##$DFILT= <>
##$DTYPP= 0
##$F1P= 15.7292609196834
##$F2P= 12.9074282941183
##$FCOR= 0.5
##$FTSIZE= 0
##$FT_mod= 4
##$GAMMA= 1
##$GB= 0.15
##$INTBC= 1
##$INTSCL= 1
##$ISEN= 128
##$LB= 0.24
##$LEV0= 0
##$LPBIN= 0
##$MAXI= 10000
##$MC2= 0
##$MEAN= 0
##$ME_mod= 0
##$MI= 1.114404
##$NCOEF= 0
##$NC_proc= 0
##$NLEV= 6
##$NOISF1= 3.799351
##$NOISF2= 2.8
##$NSP= 1
##$NTH_PI= 0
##$NZP= 0
##$OFFSET= 15.70392
##$PC= 1
##$PHC0= -19630.52
##$PHC1= 12.20081
##$PH_mod= 1
##$PKNL= yes
##$PPARMOD= 0
##$PSCAL= 0
##$PSIGN= 0
##$REVERSE= no
##$SF= 200.130013532006
##$SI= 16384
##$SIGF1= 3
##$SIGF2= 2
##$SINO= 400
##$SIOLD= 16384
##$SREGLST= <1H.CDCl3>
##$SSB= 0
##$STSI= 0
##$STSR= 0
##$SW_p= 3612.71676300578
##$SYMM= 0
##$S_DEV= 0
##$TDeff= 0
##$TDoff= 0
##$TI= <>
##$TILT= no
##$TM1= 0
##$TM2= 0
##$TOPLEV= 0
##$USERP1= <user>
##$USERP2= <user>
##$USERP3= <user>
##$USERP4= <user>
##$USERP5= <user>
##$WDW= 1
##$XDIM= 8192
##$YMAX_p= 0
##$YMIN_p= 0
$$ End of Bruker specific parameters
$$ ---------------------------------
##NTUPLES= NMR FID
##VAR_NAME=  TIME,          FID/REAL,        FID/IMAG
##SYMBOL=    X,             R,               I
##VAR_TYPE=  INDEPENDENT,   DEPENDENT,       DEPENDENT
##VAR_FORM=  AFFN,          ASDF,            ASDF
##VAR_DIM=   8192,          8192,            8192
##UNITS=     SECONDS,       ARBITRARY UNITS, ARBITRARY UNITS
##FACTOR=    0.0002768,     1,               1
##FIRST=     0,             0,               0
##LAST=      2.2672688,     0,               0
##MIN=       0,             -300242,         0
##MAX=       2.2672688,     250772,          0
$$ Real data points
##PAGE= N=1
##DATA TABLE= (X++(R..R)), XYDATA
0@%%%%%%%%%%Qj6J6j6K4l2M0m8N6p2Q8j04J27j51J76k08K40k78L20l66M20m80
32b56N46o18O98p88Q88r96J114j243J385j542J712j896K098k318K559k824L111
49A630l427L777m162M586n057N585o179O851p618Q504r544J0781j2282J4150j6547
64h952J9752k4278L1196m3195O9751k30826O3905K39347l93166K01548K88593
75B13675k52863m1816L31776j59899j46729K24601k3257k11418J23684L6787j70479
86g5938K3946J02966r6499k7598R6583q049q3470L8679M7825p1637l2498R4053
98H363j6871q1487Q6533N6010j08121M5655J14608r0491j5608J36940o4563q5120
110a4152J10586k8801j29379P5109J9344j31348L6986O1602j04016R967R5992
$$ y = [0, 0, 0, 0, 0, 0, 0, 0, 0, 0, 0, 8, -8, 8, -8, 16, -16, 24, -24, 32, -40, 48, -56, 71, -80, 96, -112, 128, -150, 170, -196, 224, -256, 290, -328, 370, -418, 470, -526, 588, -655, 730, -812, 900, -996, 1102, -1216, 1343, -1481, 1630, -1797, 1980, -2182, 2404, -2653, 2932, -3247, 3604, -4014, 4490, -5054, 5727, -6555, 7595, -8952, 10800, -13478, 17718, -25477, 44274, -186552, -122647, 116700, -276466, -74918, 213675, -39188, -81004, 250772, 90873, -55856, 168745, 145488, -65930, 57754, 94541, -75938, -51992, 50974, -45525, -73123, 23460, 15411, -68059, -29380, 18445, -53192, -85690, 8363, -8508, -89995, -3462, 52548, -55573, -9918, 104690, 14199, -1409, 135531, 70968, -14152, 96434, 67633, -61746, 13363, 32707, -98641, -61655, -53, -104069, -94102, 1890]
121A890n7188j2509J04796j6042l6061Q3619O251o3844M3358K1966p8036J85M4993
134D3378n9140l6542O3892r533o3905N1186M5879p4065Q1Q2179m8598n6935Q5503
147B3380L436r4492N5606O2102r3656R005J08634n8752m9637J11023j4614j06136
159d4101P3471M0548j23683J8791R4444r6718m4785J17344l7418r2974J05914
170A0833L6783j12388N6748R1851j04385j5395J13936o2423p4647J05066j026
181D4953j04565O3921N1628j00405R989Q2462o3073l3385Q3170j7134n9841N5100
193A2820J9772o2777J9177M3502m3509j2202M7032j7035l4045L5245J0102l9503
205b1421J5901L1142l2690q347L8042j8491k8852L5874K588l9346K6374K3539
$$ y = [1890, -55298, -67807, 36989, 20947, -15114, 68505, 74756, 10912, 54270, 76236, -1800, -1615, 43378, -15762, -52304, 11588, 2055, -61850, -10664, 35215, -38850, -38769, 43410, -5188, -62123, 23380, 26816, -67676, -12070, 50032, -43624, -34619, 74015, 15263, -34374, 76649, 62035, -44101, 29370, 69918, -53765, -34974, 59470, -37248, -82033, 35311, -2107, -95081, 10833, 47616, -64772, -8024, 83827, -20558, -35953, 77983, 15560, -59087, 45979, 44953, -59612, 4309, 55937, -44468, -34479, 47983, -15090, -48475, 34695, 17561, -42280, 12820, 32592, -30185, -11008, 32494, -11015, -23217, 23815, 6780, -27265, 7980, 18082, -21421, -5520, 25622, -7068, -15415, 22627, 4136, -24716, 11158, 13746, -25600, 774, 24313]
217B4313m2282Q592M0127l6966j4146M8954k1826l6955M6740J831n2623L2873
229a368K8550n5443Q900N1083m3015k0137O1132j7918m8032N2626J6187o3231
241c0666K6073M8994n7670j3281O6206l0103n0418N9932J0146p0227L1232M8189
253C8407o5039q402P1153l6460m6890P0346O069p1797M3431M8283p2084p29P5013
266E1301m6080m6384P4160l279p5548M7039M0431p6807N643P0151n1494l5840
278d6707P4796j1697o3942N5916L0558p0017J9995N9017n5920k0591O6916k4988
290A3336n0482N5141J1582o1959K7550L9904n4738n577N3356l1496l2072M9969
302A4514j840m6314L2867K4241m5311R488M1490l2205j4358M5237j3583l4503
$$ y = [24313, -17969, -9377, 30750, -6216, -20362, 28592, 6766, -30189, 16551, 18382, -34241, -1368, 27182, -28261, -19361, 31722, -11293, -31430, 29702, 11784, -36248, 16378, 32565, -30666, -4593, 44401, -13269, -26550, 39656, 9553, -40865, 19067, 29213, -41014, -9782, 38407, -26632, -35034, 36119, -341, -47231, 23115, 29184, -42613, 818, 49101, -22983, -23712, 51301, 5221, -41163, 32997, 29718, -45830, 1209, 41640, -35167, -29524, 40627, -10867, -46707, 28089, 16392, -47550, 8366, 38924, -31093, -11098, 47919, -8001, -28592, 38324, 13336, -37146, 17995, 29577, -32382, -4832, 35072, -19666, -25243, 28113, -3383, -35455, 14514, 12674, -33640, -773, 23468, -21843, -12355, 29135, -3070, -17428, 27809, 14226, -20277]
314b0277L5867P946m4198J8595K8428m0909m086M0757k7005k5774M3004m146m0720
327c2518L3632K1159m6140J2561M2066l8558j4366N2074j7435l9314M5383J0022
339B8566n4280K3397L6334n1463o185N3275l1404l5200N3999j8n4568L6023L3040
352C1516n5935M773N5391l7757k9956N7630n471n3055L9900K8251n7182P294N0732
365C6131m1111k6161N5628j1010m9655M1325K1780n5526J3450M6360m2374j7290
377b8453N4257j5667m0942M3239J3529m9687J9199L6363m1250q587M4803k1319
389E485l0856L8178L300m1196K1072K4458l7276l52L6839k2721k0441L6927k217
402A1200l3086K6796J7653l6886Q776L1601l0892j1105L7855j7254k8243L6207
$$ y = [-20277, 15590, 23536, -20662, -2067, 26361, -14548, -18634, 22123, -4882, -30656, 12348, 8202, -32518, 1114, 22273, -23867, -11306, 30760, -7798, -22164, 29910, 12475, -26839, 18544, 28566, -25714, -2317, 34017, -17446, -23631, 29644, -1760, -36960, 17039, 17021, -37547, -1524, 31516, -24419, -19646, 35745, -2012, -31968, 25662, 20191, -32864, 7036, 35287, -21895, -14601, 36131, -4980, -31141, 24487, 13477, -36178, 5147, 26927, -28599, -15149, 31211, -11163, -28453, 25804, 10137, -30805, 12434, 25963, -23724, -4525, 31838, -9412, -17999, 26804, 5485, -25371, 12807, 16107, -25089, -4017, 20441, -16835, -17187, 19652, -3069, -23510, 13417, 11200, -21886, 4910, 22563, -14323, -5547, 26054, -4838, -15943, 21912, 4658, -23585, 12622]
414A2622J441l8936K5692K0487m1612Q780L5907l3724j0751M2610j8437k8999
426b4920L8593J029l9289K5859K0673l9219P183L4978k9402j4190L8202j0716
438H781l0671K9738J1488l6541J0309K8503k8923j2312L4955r833k9012K8849
450E331J3157l5587J0535L0788l0306j2725L8951j2406l2099L3290J0473m1657
462b2255J5042L1432l6215p904M2466j8414k8692L8571M586m0721K1792K5298
474B4986l8795n30L7796k4616k1677L7252m366l4576K6529J6715l5736Q812L0369
487B2163k6775j0911L3325j1247k5188K6426O443l0003J2441K0144k5175m243
499a2600K6570j2473j8082K3987L621k5680J3284J7988k5578k966K8050j6231
$$ y = [12622, 14063, -24873, 819, 21306, -20306, -11526, 24381, -9343, -20094, 22516, 4079, -24920, 13673, 14702, -24587, 1272, 21945, -17274, -10091, 24887, -4515, -18705, 19497, 8781, -21890, 7848, 19336, -17205, -6896, 21607, -7316, -19628, 15327, 5494, -23518, 5331, 18488, -17099, -6564, 24224, -6082, -18807, 20144, 7738, -24361, 8929, 19402, -22255, -7213, 24219, -11996, -19900, 22566, 4152, -24540, 14031, 18617, -22104, -312, 24986, -13809, -14339, 23457, -1159, -22836, 14416, 10050, -24526, 2003, 18718, -17018, -8206, 22163, -4612, -15523, 17802, 6555, -18633, 7793, 14236, -15767, -3326, 16818, -8357, -12600, 13970, 1497, -16585, 7402, 11023, -14657, -1373, 16615, -8963, -11929, 16121, -110]
511a10j9089L1167l51l1812K4441J7206l8343J0121L3707l5847r514M4535k4391
524A720l0120M6082m237m5768L6489J9189n0101J7774L7570m2544m533M4884k6324
537H1k2702M0854o052l2054K7519J0462l1465R481K0410k0787o982K0342m602
550D505j6876J0071J1804j5642o318K1020m065k1727J9307J3471k9974P258K9838
563B2672k8410j0929L9055j6561k8626L8696J178m1236K7443K0545m3172R405
575i940L3943l3711r622L7371j6904k2754L0562P85k6699J6849J3243k1930K856
588e951J8687j1796r137J6081J14j6276P925J2224j6469m392K0051r323j7620
601a5882K1780L750k7111J5364J8654k9314K973L0016k4270j2771L4956j2710
$$ y = [-110, -19199, 11968, 11617, -20195, 4246, 21452, -16891, -6770, 26937, -8910, -18424, 26111, 1720, -28400, 17682, 13445, -32323, 4166, 23355, -26746, -8972, 28598, -13946, -18479, 26405, 81, -22621, 18233, 12181, -19873, 7646, 18108, -13357, -3876, 16534, -4253, -11235, 9107, 4505, -12371, -2300, 9504, -6138, -12456, 8564, 4499, -17228, 2079, 15550, -14424, -7166, 22672, -5738, -16667, 22388, 5827, -22799, 15897, 17075, -24161, 3282, 23827, -19345, -9940, 24003, -9708, -19330, 18041, 1137, -21617, 8945, 9730, -16969, -120, 13123, -8807, -5951, 12736, 940, -8197, 7884, 7998, -8278, -353, 11871, -4598, -8990, 11061, 1738, -15882, 5898, 9648, -17463, -2099, 16555, -12759, -9786, 20230, -4040, -16811, 18145, 5435]
613E435k6265L2566K912l4608K2625J7887l6431P605K9838k9042r226L4496j5020
626B772k3509K9958K064l0589J7905J8286k8422J344K7724j7780j4946K7281j803
639A0285k5796J7838J4656k7013J904K5435j8808j4941K6745l168k5210J9175
651A102J3133k7035M427K3918j8784j0888K5934m943k1638J8355J0125k3886M708
664e472K0422j7190r978K2620m085k0152J6861R712k3488M896K0514j9135r071
677a3546K5176q049k0481K2619O355k6780J2403J8893k5219j477K6402j6562j4185
690a4451K6374m103k3382J9256Q227k5464R395J8616k0757k976K2829j2982j4076
703a3494K1556o58k0279J4726J1009k1595K934J8714j6136r083K1807m653j8152
$$ y = [5435, -20830, 11736, 14648, -19960, 2665, 20552, -15879, -8274, 21564, -7478, -16704, 17792, 2772, -20737, 9221, 11285, -19304, -1399, 16887, -11535, -10191, 17533, -247, -15193, 12088, 10285, -15511, 2327, 16983, -10030, -8126, 17309, -1499, -16440, 10305, 7137, -18073, 1102, 14235, -12800, -8373, 15545, -3239, -14127, 11807, 6864, -14774, 3581, 13706, -10180, -5472, 14950, -2240, -12218, 10402, 6317, -13835, 3026, 12738, -10750, -5854, 14660, -4475, -13546, 11630, 3581, -16900, 5719, 12074, -14706, -2303, 16590, -8629, -10106, 16296, -266, -14451, 11923, 7820, -15562, 3694, 11921, -13543, -4148, 14468, -6289, -9265, 13564, 582, -13494, 8062, 7404, -12875, 1851, 12860, -8735, -5801, 12913, -3223, -12306, 9501, 4848, -13304]
716a3304J7639P426k2966O829J7754j9558n097K4209j0042j7060K1779K282k4737
729a4846J3914J5670k3895J212K4708j7124j3489K5016m383k3103J9313J0338
741A3331k5323O899K0286k0704p219K4667q824j7891K0881N059k3310R775J5990
754A3617k0022l436K1532r652j4347J8595K428j9869R585J3131j7459j634J8989
767A1458r743j2669J7377J053j8572J0298J2186j7812o41J8100j1466j1338J8374
780F605r49j7605J3394R148j9050L694J6610j5379o200J9937p038j4758J7373
793E782K654j9727J0531J2183j8633J230J8295j3478q916J9015m756j6414J5534
806C300N670j8980P304J4114j6980l098J8517r165j1943J7661J234j7865J0543
$$ y = [-13304, 4335, 11761, -11205, -4376, 13378, -6180, -11277, 12932, 2890, -14170, 7609, 9891, -14846, -932, 14738, -9157, -7945, 16763, -361, -13850, 11166, 6783, -16320, 2993, 13331, -11992, -5093, 15193, -5511, -12730, 11937, 3113, -14778, 6103, 11162, -12148, -2373, 13617, -6405, -9841, 11691, 2039, -12308, 6287, 8715, -11154, -1569, 11562, -5897, -7531, 11458, 1715, -10954, 6423, 7476, -11096, -798, 11388, -6424, -7065, 11035, -431, -11769, 6605, 5656, -11949, 1445, 10593, -8457, -4763, 11847, -3532, -9732, 10205, 3167, -11591, 5782, 8436, -11291, -760, 11423, -7210, -5980, 12315, -1163, -10079, 8936, 4180, -12234, 3300, 8970, -10010, -2706, 11408, -5572, -8670, 9847, 682, -11261, 6400, 7634, -10231, 312]
819C12J0740j8201O23J7977j2020j0154J8804k014j8053J3249R283j9732L741
832e445J8183j5132q294K1018n769j7702J7235O414k1461P995J6316j8961m025
845i628K0752r992j4073J9262J648j9515J1439J1629j8854M45J8130j1994r988
858a0739J8234j420j6881J1782R162j7231J945J6074j1624q325J6736k754j5275
871a0316J2338O743j7155M588J3978j4178m614J7354p319j2331J6082J729j6715
884i816R901R853j6329J451J4956j1394o645J5388l915j2271J1987L782j4045
897g097N441R931j1925k298J3154o356r103J2012J571j3276O718R636j3016j364
911e972J4609p893r836J4759M44j5918J0244R315j6921K073J5907j3131p262J8372
$$ y = [312, 11052, -7149, -6526, 11451, -569, -10723, 8081, 6067, -11986, 1263, 10546, -9186, -5445, 12738, -2394, -10688, 10330, 4561, -13141, 4094, 10508, -10953, -2958, 13358, -5603, -9628, 11124, 1132, -12941, 6321, 7969, -11546, -107, 11522, -7332, -6887, 11243, -751, -10739, 7495, 6075, -10806, 976, 10138, -7093, -5148, 10926, -698, -9023, 7713, 4959, -10316, 2022, 8765, -8390, -3802, 10176, -4002, -8616, 8738, 1419, -10912, 5170, 6899, -9816, 85, 9938, -6391, -4940, 10016, -1378, -8023, 7365, 3450, -8821, 3166, 6948, -7097, -1656, 8275, -3650, -5948, 7206, 850, -8253, 3759, 5330, -7946, -1228, 8408, -4608, -5972, 8637, 744, -9092, 5667, 6111, -9807, 437, 9752, -7169, -5096, 10811, -2320, -9582, 8790]
925H790m932j5110J5378M831j8518P564J3139j6297k481J7261r035j1137J6045
938E498P45j5717R245R727j5122pJ5058r231r318J4933m32j5184R629R003j5467
953f640J290J4939j0556p969J6340k806j4252J2594O012j6571N098J2773j4229
966c977l659J5963p416j0764J4575P78j4625R205Q422j4419J546J3232j0270n939
980g348J3945l567j1564J0830L768j3119N443R444j1110j360J2010o631p180J1474
994E035o52j0806P390N088j1143J648R369p914m127J0067j886q374P438M303r491
1009d055J675Q832o952m880J0060j311j0359P930N534j2292K171J1832j0285n193
1023g293J4840m809j2026J3567K881j6019Q309J0329j6150M96J5347j1156p553
$$ y = [8790, 3858, -11252, 4126, 8957, -9561, -1997, 11142, -5155, -7636, 9625, 590, -10547, 5498, 6243, -9474, -229, 9498, -5624, -5631, 9427, 196, -9122, 5811, 5379, -9805, -176, 8827, -6640, -5350, 9589, -967, -8936, 7404, 4598, -9654, 2940, 8952, -7619, -2521, 10252, -3977, -7636, 8327, 911, -9853, 4722, 5500, -9125, 80, 8502, -5917, -4371, 8861, -1409, -7348, 6597, 3030, -8534, 2296, 6064, -7055, -1612, 7832, -3278, -4638, 7372, 741, -6439, 5035, 4383, -6423, 967, 6055, -5088, -3440, 5929, -1985, -6112, 3955, 2069, -6305, 1133, 5436, -4055, -2380, 6452, -500, -5380, 4680, 3369, -6990, 940, 6474, -5818, -3647, 8185, -2100, -7293, 7547, 2738, -9288, 4279, 7160, -8859, -550, 9779, -6371, -5875, 9472, -1684, -9237]
1036i237J6433l704j3276J2446M587j4354N211J0719j1501l025J2290m844r033
1049g288R590K921j1304L629R234r066l751J2189l434j0373J0949L752j3979N521
1063a410J0567j3542j864J4867r218q761J5619k351j3900J2557M861j5656O834
1076a397J0752j4065q9J3394r446o226J2922l184j0009R468K875j0428L941P218
1090E726p471j578P843k998o156O099K432p417J678O393n822l745Q472j708q019
1105f271P692L709j0310L825Q837j0159k229J1855o409p904J1864j26j1856Q075
1119E93O083j2185J963J0739q395m351J1144k514r158P776L396r983K490Q215
1133E813p437l662R907k840q747Q245M143j1171L642R947j0257l429J2882n253
$$ y = [-9237, 7196, 3492, -9784, 2662, 7249, -7105, -1894, 8825, -2676, -5701, 6589, 1745, -7288, 2302, 5223, -6081, -2452, 6782, -2284, -6035, 6154, 2720, -7653, 3296, 7048, -6931, -1410, 9157, -4385, -6249, 8618, -600, -9361, 6258, 3907, -9993, 2564, 7425, -8231, -1397, 9355, -4710, -4799, 8595, -851, -7077, 5845, 2661, -7348, 2120, 4995, -5433, -1492, 5726, -1745, -3323, 4520, 1522, -4634, 1465, 3897, -3520, -1842, 4551, -1271, -5016, 3456, 1748, -6271, 1421, 5130, -5180, -1355, 7482, -2677, -4906, 6949, 540, -7364, 4500, 4374, -7482, 593, 6676, -5509, -3546, 7193, -1202, -5553, 5591, 3077, -6081, 1695, 5091, -4892, -2402, 5813, -1624, -5286, 4621, 1781, -6966, 1279, 5422, -5749, -2107, 7840, -2417, -5846, 7036, 1783]
1147A783j0028J1997K094j3522P436Q551j3253L74J2437r137n797J3112l144j0369
1161g466J0082K797j1969N103P952j0255q57J0655n941o262R721p1r242O067N499
1176E813r195N44Q668n971m927Q965j236q265O616L896r321K271P976p922k713
1191d801R850l792p313Q755J483r701M938O480r095l1Q907n727n202Q980r75q227
1207e471O122M303q934J367P757o269l783Q695j300p764O441L804q799J705P706
1222E580o595l804R038j967p902P262L277r630K813P964q252k715J0173l888p633
1237f279Q959J565j0217N217O738r713j02R945o445n274J0261j481r059P597L918
1252E630j0103K857P801q319k320R448m425o583Q481P57q619N219N068q296N44
$$ y = [1783, -8245, 3752, 5846, -7676, -240, 8311, -4942, -4568, 7869, -1268, -7065, 6047, 2903, -7466, 2616, 5413, -6556, -1453, 6499, -3756, -4613, 6042, 101, -6161, 3560, 3489, -5753, 314, 5813, -3382, -2838, 5830, -141, -5068, 3897, 2661, -5604, 1012, 4908, -4413, -2142, 5834, -2088, -4801, 5049, 1257, -6056, 2699, 4182, -5519, -581, 5899, -3196, -3227, 5680, -47, -5249, 3731, 2756, -5471, 651, 4954, -3980, -2613, 5144, -1125, -4908, 3787, 2487, -5277, 1164, 4968, -3831, -2126, 5580, -1015, -4819, 4219, 2252, -5650, 1612, 4889, -4741, -1928, 6036, -2216, -4931, 5242, 1354, -6279, 2680, 4245, -5972, -755, 5983, -3730, -3832, 6113, -332, -5606, 4655, 3174, -5885, 1712, 5630, -4473, -1616, 6185, -2134, -4454, 4994, 569, -6014, 2467, 3224, -5395, -176, 4892, -3404, -2860]
1267b860P811n803l567Q102j634o660N922K513p517K335N928o096j748P462l055
1282A133n367O500Q41p283L649M967o909m11P352m657m387P398o43o960N311L653
1298D187p735J617O873o341k735Q121k579o369O755J988q084L444N743p129j146
1313c390P816l837n147P238N27p360M125M745p428k16P256m491m582P511K5p547
1329d755M904M446q044P91P473n542l780Q483j736p436O646K821q715K999O898
1344E453p482j534Q423m070n838P594M55p797M757M679p426N88O785n466l422
1359d301P174j397n999N470K678p109J812N700n442k220P326k116n530O077J807
1374C930p598K893N165o743r33P679m144m835P438m13p500N413L929p992J858
$$ y = [-2860, 4951, -852, -4419, 3683, 2049, -4611, 1311, 3824, -3693, -1358, 4570, -1526, -3274, 4188, 1133, -4234, 2266, 3107, -4176, -527, 4440, -2469, -2880, 4472, -185, -4572, 2826, 2183, -4777, 534, 4187, -3548, -1931, 4942, -1399, -4134, 3987, 1408, -4961, 1794, 3782, -4302, -858, 4885, -2244, -3390, 4426, 589, -4558, 2680, 3207, -4153, -28, 4717, -2711, -2927, 4329, -162, -4744, 2767, 2792, -4755, 149, 4595, -3449, -2658, 4815, -727, -4507, 3976, 2240, -5196, 1450, 4271, -4444, -1445, 5453, -2029, -3563, 4860, 790, -5048, 2546, 3001, -4796, -39, 4640, -2786, -2198, 4587, -879, -4301, 2873, 1476, -4523, 947, 3625, -3484, -1672, 4028, -1414, -3634, 3692, 1576, -3954, 2123, 3930, -3668, -775, 4390, -2353, -3286, 4393, 249, -4586, 2852, 2439, -5061, 352, 4281, -3711, -1853]
1389a853O929o346k726P985k987o174O777J724p492L602N276o710r10O966l612
1404D49m522O586N21o859L668M406o925l28O987m407m372P532o9p384N268M162
1420D713p931J174P446o004l351Q109k439o709O466J895p956L232N514o649p37
1435c227P341l841m334O595O6o332L971L631o073K1N662l505l507N760j92n424
1451c388L824L281n815N10N577m430l128O149j295n746N109K177o645K313N262
1466C755n670j132O788k872m335O161K15o254L813L390o208M09N629m303k836
1481c450O104j354n283M884K164o199J999M918n173j676O153k490m741N714J013
1496B583o262L261M264n912o1O176l833l474O052n78n800M257K784o465J281N424
$$ y = [-1853, 5076, -1270, -3996, 3989, 1002, -5172, 1605, 3329, -4163, -561, 4715, -1995, -2905, 4061, 449, -4073, 2513, 3034, -3825, -157, 4249, -2676, -3004, 3983, -424, -4796, 2736, 2667, -4717, 551, 4713, -3218, -2044, 5402, -602, -3953, 4156, 1717, -4992, 1474, 3369, -4587, -1355, 4159, -2490, -3227, 4114, 273, -4061, 2534, 2600, -3732, 239, 3870, -2203, -2182, 3480, -25, -3532, 2228, 2036, -3388, 436, 3717, -2098, -1588, 3989, -441, -3569, 2580, 1285, -4461, 648, 2825, -3820, -1507, 3755, -1915, -3047, 3741, 869, -3466, 2695, 2910, -3344, 469, 3859, -2349, -1940, 3689, -614, -3450, 2654, 1300, -3983, 901, 3065, -3134, -1135, 3783, -1390, -3066, 3087, 597, -4144, 1570, 2583, -3679, -418, 3846, -2066, -2127, 4049, 216, -3258, 2794, 2216, -3584, 673, 3457, -3008, -1727, 3697]
1512C697m851k322O341j840n100N367J846o313K410M609n686q87O169l048m103
1527c711N926r2n764L956L150n892J059M991m432j993N476j731m107M217J169
1542B222m686J763L301l588r80L945j524k852L265R62l623J175K983l113j257
1557b007M094j127l504L461J265m762J950L668m628o74N268l197l404N982p39
1572A646n293M768J983n983K315M471n424m67N518l556l152N422p14m891L817
1587D60K113n142J262M203l797j739M736j053l999L451K038m775R26M406l808
1602g18j971N386j240m651M711J880o275K331M587n905p69O298l730m087O370
1617B217o92n965M845K696o237J830N137n045j317N746k475l809M622O37m823
$$ y = [3697, -1154, -3476, 2865, 1025, -4075, 1292, 3138, -3175, -765, 3844, -1842, -2729, 3440, 392, -3711, 2215, 2123, -3641, 315, 3465, -2427, -1368, 3623, -809, -2802, 2674, 943, -3164, 1053, 2222, -2464, -701, 2600, -988, -1968, 1977, 453, -2399, 866, 1828, -1795, -620, 2363, -750, -2007, 2087, 960, -2544, 917, 2182, -2580, -630, 3038, -1590, -2264, 3004, -193, -3597, 2385, 1646, -3647, 1121, 3104, -2879, -564, 3907, -1517, -1984, 3534, -22, -3174, 2248, 1534, -3357, 460, 2573, -2569, -1307, 2896, -901, -2640, 2096, 1043, -2956, 495, 2533, -2242, -1316, 3090, -718, -2689, 2697, 1457, -3194, 1517, 3397, -2878, -547, 4040, -1865, -2634, 3664, -66, -4153, 2217, 1525, -4440, 405, 3101, -3136, -1306, 3831, -1214, -2531, 3215, 740, -3069, 1553, 2190, -2633]
1632b633K405L026m077n02L941j792k741L438Q12m010J832K713l694p48M129k058
1648D1k858M146M49m559K832K820m741M82M549l279k413N047j265m156L637J455
1664B187m794J649L648m040o99M605k158l136M118N09m453K474K938m304j10M133
1680B567k572k724M213O3m320K980K479m630O73M239l643j973N103j453m092M221
1696A131J411n299J974M008m788o32N231k759l072M805j58m768L046K555m744
1711b059P41M123l385j800M352j179l746L709J140m112J575L145l391q37L904
1726B180j870k637L453M29l682K008K382l566j60L662k258k122L711k23l341K489
1742D55J812l871N67L162k734j441L682q94k879K762R58l485J363K646l015m87
$$ y = [-2633, -228, 2798, -1279, -1781, 2160, 368, -2373, 1065, 1877, -2133, -301, 2412, -1282, -2030, 2099, 41, -2817, 1329, 1778, -2781, 51, 2871, -1870, -1388, 3161, -118, -2531, 2516, 1251, -2905, 732, 2187, -2607, -958, 2690, -1350, -2049, 2556, 398, -2738, 1380, 1889, -2564, -90, 2848, -1456, -1566, 2567, -5, -2729, 1484, 1547, -2773, 207, 2686, -1944, -1271, 2968, -675, -2648, 2455, 1002, -3090, 1131, 2542, -2757, -783, 3225, -1563, -2195, 3036, 277, -2795, 2010, 1852, -2916, 130, 2685, -2059, -1318, 2805, -580, -2380, 1972, 793, -2953, 756, 1896, -2216, -641, 2504, -887, -1724, 2180, 310, -2327, 1126, 1555, -2127, -119, 2263, -1303, -1463, 2199, -59, -2181, 1530, 1307, -2034, 455, 2267, -1604, -1037, 2125, -609, -2050, 1632, 738, -2141, 621, 1579, -1906, -543, 2103, -912, -1399]
1758a399L400j551k382L038L49l547J847K356l202q2L327k056k151L315l8l457
1774b233K351K061l611L78L330k919j480L664r82l183L501J196m105J647K891
1789B506l637n68L966j940k492L812j46l999K645J917l962O58L701k862j384L812
1805B027j213l322L212J005l706J628K502l138o15L500j780k261L309J43l140
1820a849J991J826l126k4L155k092j811L202j71l030K301J634l433O19K933k459
1836c34j414L585j000l060K988Q73l670J426K646l332l09L444j881j974L268m1
1852A215l143K111J719l185M86K877k287j298K963o94k663K442J083l056R00K408
1868A878k380j148L060r74k655K700J018l242J108K787l097o53L501j700k339
$$ y = [-1399, 2001, 450, -1932, 1106, 1455, -2092, -245, 2111, -1091, -1173, 2154, 98, -2053, 1262, 1224, -2233, 118, 2179, -1432, -1054, 2276, -643, -2123, 1541, 559, -2624, 877, 2073, -2032, -385, 2506, -1131, -1699, 2267, 327, -2165, 1647, 1501, -2498, 147, 2064, -1898, -1240, 2461, -401, -1785, 2027, 814, -2508, 704, 1709, -1997, -369, 2133, -1005, -1620, 1880, 100, -2161, 1148, 1291, -1849, 142, 1968, -1158, -1182, 1973, -119, -1930, 1272, 1101, -1929, 372, 2006, -1427, -808, 2125, -334, -1748, 1837, 837, -2223, 765, 1638, -2032, -606, 2040, -1292, -1601, 1843, -38, -2012, 1256, 1215, -1928, 183, 1902, -1283, -797, 2080, -207, -1505, 1458, 764, -1899, 543, 1626, -1430, -530, 1878, -502, -1650, 1410, 436, -2219, 481, 1499, -1743, -635, 2152, -945, -1598, 1903, 203, -2136]
1883b136L313J98l587K336K007l672N43L240k620j317L593j102k854K844O81l244
1899a777J253K291k708n95L018j258k000K662M77k897J445K068k799l19K934j659
1915A36k080K899J08l036J833J928l151M06L173k310j565L429q73k842K599Q16
1931A470l383J428K376k994m39L244j653j730K919pk631J673J507k810K10K290
1947A470j818j332K540l04k438J970J376k717O54K615k095j159K801q23k531K389
1963E98P15l052J215K200k617m03K953j343j820K909j87k809J965J234k966M24
1979i84K522k113j101K698p73k094K263R26k297R00K124k188o71K241r86j866
1995a399J898M22k402J034J708k255k38K473j304j275K396L3k379J261J261k350
$$ y = [-2136, 1177, 1375, -2212, 124, 2131, -1541, -998, 2242, -378, -1695, 1898, 796, -2058, 786, 1467, -1777, -524, 1767, -941, -1536, 1482, 224, -1776, 886, 1363, -1534, -89, 1979, -820, -1139, 1795, 136, -1944, 955, 1063, -1973, -140, 1788, -1363, -957, 2216, -94, -1659, 1770, 897, -1945, 654, 1470, -1913, -485, 1891, -1103, -1542, 1702, 49, -1681, 1238, 1231, -1400, 273, 1780, -1030, -820, 1470, -348, -1680, 860, 556, -1882, 88, 1464, -1253, -599, 2016, -79, -1238, 1563, 740, -1791, 598, 1313, -1739, -524, 1676, -941, -1344, 1609, 266, -1554, 1355, 1168, -1641, 324, 1558, -1408, -984, 1538, -575, -1676, 1022, 249, -1845, 418, 1344, -953, -53, 2071, -117, -788, 1453, 467, -1399, 499, 921, -1481, -447, 1261, -994, -1232, 1241, -63, -1338, 1058, 1091, -1288, -27, 1234, -1116]
2011a116J11K315j574j251K575l36k141J979J039k523P11K152k127r68K610j339
2027A17k009K248K32k476J702J610k515K27K515j800j119K675n61k102J839O78
2043A261k547O34J890j983m34K381q15j643J912L95k150R03J575j855m91K157
2059A190j181j514K048L54k284J354J547k203M1K358j802j196K500n26k236K034
2075D84O04k594R72J729k137j10K373j262j253K160k27j834J291J003j831J19
2091e13J662j370p66J512l8j526J150Q91j613J07J585j165j133J938j13j883J350
2108G5R51k181M87J986j765p13K538q38j874K001M32k366J275J491k361P2K180
2125A390j617j058K284m99j837J696P03k093O63J592j767m75J893o62j511J753
$$ y = [-1116, -1005, 1310, -264, -1515, 1060, 724, -1417, 562, 1601, -922, -211, 1941, -186, -1154, 1456, 117, -1892, 356, 588, -1888, -186, 1424, -1091, -864, 1651, -149, -1268, 1407, 846, -1256, 583, 1261, -1286, -652, 1238, -745, -1179, 1202, 387, -1256, 656, 1051, -1099, -196, 1379, -476, -967, 1190, 9, -1505, 543, 897, -1387, -33, 1514, -689, -648, 1710, -92, -1288, 1212, 686, -1550, 484, 1088, -1506, -534, 1195, -942, -1052, 1321, 59, -1194, 966, 739, -1095, 196, 1199, -632, -513, 1149, -221, -987, 525, 487, -1039, 111, 1002, -611, -504, 1081, -84, -1217, 721, 608, -1275, 75, 1026, -1155, -668, 1318, -447, -1160, 1378, 540, -1334, 667, 1099, -1267, 8, 1499, -862, -790, 1390, -227, -1285, 999, 500, -1337, 359, 1062, -1031, -368, 1224, -543, -1018, 875, 213, -1298, 455]
2141D55N00j993Q41J395j585l27J866q68j329J725K53k120J080J273k007J18K004
2158A281j513r00K060m35j703J493P52k021P17J432j607m19J945r08j227J561
2174E08K13j715J066R45j537k6J504r81j042J719q1j623J091Q92j649K29J499
2191A012j215o30J602l94j412J241O92j793O63J234j336n03J708q08j121J585
2207E25J45j659Q66J099j476l3J545j043q73J548k7j506J066Q10j584L07J413
2224A123j344p87J875m37j552J371O29k010P55J431j608l77J839p89j252J875
2240G42k8j770J126J100j866L55J553j284p40J757n74j381J313N08j682N77J279
2257I85j515l25J661p73j083J361L21j495Q73R43j518J05J230p30p92J323n0j334
$$ y = [455, 955, -1038, -197, 1198, -387, -714, 1152, 284, -1045, 680, 933, -1187, -107, 1166, -841, -723, 1281, -232, -1132, 928, 493, -1210, 283, 1035, -986, -269, 1163, -444, -863, 1082, 174, -1053, 508, 721, -994, 72, 1017, -520, -546, 958, -23, -1065, 654, 573, -1050, 41, 933, -716, -487, 1012, -203, -833, 769, 375, -1037, 204, 896, -897, -234, 1000, -336, -839, 869, 61, -1060, 525, 670, -989, -123, 976, -500, -533, 1012, -31, -904, 644, 617, -889, 177, 987, -597, -290, 1123, -221, -1008, 867, 430, -1122, 249, 878, -1132, -377, 1054, -554, -931, 908, 119, -1133, 742, 714, -1056, 70, 1170, -696, -341, 1212, -72, -812, 945, 371, -1010, 303, 811, -871, -294, 985, -530, -855, 806, 33, -1050, 311, 632, -863, 10, 953, -565, -460, 770, 40, -752, 571, 521, -813]
2275h13Q40P06j291O8J258r19o85J480k85j244J129N98j519M43J119j125m48J568
2293H80p49j028J438m3j357Q27Q25j366J40J232j025n76J369j99j224J023M76
2310F43j268L51J112j057l30J278m54r68R86M40j380N33R39j206k10J302n80j087
2328i56J308K19j459P14J018j448Q7J406r74q43J603j15j514J266N14j541M27
2345b88J189j197l66J567p65r83J270M9j220Q02P00j281PJ305q67o85J095M5r76
2364e99N81O61j193K86Q45q10k84J031k65r03Q90M53j224L30J063j070l52J221
2382F61n06r31J201R1j333P03P61j231J09J127q03n72J222k54j007J006L42j144
2400e58M10R40j080j84J100m99o91R38L3j003M64P03q06l17J099m55p52J067j1
$$ y = [-813, 27, 733, -558, -490, 768, -151, -836, 644, 359, -885, 244, 842, -677, -234, 885, -240, -688, 880, 131, -897, 541, 498, -859, -32, 793, -573, -433, 799, -226, -802, 567, 368, -856, 167, 643, -625, -274, 838, -219, -549, 729, 275, -693, 293, 733, -647, -114, 825, -381, -591, 711, 131, -956, 352, 571, -888, -174, 844, -604, -517, 889, -85, -928, 675, 560, -954, 312, 826, -715, -288, 901, -296, -662, 905, 140, -843, 427, 476, -744, 58, 758, -523, -516, 789, -78, -763, 332, 377, -599, -18, 643, -550, -264, 581, -229, -513, 518, 253, -650, 240, 693, -531, -201, 862, -208, -560, 661, 155, -776, 425, 516, -817, -114, 647, -584, -475, 652, -151, -723, 499, 245, -762, 244, 586, -558, -148, 792, -288, -472, 628, 129, -562, 376, 409, -594, -130, 573, -233, -550, 549, 94, -658, 409, 398]
2419C98j083O79O55j164J77J133q57o64J364k78j122R54M42j344L83J125j117
2436c19k37J221o56p92J035K54j177P13P34j016l3J006o93n94J008j13q40N19
2454B0N81j017R1Q65o87m68R07j30q93R25L75j021K48Q16q13l00J132m86p50Q95
2474B90J43r29N19N94j028O5J045q49m36R21k35p56O56M71q90J60Q66q22l26J009
2494D68k74o79P81K97j042M18Q20j057r1R42n41p39R45J80j057N36O71r87j0J018
2514E99p22m38J013j89q23O78N13j069K36Q20q22k43R68l63q56R44K64j087M07
2533a70P15r25o1J031n90m45Q42n4r50O64N82r64o2R39n93m25P78j81o82O40L30
2554D19p58M9P19o25k43Q20k94o82P58L26q44L09O15p57j90Q76l91n25P91K4q39
$$ y = [398, -685, -6, 649, -515, -338, 795, -62, -726, 638, 360, -762, 192, 634, -710, -327, 798, -319, -556, 665, 9, -783, 252, 506, -671, 42, 776, -240, -273, 733, 40, -554, 454, 341, -499, 20, 601, -416, -325, 540, -147, -615, 292, 162, -731, 194, 569, -452, -204, 612, -201, -501, 631, 145, -605, 290, 433, -496, 23, 617, -411, -346, 699, -150, -586, 335, 100, -656, 0, 471, -419, -259, 607, -215, -541, 468, 194, -485, 296, 593, -449, -31, 789, -268, -359, 583, 42, -697, 248, 428, -629, -93, 578, -409, -419, 599, -123, -561, 452, 263, -560, 118, 631, -438, -202, 618, -204, -447, 521, 158, -698, 246, 510, -577, -170, 545, -380, -441, 590, 0, -445, 397, 343, -607, 57, 639, -325, -387, 552, -41, -466, 312, 131, -551, 89, 419, -339, -290, 429, -196, -439, 381, 87, -595, 163, 489, -355, -46, 569, -188, -378, 498, 107, -418, 373, 397, -442]
2575d42N13M97r85K05P44p07k51Q74m09n60O72J57q26M42N71q04J1Q11n61m39
2595d87P06K1p29N17M72q68O5P51m84l52Q18j16o44M12L69p94J76O94o42l44R59
2616E00m78o55Q24R9p56K97O57q08N2Q30m88n80Q02N0p91M17M42o61n9P08l92
2637A0l55O68j64n71N10L32p04K9O06m76l72Q09j74o77O14L06p67K87O27p20q1
2658b63P67l85n68O84m9o85M73L64o79J37M97l14k96O26j4o65N31J37o37J40O04
2679D05o42j20P12l59n00Q05lo59L73M23o87j0P16o81k89Q51k50o55O60L42p45
2700c13L11O16p83p4Q22l51n67N48J19p36M03K62o66nO13k24l85O67l8o27M80
2721G2L55n86O7N63m98m63P01R9o96L97M10o55R9N27m92l04P47j46o39N61J64
$$ y = [-442, 71, 568, -417, -212, 532, -175, -426, 448, 39, -521, 151, 308, -518, -76, 495, -309, -298, 513, -48, -487, 219, 240, -489, 28, 500, -368, -303, 448, -36, -388, 430, 314, -330, 82, 451, -343, -167, 527, -115, -459, 500, 22, -633, 191, 290, -466, -169, 488, -320, -268, 562, 74, -506, 296, 346, -445, -28, 414, -247, -306, 402, 10, -345, 323, 159, -412, 98, 430, -274, -245, 361, -115, -487, 322, 148, -529, 85, 391, -376, -89, 538, -182, -263, 504, 119, -449, 235, 186, -499, -26, 338, -341, -204, 293, -21, -317, 309, 295, -370, 161, 298, -339, -199, 405, -237, -357, 355, -4, -504, 301, 298, -361, 12, 435, -252, -262, 454, -227, -516, 335, 85, -570, 90, 432, -313, -2, 614, -169, -243, 579, 228, -339, 209, 328, -408, -5, 257, -409, -414, 199, -25, -410, 257, 219, -408, 72, 427, -159, -92, 471, -27, -490, 211, 310, -386, 11, 421, -234, -135, 392, -100, -404, 343, 197, -442, 119, 283]
2742B83o81K16N32n67j09P01k93m81O97k2n72M07K78p05J55M93m38k51N29j15
2762E7m26L73J88m04L7N60m82j53N82j50l75K48J65n45K40L76m83j02N92k03m87
2783c92N38N6o28N11L14o40J7O35m76k69O27j36p23P40P2o18M45L59o11j29O75
2804C67l79m50O14J5n78L66L34o56J88N09m24j76M67q0l11L44J93n18O2M96l87
2825dl07M72l8m24K71L16m55R0L96l34k77O13k15m02M48L9n30L49K86n08o1N30
2847B55k15k98M68j30m58M03K70m98O8M52m20q9L83qm53M28k1l79K81K10k76j09
2869a36M18k25k37K61O0m70L39J78m19J20L66l10k66N67k25l95N91J48n30J68
2889CL47m63q4N64l35l41N30j02m63L54K78n20J79L93l75k07M78k14k83L51K37
$$ y = [283, -398, -182, 350, -217, -326, 375, 82, -399, 298, 276, -296, 111, 389, -316, -161, 332, -106, -357, 172, 57, -369, 4, 192, -212, -175, 385, -97, -250, 332, 182, -193, 55, 220, -325, -85, 291, -192, -294, 298, 95, -392, 146, 202, -426, 85, 399, -241, -224, 411, -65, -334, 293, 157, -566, 174, 246, -372, 73, 432, -179, -308, 367, -12, -462, 152, 167, -411, -45, 289, -367, -179, 330, -94, -270, 197, 117, -194, 150, 343, -175, -113, 383, -4, -311, 161, 123, -301, -30, 286, -169, -79, 317, -17, -294, 319, 104, -298, 150, 189, -341, 8, 294, -214, -275, 255, 40, -258, 210, 80, -378, 25, 295, -203, -135, 317, -103, -192, 191, 183, -270, 158, 137, -242, 39, 249, -27, -136, 282, 57, -180, 81, 141, -329, 10, 188, -231, -111, 255, -55, -321, 246, 21, -374, 217, 365, -165, 3, 350, -113, -197, 367, 32, -309, 221, 119, -344, 10, 288, -232, -53, 340, -35, -242, 236, 22, -261, 90, 327]
2910C27o40J35L72k36k15M12L7m68L01K30n25K47L19m26r4M92k75k62M06J48m83
2931a98K50K04m79J50L19k39l05N32j35k51K04J73m37Q6K30k49JK90j1l76L79
2952A38Q3l50J01K17l02p2M25j80l67N22m5m54K35L49n33O6L83k86j73L87r5l27
2974b78L55O4m19J85L44m36R4K74k42r2M82k73l99K64K86l82J40K85l36r3L46
2995A69p1l29L25J01m37J86L70l67j49M21j02m97M43J11m83J74L23l51m8L91j43
3016C7l24L31J27l83K25L54m39j04M37j24m02M03M3l91K65K55n43J41L77m66m9
3037b30L21o2l10L16P7k49Q4K36l10j31N09j99k93M72J0l49P9K19l97O4K28j53
3059f8j61K91L1l65K83J63m58J63L45l16r7M20j89k11L01m7j50Q4J89k92o9M48
$$ y = [327, -313, -178, 194, -42, -257, 155, 192, -276, 25, 255, -270, -23, 296, -130, -224, 268, -7, -269, 137, 285, -198, 52, 256, -223, -73, 246, 7, -298, 234, 99, -152, 52, 225, -212, -126, 104, -145, -144, 146, 135, -241, 138, 221, -129, -28, 189, -113, -185, 240, 60, -307, 215, 170, -284, -49, 300, -233, -167, 216, -70, -243, 144, 49, -278, 77, 141, -278, -93, 251, -185, -91, 183, -59, -151, 331, 58, -341, -77, 209, -173, -33, 252, -84, -177, 169, 98, -231, 94, 195, -242, -56, 314, -53, -202, 219, 117, -380, 63, 174, -309, -135, 188, -163, -211, 180, 37, -287, 44, 171, -212, 13, 367, -72, -176, 261, 137, -265, 138, 181, -210, 55, 310, -233, -92, 285, -181, -230, 91, 29, -281, 35, 112, -137, -53, 183, -127, -258, 251, 52, -241, 231, 241, -108, -29, 190, -207, -143, 85, -68, -229, 62, 93, -272, 11, 174, -284, -121, 224, -92, -189, 231, 42, -169, 132, 85, -65, 19, 208, -84, -153, 295]
3081B95l39j19L04j06k39K62J48l70J45L41l89n9K48r1j94L17P7m68J06L16k09
3102b4k22L19n2l10L19J52l17P6K83l11n7L91k92j31K72k0k73L27R6m19J72L13
3124B92l22j67K98k4k96K18J28l82J68J30j23r5K79j98q4L34m6k72Q8K35k13k3
3146g5L05k55j14K20jk57K46N0l61J93K84k94n5K81m6k79K35L5k78R3K37l46N9
3169a23K76j97j42K85j04j71O5J46j87J36K49k32j88M19k48j65K30J19k87Q4L03
3190B68j85k83L37j16j94K94j3l07Q1L30k95k8K66j15k54K82K1l02K68J93l57
3211a09L0L59k60j49K26nl53L49jj92K9K50k23m0J07P6l30L08P4l31Q2K15k92
3234a80N0L01j68j51K11R5l51J73J41j02r1K56k55J6J39r2k24L28J39m23J37J80
$$ y = [295, -44, -163, 141, 35, -204, 58, 206, -164, -19, 322, -67, -126, 122, 31, -163, 154, 231, -237, -131, 185, -24, -246, 73, 21, -289, 30, 182, -135, -59, 224, -87, -144, 247, -45, -176, 96, 76, -197, 130, 226, -193, -21, 292, -30, -197, 101, 77, -219, -1, 127, -255, -87, 43, -80, -175, 104, -94, -178, 156, 110, -162, -74, 161, -52, -75, 230, -25, -139, 81, 80, -177, 69, 119, -242, -49, 235, -59, -114, 167, 121, -158, 77, 112, -166, -73, 164, -182, -123, 153, -44, -186, 99, -5, -176, -111, 35, -152, -16, 233, 1, -187, 232, -16, -181, 49, 168, -119, -35, 268, 83, -200, 137, 21, -173, 121, 108, -199, -118, 212, -83, -111, 155, 40, -214, 68, 89, -213, 55, 248, -109, -79, 280, 20, -129, 97, 92, -261, 88, 87, -105, -76, 174, -49, -89, 18, 94, -236, 72, 146, -185, -103, 112, -180, -130, 171, 3, -148, 63, 158, -193, -20, 121, 19, -72, 184, -71, -55, 84, -8, -232, 96, 235, -188, -51, 129]
3256A29k22O2J19j43o1K72k29n4J42J48l43J62J89k26j52L49p3k60J69K23l04
3277a03O0K51k96j45M89j44l02L19L4l59J99J33k05p0L05j83r8K20n9j85P5K14
3299A50l39J00K40j67j19L21j6k72J35Q9k92J42K97l56r0K55k1k74K15J45k84
3320a41j3L35l08M8J94l8k09K62l8j57P9J05k99J10J26q3r8K19m9j71K51R4l11
3343i2NK55j63j06K10K4j98J57J2j85P4J96j74J3J43k34l8J19N8j22K2J12j87
3366i9m5L59l84J31K57k05j52K91l7j90P5J97k59j5J35o0j14K44o5k51K27J52
3388A92k83j00K31q3n1J75kk49J77M5j40j3K47j44m3O9l7p1J73O2k39O5J39k31
3412a11M4K52k20k0O6K3j44NK28k28o5K67n3j62K80j23j74K18L0k66R8J48j97
$$ y = [129, -93, -31, 88, -55, -116, 156, -73, -127, 15, 163, -180, -18, 171, -55, -207, 142, 69, -191, -22, 201, -103, -43, 208, -88, -233, 256, 112, -190, 129, 163, -196, 3, 136, -69, -139, 166, -17, -115, 105, 46, -139, -64, 150, -189, -89, 151, -16, -135, 186, 170, -102, 33, 122, -170, -28, 269, -87, -177, 78, 57, -217, -2, 143, -141, -154, 181, -127, -79, 115, 77, -132, 130, 92, -65, 14, 119, -180, -70, 56, -27, -125, 94, 45, -126, 125, 219, -92, -87, 168, 5, -101, 109, 133, -65, 92, 104, -81, -7, 189, 15, 28, 171, -63, -101, 18, 76, -46, -24, 88, -99, -144, 215, -169, -38, 219, 14, -138, 153, 116, -74, 1, 198, -61, -76, 59, -1, -115, 129, 64, -187, 40, 192, -91, -191, 40, -43, -94, 81, 79, -170, 7, 52, -88, -101, 146, 2, -41, 28, -9, -80, 93, 155, -84, -19, 120, -111, -67, 185, -35, -55, 11, 34, -110, -105, 123, -105, -170, 97, 44, -118, 162, 39, -135, 83, 113, -153, -55, 93, -104]
3435a04L7K17j24n4O4L4j16P8R1l10K02J08q7j58K33k2k22J70R8k19jJ54j20l5
3459h6J82j2j24L6N4k02J31J22j17r5K99k21j24L35k02q9J26K77l24j3K13j12
3481E4k32K60m1q3K7J20j40p9K55k94Q7J11K3k02K50Nl08J63J56j51k9K39j22
3504F9k18K20P2k00L1Q5Kj27J89j93q9K48k0k11J41J27k54MJ83r3J8J14J7n9o8
3529a2N1r2J5J26n2l2mJ2j03J27M7j46J50Ok18J03K03j86r9K06p2j34J38J9k26
3554a73J34J30k16R2J89r3j67J81n2j52J55J57k83j2K11j86r9K56k9k03J32J29
3576A01k03Q3K26k73m6J22L0j63J1K58k92J48N8j00j46K68q0q1K40j19j93R4J31
3599G4r9l3J49k7j52R3N4j47R9J20k13Q1J25j00j3J11p9k22J60O9j45J73m5n7
$$ y = [-104, -67, 150, 26, -28, 36, 70, -46, 32, 123, -187, 15, 123, 36, -122, 111, 89, -133, 37, 135, -84, -85, 69, -51, -86, 96, 84, -40, -4, 50, -152, -21, 101, -16, -111, 188, -33, -157, 178, -24, -113, 13, 290, -34, -47, 166, 54, -178, 82, 41, -42, -15, 105, -35, -114, 141, -153, -66, 45, 68, -134, 116, 121, -187, -24, 132, -19, -48, 191, 69, -149, 71, 143, -57, -26, 59, 61, -66, 123, -70, -159, 89, 69, -142, -1, 126, -128, -124, 59, -34, -16, 98, 115, 56, -12, 39, -53, -38, 88, 36, 4, 0, 12, -91, 36, 83, -63, 87, 93, -125, -22, 181, -5, -104, 102, 30, -104, 34, 53, -173, -39, 91, -125, -33, 156, 63, -104, 77, 25, -127, 28, 185, -98, -110, 101, -85, -184, 72, 43, -160, -28, 101, -102, -19, 207, -66, -112, 10, 40, -123, -112, 146, -146, 2, 60, -40, -186, 82, 2, -79, 161, 42, -151, -57, 74, -25, -58, 91, 64, -88, 5, 59, -88, 11, 131, -82, -1, 124, 24, 11, 122, 43, -179, -19, 50, -95, 78, 33, -24]
3623b4o9J99j30n7J12K6j76P3J70j69oJ39j41j34L00jk63J55J43l26J03J41j86
3646a21R2K24j37k46K90N9k35J95n8r5q1J85n6j91L03j30j07J52P1k24O0J66r8
3669A8n6K36k41j10K21n3j55J70R2j64Q8K2k2m3N8P6j68M6J85l46Q6R5m6l3J75
3694A31Q3k70J31M3r6J5MK1j52K24j17j08Q5J5r7J24mj12L5N5Oj23J61l8j85J40
3720b9Pn7L7J42k23N5Q7l6j13K08j01K2njn5L5J84j57m7J10J07l15J86k9n2j3
3746e3K21j61j15K34r9o8m7O1j3m1J31j47N1J58j29j50K58j1j72J39J03j41oP8
3770H1r4m7L6K3j17J83j1r4k2J16j3q9K10P2l06M3J69k41R9O2j41J29J27j29j10
3795f4P7J67k56mN3No2J49j27o0J55R1k73J68R3k23L9J22j1j56J84j7p8J07o3
$$ y = [-24, -93, 106, -24, -81, 31, 57, -119, -46, 124, -45, -51, 88, -53, -187, 113, 112, -151, 4, 147, -179, -76, 65, -121, -29, 195, 58, -188, 102, 161, -74, 121, 63, -32, -113, 72, 16, -175, 128, -2, -109, 43, 114, -110, -50, 116, 18, -38, 198, -43, -153, 68, 15, -140, 30, 122, -42, 46, 68, 46, 3, 61, 137, -31, 15, 200, -146, -60, 35, -11, -44, 131, 214, -56, 75, 118, 22, 37, 41, 62, -90, 134, 17, -91, -6, 9, -88, 36, 32, -80, -45, 10, 16, -107, 54, 16, -169, -29, -22, -79, -42, 100, -123, -68, 19, -17, -130, 78, -23, -1, -6, -7, -62, -27, 157, 0, -47, 63, 170, -145, 41, 12, -40, -53, 168, 7, -108, 126, 27, -41, -88, -27, -40, -81, 50, -97, -46, 112, -17, -167, 91, 80, -92, 47, 150, 9, 3, 81, -13, -60, -24, -1, -118, 65, 54, -40, -62, 54, 41, -48, 162, 234, -72, -29, 140, -101, -2, 60, -81, 48, 175, 46, -64, 13, 180, -76, -80, -27, -22, -84, 65, -62, -122, 33, 124, -149, 19, 112, -111, -72, 50, 39, -117, 67, 50, -28, 79, 16]
3820A6Q7o6K5n4o1K04j73j46J61M3q6Q2J9j21N0J64k20M7P9N6j65N3J11l24J51
3845f8J28j07j19K88r9j31J86M8k04O6R2j91M7J01j6j49J83L3r8O3R4j37p3P6
3869A3j5l6L8P4k60K41j3m3j02J00j4J2J56j04j96J45J43k10N5K08j80j48J72
3892C6k6m1Q0r0n7J8J48j98N9J36j00K1N5j29j5K18q0j35P9J05j49k8J58l7k8
3917@J16kj64J56J6j17q8J43n4j01J39o0q8J34pj78J29O5n1L6kJ1l0O3M0k52R9
3944d7J32j73Q2J44k23L1J44l7k14J41J14j00O0M2l8q3J07k8n9J0J60j79l9J96
3968A43k06oJ24o6r0J25m7M9q7J00j74N9J06l9OO1j06NOJ68j18j2J15j29l2J44
3994I9j20q7J11J05j30L6L0qj64K38j43p8K25J5j78J8J20k04O7J81j78mJ28j58
$$ y = [16, 103, 37, 62, 8, -53, 151, -22, -168, -7, 36, -50, 32, 51, -70, -20, 144, -76, -29, 50, 106, -59, -6, 105, -219, -68, 60, -47, -166, 122, 23, -108, 78, 126, -78, -12, 80, -111, -64, 37, 21, -128, 55, 88, -10, 53, 147, 10, -63, 13, -2, -38, 0, 74, -186, 55, 42, -1, -103, -3, -17, -5, 151, 47, -149, -4, 139, -71, -16, 192, 12, -136, 36, 10, -31, 49, -41, -98, -80, 68, -130, -71, 65, -35, -14, 41, -88, -103, 115, 35, -100, -21, 84, -65, -93, 65, 28, 0, 116, 114, -50, 106, 122, 5, -83, 60, 6, -95, 44, -16, -104, 30, 23, -155, -26, 39, -12, 24, 22, 33, 3, 66, 106, -146, -47, 85, -88, -6, 138, -85, -54, 90, 53, -161, -20, 94, -6, 54, 96, 58, -25, 82, 54, -5, 5, 165, -14, -53, 143, -63, -69, 55, -11, -101, 24, -23, 26, -61, 39, -135, -76, 30, -9, -3, 58, -48, -43, -37, 131, 13, 1, 116, -13, -45, 99, -21, -108, 3, 108, -22, 14, 44, 36, -128, 110, -33, -111, 114, 129, -49, -31, 89, -115, -48, 133, -45, -49, 79, -79]
4018g9k1J16J3j88K43r3L0m7Q8m1m0N5o5l8J8O5j5j12K00o7j13J81m8j02N7J42
4044A39j40J4J21j31k03K72K0j42J1J95k21M6O5n0mR3Qk19J84K8j17J2O5l7K6
4069C5nL0j07K4Qk0R2qm7p3K35j42p6J21L6r7k6J3n4J28j1j55L0J96j36p2J59
4096G8J8j32k8P7o1k5L8J5j2J9J1j13J49P7k66Q0J79j41LJ64p6j89K02Q2j92P0
4122B7kn5LJ8N4l0Q9j23p2P7M1n8k6K54k63k7J07M1o8J8R1j04l6J58j47o7J88
4149H8q3n8J19J1j09J42j20Pk2K7L8k7L3j4j95K47l4n1p0J13p3N4p7J15j90J68
4175C9r2o5P4J14p0j5J40r7j5J13qj16m7J01j2r2K00j38r3J46j18j4Q0N4j8j4
4201C7M8j53qJ27M8j80O8N0j05M3Rn2k1J10P9o0q2P4j71J95K0j05NP4r0l9R0J7
$$ y = [-79, -100, 16, 29, -159, 84, -9, 21, -26, 62, 21, -19, 36, -29, -67, -49, 16, 1, -111, 89, 22, -91, 90, 42, -60, -3, 139, -1, 13, 134, 3, -200, 72, 92, -50, -39, 156, -65, -19, 46, -4, -8, 85, 93, -126, 58, 86, -31, -19, 46, 9, 35, 30, 60, -47, -23, -15, -35, 57, 49, 2, -71, 164, 22, -54, 67, 103, 6, -20, -7, -61, 67, 56, -99, -69, 127, -9, -81, 78, 96, -36, -64, 13, -48, -73, -35, -20, -32, -13, -2, -115, 34, 111, -155, -75, 104, -37, -34, 130, 54, -135, 67, 149, -43, 27, 25, -30, -27, -9, 45, 15, 104, -19, -91, -14, 27, -31, -57, 197, -66, -93, 14, 55, -13, 5, 96, -8, -44, 114, -33, -100, 88, 5, -53, 66, 77, -32, 110, -10, -3, -25, 2, 40, 13, 46, 32, -163, 84, 50, -1, -71, 42, -31, 23, -54, 61, -129, 39, -53, -118, -44, 70, 0, -15, 125, 28, 13, 126, 118, 2, -45, 56, 44, -48, 152, 14, -79, 67, -51, -65, 15, 69, 51, 37, 85, -68, -76, 51, 99, -81, -13, 37, -68, -25, -16, -68, -89, 21, 100, 40, -42, 32, -139, 56, 76, -29, -24, 50, -40, -79, 11, 28]
4229B8p8R0l2j45K3J81j27L5Q3o3j18Q1J36k15J85%j19L2K1O7j67M0R9j37J16
4254A6n0q0P1J32r6RmJ24j86J4J44j57K0J61k42J14l6P8K3mn8L2Q2M0j77MpQ3
4282E0j89K19k3r9K1O7m5mK06k32kJ16r1o4P8p3l1M1J77j19k6R0j10k4J62m8p4
4309b7l5M4m8J2J04m9j05J83j52k5J10M1q9KL9o6Q1N6p2j26J62O8p2m6P1j30Q8
4336A9J5l5j32J97o7p6J68Lj25RJ29q1o3M9m0N2Q4r9q1N9J01k06J49J2p2N1J9
4363C9r7q9J58m2K7n0J0O0k1K5l0m6Q2j9j53J37Q6k3j29P2K3j22J30M5j86J75
4389F2j6j48j7P3L6j00J93j2o7j5M4On8R4r2J8qP3m1M8j53M2J17op6m6Q3Pj07
4418f6N7k5j5L3r7K0N0O4j7n6N8R5j97P8Qn3O4J23k28Q3N7kj81P9Q2j07P0N8j15
$$ y = [28, -50, 40, 8, -137, -114, 67, -60, -25, 58, -5, -123, -42, 94, -121, 64, 64, -55, -23, -2, 65, -102, -62, 37, -100, 16, -34, -114, -43, 89, -7, 2, -2, 122, -64, -50, 94, -63, -43, 118, -124, -10, -46, 32, 55, 51, -7, 25, 107, 147, -30, -26, -33, 50, -139, 80, 57, -42, -21, 46, 1, -3, 203, -29, -31, 85, -6, -70, 8, -65, -96, -55, 122, 3, -23, 67, -43, -67, 95, 47, -27, -62, -18, -66, -54, 50, 1, -104, 79, -73, -98, 12, 53, -36, -34, 5, -61, 20, 76, 4, -122, 40, 108, 36, -10, 61, -69, 19, 34, -1, -133, 64, -3, -79, 89, 92, -33, -24, 105, 24, -39, 10, -30, 22, 106, 7, -74, -15, 86, -120, 29, 41, -31, 20, 39, -58, -147, 11, -31, -4, -54, -44, 16, -5, 20, -10, -56, 26, 7, -146, -9, 77, 54, -75, -3, 20, -102, 28, 73, -113, 62, 46, -102, -119, -46, -10, -110, 83, 71, 4, -11, 33, 39, -19, 75, -17, 1, -7, 66, 25, 73, -80, -38, 79, 73, -3, -49, 34, 41, -66, -9, -34, -49, -16, -113, -93, -43, 21, 4, -52, 6, 101, -96, -18, -10, -63, 1, 124, -104, -21, 36, 34, -147, -68, 14, -93, -23, 35, -80]
4447h0j7K02r9j13L1J36j06M9O4r4L1O3j17M7L9j7m6QN1j18l7K69k62J59P4j99
4473h2qJ85j88j0J00J18j82NM5M7j30J27Q2j95J59p2p3LJ82j08n1J70m2j58J11
4498C5J63l25J20N9k2j7P1j31r8J45j5jJ4Q7r8m0J19p4j54K05mm4L5k8j4Pj3l4
4526e2L8m2K9%J50k2j51Q1P4j94R2M6o3%L2M8r4j3K2lN6n4L2n4L0J8j08J45l5
4555Hj8RJ9J12k45J89q5p0J98n8j00R3k6j25O8O1k1kl5N2j4J3l8%L2J23r0l2P7
4584I5j26nJ17q9M1m3J15j86N0J67k41K9P2Pj34J41J7j02P0LJ02p2L5r4n9K3J48
4611H1j27j7J0N9m0P4p4J9M4J0r6N7L1n1p7O9lm5J89j63L7K7L2l9q4R3k5l3J42
4640A00j00JO9N3k28P5J69o3j88J48oq4K5Q6j55J01M6m8o7K7m7J02J3R2j93P9
$$ y = [-80, -97, 105, 6, -107, -76, 60, -46, 3, 67, -27, 4, 67, -50, -3, 36, 19, -27, -19, 32, -86, -123, 146, -116, 43, 117, -82, -90, 95, -93, -103, -3, 115, -67, -62, -17, 30, -100, 27, 109, -86, 73, 1, -72, -69, 113, 5, -46, 124, 82, -76, 35, 198, -127, -7, 52, 30, 13, 84, -47, -145, 0, -15, -16, -2, 85, -13, -53, 66, -8, -162, 43, 39, -5, 30, 2, -12, -5, -18, -52, -14, -56, -27, -27, 123, 101, -50, 31, 105, -89, 3, 49, -14, -14, 18, 66, -28, -41, -19, -22, 34, -20, 12, -42, -12, 6, -102, 43, 8, -10, -1, 18, 130, -115, 74, -11, -81, 117, 59, -41, 52, 26, -99, -31, 30, 9, 7, -28, 24, 10, 23, -15, -15, 17, 140, 50, 18, 95, -31, -36, 81, -8, 33, -10, 105, -81, -31, 136, -105, -76, -4, 3, -131, 10, 27, -75, -5, -2, 100, 28, 63, -31, -90, -67, 81, -46, -63, -53, 6, -34, 40, -34, -15, 29, 39, -57, 0, 31, -20, -97, -28, -31, -76, 113, -50, -13, 14, 46, 7, -77, 16, -9, -42, 100, 0, 1, 70, 123, -105, -30, 139, 76, -112, 36, 30, -54, -29, 57, -98, 3, 49, 1, -66, -39, -86, 16, 29, 121, -72, 7]
4666GO7p8L1K5j5k9Q5j05n1P6l7N2r4J9O0j8O3L8j31j3K7n8P4N2q0Q3J2l1j11
4695h0J44M0j38k2Q1o7M0P9j57k2R3k6j4MP0n1l5O6N4j76R5q1J39Rj7j04J7K82
4723B23k15m5J03j08j2Q8no4K5P8j23nM3j7J45q3Qm9M8Nn0K1J68k53P0R9j23j
4751b9J1j8m7J18rr6J50q0j0O1mm5r0J02P6j96L2P7No9O6j53M4J89j04R9p5O6
4779G1rq9O6m1j8oL9n7J31n4j15j9J13j4k9J47q7j37J99k0j58NK33j62MMPn3O0
4808A1l9n2Q0J15n4j00k8N1j0rR8j25L6O8q1K8J07j9j39P1N8j14m1J02q6R4M8
4835G0j04j1M4L4q8J37m3j24J26l9p2J09o7l5J2N9j8mk3P8J1Pj77J04N0n5N3p6
4863d2M6j0l7O0N7k8j5k0PoJ17p9j05J35j20m9J84l7q8OM1O6r9L6Q7Jj07l1Mq
$$ y = [7, 74, -4, 27, 52, 37, 8, 93, -12, -63, 13, -24, 28, -66, -47, 13, -5, 58, 96, -35, -48, -21, -79, -5, 47, -33, 50, 62, 31, -80, 64, 104, -34, -56, 25, -42, -2, 77, -80, -102, -9, -35, -49, -45, 25, -26, -61, 5, 59, -117, -22, -103, 36, 45, 28, -76, -59, 223, 8, -37, 66, -42, -54, 34, 29, -35, -10, 68, -55, -60, -17, -34, 111, 28, 36, -13, 35, 40, -10, 11, 179, -74, -4, 95, -28, -29, -18, -36, -83, 35, 26, -70, 80, 0, -10, 51, 47, 2, -88, 14, 90, -106, -74, 3, 8, -61, 5, -148, -104, 85, -19, 80, 5, 71, 62, -27, 39, -2, -20, -26, 13, -44, 87, 33, -82, -101, 12, -2, -31, 116, 29, -108, 91, 71, -87, -82, 151, -11, -7, -3, 4, -49, 11, -28, -80, 0, 115, 61, -39, -67, -16, -26, -35, 63, -62, -26, 42, -39, -11, 96, 77, -62, 9, 67, -47, -88, 14, -72, 22, 70, -34, -45, -1, 33, -55, 82, 39, -85, 41, 2, -70, 39, -28, -63, -51, 8, -10, -14, -37, 41, 52, 59, -118, -14, 36, -19, 34, -42, 4, -6, -43, 17, 74, 46, 31, 11, 18, 12, 129, 50, -55, 80, -40, -89, 95, 58, -30, -24, 17, 83, -16, 20, 107, 108, 1, -30, -26, -34]
4893c4J7K3m0M5Oj3P9j14N3Ol5J05k13J89kr6P5N5k13J67p2p5K6Q7j07L0QL1L6
4922B4%J12j38q6J65q4ON6j30nJ86o4j36L6J0j3K8J27m2j71Q4m1P7r9N9mr8K31
4950I0j61J50j18N3j21J60L5q1Q8O2j24o9Q7p7o5J38j05J25j51J18O3j01K8Jj06
4975h1O5r9N0K9J7Kn6J32o8j2J27j58PJ18n1j03N0J81j11j03J59j4j56J58l6r6
5001d9L0j2J26j85P7l0K5J05j3r8K6M8j15P0K6j52oJ67L0k04P4J02n8O5Qr1J8
5028a6P1j26J47l3k4Krj1l1J06p1J7j06J17o3p8J05L1l4j9J20k39P8Q3qk9L5K7
5056D2j64J34l4O4j04J10l9Ko9k3P2m4J4k3RR6O0r8j2N2j16K22q7k6j6m0k3mN2
5085GOr4O8J3q4R4J01p7l2K7j13N9R0j26O7jj8p2M2J00N8k54J75L1j05QP1j55
$$ y = [-34, -17, 6, -34, 11, 17, 4, 83, -31, 22, 28, -7, 98, -115, 74, 72, -24, 51, 106, -107, 60, -12, -87, -61, 26, -81, -51, -43, -12, 24, 24, 136, -2, -88, 77, -7, -1, 55, -75, -80, 106, 42, -94, -58, -48, -61, -33, 94, 52, -119, -35, -76, 1, -98, -39, -43, -141, 90, -71, 79, -39, 14, -107, 53, 88, 7, 95, 157, 33, -36, 51, -26, -91, 47, -58, 67, -84, 34, 97, -4, 24, 25, -81, -16, -115, -65, -36, -19, -17, -73, 59, -9, -21, 106, -52, -45, 73, 22, -81, -31, 150, 39, -64, 95, 81, -75, 83, 47, -49, -19, -31, 95, -90, -13, -43, -18, 87, 74, -24, 2, 50, -65, 5, 31, -121, -127, 40, 70, -134, -60, 42, -16, 49, 57, -34, -16, 55, -71, 76, 43, 19, 21, 12, 1, -30, 76, 5, 22, -84, 33, -30, -108, -3, 28, -6, -25, 95, -144, -66, 17, 9, -20, 15, 42, -122, 12, -22, 42, -62, 48, 9, 11, -58, -81, -9, -53, -39, -62, -53, 43, 103, 5, -7, 45, -71, 151, 64, 38, 22, -18, -41, -45, 7, 13, -81, -13, 0, -84, 10, 111, 34, 2, 29, -84, -25, 65, -61, 6, 5, -13, -85, -43, 57, 115, -139, 36, 67, -38, -30, 41, -114]
5113a14J29n1J9Q5r8M2Kp1R9m2m1J14m6O8r5m4k1Q3K4n7J8J08k1j49R7j15L0M5
5141bQ4j54L1J16j38Q2K9n6j8M6O3o2J26j13jm9K5k0k4Q2j26OJ07N3k00J21n8
5168e0q2R5P1n8n8P5M2n3O4r6j23P9J02k3OJ2P4j16R8J6j09K5K7m7L5l1O4j42
5196a03J8J43j96K27r9kn0J4J1RM9Jq2J40q7l1M8J11p4n1N9K3j45M7Q3r1J33j56
5224e1O9kL3r0j1j5O0l8J38R5j85K3k5Ml4N5o8p4J01O6j75J63J7j07K5M3J22k87
5252a48J69l2r7L4J73k38R8R8m0j03M8N7q4M8j5j3k5L1K4Q4m2J9l0o8K3m3N8Q9
5280G5n2o9R0q4o5J27%K1P7j24j89J57l9J43r6L4P3j47R1l8K8n3M3q2J1J30j74
5307a12L0J92r8j09P3K5QP5r0L4j0ll2m3J28j53K8QQ5l6M9q0nL3P5n1q1R4l3k5
$$ y = [-114, 15, -36, -17, 68, -30, 12, 14, -57, 42, 0, -41, 73, 27, 95, 0, -44, -65, 18, 42, -15, 3, 111, 90, -59, 38, -77, -47, -2, 82, -72, -41, 75, -63, 19, 48, -8, -26, 20, 83, 21, 147, 34, 33, -16, 9, -11, -35, 47, -79, -73, 34, 87, -113, 8, -50, -132, -37, 34, -24, -82, -7, 35, -18, 46, -50, -173, -94, 8, -15, -9, 3, 77, -39, 59, 75, -34, -9, 18, -29, 6, -25, 39, -103, -85, 58, -138, 89, -10, -12, -62, -48, -37, -28, 21, 22, -60, 80, -7, -38, 10, 121, 47, -4, 55, 78, -67, -20, 63, -28, 105, -51, 18, 16, 49, -41, -52, -67, -7, -45, 93, 188, 3, 26, 1, 5, -29, 26, -42, -116, -15, 51, -124, 39, 56, -51, -26, 17, 139, -148, 21, -11, -108, -74, 99, -139, -41, 57, 17, -86, -38, 19, -65, -17, -32, -45, -70, -39, -15, 69, 27, 46, 16, -52, -29, -72, -14, 75, 23, -46, 44, -40, -105, 22, 22, 43, 120, -4, -193, -36, -75, 68, -28, 6, 79, -68, 23, -15, 13, -40, 3, -79, -68, 62, -112, -82, 110, 12, -97, -24, 1, 9, 84, -6, 28, 18, 15, -17, -60, 68, -85, -57, -49, 36, 0, 49, -31, -36, -3, 72, 21, -60, 34, 1, -24]
5337b4l4J75j62P4q1J25j62L1J14j53n5J23M6p6J15n9LN2p4JJ33r6j18N1K5J29
5363A03j28l8K06j87J48j60n8K2Q0P1l4p6N7M1q2P5r2O2M2Nj26J10Q1j52J8n2
5389f4O3k7q1R1P4j29O2J04n5j03M6qjJ2l1J05j8rlJ03j17M2j03O5j8j7qJ3j3
5418b5Oj16K03j08K8m1O3n5N4k9K8m2M6K8q9O6Mqo8O5m9l1J01p7p1J10P2q2N3
5447C6l8p0O8L7J6q9R1K4q9j0J8p5nQ1l1j8J20j7n1J10o3j09n0K73j57n1J1P5
5475C7j9k3N6r5J04p7o3J71k4q7J3pJ27k29J18J3j0j0m2jQ8M5n6j14J64o2J5O
5503C8L0j19L7k7L6o3j04J42Pj6L5N3n3k8J9r6L8mM1N7J8j13J36o8k5J19m3j0
5531C7p5R4m1k8%L4j32J35j10P5o7J15rpn7k0M7N6j43O5p9kJ37m3J2M8j07J0J16
$$ y = [-24, -58, 117, -45, 29, -52, 73, -89, -58, 56, -97, -152, -29, 17, -59, 56, -3, 0, 52, -22, -21, 112, 16, -102, -51, -26, 103, -25, -63, 143, -44, 104, -56, -114, -92, -12, 59, 25, -51, 6, 47, -35, 40, -52, 10, 52, 57, -69, 41, 122, -30, -12, -64, -1, -28, -109, -18, 56, -73, -11, 93, 38, -65, -19, -27, -28, -16, -47, 58, 40, 31, 28, 131, 14, 56, -47, 18, 0, -17, -25, -12, -25, -19, -135, 68, -40, -12, -53, 10, -45, 9, -20, 8, -34, 12, 40, -49, 17, 21, 13, -55, 10, -39, -70, 31, -46, -117, -7, 65, -17, 36, -2, -72, -4, 33, 49, -40, 51, 75, -14, -24, -6, -81, -86, -5, -36, -54, 66, 49, -2, 108, 45, -64, -114, 159, 2, -49, -38, 37, 18, -5, 51, -44, 60, -17, -80, 91, 67, -20, -7, -14, 113, -116, 2, 15, 5, -5, -47, -48, 40, 85, 29, -85, 79, 17, 32, 38, 68, -51, -14, -41, -5, -68, -172, -30, -23, -39, -4, 49, -4, -32, -13, -109, -71, -75, -34, 23, 41, -72, 64, -4, -29, 90, 47, 37, -38, 56, 15, -13, -13, 21, -111, 24, -86, -11, -78, 37, 28, 21, -36, -56, -9, 47, -96, -31, -110, -112, 25, -18, -6, 42, -65, -55, 61]
5560F1j07k1J04l3q7J14K2j29PN2J07l6kQn6M6j9q4QK4N5Pm3Rj4rr7O2M8Q3oo5
5592Ij6k3nM0N8j67P9LL7OOo4N5N5l4m4O7l8L4n2L7j41J01N0l8r9R6k6k6k0Q5
5623B5k1J0q2j9N9N7n9j0M0M4k0J0l8QPl3j0o9J95m8o2p2oJ78p3pQ8j99nJ2J06
5654FOj7j17L3K03j44J5L2JN4K7n3J1j9pr3J78l9q0j12J03p1M3J03n3j0n6K1k6
5683f1J44j62J31j47J59j40N2L8N1K9r0k4L1K1OL5j36J5M6M1k9Q1r2NO6j35Q8
5710B3om2N6%o3p5J30P5j26K3m6K0O0l7N5o1K6Q6j29p4J24n5O4KJ5k0qj7p5j3
5740h8J48j06L1M0p0L5Q7j38J04n0k1N0J6o1O2j9n2o9M9k8J29j00p5N4K7M7J12
5767A14k3k45J56J9M5J6j45Q8R3j85K8K1K7M3q9qO8nr3P1M8j8Q2n1j2o9k5J03
$$ y = [61, -46, -67, 37, 4, -83, 31, 53, -76, -69, -17, 90, 54, 52, 60, 4, 50, 31, -53, -45, -21, 34, 41, -2, 7, -7, -16, -113, -51, -3, 80, 74, 9, -7, -30, -35, 5, 63, -104, -25, -22, 15, 21, 27, -37, 18, 73, 39, -5, 62, 24, 58, 6, 43, -98, 3, 53, 15, -84, 12, -14, -40, -60, 25, 4, 14, -68, -87, -28, 29, -30, -40, 0, 44, 24, 34, -4, 4, 11, -22, -32, -101, 94, 46, -16, -88, -94, 84, 11, 4, 92, -107, -112, -100, 6, 12, -5, -122, -89, 114, -30, -15, 17, 18, 72, 99, 46, 57, 38, 31, -62, 116, 77, -3, -115, -12, -83, -40, 63, 10, 0, -56, -35, -61, 83, -79, 52, -95, 64, -76, -24, 14, 65, 94, 4, -20, 11, 32, 38, 73, -63, -48, -2, 39, 10, 91, -1, 4, 70, -65, 23, 17, -25, 31, 31, -32, -107, 23, 98, -28, -5, -51, -31, 29, -8, 47, -14, 12, 98, -31, -105, 19, -36, 28, 30, 45, 25, 17, 0, -75, -88, 60, -46, -15, 25, -45, -10, 77, -61, 43, -7, -28, 22, 38, -23, 39, 20, -32, -101, -52, -80, 49, -51, -126, -72, -45, 2, 114, 91, -154, 2, 21, 66, 82, -63, 25, 118, -67, -39, -18, 9, 52, -37, -45, 23, 18, -75, -4, 44, 26, 108, 57, 45, -24, -49, 54]
5795E4p3k5R0k8m7l3K6jNJ4M5j03J38r0lR1j06L4m4q1J19J02o5m7J3j1L3j00J13
5824B0p4J25p7K6j01J89j09M8K9q0L1j1j4q9J27p8j2O7K6j27L8K2N8j60R0m1J22
5851D5j34m3O5J0Q5k9k7LN8mk9R1j40L0N5J00j99P5L9J2j5l5l6M8L0o4P6j00K3
5880a0Q6j80J06J6jj7M7j31K6J24j25O9M5p1N9j07J7M5K6j4n0oM5k5MO2lm8K1
5909A0n5rP3j8k7J64j95ON4M7o3O1r3N7m4M1K8k5j25J68n9m4N8r8J74n9l5ro0
5938g7L6m5J2P7Oo0P1L5K4qj00p6R9M7j12j1Q1k5%J2N%j6M2l6q3O4p9l1K23j17
5969d2L1n5Q6j3j8J42j17L3m6j4%q7K16j98L9P6Rj5q9J41o1q0P0N6j23M0P1l6
5997A6n2J3K1n8O1m9P8o5N8l6oJ15j12N5k7j39J20O9k7l6o9O4O7l3k5L3o3J72
$$ y = [54, -19, -44, 46, 18, -29, -62, -36, -37, -32, -18, 27, -76, 62, -28, -31, 60, -46, -12, -56, -137, -18, 84, 19, -28, -15, -26, 7, -93, 20, -54, 71, -6, 20, -81, 108, -1, 47, 76, -4, 27, 16, 2, -87, 40, -38, -50, 17, 43, -84, -46, -24, 34, -126, -36, -77, 45, -89, -132, -67, -57, 28, -1, -28, -25, 33, 29, 0, 91, -49, -19, 36, 136, -63, 12, 51, 63, 48, 13, -23, 25, 55, -9, 67, -33, -10, 76, -104, 2, 18, 17, 0, 47, -84, -58, 66, -59, 10, 55, -16, 43, -64, -47, -2, 24, 10, -40, -46, -1, -26, -22, 40, 37, -11, 10, -45, -54, 19, 1, -26, 138, -57, -51, 3, 50, -13, 48, -45, 12, -32, 9, 37, 12, -113, 55, -4, -48, 10, -88, 86, 27, -8, -17, -77, -41, -86, -74, 3, 9, -51, 20, 55, 79, 71, -29, -105, -6, 41, -71, -82, -1, -26, -26, -14, -9, -9, -25, 17, -19, -102, -38, -117, -148, 75, -42, -11, -66, 20, 7, -11, 131, 14, 47, 1, -13, -13, -100, 116, -82, -43, 33, 42, 27, -62, 79, 18, -62, 8, 64, -59, -19, 52, 16, -36, -23, -2, -60, 1, -48, 30, -35, 23, -13, -19, 96, -16, 39, 12, -127, -7, 62, 35, -1, -70, -6, 61, 28, 3, 36, -27, 145]
6025A45j31n1N5j22O9P1k6K4R4K3j93P2M7j24mJ42k01N0N6N0Km9J5o0R9o3l0L2
6053hr4O2L1Q2k1r7R3n1m1J3J46j74P6O6j33J11j8q7Q4N8n3J7n5K4M8o5O0r9l9
6082f4j2QO8P2j04rM7l6k8k3J57j29L5L0p0k2J76o3J8j02N6p6O6Nj10J8J28p5
6110c9K8L7J3j8k7o8J30k2J4l6O2j41Q8L7Mj34P2p7R9p2j9mK21r2j89J78p7m7
6138g9J9J11j06K7q8J14qN6%kq3J4o0P2N5p8N1K2k4j20J56mk2jk5pj6O3n4ML5
6169B2k1R2q5R1j36l2M9J8K2j07J51q3K9r6M9L8k0J08j09N3o1O0P8q7m0l1j%L0
6198a9j0j9J61p6pkm7Q0n1m1Lj6Rj0J3J91j32qn4L9N2j12O1Jj7on1J43q9j2K2
6229dJ05j40N0k2O2N1m7M1o9QJ0j36J75j11J2M5m8J4M5J5j17lO3j2M2j02O0L6
$$ y = [145, 14, -37, 18, -104, -35, 36, 10, 34, 128, 151, -42, 30, 77, -47, -51, 91, -110, -60, -4, 46, 48, -1, 14, -46, 53, -10, -40, -8, -102, -40, -9, 73, 52, -45, 48, -3, -44, -31, 115, -59, 17, 83, -50, 61, 43, -44, 40, 98, 45, 62, 7, 31, 79, 14, 74, -25, -64, -76, -68, 0, 72, -32, -41, 6, -30, -58, -81, 76, -53, -18, 12, -58, -80, 96, 33, 51, -51, 5, -71, -5, 0, -110, -92, 36, -39, -11, 26, 39, 21, -6, -74, 56, 34, 48, 12, 74, -67, 21, 58, 62, -72, 0, -77, 22, -50, -69, -73, 148, 56, -133, 45, -32, -79, -60, 51, -55, -28, -116, -2, -10, 46, 46, 44, -39, -25, -85, -13, 42, -36, 15, 37, 13, -107, 49, 45, 23, 22, -3, -10, -26, 37, -17, -13, 22, 1, 93, 8, 99, -37, -69, -20, -2, 20, -87, 64, -19, 10, -86, -37, 1, -19, 89, -20, 33, -28, 32, 110, 23, -17, -48, -49, -49, -19, -29, -48, 113, 37, 30, 28, -19, 61, 10, -31, -28, -44, -35, -45, -32, 159, 27, 19, -35, 4, 56, -56, 5, 6, -11, -17, -68, 75, -14, -26, -4, 101, -39, 11, -11, 51, 102, 55, 96, 27, 35, 45, -91, 84, -27, -15, 30, -18, -4, 41, 56, -61, -64, -1, -13, 29, -73, -13, 23]
6257B3l4Kj6J22j56L7l3J15m5k1q4J47p7L%l4Q0q4J72j28P3q0J1P0o3p0Q4J16
6285A30j61L9K9r6qP4j5n7M7j7L8K9n0J3lNr2Q1P0p2N6k3l6k9O2N9j29j9J80j51
6315d6oLR4j51P0q3R9N4P2n0j12J63j27N6j6q3P1rK8L3nj24J45j30K2R5Pn2k19
6344b01K29K5q4Q4r5qJ27j15M5oM1j13P8Jq7O7Q9j88K6R3j02O1J0K0Ll5J25k8
6372F2k2p2pL0R6n6j6O2o2q0M6P1on0l3M6P3p9R2j14l8m3P0J8K1pOj30K28r3p9
6403f6l8N7j3M0j8R5jnj36J35p7N6m6J4p6M9J09j92J17M7p4Q1j42M7NqJ18j55
6431g7O8N6M6j14J12j92L5K8l3O9l8J9O9k1L9k9m0Nj9Q1m9O3j24M9k7J15q9K8
6459C0Pj23k2P1N8K9M1j81J51n3m7Q4k5o9k9KL5J10r7J00l4o8J42o1Mm2oN1j22
$$ y = [23, -11, -9, -25, 97, -59, -22, -55, 60, 15, -6, -90, 57, -20, -17, -17, -51, 29, -55, 117, -11, 62, -18, -7, 63, 0, -70, 14, 130, -31, 8, 37, -59, -67, 7, -8, -65, -18, -35, 3, 32, -18, -5, -8, -3, -95, -14, 56, -16, 40, 17, -19, -48, 14, 73, -56, -75, 105, -46, -52, -49, 45, -106, -36, -119, -20, 34, 106, 56, -56, 107, -20, 36, 20, -63, 8, -1, 27, 60, 55, -69, 76, -54, -32, 63, 70, 18, -201, 28, 53, -31, 53, -42, -50, 77, -38, 7, 1, 42, -71, 7, 8, -79, -12, 77, -111, -85, 8, -94, -33, -23, -3, 0, -35, 90, 62, 40, -32, -39, -9, 87, 31, 15, 77, 15, -65, -19, 52, 46, -4, -37, 9, 82, 3, 95, -19, -57, -100, -30, -12, 9, 2, 8, -122, 106, 13, -66, -104, -47, -60, -20, -38, 57, 56, 51, -85, 50, -27, 29, -17, -3, -79, -30, 79, -113, 4, 51, -23, 58, -84, -37, -32, -40, 78, -77, -9, 47, 93, -21, 91, -101, -66, -38, -71, -2, -40, -21, 48, 27, 66, 37, -3, 2, -17, 64, 15, 78, -46, 3, -24, 91, 2, 30, 37, -86, -108, -37, 21, 50, 91, -90, 61, 8, -39, 45, 20, -49, -78, -76, -41, 69, -28, 72, 38, -30, 112, 51, 55, 13, 7, 58, -64]
6488f4Q2k5Q0O1j84K5lO0k2n0P6j28J63k6Oj46O4l1J31j37Q7J7jq1P0p2O9Pl8
6517a0M7Q3q7K2l7P0j49J0P5l3k5MR7o5NJ2L4m1N2m8o3oK8O0k0n6K5O3j46O5J07
6548G3k3j6L4L9j84pJ06M9n3J7K0j48N3J65j47M9p9K7p5J16L1q3J07q3r3J62j6
6575D1q8J7J19j55J35k6j5k0po5K8JJ5j8J22j07kO5q8P0k7R9j65J16o5Q8M4j39
6603b7J9N1k7Mp8J24m8m8J7K6M8n1k8m1j4R4k4J7qR3Pj04j24K04j09K7J4r6O1
6632b1m6N1m4L5OJ7n5m3K25j28j0j1l1m1N5M7J5L9M4l5p9R5j00n0J14l3n8M7j8
6661a3o8MQ8K0M7m5o9P4N5j26p2M7Q8q0L0N7J06o2j42jJ4k2K6J5l5J73j17j15
6689a23J87m0K1M9j06K4oK5l3p8J3J54l3Q8j34L0j26J23o9j5M0l3M7j0l3R6mj48
$$ y = [-64, 18, -7, 73, 134, -50, -25, -28, 32, 10, -40, 36, -92, 71, 45, 51, -95, -31, -62, 69, -68, 19, 36, 35, -46, 24, -48, 21, 28, -10, 37, 120, 33, 55, 18, 88, -61, -51, 24, -9, -34, -30, 67, 2, 7, 19, 53, 12, 64, 16, -47, -53, -25, 35, 15, -41, -16, 47, -99, -34, 73, 50, 34, 68, 107, -77, -84, 22, 71, 18, 35, 55, -93, -40, 125, -22, 27, -52, -25, -100, 16, 47, -36, 71, -12, -105, 57, 41, -47, -30, 89, -66, 69, 43, 28, 8, 1, -64, -36, -35, -20, -38, 84, -23, -25, 40, -48, 22, -5, 94, -71, 45, -20, 68, 112, -27, -8, 43, 16, 20, -58, 66, 18, -30, -13, 13, 61, 10, -18, -59, -73, 21, -3, 14, 6, 99, 106, 2, -122, 82, -27, 0, 14, -82, -21, -67, -16, -60, -25, -19, -2, -57, -100, 125, -3, -13, -24, -55, -96, -41, 6, 21, 60, 104, 69, -10, 85, -15, -65, 49, 16, -42, 5, -13, -81, -77, 11, 31, 78, 33, -36, 38, 93, -33, -105, -58, 30, -50, -20, 37, 143, 81, -61, -62, -48, -70, -44, -29, -64, 109, -8, -123, 64, 24, 45, 94, -12, 12, 6, 31, -2, -80, -67, 87, 54, 142, 8, 38, -88, 35, -34, -49, -9, -42, 5, -5, -38, 58, 54, -94]
6717i4J28j7j6J8j05%J05j3P4j34K2L9P0r9J37j25m4K4J18j27N3m3k2q9R3O5k2
6744dj0J03j54R2P1r9pPJ4n0L3j6k1j2L5J3j6j1K3j8L6p5J88j15j0R4j26n0M3
6773d2N2L8N1q9q0J15p5J35j5l8q4J52k45J16R8p8KJ5k9L3J5r8J18j17j6J21J9
6800G4m9o1NJ8K1J3k7k4o%M7j2L5o4rL5J08j71R1j8j3k4P0n9QQ9m7Jq2L3qL5j7
6833hQ4j08P0j4n8N5J04j67L5N6mq2L2R4j50jJ8L0J01j55J37k2p4jO3l1q8J06
6861B2j04J82j03M3m6qJL2M5l1n0j6Q2j9j05M4Q0j02N8OO4o9M3m3K5p7Q4r1L2
6890b1J6Mj17O6J1K4l9J5R6j39O2J6J51j03j35R7K2j04R3K3j1k3L5l1MKk3L5j31
6919a05J26r9O9l3Q3j6L4j61PJ21o4Q3qj38J05o0n7P0L2qL2k6K6LN5l1Rj31P3
$$ y = [-94, 34, 17, 1, 19, -86, -86, 19, 6, 80, -54, -32, 7, 77, -22, 115, -10, -54, -30, 88, -39, 14, -29, -51, -140, -47, 18, -4, -14, 89, -65, 27, 98, -1, -8, -1, 13, -37, -4, -20, -41, -53, -18, -5, -21, -32, -9, -27, 9, -66, 122, 7, -3, 91, -35, -85, -42, 10, 48, 99, 10, -70, 45, -30, 105, 90, 52, -32, 120, -125, -9, 89, 11, 13, 28, -1, 32, 47, -51, 67, -50, -66, 55, 74, 25, -36, -31, -13, 8, 21, -6, -30, -36, -36, 11, -1, 34, -30, -39, -4, 104, -67, 24, 6, -7, -31, 39, -20, -12, 77, 30, 31, -51, -18, -26, 9, -8, 76, -32, 38, 24, -34, 21, 125, -42, -7, 49, 45, -37, -5, 89, -61, -62, -44, -14, 87, -68, 69, 47, -27, -28, 35, 4, -84, 22, -82, 100, -3, 40, -6, -14, -13, 19, 64, 33, -17, -33, 49, 30, -75, -31, 49, -53, 5, 11, 75, 6, 49, 6, 31, -46, 38, -53, -21, -5, -1, -118, -52, -41, -17, -56, -41, 55, -84, -22, -6, 145, 42, -93, 4, 26, -78, 15, 38, 27, 4, 39, 8, 12, 14, -9, 26, -105, 21, -78, -9, -42, 41, 25, 59, -102, -95, 26, -38, 45, 37, -101, 4, -56, -113, -43, -11, -19, 13, -13, 13, 16, 71, 40, 49, -82, -9]
6948ijJ6O8R6j53OK1j39O8J6L7l1l6m8L9MJ36j26Ll8J37L6j41J7K5oj5m0K8R0
6978F0n5qQ4q4j2l0L1l2L6M4K6j2Rr9Q3N0n6n5R8n4K4j13P4j11R3L3q6M2Q7j10
7008d3PN9n9M1j02L4R1ok7L1op1O8K9l0j2J11m5n6l9J22l2o0N0J4r9Omj3N9k7
7039il3M9p7J21j6m2L8o6q5M5J13r5J41o7l6k5PK2p7O8j4L2RJ8l0J1k7j1R3lp5
7070b1Q1o1J02j36J4LK0r1J1Q5j3J5k3J0Q9j65n0J71nj29J63o4K8o0pO7p1nR3
7099E1o9L9L5j57R2Rl0K3o8J79j78Q8O8r6K6m8m5O4K2Kj5L6j03J37J7KJ2n8k9
7128FnK8r0N4J3N5p9N4n8r7Q7k8oJ00p8LK9M8%o4j9k7K5N2k2Q6j11L2p3R0L4l7
7160BJ27k07P2l7L0l3K9J1m3m8O7l3Q4Lj19j9J62n6n7J3J8P8mn4p8P2P7p1NP5
$$ y = [-9, -10, 6, 74, 170, 17, 23, 44, -95, -27, -11, 26, -5, -41, -89, -50, -46, 90, -36, -33, -71, 66, 102, -39, -22, 3, -3, -18, -58, -30, 60, 5, -3, 81, -3, -15, -45, -14, -46, -10, 34, 60, 48, 57, -42, 41, 91, 35, -20, 78, 24, 48, -65, 9, -102, -9, 24, -62, -20, 67, -43, -36, 23, -36, 5, -97, -63, 28, 22, -5, 26, 20, -51, 17, 46, 16, 4, 115, 70, 14, -25, 97, 65, 5, 55, 69, -30, -24, -28, -41, 18, -9, -42, 7, -70, 51, 35, -7, 31, -35, -120, -75, 38, -57, 84, 17, -19, -44, -37, -15, -92, -24, -38, -6, 3, 21, -9, 2, -25, -36, 57, 54, -21, 60, -1, 101, -35, -21, -18, 2, -89, -78, 7, -6, 9, -14, -4, 85, -80, -130, 41, 36, -93, 70, 6, 34, -26, -33, 34, -37, -42, 51, -18, 21, 56, -101, -9, 0, -30, -7, -75, 104, -74, 14, 82, -14, 12, -36, -81, -17, 5, 7, -8, 28, -75, 62, 79, 81, 93, 35, 6, 1, 29, -61, -7, 6, 61, -18, 36, -22, -119, -32, -60, -66, 34, -44, -41, -12, 36, 36, -28, -47, -74, -49, 3, -19, 67, -44, -12, -85, 5, 39, 2, 129, -78, -6, -43, -13, -46, -17, -6, -49, -97, -30, -63, 21, 24, -95, -114, 48, -8, -65, -52, -34, 44, 40, -14, -92, -20, 57, -14, -9, 66]
7190F6k3k3r3J46r4oK6L3k6m0J85j06m3p2M8R7n6k6KK9m8L9l4oL2o7L2L9k5n4
7220f8N5j2J5J00j45P8j66J50pO2m4rn6K3l6N0j5l8R1K6J0l2k6N4j06M4o2N6M6
7249C8J8j15P8L4q8O7O6j18J9p0O3l5M5qN0j0Pm9Q6l8m4n9Q3q1n9J40J8o7O5N9
7279I5r0L1n6Pq2J08q0N8l0O9j6k0J0j7j3L9O9k1j22O4M7p8j4M3j0O5p3pQ4K1
7309H1o2m1J8M2r0QL1j8pN1o4J19r8J56j13M8j39L1q8K13j54J26j32L8J9N0l6
7336a1J7K7Q7j85M4O2n0k0J4n2M8J2o3L3RM2J3pm0K0q1R0Kk5l8J29L8p9j32k3
7366a19J29QJk3r5J10l6QQ4q1j00J50p3N4j4K9M0k7n0m6R8j7o1N1J8n3N0j43J33
7395B5N0r0J8l6O5m1k8L7L7r3J06k4j02N7M6j0J8m8J1k3P3j75J23mk3J05l1l1
$$ y = [66, 43, 20, -73, 73, -21, -27, -1, 32, 6, -34, 151, 45, 2, -70, -22, 75, 19, -7, -5, 24, -24, 15, -19, -25, 7, -60, -28, 11, -14, -68, -13, -25, -10, 90, -55, 23, -143, 7, 0, 62, 18, 9, -47, -24, -60, -10, -25, -63, 28, 54, 64, 32, 6, 60, -46, -2, -64, -8, 38, 56, -59, 19, 53, -35, 32, 98, -20, -1, -71, -8, -43, 2, -6, 44, 34, 41, -8, 78, 40, -4, -63, 20, -61, -120, 20, 38, -29, 36, 95, 5, 36, -20, -13, -95, 13, -67, -9, -39, 30, 14, -6, 4, -13, -26, 13, 82, 61, -61, 3, 50, -28, -42, 1, -9, 56, -17, -24, 60, 81, 19, -22, -4, 38, -52, -44, -13, -31, -38, 13, -51, 68, -30, 126, 13, 61, -78, -47, -135, 78, -76, 50, -82, -44, -25, 25, -11, 6, 33, 120, -65, -21, 41, -9, -29, -15, -67, -19, -7, -70, -37, -28, 14, 27, 20, -20, 0, -81, 9, 11, -14, -52, 77, 115, 36, -96, -119, 10, 18, 19, -4, -99, 11, -25, -17, 67, -14, -114, 36, -37, 17, 3, 32, 72, 45, -5, -51, 47, 30, -31, 20, 38, -15, 35, -108, 25, 75, -15, 3, -33, 32, -9, -37, 0, 37, -56, 50, 26, -76, -19, 27, 17, 35, -13, -2, -25, 48, -127, -4, -8, -31, 74, 43, 12]
7423A2mN3L8n9j09R5m5NL3k0n1Q9j09O1J04o7m9Qj9n8O0K1k1J01l3j16O7P7l3
7452C1r4Q3O0q0m0L8rj32J19%l1J44q5j6q9J44j74R5n2J06p5j8P0j47J31q2O7
7479c6N5l9k0j9R6j33J49Rr9J72r0m6k3L7m9J4mj7J4m8P7Q8r5J4M4k17K10o0P6
7508F0j22L5j35J97j12N6L9n5N6o1J24j7j04P9L6k4n3R3j27J14p9k2o8N3N7K2
7534D2n7p5J63k12N0M9P3J6j3j58L9J76j24N1m7Q8l8k2n9J0K6R1o2o2RK6l1Q3
7562C2k5K4%K7l2n9m5Q1l8R8o7jK4j4m2n0J23n1L5M0k7j1J4Q2o3o5O1j12J7j7
7592f1K6m2P1ol8l3J8k2J32n2L1o4O1Qp2R1j06K9M3p0J07o3M5pM9j76K7O8k7Q9
7622E6o0j4P3j12M4M2j25O0J07r8N3j08Q6n9P0M9m9j5J10j24P9j13P9j15J11m4
$$ y = [12, 8, 61, 99, 40, -69, 26, -19, -14, 19, -1, -52, 37, -72, -11, 93, 26, -23, -15, -34, -92, -32, -11, -32, 69, 36, -80, -13, 64, 31, -63, 20, 80, 0, -40, -2, -11, -143, -24, -24, -55, 89, 4, -12, -101, 43, -131, -36, -88, 18, -57, -75, -5, -152, -21, -103, -36, 19, -20, -40, -59, 37, -96, 53, 62, -37, 135, 45, -1, -24, 13, -36, -22, -26, -43, -29, -77, 0, 88, -7, 7, 51, -166, 44, -16, 60, -62, -27, -162, 35, -77, -21, 18, -37, 19, -42, 82, 65, -39, 40, 76, 52, -1, 92, -35, 79, 0, -22, -90, -37, 20, 42, -15, -90, 73, -139, -89, -40, 33, 49, 36, -122, -83, 93, -31, 20, -27, 61, 23, 1, -58, -48, -22, 69, 7, -55, -46, -20, -51, 32, 7, 31, 31, 58, 26, -33, -78, 3, -35, 63, -4, -5, 19, 5, -37, -87, 36, -15, 20, 60, 33, 22, 36, 118, 55, -10, 51, -61, -44, -61, -35, -77, -6, -12, -50, -83, -65, -87, 45, -7, 24, -40, 21, 29, -43, 48, -58, -29, 14, -56, 51, -12, 33, 26, 75, -101, -74, -6, -33, 56, -4, -18, 55, -57, -13, 29, -96, -36, 71, -27, 26, -82, 4, -55, 15, 64, 15, 0, 110, -14, 65, -48, 31, -84, 27, -17]
7648a7L9kNJ0r7L0Q5p1N3j4L1%j29J08k1j15J59Ll1r3R3J6k8k1J6k9M4k0l9J30
7678I5n6j27N6mL6O2l8l6p7J33o8o0P0L4m0J1on3j1J36%p9r6J64q7p0J68m6j25
7707a14J23R3k00L8n7Q3J9J6K5L1m5K3lk9Nq3M0n4K6O4j3K6m7N4J9m8L2q1J0M5
7737bJ07j41J67q3j10P5n8M1OMk5J25r3P7j21L8m3R1o1j2J11p6o2O1k6J6K0rL1
7766D8n7L2K6Rl1k0Q7q7N5j00n7R0L5k8J9l4K0K5q1O5rj00K8L3J8J4o0N6l1N2
7796A7K8N8j50J16q0q2J09j2j7K8nl0Oj3lq1J7M6K4q3J31j08M4J23j06K2Qm6N8
7825A9m2QM1M1j21L8Rj1J18j53O2J2j1J08r1nO3n2r1J21j25J83p5p1o8R1o0k6
7853h8Q2M2n6J31r8OKJ7Mj73J56kK3n4J07k10J96L3r3m7oJ79j80KJ51j64N1M0
$$ y = [-17, 22, 20, 25, 35, -62, -32, 53, -18, 35, 21, 52, 52, -77, 31, 10, -105, 54, 57, 26, -67, 26, 42, 14, -7, 9, -20, 24, 4, -35, 95, 39, -88, -32, -36, 0, 62, 24, -12, -89, 44, -24, -84, -14, 20, -20, -9, -15, -68, -79, 57, 57, -22, -118, 46, -41, -111, 57, 11, -114, 9, 102, -98, -60, -117, -34, -15, 1, 26, 57, 12, 35, 32, 3, 8, -75, -35, -89, -63, 1, -12, 14, -33, 21, 40, -8, 24, -57, -47, -2, 105, -36, 131, 48, -62, 13, -45, -4, 2, 6, -19, 106, 13, 90, -31, 7, -36, 55, -6, -18, 93, 17, -45, 16, -10, 6, 26, 17, 48, -9, 23, 49, 58, 27, 7, 94, 7, 62, -38, -95, -5, 30, 2, 21, -13, 7, 32, -49, 16, 7, -93, -65, -32, -14, 0, -60, -4, -35, 17, 45, 103, -47, 69, -11, -93, 16, 4, -13, 15, 10, -20, -14, -27, -30, -111, -94, -48, -24, -107, 24, -84, -40, 83, -23, -1, 7, -39, 19, -23, -15, 26, 67, -54, -16, -7, -18, 100, -53, 9, 21, 10, 118, 27, 22, 85, 33, -58, 63, -62, 121, 46, -25, -93, -2, -62, -88, -6, 36, -20, 111, 13, 19, 21, 38, 42, -131, 25, 23, 46, -8, 99, -111, 85, 118, 25, -22, -28, 151, -29, -27, 124, -40, 11, 51]
7881E1j0j05Q8p1OJ17r3M0l3K7r7k2J36n6K0q2N8K3k9K9M0kp9J5Mk7NK4oJ12j16
7912c3O7R3p9lj25J24r0L2N7J4l4pk0k8l7J33q8k9J50p0o3R1k8j33N6L4m5l8O6
7941c3J08j40Q3j12J46j68J35k8j0k3M3kPj3j3M3o2N9m2J0K2N6ok8q2J08j59J39
7969C8k08J37ql6P2m1k5KJ97k03M3M1l7Ko6M5J0m4N5K5OJ8M2o6l8J0K3p6Q9k3
7999a6J09j34M7o0L8M5n8L0Pm0%N1m9Kn1N5m4L0Q8j40J48j26J5Q3J07j70j3J5
8027c1n1L3M6O7n3k6Q4j9j4l2K9L2n5o7L1r3J07r5K4J10m6Q3jj70J10J6n0k9n3
8056a13P0%l0L3K2QJ09L3j75J7J03Qj54p0J87n2n9J45j07Jk5O2M4m1o4k8L8K4
8084a4O4j64M6J0mML7p7J41J1j55L7mN2J21j20O3j13J20l4j47O7L8O1Rn3l8jN8
$$ y = [51, 41, -64, 24, -47, -41, 76, -17, 23, -10, 17, -80, -102, 34, -22, -2, -84, -26, -3, -32, -3, 37, 35, -44, -29, -25, -52, -47, -23, -29, 83, -33, 34, 127, 48, 45, -80, 44, -46, -14, 43, 57, 23, 16, -4, -32, -69, 64, -24, -53, 97, 27, -36, 55, 27, -106, -50, -16, -61, -99, -33, 75, -65, 18, -94, 52, -116, 19, -9, -19, -42, 1, -1, 6, -7, -20, 23, -39, 20, -22, -12, 10, 66, 60, 32, -50, 58, -101, 38, -170, -33, -41, -77, -5, -46, -71, -69, 128, -75, -32, 9, -28, -26, -92, -47, -37, -81, -26, -1, 5, 23, 65, -1, -39, -29, -6, -82, 7, -16, 93, -41, 6, -54, -16, 29, -29, 1, 8, -32, -32, 19, -30, -28, -79, -24, -68, -38, 50, -90, 58, -68, -53, 30, 137, -33, -46, -31, -82, -49, -3, 64, 11, -15, 69, 50, 36, 4, 33, 65, 10, -57, -26, -119, -12, -107, -83, 27, -19, 64, 63, -107, 3, 19, -31, -60, -113, -43, -43, -73, -40, -18, -10, 99, 132, -43, -26, 77, 85, -69, -139, 48, -4, -63, 82, -25, -24, -49, 13, 57, 16, -48, -76, -38, -14, 50, -114, -68, -58, -62, -58, -21, -98, 43, 54, -101, -64, -68, -16, 105, -15, 48, -65, 55, 21, -126, -59, -21, 40, 49, -4, -42, -43, 15]
8113A5j5J22o0n0p7LR1l2j7L0P6j38J4J39j50P6n9l5M6j3L1M0p7O2j02J29k5k8
8141dRm2l5N1l2N1M8l6K0N0Mj94P4J1J3L1k2o2J7q7J91m0l5J8m0l3LL4q5J26K0
8172B4km5J0Q1m0P7j68M4M3n2Q5o0j6j0k4J5M3j2l2
$$ y = [15, 0, 122, 62, 12, -65, -62, 29, -3, -20, 10, 86, -52, -38, 101, -49, 27, -32, -67, -21, -34, -3, 37, -40, 22, -80, 49, 24, -4, 5, -37, -72, -21, -53, -2, 46, 10, 30, 80, 84, -110, -36, -25, -12, 19, -3, -65, -48, -135, 56, 16, -19, -1, -41, -74, -71, -37, -122, 4, 24, 22, -23, -13, 68, 28, 105, -63, -19, 24, -28, 57, -3, -19, -29, -53, -38, 5, -7, -39]
8191c9
$$ Imaginary data points
##PAGE= N=2
##DATA TABLE= (X++(I..I)), XYDATA
0@%%%%%%%%%%%%%%%%%%%%%%kLnQqRj0J1j2J2j2J2j4J8k0K0k0K0k1K4k6K6k6K7
46A4l0L2l3L7m1M5n1N7o5P7r4J16j45J87k45L26m48O38r44J474k486M733j1303
69h149N7721J67270l92326l7465L34265k53722j67836L34850l9199k11784K50577
80C4202R5955k03963J04170J36122j57773o838J31183q2409p9673Q6283m525r8170
92d5436K1247O5795n3581m0376Q4458O664j00782L8809N8961j17366j8601J14251
104A4043o9747o1170J38411l516r3088J22707N6655j08271P0270Q3447j18480
115C1261n066Q0141j06002n6910P9415o1175p3163Q0917k234o6364O9379L9997
127A0196n8888M0303O1365n2444l599O7194l2690m7109N7566O958p3465K4559
$$ y = [0, 0, 0, 0, 0, 0, 0, 0, 0, 0, 0, 0, 0, 0, 0, 0, 0, 0, 0, 0, 0, 0, 0, -2, 1, -4, 4, -4, 5, -5, 6, -6, 6, -6, 6, -8, 10, -10, 10, -10, 10, -11, 13, -13, 13, -13, 14, -16, 16, -17, 20, -21, 24, -27, 30, -35, 42, -52, 64, -81, 106, -139, 187, -261, 377, -567, 907, -1579, 3154, -8149, 49572, 216842, -175484, -212949, 121316, -132406, -300242, 34608, -4591, -216375, 34202, 130157, -73806, 30364, 166486, 8713, 1875, 133058, 50649, -29024, 57259, 52734, -45436, -24189, 41606, -11975, -52351, 32107, 38771, -62011, -23202, 35759, -81607, -100208, 14043, -55704, -116874, 21537, 18021, -75067, 47640, 104295, -3976, 66294, 149741, 31261, 26195, 106336, 334, -56576, 22839, -38336, -111499, -30582, -32816, -99180, -29801, 10196, -48692, -8389, 52976, 532, -3067, 64127, 31437, -15672, 41894, 48852, -24613, -54]
139e4N2846o7345k5640Q1593k3972p3912O8388L0274r8905K2118P8501q2288l0884
152f9280J06943l3255p9861R5615K6550j06260N5523Q6967r7042p436J16336o4213
164C0587q0470J04147o341j21840O6709O1477j20473R062J09491q1942n0860J22962
176D2509j7688r2834R5156M2384j10124L4148P9275r1399k4819R3495m2378o1994
188e4269P7373P385p4592M0754M2267o1631J849N6101l4061k9027M6746m973m3397
201b9475K7113K2828l8521M435L8213k4683k0030L7469m992l6008K7899J6214
213B0462m1008J1671L3446l6680q397M4577k3102k8057M7089k511m5126L7221
225I585K1102n3436J5566M2440m8134j2264N5365k8787l9137N4519J055n7795
$$ y = [-54, 52792, -14553, -40193, 41400, 17428, -56484, 11904, 42178, -56727, -34609, 43892, -38396, -69280, 37663, 4408, -75453, 20162, 46712, -59548, -4025, 82942, -14100, -21536, 94800, 30587, -49883, 54264, 47923, -73917, -7208, 54269, -66204, -57142, 52349, -29593, -80453, 42509, 24821, -68013, 27143, 69527, -40597, -6449, 72826, -18573, -43392, 50103, 7725, -54269, 23104, 30489, -44103, -3349, 38918, -22713, -20864, 35237, 1176, -27851, 18895, 13922, -29475, -2362, 20466, -18055, -13620, 24593, -90, -20120, 17349, 12357, -23651, 4248, 20462, -20546, -8875, 24571, -12109, -20506, 24071, 969, -27088, 20001, 17490, -27636, 9585, 30687, -22749, -7183, 35257, -12877, -25141, 30224, 1437, -37700, 16819, 17874, -39921]
237c9921L7386L4871o0146O222O0513m2795l1918O6367p704o0788M7846L2296
249D2229o8398J0495O1845n1784l1480P0154j6191o4425N4520K6801p5671J9347
261b2558O3906n9597k4113P9648k1375o1709O5487K4215p8233K6758O0902o6240
273a2909j9656P5793l2351n8204O4936J1338p4472L5551M9663o6608m743O9198
285C7536l9317m0864O6328j316o0695M4112L3791o1284R544N3625m4085k4191
297b6816N6597j4911m6347M1728J4348n2798J7434L5986m2481q070M5861k2057
309a526k8634M2313J556m0741K7875K4448m0572P420L9874l0903j7483M2800j3078
322A3349l6845L5258R718m6539J7909L1560m3574n370M6648k6617k9406M9136
$$ y = [-39921, -2535, 32336, -27810, -21588, 38925, -3870, -35788, 30579, 22875, -37913, 9933, 42229, -26169, -15674, 46171, -5613, -37093, 33061, 16870, -47555, 6965, 33766, -41905, -22558, 41348, -18249, -42362, 37286, 15911, -45798, 19689, 43904, -34329, -7571, 53331, -12909, -32565, 43228, 10877, -47327, 17609, 28947, -45525, -9974, 39689, -26919, -31662, 37536, -1781, -42645, 23683, 22367, -38328, 5784, 39575, -21709, -12165, 41460, -2625, -26816, 29781, 14870, -31477, 10251, 24599, -28199, -10765, 25221, -17260, -25330, 20531, -1526, -30160, 12153, 13709, -27032, 843, 25291, -15281, -7861, 32013, 1110, -16373, 26427, 13349, -23496, 11762, 21480, -25059, -7150, 24410, -19164, -24534, 22114, -4503, -33909, 15227]
334A5227K16m6941L4799K7644n1679Q142M8737l9036k2563N5334j3735m7717M3935
347A2363J7372n8583J7759M5152m9420j5544N8455k2464m4668N0915J3698n7524
359c2489K5053M3795n0293j0209N7384k5284m0302N1041P890n5933K7012L6873
371C4538n1764m995N2918l0174l4063N0503L31n0462L1369K8737m8771L930M6276
384B8373l1320k2356M6669o342l9277L2071J7968m2018R196L3952l1806j4010
396a8900L7842j3162l1230L0754R072l7354J5563K7470l2939l890L7480j9840
408H66k2036L7591k521l5170K8643J5647m0789J2289L1131l6612o894M1157k2722
421E80k5263M1147m112l8182L0453J6038m1632J3351L1915l5094p202L9441j9662
$$ y = [15227, 15443, -31498, 3301, 30945, -20734, -12592, 36145, -2891, -25454, 29880, 16145, -31572, 12363, 29735, -28848, -11089, 34063, -15357, -30901, 27554, 5090, -39578, 11337, 25035, -32489, -7436, 36359, -13934, -24143, 33241, 7957, -32345, 18696, 26586, -29347, -2335, 34538, -17226, -22221, 30697, 523, -33540, 16963, 17294, -33168, -1799, 26938, -21833, -17903, 28373, -2947, -25303, 21366, 15024, -24253, 7818, 25786, -16232, -7036, 26916, -4890, -18900, 18942, 5780, -25450, 5304, 14376, -22978, -7415, 20055, -12884, -16774, 20706, 866, -21170, 16421, 13900, -21270, 7373, 23020, -17769, -5480, 25651, -10961, -17855, 23302, 580, -24683, 16464, 12352, -25830, 4623, 20661, -20971, -7620, 24295, -10799, -18001, 21440, 1778]
434A778k5959L6164K038l5796K2017K2660l4429k08L4007k0967k1675L3111Q10
447A3551l4055J9702K1717l4035j857L4908k1008k2495L7170J093l6927K4368
459B132K2696l9751J882L8054k7669k1398M1099o163l7820L0268J7765m1289R906
472a0288L5618l1232j2835M1018j2986l1684L2365Q202l8923J5610K6442l3346
484a2039m113L5207j8772k1390L2750o9l0439K0756J6784k9794L129K6201k0376
497b165j2977K6973m818k3350J9216J1369k5872N089K3064k0306j1527K8236o901
510F031k5361K4610J0100l3444J2623K6595l2955l898L9258k3721k2993M3481
522B0326o936m0164L7550J3969m9879K1201L4323m7353j349M6303l3301k2558
$$ y = [1778, -24181, 11983, 14021, -21775, 242, 22902, -11527, -11735, 22272, 1305, -20370, 12741, 13551, -20504, -802, 20915, -13120, -14977, 19931, -1077, -23572, 13598, 14691, -22236, 2132, 24828, -14923, -13041, 25013, -2656, -24054, 17045, 10882, -26938, 3330, 21095, -20194, -10288, 25330, -5902, -18737, 22281, 9295, -22389, 9976, 18178, -20745, -5135, 21307, -12039, -16152, 19055, 283, -21107, 11643, 11574, -18865, 1891, 18675, -11119, -7990, 18211, -2165, -15142, 11831, 7013, -16337, 2879, 14248, -11624, -6535, 16529, -3777, -15304, 12932, 6031, -19330, 5280, 15380, -18064, -5441, 21154, -11801, -15699, 23559, -162, -23155, 20326, 13390, -26774, 10776, 24745, -25134, -3933, 30390, -16963, -18312, 27991, -5310, -27868]
534b7868M6818j2084l5561L6779Q741l8131J9385K2539l0998Q37K7367j6337j3310
547a1823K1526M18j9230P477J3868j3313r899J7960J295k2808J1017J8712k5866
560a0666m151L1873j8089k1893L6319j847l6068L0202J6883m2585J4440L3526
572B7944l7943n671M1263k3830k3293L7802m826l2633K5231J1585l1254Q950K0473
585A3798k1090m622K1425p795j3824J5129N129j6086M505J5248j1940q893J9086
598A0070k208k0429J5595J1390k6419N131K4295k4018r041L1707j4333k3183L1995
611A0552M15l2623K4901J6053l5890J0667K8416l1539n421L5455j9801k0646L3992
624A4531l504l0875K3901J3047l2418Q169K5504k4874q966K9238j0278k2261K3942
$$ y = [-27868, 18950, 6866, -28695, 8084, 16825, -21306, -1921, 20618, -10380, -9543, 17824, 1487, -11823, 9703, 10121, -9109, -1632, 12236, -1077, -10976, 6984, 8279, -14529, -3512, 15200, -10666, -14817, 17056, -1033, -22926, 13393, 11546, -24522, 5680, 22563, -20022, -5582, 27944, -9999, -15670, 25593, 1763, -21530, 16272, 11446, -21187, 4044, 15629, -15625, -6675, 13798, -7292, -11914, 9511, 1716, -12108, 3021, 8150, -7936, -3431, 11817, -123, -9016, 10070, 7862, -12567, 3028, 14418, -12001, -6870, 17425, -6593, -15634, 16073, 1740, -21443, 10552, 10967, -21656, 3245, 19298, -16592, -5925, 22491, -9048, -14469, 20986, 1185, -19461, 14531, 11027, -19848, 4053, 17100, -15318, -7149, 18355, -6519, -15485, 13753, 3475, -18786, 5156]
637E156O983k7370J0866K1932k3018o228K7901j0941k1372K3884O077k7837J1300
650b667J9820k4893n072K6748j2584j8237K3716L208k4880J2493J6884k2044k563
663a0071K3232j1450j5778K0887L195k2353J1239J5825k0999k698K3081j2705
675A405j5710K3129M89k4354J5716J4210k6428K904K4200j9851j0702K7852p776
688E084k1353K3129N512k6589J2572J6720k3941O34K3413j6352j1650K3049n580
701D648j9459J8314P464k2064Q537J6598j9327m208K1146j0039j4956K0194K394
714I242k1326J1717J3462k1449m45K1550j3670j2097K3277k617k2085J6647J0245
727A2451k5030O150K1804j9968p632K5876r604k0109K2425M938k5361J2812J7910
$$ y = [5156, 12139, -15231, -4365, 17567, -5451, -11679, 16222, 5281, -16091, 7793, 13870, -13967, -2667, 17153, -7740, -12812, 13936, 1352, -16885, 6831, 10039, -14841, -2348, 14536, -7508, -10071, 13161, 1711, -14067, 6820, 10015, -12338, -1099, 14726, -6273, -8971, 14110, 1405, -14305, 8824, 9313, -15041, 675, 14885, -11543, -8639, 15561, -4290, -14992, 12860, 5084, -16269, 6860, 12372, -14217, -1645, 15075, -8866, -8232, 15181, -1171, -12821, 10228, 4648, -14811, 3503, 10967, -11097, -2560, 14038, -5289, -9497, 11649, 1610, -13346, 6848, 9242, -12084, -367, 13095, -8354, -8799, 12751, -919, -13016, 10261, 7644, -14441, 2206, 12451, -12579, -6429, 15375, -4593, -12225, 13651, 4047, -16062, 6363, 11301, -14060, -1248, 16662]
740A6662k3882j888K3895j4958j4780K4000r28k2550J5752J2084k3378K574K0654
753A3257j5603r997K1918l312j8710J4668Q514k0302L847J7293j4208p488J9112
766H989m222j6613J4407P404j8834M945J6397j4800o924J8993n918j5929J5749
779C644N579j9103P418J4259j7317l167J9121j0123j2152J9006l37j8631J3111
792A308R208j9913M437J7019j5596n613J9814p896j4584J7456K226j8908J1010
805c2J1963j8574Q23J7482j3226r167J8581l220j6204J4129O932j8778N117J5170
819A0996j5043n321J9202o305j4822J6324M172j9660P825J4545j7581l070K0213
832A1475r914j4289J9154J410k0352J2340J2979k0431Q36J9943j4207j0941K0848
$$ y = [16662, -7220, -9108, 14787, -171, -14951, 9049, 8121, -14429, 1323, 13407, -9971, -7397, 13257, -2346, -12343, 9575, 6263, -12447, 2221, 10735, -9567, -5720, 11573, -2635, -10123, 8989, 4767, -11846, 2561, 9965, -8869, -3924, 12473, -2327, -9251, 9742, 3824, -12105, 3644, 9223, -9880, -2462, 11797, -5520, -8687, 10434, 311, -11841, 7165, 6828, -11803, 1308, 10516, -9397, -4960, 12059, -3537, -9150, 10664, 2768, -11816, 5640, 7866, -11042, -32, 11931, -6643, -5820, 11662, -1564, -10731, 7850, 4630, -11574, 2555, 9487, -9291, -4174, 10996, -4047, -9368, 9834, 3529, -11293, 5031, 9203, -10457, -2632, 11913, -5668, -8738, 11475, 1561, -12728, 6426, 7836, -12516, -176, 12803, -7628, -6792, 13151, -1056, -11997, 8851]
845H851l066j8592J5547Q269k0578N301J6442j6134n886J9502o590j4775J5933
858D224M450j8574O867J3821j5442l639J7720p084j2869J5148L063j6793P990
871a118J1803j5587j109J6397j0151j0227J6586j446j5799J2141P605j7512M388
884d029J4166j3941m397J6689o731j1364J4388J417j4730Q472Q561j3770J021
897d248J2726r181o384J3237k206j1820R462N611j3475K621J2082j0421n818J4349
911F535l341j2713J2010N471j6046N092J3439j4387l940J7440q019j2655J6738
924E624J378j7782J0895J0634j7964J623J6905j2706q271J7729l503j5081J3113
937B594O101j6811M438J3344j2725n126J6127m724j2712J2760M623j5827N384
$$ y = [8851, 5785, -12807, 2740, 11009, -9569, -4268, 12174, -3960, -9846, 9656, 3066, -11709, 4224, 8674, -9900, -3033, 10788, -4654, -8293, 9427, 2343, -10526, 4622, 7685, -9108, -1118, 10685, -4902, -6011, 10386, 235, -9992, 6594, 5148, -10651, 1490, 9095, -8417, -4029, 10137, -3804, -8201, 8488, 1757, -9607, 4781, 6198, -8532, -60, 8501, -5269, -4248, 8478, -703, -7087, 6150, 3944, -7876, 1586, 7197, -6278, -3657, 8425, -1996, -7814, 6535, 3194, -9519, 2491, 7962, -8084, -2992, 10447, -3940, -7880, 9560, 1541, -11114, 5624, 7002, -10780, 115, 10749, -7215, -5592, 11313, -1393, -9664, 8065, 4562, -10519, 2594, 8695, -8116, -3678, 9666, -3059, -8185, 7942, 3218, -9494, 3266, 7889, -7938, -2554]
950b554J2463j3358m346J5978o359j2393J4305K851j6091Q355J0996j5136l23
963e612J5715j0220q559J5999k276j4288J1456N929j5812M403J2253j2597l498
976g107J4771o266r857J3038J068j3508P637P823j2908R07J1910r029n767J2441
990E153k799r868J0039L626j1544M382Q447r783j796J0517n182p275R094Q85r774
1005e878M847O438q803j195R692m373o939R135K107j0764M824Q281j0637k034
1019e299J2542o583r121J3217M16j4226R756Q221j5630K804J4293j2846n312J6647
1033H879o466j2245J4560J736j5859Q410R490j4229N28J3431q650o992J2511q99
1047D205j1032P537O131j0971K12J0504o862p048J1162K98j1718P522P656j2731
$$ y = [-2554, 9909, -3449, -7795, 8183, 1824, -10569, 3736, 6587, -9504, -1149, 9847, -5289, -5612, 10103, -117, -8676, 7323, 5047, -9241, 2215, 8144, -7668, -3265, 8988, -3609, -7107, 7664, 1398, -8459, 4579, 5647, -7861, -224, 7599, -5309, -4402, 7508, -1521, -7288, 5153, 2354, -7514, 2525, 6151, -5393, -1011, 7436, -2347, -4143, 6374, 1192, -6083, 3011, 3896, -5878, -1031, 5407, -3396, -4591, 5101, 728, -6211, 2924, 5031, -5733, -909, 7372, -3265, -5299, 7243, 660, -8461, 4756, 5172, -9054, 702, 8923, -6707, -3903, 10390, -2456, -7768, 8879, 2413, -9832, 4728, 6464, -9395, -985, 8505, -5724, -5196, 8235, -415, -7407, 5104, 4205, -6827, 710, 6841, -4130, -3918, 6586, -276, -7324, 3838, 4136, -7582, -60, 7596, -5135]
1061e135R48J3178r925o642J5183l921j2792J2929L339j6065P886R949j5282J089
1075e261J4269j1192n578J4950m965j0473J2144J583j2384O728O566j0779Q57
1088c535R129o296m292Q181p30p000M902M459o735m08P102l983n666P310R47q711
1104e326M616O279r539m2J0309p225n832J1869j977j0421R842M109j2818M256
1118a900R486j1120k096J2084n475p847J0273J005j0558N468O812r125m43R695
1132F259n283o583R027M07j0031N617O754j0396j63J1182p157p103J2230p32j2168
1147h140R313O467j3472K709J1634j1035m364J3744n197r598J2065J390j2469
1160f953P155O941j1776J130J0528q059m851J0956k861q968Q106L293r808L185
$$ y = [-5135, -4187, 8991, -934, -7576, 7607, 3686, -9106, 3823, 7162, -8903, -1017, 8932, -6350, -5261, 9008, -2184, -7762, 7188, 2223, -8250, 3894, 5477, -6907, -179, 6387, -4392, -3535, 5594, -702, -4994, 3187, 2457, -4543, 359, 4818, -1917, -2325, 4777, 794, -4872, 2438, 3385, -5326, -710, 5569, -3970, -4012, 6297, -928, -6760, 5109, 3132, -7289, 2553, 6662, -6156, -1900, 7586, -3534, -5630, 6454, 979, -6868, 3405, 4410, -6148, -680, 6132, -2993, -3436, 6259, 976, -5607, 3420, 3827, -6204, -587, 6167, -4229, -4392, 6790, -367, -7470, 4760, 4028, -8140, 1173, 7640, -5832, -3123, 8511, -2524, -6888, 6856, 1659, -7939, 4126, 5516, -6953, 202, 7143, -4633, -3503, 7025, -1034, -5885, 5071, 2210, -6758, 1348, 4641, -5167, -1982]
1174a982P864p944k501R394l466p097Q089K046r235M165O467q434q78R066n432
1189A22n700R260m47r139O575M749r917J871Q560p495l459R640k853p477P942
1204B232K134r092L811O502p830j646Q746m252o049P898J119q654M053O139p778
1219b667j161Q727m145o106Q309R17q950M881N893q882k64R328n897n699R702
1234C986n86r401O867M787j0149J834Q840q012l578J0209l370q054Q852K039j0195
1249e931M948P042r193m09R752o135n450R557j033q595O725L737r105K272P218
1264E400p339k456Q571l294o043P397J146p760L933M751p106O1P110m647l992
1279d268P269p53o679N085L459p273J460O610n648k866P521k141o372O184K002
$$ y = [-1982, 5882, -2062, -4563, 4831, 1365, -5732, 2357, 4403, -4832, -667, 5800, -2634, -3512, 5554, 122, -5578, 3682, 3235, -5904, 671, 5420, -4497, -2626, 5934, -1561, -5020, 4620, 1767, -5710, 2232, 4366, -4726, -915, 5587, -2243, -3889, 4857, 605, -5444, 2454, 3573, -5081, -1028, 5111, -2667, -3828, 4899, 754, -5352, 2957, 3874, -5076, -195, 5698, -3184, -3448, 5880, -17, -5716, 3986, 3400, -6001, 866, 5653, -4496, -2662, 6178, -1834, -5412, 4797, 1427, -6627, 2225, 4264, -5931, -983, 6059, -3134, -3543, 6209, 74, -5376, 4181, 3148, -5447, 1278, 5015, -4090, -1818, 5400, -1939, -4395, 4176, 882, -5161, 2236, 3382, -4378, -445, 4306, -2800, -2739, 4371, -276, -4268, 3001, 2248, -4431, 654, 4113, -3160, -1700, 4910, -738, -3604, 3917, 1776, -4596, 1588, 3590]
1294C590p714L128N699p080j075P870m197n170P724J21p741N059M387p857P01
1309b555P320n581l566P803j445o677N814K977p664K010O407o150k495P718k219
1324A697o358O347K384p920K511O202o727k084P979l175n989P502J101q360M133
1339g57N628q030N0Q451n580m582Q475j243p678O184L391q170K354O705o426k190
1355c418P496l164n376O563J032o862L510M463o770n95O654l833m120O746J82
1370B508o590M258L821p043N40O985m959l362P709j594o703O052K127q041L101
1385a191O004p090j088Q103m504n011P658k52p378N129M132p616J062O514n546
1400a074l234P200j326o011N561K777o909J692O060n673k600P192k090o173N987
$$ y = [3590, -4124, -996, 4703, -2377, -3452, 4418, 221, -4949, 2775, 2896, -4845, 214, 4601, -3256, -2555, 4765, -816, -4382, 3421, 1976, -4701, 1113, 4090, -3574, -1564, 4843, -1307, -3802, 3916, 1697, -4661, 1686, 4070, -3850, -1339, 4863, -1864, -3948, 4031, 856, -5133, 2369, 3470, -4890, -757, 4871, -3159, -3109, 5342, -238, -4820, 3655, 2412, -5266, 918, 4309, -3861, -1507, 5198, -1228, -3418, 4078, 914, -4462, 2101, 3133, -3729, -219, 4244, -2526, -3121, 3533, -300, -4420, 2326, 2508, -4082, 176, 3997, -3046, -2506, 4479, -480, -3842, 3867, 2273, -4430, 1622, 3749, -4292, -1191, 4813, -2277, -3365, 4738, 234, -4777, 2881, 2629, -4749, 380, 4512, -3104, -2042, 4472, -1074, -4308, 2892, 1566, -4445, 1116, 3893, -3016, -1324, 4736, -937, -3537, 3655, 1565, -4608, 1379]
1415A379K173p923K690O175o834j528Q238l495n577P708M84p882M768M441p791
1430b974P19O922n544l256P404j802o222N648K364o688K041N454n262j881O206
1445C129j999m889M927J688n919K036M800n011j543O236k593m320N649R15o280
1460c174L227L947o369j63N994m265l535O535r32n735N081K614o419K069N260
1475D135n246j299O141k774m469N443P25o043L150L784n626p6N782l633l464N907
1491B437m32n936M343K868o256J082N554m922k313O402j703n180N546J647o225
1506c088K599M663n653r19O025l239m074N881J72o156L849L576o152L27N952m262
1522d99k985O315j196n540M757K322o296J984M738n163j093N906k804l728N327
$$ y = [1379, 3552, -4371, -1681, 4494, -2340, -3868, 4370, 875, -4702, 3006, 3490, -4392, 376, 4817, -2974, -2255, 4667, -877, -4133, 3271, 1469, -4753, 895, 3259, -3429, -1388, 4066, -1196, -3077, 3129, 1130, -3759, 1168, 2856, -3063, -1027, 3773, -1238, -2781, 3455, 862, -3458, 2191, 3106, -3174, 53, 4000, -2369, -2532, 3462, -803, -4338, 2197, 1265, -4470, 611, 3225, -3194, -1125, 4135, -1111, -2410, 3731, 957, -3512, 1931, 2656, -3387, -237, 3547, -2079, -2155, 3627, -6, -3470, 2437, 2005, -3931, 412, 3280, -2976, -1894, 3660, -1262, -3575, 2827, 1124, -4056, 1490, 3137, -3088, -489, 4174, -1479, -2398, 3627, 388, -3686, 2195, 2367, -3789, 60, 3636, -2516, -2189, 3763, -499, -3484, 2831, 1635, -3905, 852, 3174, -3122, -1138, 3600, -1563, -2656, 3250, 446, -3282, 2045]
1537B045J23n133L214K821m940L90M302l117k126L978l71l540K388K079l542L3
1553a396L518k217k180L637J36l936K494K715m574L57M717l694k250N259j461
1568A125m744M772J287n882K901L903n783K92N644l991k617O032j730m574M887
1583A522J303n566K424L598m771o69M942k642l095M404L71m424K283L064m218
1598a474p04M782k490l408M818L17n210L203L583n678M67N851m298k862O596j682
1614A811n633N443J567o778K914M442o039m52O045l775l346N863m31n005L864
1629D90K225m825R41M059l355j945M151o57l490K937J788l677L95L521k782j896
1645b120M035o10l871L118J707m712J223L877l915j307N128j972l565M537O28
$$ y = [2045, 2168, -2965, 249, 3070, -1870, -1480, 2822, -295, -2421, 1557, 1186, -2354, 34, 2113, -1429, -1396, 2122, -95, -2275, 1362, 1498, -2438, 56, 2771, -1803, -1446, 3271, -423, -2673, 2586, 1125, -3619, 1153, 2440, -3442, -541, 3362, -2421, -2129, 3515, -476, -3093, 2939, 1209, -3365, 1522, 2825, -2741, -317, 3281, -1490, -2159, 2783, 141, -2954, 1450, 1821, -2603, -320, 2744, -1474, -2178, 2604, 114, -3294, 1524, 1841, -3369, -166, 3417, -2261, -1794, 4057, -241, -3103, 3493, 1811, -3822, 1621, 3188, -3590, -676, 3766, -2273, -2725, 3320, -455, -3801, 2062, 1631, -3374, 490, 2715, -2110, -1169, 2890, -465, -2410, 1741, 1084, -2406, 531, 2319, -1358, -963, 2558, -224, -2120, 1915, 1305, -2566, 552, 2259, -2453, -1230, 2647, -1268, -2575, 2553, 581, -2984, 1553, 2181]
1660B181m817K617K990m689K12M461l272k330M655r71m143L439J941m416J179
1675i63L913l500j693M603j298l751L532J410m479J499L568m001j046M725k251
1690B68l275M672L47m812L004K908n247L43M920l663k303N226j050m544M076J620
1706B490n112J774L880m188q00M676k166l226M083L20m380K410K716l983N3L884
1722B431k706k073L925m84l518K865J803l843P86L188l016j397L885j201k957
1737b312L214R62l661J380K752l344n92L703j757k218L224%l299J830J969l278
1753a427O6L220k046j751L337m53l145K413J598l496P84L083k617j295L552j142
1769F81l007K919J126l535J412K904l225p64L635j859k641L645J52l684K337K174
$$ y = [2181, -2636, -19, 2971, -1718, -1506, 2955, -317, -2647, 2008, 1037, -3106, 333, 2274, -2142, -963, 2950, -550, -2243, 2360, 1062, -2689, 843, 2253, -2226, -727, 2841, -1160, -2206, 2519, 268, -3007, 1665, 2012, -2800, 204, 3112, -2135, -1792, 3128, -535, -2838, 2388, 1338, -3206, 870, 2490, -2622, -848, 3032, -1156, -1956, 2720, 554, -2672, 1411, 1731, -2649, -239, 2477, -1506, -1453, 2431, -275, -2348, 1577, 1093, -2425, 440, 2243, -1600, -814, 2374, -642, -2039, 1846, 645, -2312, 902, 1864, -1797, -417, 2335, -1009, -1601, 2102, 345, -1873, 1351, 1351, -1948, -118, 1851, -1427, -1361, 1859, -187, -1938, 1399, 946, -2199, 214, 1812, -1684, -900, 2183, -434, -1729, 1823, 681, -2326, 593, 1719, -1816, -404, 2500, -725, -1489, 2146, 287, -2354, 1291, 1443, -2241, 96, 2270]
1785B270m066L22L729k773j824M170p27l394L080J343m152J390K968l405n89L837
1801B179j897k695L567K16l753K463K184l511L46L259k425j793L360o06l096K553
1817C51J457l493R86K763k749j027L253r65k627K756Q89l440J371K474l002n30
1833a533L372j589k175L146J49l243J877K125l334J72L312k587j587L516q71l022
1849b272K738J094l455J188K570k710o23L173j361k166K745K91k804J450K030
1864A888k813o4K844j566k023K955L3l060J836J859l078p0L167k186j766L469
1880A425n93l066K790J262l648J139K810l084p39L632j736k279L213K87l378K056
1896I1J991l233K53K944k254j535L049n07k709K085J292k821M50K580j973j212
$$ y = [2270, -1796, -1474, 2255, -518, -2342, 1828, 1101, -2293, 787, 2130, -2022, -632, 2336, -1069, -1658, 2179, 282, -2413, 1154, 1370, -2383, 80, 2264, -1247, -901, 2358, -67, -1860, 1500, 894, -2202, 351, 1808, -1685, -699, 2064, -685, -1712, 1541, 576, -2051, 705, 1594, -1846, -475, 1999, -1003, -1533, 1839, 250, -1925, 1221, 1370, -1873, 4, 2129, -1205, -1033, 2279, -308, -1895, 1621, 750, -2272, 466, 1560, -1895, -707, 1863, -847, -1470, 1703, 342, -1824, 921, 1212, -1592, -142, 1888, -925, -989, 1855, 289, -1734, 1221, 1254, -1806, 30, 1889, -1189, -1259, 1908, -278, -2044, 1425, 832, -2234, 556, 1818, -1830, -691, 2119, -965, -1704, 1928, 192, -2087, 1126, 1413, -1965, 91, 2082, -1151, -898, 2046, -208, -1743, 1306, 799, -1910, 175, 1467, -1354, -904, 1676, -297, -1509]
1912a509K979n40k712K179J260l283Q09K705k608r56L339j316k558L135N03l206
1928a779J930K063l206J02K898k383j475L148p73k579K597Q81k834Q62K333k369
1944e84l92K584j085j987K286M62k789J090J725k422k78K691j340j774K669K69
1960A125k728J882J714l005K44K575k078j477L003o69k521K367J003k873J183
1975b55K215k559k08K549j401j833K364ok705J331J588k299J30K392j470j321
1991a488K555n6k045J465J423k533K74K036j960j053K339o24j988K108P85k516
2007a278R00J990k104o31K480r58j937K054K20k439J236J730k197l1K733j543
2023B25j373K517k14k411J721J204k769M77K221k416q88K664r20j782K344N30
$$ y = [-1509, 1470, 930, -1782, 397, 1657, -1626, -817, 1888, -720, -1676, 1663, 347, -2211, 924, 1427, -1779, 151, 2214, -992, -890, 2008, -375, -1850, 1298, 525, -2054, 543, 1424, -1410, -548, 1785, -584, -976, 1608, 523, -1464, 822, 1284, -1505, -415, 1310, -1112, -1390, 1301, -39, -1813, 856, 1125, -1603, 279, 1993, -1012, -768, 1807, -271, -1748, 1255, 586, -1935, 432, 1435, -1438, -255, 1960, -599, -807, 1742, 341, -1492, 872, 866, -1839, -508, 1080, -1219, -1089, 1303, -167, -1488, 1067, 1011, -1034, 431, 1854, -679, -405, 1631, -329, -1382, 957, 333, -1655, 453, 1238, -1278, -378, 1612, -492, -1123, 1357, 399, -1538, 516, 736, -1703, -467, 1263, -934, -965, 1768, 225, -1148, 1369, 1155, -1256, 465, 1669, -1100, -623, 1598, -818, -1706, 958, 38, -1744, 600, 1130]
2039A130k428J246J560k186l0K095j391j298K296l59k132J430J160k152M06K122
2055A469j461j019K033m81j877J656P85k258N75K057j958q50K475q29j925K434
2071H26N14k578J446J526k593J44K223j708j142K358p35j877J758P49k079R45
2087b23J468j672m01J824p61j199J488K30j643Q01J164j425m70J647l98j442J560
2104E48M63j951P62J465j881l23K086j212j557K350p8k206J598J245k488N77K226
2121A624j890q09K397r73j698K081K88k273J245J407k092o3K006j269j034J830
2137G77j32j872J264R44j733m5J772j195r25J880k08j713J483P99j980M96J758
2154A370j690n42K082q79j598J873L53k172J099J491j994k00J889j212r46J797
$$ y = [1130, -1298, -52, 1508, -678, -708, 1387, -4, -1302, 994, 635, -1497, -67, 1093, -1059, -653, 1469, 8, -1011, 1022, 541, -1336, 320, 1105, -1153, -578, 1479, -479, -1329, 1146, 317, -1608, 826, 1340, -1238, 208, 1734, -859, -715, 1508, -200, -1342, 1016, 281, -1596, 162, 911, -1168, -223, 1245, -427, -828, 996, 235, -964, 524, 754, -889, -88, 1076, -349, -819, 828, 430, -1012, 548, 1011, -940, -178, 1287, -594, -917, 1169, -43, -1600, 750, 672, -1534, 64, 1309, -1179, -602, 1624, -266, -1075, 1322, 349, -1349, 732, 1020, -1253, -8, 1399, -693, -756, 1250, -19, -1053, 777, 645, -1227, 37, 981, -752, -797, 975, -220, -1145, 735, 527, -1186, 297, 1096, -884, -388, 1370, -320, -862, 1220, 341, -1257, 616, 969, -1203, -104, 1387, -607, -807, 1082, -130, -1076, 721]
2170G21j50j715J287P20j626L51J483j310n98J677n18j334J367M76j592M92J299
2187A030j467l34J695p83j302J654J55j658J050J019j581P8J579j170q04J633
2203G94k08j594J209O27j652L39J404j374m06J633n41j175J314L45j673O79J272
2220I93j407l20J732p55j228J617J25j671R92J110j740K5J676j273j039J955k53
2237E39j808J413P24j865N32J555j553m36J963q23j282J625K81j797J010J059
2253A137j594j48J644j002j010J672k44j513J204N04j454M39J209j099m72J435
2269G08m65j079J100M72j368N09J099j285l37J444o85j009J286L07j445N97Q99
2286G48j319P7J451j085p10J459k40j286J066N64j438M41J233j171m92J573p33
$$ y = [721, 571, -1144, 143, 863, -763, -412, 1071, -239, -837, 840, 322, -1012, 355, 831, -761, -269, 1030, -437, -771, 924, 141, -1161, 493, 648, -1010, 40, 1059, -522, -444, 1135, -35, -839, 794, 586, -1008, 201, 828, -824, -485, 919, -455, -861, 772, 231, -944, 370, 715, -958, -279, 993, -414, -734, 998, 243, -985, 632, 757, -914, 78, 1188, -552, -527, 1149, -124, -1163, 792, 539, -1269, 144, 868, -997, -465, 1090, -463, -899, 1064, 241, -1041, 584, 865, -932, 78, 1137, -457, -605, 1039, 37, -973, 699, 455, -1058, 146, 650, -804, -365, 844, -255, -727, 708, 243, -836, 264, 736, -632, -123, 976, -309, -646, 798, 113, -896, 390, 697, -748, -151, 748, -571, -494, 957, -128, -838, 621, 381, -905, 161, 725, -713, -272, 961, -210, -702, 871, 138]
2303A38j080J332J70j366P14R05j282n7J203p79p56J338m5j253Q82O84j161RJ179
2322G75o98q35J358r8j329J021M95j326L63J174j277l37J460m68j334J407K94
2339F45j596P06J235j519j75J708j090o80J321j33j361J101O42j471M21J074r70
2356a42m26J226m97q24J034J42j074M64R10j155j99J061n01p77J001J52j056O06
2374e5P13j083j08J182o81n84J034M5j213R14N32j317M23J023j008m23J517p16
2392A95r55J127O7j302P72O92j144J25J076p39n36J110j57j033Q69N17j206K97
2410b25R25q45l86R80j20j067R06M31j181K63J004r80k75J297o05q44J075J34
2428D87j297P49Q43j205r3J230o85p54J218j04j082P52M65j005K01J017q83n11
$$ y = [138, -942, 390, 560, -806, -92, 813, -469, -526, 677, -102, -858, 480, 435, -818, 64, 748, -413, -404, 775, 77, -758, 600, 502, -827, 194, 689, -637, -274, 900, -377, -714, 746, 278, -1056, 351, 645, -951, -245, 990, -529, -704, 1004, -86, -766, 555, 422, -939, 162, 804, -667, -246, 828, -142, -568, 658, 161, -663, 371, 513, -561, -97, 813, -342, -541, 520, 19, -758, 243, 395, -661, -55, 658, -425, -533, 649, -32, -616, 418, 463, -750, 164, 696, -621, -198, 825, -183, -606, 911, 195, -760, 367, 434, -868, -96, 596, -548, -423, 653, -86, -622, 488, 331, -702, 167, 684, -522, -225, 700, -145, -531, 449, 329, -738, 168, 599, -582, -319, 685, -295, -570, 727, 122, -722, 353, 487, -810, -61, 782, -423, -516, 714, 29, -725, 493, 389, -693, 59, 524, -481, -280, 737, -146, -657]
2446f57J106l33p94Q99L72j016K73R56j073j81R73m13p30J008L7j022M42O83j024
2465d94k5J073n68p08J103Q4j242R42M11j102M28Q99r97l08J131l34q97R16K40
2484E52j161N30O57r18oR29n65o62R82Qr16N91M91r28J82Q11n87n68J095k10r01
2505e94Q31L70j158L56P75q76l50J285n37q46J027M3q33M89N63q27j16Q97m58
2524D1o70J102j53q46O20N18r20q1J019p55l97R75j93r21P46M10j040L97O95p46
2544a99k69R60l19n55O52J18q41M37N26p06p2O94l89o22Q18N8q31N70N11q46m2
2565c47Q47o18m38R39j47p75P00L35j015L66P51q21k13Q90m58m90P96kq19M99
2585b0M48p87J98O09m80l84Q01k34p22P81J69q14L36N70o41k00P47k36n57N35
$$ y = [-657, 449, 116, -678, 221, 593, -423, -150, 806, -267, -448, 525, 112, -618, 390, 427, -595, -153, 530, -494, -519, 554, -14, -722, 381, 465, -777, 165, 576, -526, -98, 801, -196, -504, 627, 293, -604, 312, 552, -609, -79, 578, -340, -346, 583, 18, -644, 338, 346, -570, 21, 512, -416, -234, 577, -10, -578, 517, 307, -594, 237, 607, -551, -195, 580, -296, -646, 639, 102, -744, 283, 326, -507, -18, 545, -282, -398, 499, 41, -629, 473, 320, -526, 94, 612, -308, -389, 630, -125, -522, 453, 260, -661, 85, 495, -545, -148, 547, -199, -468, 492, 173, -382, 270, 388, -453, -16, 510, -196, -268, 426, 37, -585, 233, 291, -540, 30, 541, -305, -347, 500, -118, -556, 383, 236, -539, 161, 496, -519, -153, 598, -223, -436, 454, -4, -494, 302, 300, -519, -20, 428, -359, -161, 448, -32, -416, 385, 151, -571, 210, 379, -435, -99, 471, -170, -370, 377, 141, -416, 119]
2605A19K58q61M80M33n36k76R33m89l51O77o0p93L92M82q25J72P52o02l73Q03
2625C35j91p19O56L66q02J66O23o33q4O77k86n17N90J62p11L78N17o91j03O66
2645C99k67n23N72Q1p08M23M77o49j56P02l61l34O83j02n93M93K84p45K86M63
2665D25o04k09O66k45n08N66O8m64L37L31n40J32N14m36l56N53lo34M44K31o38
2686c70J76N79n67j22P07l33n39O29J81q12L47O34p55J3P54n56m38R12j88o24
2706c72O82J69p69K29N72n80l15O69l82l34N06J66o26K08M13m08nN28j69n48N87
2727B21Q4o85L59N12p33j24P18l20m33O57J04n91J66M79o07p5P21n19m47P45q9
2748A43m79L57K74o39J89N20n63m1N37j34m65L56J53m91L30K03o07J25N00l32
$$ y = [119, 377, -484, -4, 429, -107, -383, 550, 61, -290, 387, 327, -466, -74, 408, -417, -245, 507, -95, -468, 335, 144, -575, 81, 447, -355, -189, 434, -199, -283, 394, 108, -409, 181, 343, -368, 10, 527, -164, -267, 399, 132, -391, 181, 262, -446, -23, 454, -195, -351, 351, -10, -344, 339, 237, -356, 137, 421, -324, -38, 425, -179, -388, 278, 33, -475, 91, 159, -305, 32, 363, -177, -45, 469, 33, -323, 230, 227, -407, 37, 268, -370, -194, 385, -182, -304, 403, 70, -469, 160, 341, -471, -124, 510, -245, -232, 522, -34, -472, 440, 252, -372, 310, 479, -290, -61, 511, -69, -384, 285, -97, -431, 75, 241, -385, -177, 236, -172, -177, 351, 182, -366, 221, 305, -380, -21, 491, -242, -366, 352, 32, -401, 256, 360, -231, -65, 414, -193, -268, 453, -66, -513, 232, 143, -336, 21, 295, -344, -155, 365, -198, -239, 298, 164, -301, 55, 208, -283, 47, 250, -357, -232, 268, -64]
2768f4k48M58Q8m24L21K43n84J31M26l05l86N53q4m98M71K19p10K18M65m62k21
2789c93P59l35m62P07j51o85N52L27n81J58N64m98l12O57j04n94M56K90o04K42
2809gL99n60j18O54l93l71N09Q2n38L27L10n43L3M89k59l50N63Pm73J72K88l64
2831a43jN18l65l87M64R2l76L35K64p42J73N44m08k01N35j58m71N43n2m84K07
2852a13L91m05m6N31l12l56M68p2l88L97J83n05K62K76l69o9K34n3k70K88R4k92
2874a26K1M06m82o4N01l09l42N28Ql96J40L43l95j2O38m26k99N48p7m64L60J14
$$ y = [-64, -312, 146, 234, -190, 131, 374, -210, -79, 347, 42, -344, 209, 125, -373, 98, 317, -393, -175, 290, -172, -393, 366, 31, -431, 276, 125, -560, -8, 319, -262, -104, 460, -38, -350, 307, 203, -391, 65, 355, -249, -7, 392, -168, -286, 368, -25, -396, 113, 195, -343, -16, 294, -249, -216, 273, 14, -336, 227, 234, -239, -67, 221, -143, -144, 374, 9, -378, 86, 178, -198, 137, 401, -341, -168, 376, -32, -233, 302, 144, -327, 216, 164, -320, -113, 278, -127, -173, 358, 46, -310, 158, 86, -302, 95, 278, -227, 35, 311, -58, -127, 107, 54, -216, 72, 166, -126, -105, 301, -181, -245, 256, -53, -395, 133, 141, -255, -115, 228, -167, -179, 459, 33, -266, 282, 205, -259, 101, 215]
$$ [...]
8191C0
##END NTUPLES=NMR FID
##END=
