##TITLE=1H_2PBDP-1
 CDCl3
 8 sc, 
 13.4.2023
##JCAMPDX= 6.0         $$ Bruker NMR JCAMP-DX V2.0
##DATA TYPE= NMR FID
##DATA CLASS= NTUPLES
##ORIGIN= UXNMR, Bruker Analytische Messtechnik GmbH
##OWNER= root
$$ XWIN-NMR		Version 3.5
$$ Thu Apr 13 14:08:40 2023 Russian Standard Time (UT+4h)  she@DPX200
##.OBSERVE FREQUENCY= 200.13135
##.OBSERVE NUCLEUS= ^1H
##.DELAY= (6, 6)
##.ACQUISITION MODE= SIMULTANEOUS
##.ACQUISITION SCHEME= undefined
##.AVERAGES= 8
##.DIGITISER RES= 18
##SPECTROMETER/DATA SYSTEM= spect
##.PULSE SEQUENCE= zg30
##.SOLVENT NAME= DMSO
##.SHIFT REFERENCE= (INTERNAL, DMSO, 0, 15.7039)
##AUDIT TRAIL= $$ (NUMBER, WHEN, WHO, WHERE, WHAT)
$$ ##TITLE= Audit trail, XWIN-NMR		Version 3.5
$$ ##JCAMPDX= 5.01
$$ ##ORIGIN= Bruker BioSpin GmbH
$$ ##OWNER= she
$$ F:/spectra/data/she/nmr/H-F/1/audita.txt
$$ ##AUDIT TRAIL=  $$ (NUMBER, WHEN, WHO, WHERE, WHAT)
(   1,<2023-04-13 14:07:43.28 +0400>,<she>,<DPX200>,
      <created by zg, POWCHK disabled, PULCHK disabled
       configuration hash MD5:
       00 E9 B6 7A A2 85 ED C7 34 08 36 98 17 FE 4E 26
       data hash MD5: 16K
       DD 64 4F 88 CB 7B D1 F6 18 BF 5D 3F 0B EC 51 3D>)
$$ ##END=
$$ 
$$ hash MD5
$$ 98 52 D6 7A CA 69 D1 B8 BB FC 5D 00 F7 EB 22 F8
##$RELAX= 
##$RELAX= 
##$RELAX= 
##$RELAX= 
##$RELAX= 
##$RELAX= 
$$ Bruker specific parameters
$$ --------------------------
##$DU= <F:/spectra>
##$EXPNO= 1
##$NAME= <H-F>
##$PROCNO= 1
##$TYPE= <nmr>
##$USER= <she>
##$AMP= (0..31)
100 100 100 100 100 100 100 100 100 100 100 100 100 100 100 100 100 100 
100 100 100 100 100 100 100 100 100 100 100 100 100 100 
##$AQSEQ= 0
##$AQ_mod= 1
##$AUNM= <au_zg>
##$AUTOPOS= <>
##$BF1= 200.13
##$BF2= 200.13
##$BF3= 200.13
##$BF4= 200.13
##$BF5= 200.13
##$BF6= 200.13
##$BF7= 200.13
##$BF8= 200.13
##$BYTORDA= 1
##$CFDGTYP= 0
##$CFRGTYP= 5
##$CHEMSTR= <none>
##$CNST= (0..31)
1 1 145 1 1 1 1 1 1 1 1 1 1 1 1 1 1 1 1 1 1 1 1 1 1 1 1 1 1 1 1 1 
##$CPDPRG= <>
##$CPDPRG1= <>
##$CPDPRG2= <>
##$CPDPRG3= <>
##$CPDPRG4= <mlev>
##$CPDPRG5= <mlev>
##$CPDPRG6= <mlev>
##$CPDPRG7= <mlev>
##$CPDPRG8= <mlev>
##$CPDPRGB= <>
##$CPDPRGT= <>
##$D= (0..31)
0 1.2 0 0 0 0 0 0 0 0.06 0 0.03 0 0 0 0 0.0002 0 0 0 0 0 0 0 0 0 0 0 0 
0 0 0 
##$DATE= 1681380462
##$DBL= (0..7)
120 120 120 120 120 120 120 120 
##$DBP= (0..7)
150 150 150 150 150 150 150 150 
##$DBP07= 0
##$DBPNAM0= <>
##$DBPNAM1= <>
##$DBPNAM2= <>
##$DBPNAM3= <>
##$DBPNAM4= <>
##$DBPNAM5= <>
##$DBPNAM6= <>
##$DBPNAM7= <>
##$DBPOAL= (0..7)
0.5 0.5 0.5 0.5 0.5 0.5 0.5 0.5 
##$DBPOFFS= (0..7)
0 0 0 0 0 0 0 0 
##$DE= 6
##$DECBNUC= <off>
##$DECIM= 32
##$DECNUC= <off>
##$DECSTAT= 4
##$DIGMOD= 1
##$DIGTYP= 9
##$DL= (0..7)
0 120 120 120 120 120 120 120 
##$DP= (0..7)
150 150 150 150 150 150 150 150 
##$DP07= 0
##$DPNAME0= <>
##$DPNAME1= <>
##$DPNAME2= <>
##$DPNAME3= <>
##$DPNAME4= <>
##$DPNAME5= <>
##$DPNAME6= <>
##$DPNAME7= <>
##$DPOAL= (0..7)
0.5 0.5 0.5 0.5 0.5 0.5 0.5 0.5 
##$DPOFFS= (0..7)
0 0 0 0 0 0 0 0 
##$DQDMODE= 0
##$DR= 18
##$DS= 0
##$DSLIST= <SSSSSSSSSSSSSSS>
$$ [...]
##$SUBNAM2= <"">
##$SUBNAM3= <"">
##$SUBNAM4= <"">
##$SUBNAM5= <"">
##$SUBNAM6= <"">
##$SUBNAM7= <"">
##$SUBNAM8= <"">
##$SUBNAM9= <"">
##$SW= 18.05172834244
##$SWIBOX= (0..15)
0 0 2 0 0 0 0 0 0 0 0 0 0 0 0 0 
##$SW_h= 3612.71676300578
##$TD= 16384
##$TD0= 1
##$TE= 0
##$TE2= 300
##$TE3= 300
##$TEG= 300
##$TL= (0..7)
0 120 120 120 120 120 120 120 
##$TP= (0..7)
150 150 150 150 150 150 150 150 
##$TP07= 0
##$TPNAME0= <>
##$TPNAME1= <>
##$TPNAME2= <>
##$TPNAME3= <>
##$TPNAME4= <>
##$TPNAME5= <>
##$TPNAME6= <>
##$TPNAME7= <>
##$TPOAL= (0..7)
0.5 0.5 0.5 0.5 0.5 0.5 0.5 0.5 
##$TPOFFS= (0..7)
0 0 0 0 0 0 0 0 
##$TUNHIN= 0
##$TUNHOUT= 0
##$TUNXOUT= 0
##$USERA1= <user>
##$USERA2= <user>
##$USERA3= <user>
##$USERA4= <user>
##$USERA5= <user>
##$V9= 5
##$VALIST= <valist>
##$VCLIST= <CCCCCCCCCCCCCCC>
##$VD= 0
##$VDLIST= <DDDDDDDDDDDDDDD>
##$VPLIST= <PPPPPPPPPPPPPPP>
##$VTLIST= <TTTTTTTTTTTTTTT>
##$WBST= 1024
##$WBSW= 4
##$XGAIN= (0..3)
0 0 0 0 
##$XL= 0
##$YL= 0
##$YMAX_a= 509045
##$YMIN_a= -605980
##$ZGOPTNS= <>
##$ZL1= 120
##$ZL2= 120
##$ZL3= 120
##$ZL4= 120
##$ABSF1= 10
##$ABSF2= 0
##$ABSG= 5
##$ABSL= 3
##$ALPHA= 0
##$AQORDER= 0
##$ASSFAC= 0
##$ASSFACI= 0
##$ASSFACX= 0
##$ASSWID= 0
##$AUNMP= <proc_1d>
##$AZFE= 0.1
##$AZFW= 0.1
##$BCFW= 1
##$BC_mod= 2
##$BYTORDP= 1
##$COROFFS= 0
##$CY= 11.3945322036743
##$DATMOD= 1
##$DC= 2
##$DFILT= <>
##$DTYPP= 0
##$F1P= 2.36226072786647
##$F2P= -0.459571619588291
##$FCOR= 0.5
##$FTSIZE= 0
##$FT_mod= 4
##$GAMMA= 1
##$GB= 0.15
##$INTBC= 1
##$INTSCL= 1
##$ISEN= 128
##$LB= 0.24
##$LEV0= 0
##$LPBIN= 0
##$MAXI= 10000
##$MC2= 0
##$MEAN= 0
##$ME_mod= 0
##$MI= 1.114404
##$NCOEF= 0
##$NC_proc= 0
##$NLEV= 6
##$NOISF1= 3.799351
##$NOISF2= 2.8
##$NSP= 1
##$NTH_PI= 0
##$NZP= 0
##$OFFSET= 15.70392
##$PC= 1
##$PHC0= -19630.08
##$PHC1= 10.60081
##$PH_mod= 1
##$PKNL= yes
##$PPARMOD= 0
##$PSCAL= 0
##$PSIGN= 0
##$REVERSE= no
##$SF= 200.130013532006
##$SI= 16384
##$SIGF1= 3
##$SIGF2= 2
##$SINO= 400
##$SIOLD= 16384
##$SREGLST= <1H.CDCl3>
##$SSB= 0
##$STSI= 0
##$STSR= 0
##$SW_p= 3612.71676300578
##$SYMM= 0
##$S_DEV= 0
##$TDeff= 0
##$TDoff= 0
##$TI= <>
##$TILT= no
##$TM1= 0
##$TM2= 0
##$TOPLEV= 0
##$USERP1= <user>
##$USERP2= <user>
##$USERP3= <user>
##$USERP4= <user>
##$USERP5= <user>
##$WDW= 1
##$XDIM= 8192
##$YMAX_p= 0
##$YMIN_p= 0
$$ End of Bruker specific parameters
$$ ---------------------------------
##NTUPLES= NMR FID
##VAR_NAME=  TIME,          FID/REAL,        FID/IMAG
##SYMBOL=    X,             R,               I
##VAR_TYPE=  INDEPENDENT,   DEPENDENT,       DEPENDENT
##VAR_FORM=  AFFN,          ASDF,            ASDF
##VAR_DIM=   8192,          8192,            8192
##UNITS=     SECONDS,       ARBITRARY UNITS, ARBITRARY UNITS
##FACTOR=    0.0002768,     1,               1
##FIRST=     0,             0,               0
##LAST=      2.2672688,     0,               0
##MIN=       0,             -605980,         0
##MAX=       2.2672688,     509045,          0
$$ Real data points
##PAGE= N=1
##DATA TABLE= (X++(R..R)), XYDATA
0 0 0 0 0 0 0 0 0 -8 8 -8 8 -16 16 -24 32 -37 48 -56 70 -80 96 -120 142 -168 192 -224 264 -304 351 -403
30 -403 460 -525 597 -675 762 -857 962 -1081 1208 -1345 1496 -1664 1846 -2044 2260 -2496
46 -2496 2754 -3038 3349 -3688 4062 -4474 4931 -5442 6014 -6659 7389 -8230 9209 -10361
60 -10361 11742 -13436 15569 -18345 22125 -27597 36250 -52032 90067 -374796 -208854 260731
72 260731 -599591 -144605 455188 -130339 -199115 509045 138357 -146823 356968 285618
82 285618 -145173 145207 209566 -149259 -80447 127155 -81623 -126756 81380 57329 -114720
93 -114720 -14169 80610 -98859 -158292 34088 -58918 -236289 -44177 13129 -212125 -59923
104 -59923 139394 -47772 12305 268484 109957 44221 263780 137790 -23897 147994
114 147994 75494 -126587 -2266 -10261 -206119 -107762 -38232 -186164 -104630 22534 -85617
125 -85617 -45872 96452 4106 -21082 120308 56522 -41353 83853 88353 -62195 11284
136 11284 112605 -34079 -59780 108271 32945 -105005 52444 95812 -104905 -35473 115052
147 115052 -75019 -134293 71020 -31888 -191098 22829 62925 -147113 -346 160647
157 160647 -62386 -48834 193511 32773 -97660 158628 115267 -139111 39574 138729
167 138729 -152762 -99362 132769 -86420 -170885 118922 31117 -176565 66813 123749 -138134
178 -138134 -4908 171619 -66136 -75191 149079 -6353 -130374 83350 50401 -125000
188 -125000 24599 93566 -80576 -27155 95468 -31139 -62324 67071 13625 -67340 28343
199 28343 38125 -56798 -12281 42323 -28992 -26465 47937 8052 -27349 36650 23522 -34609
211 -34609 13639 27538 -38439 -7566 30147 -37077 -26086 34692 -27017 -41294 41246 -2223
223 -2223 -48720 44912 32841 -51960 29722 62340 -48161 -3318 78972 -31113 -45092 74129
235 74129 -458 -79817 45525 36106 -94062 -2808 67690 -74322 -52433 83234 -22469
246 -22469 -86854 70919 43662 -91515 31513 96895 -65359 -24096 116383 -15516 -74501
257 -74501 92616 36530 -105586 32311 75840 -100453 -37504 92642 -58164 -90795 83764
268 83764 7372 -110768 48623 68398 -95366 303 106928 -51016 -47280 106991 -63
279 -63 -82112 75130 48629 -88175 28149 80663 -71132 -24804 85274 -39975 -67902
290 -67902 65549 -3056 -89073 31129 30230 -84152 -3780 56644 -50976 -22651 74421 -5135
302 -5135 -33451 66951 26909 -43164 39111 43863 -45663 3155 45916 -41955 -32174 39391
314 39391 -25427 -51771 33344 3830 -55117 21717 30142 -51818 -563 47942 -36369 -21259
326 -21259 60299 -8734 -39932 56680 21871 -52527 37960 51768 -54294 1180 66430 -44668
338 -44668 -43833 63070 -17941 -77842 43619 22962 -84968 13135 62196 -65631 -24639 83406
350 83406 -24036 -57190 76607 23148 -76881 41594 64218 -69358 -5329 86011 -38934
361 -38934 -52050 77575 3236 -81500 42454 41353 -85038 -5410 65686 -58892 -45730
372 -45730 71431 -12950 -66124 58040 35306 -65639 25483 64879 -48892 -14281 70287
383 70287 -20736 -46908 52693 9773 -60546 22750 35144 -52512 -8170 47661 -29116 -31941
395 -31941 44754 -1721 -46009 27897 21728 -46640 6664 40302 -33689 -13342 48501 -14211
407 -14211 -30282 45516 7185 -41081 32482 24664 -45869 12401 36100 -44336 -10142 42887
419 42887 -33496 -28724 46287 -14102 -43312 40880 8998 -50240 28620 35040 -44993 7794
431 7794 50610 -33329 -20811 49805 -13626 -42911 37717 13090 -49415 16827 36021 -42262
443 -42262 -10274 48910 -19042 -31884 48218 9732 -49308 24920 33004 -52345 -6929 49960
455 49960 -34598 -36197 52594 -3171 -54104 38760 29404 -55993 13545 54046 -42184 -17374
467 -17374 59502 -21586 -45853 49200 8116 -56566 30082 36651 -51187 2464 51971 -32955
479 -32955 -24137 49988 -9217 -41782 33099 12257 -45790 9021 25364 -35438 -10667 31714
491 31714 -12480 -19689 27425 8942 -21515 12852 22515 -14787 -4538 25428 -3004 -19688
503 -19688 17480 8859 -28743 3560 20333 -27981 -10024 29983 -19314 -23123 34271 -7350
515 -7350 -35247 34253 9359 -43019 29164 28139 -47857 14953 44334 -46141 -4615 57118
527 57118 -34012 -25956 59784 -16678 -46377 50321 4439 -57220 32834 25144 -57096 8816
539 8816 39739 -43801 -14270 45241 -19544 -30417 38313 9224 -34268 19491 31053 -27033
551 -27033 -7491 38725 -8041 -30808 30793 15481 -45073 7988 36412 -41543 -18979 49011
563 49011 -22990 -43240 47258 5063 -54875 33512 32059 -53719 10299 49707 -39122 -13008
575 -13008 53474 -18013 -31743 42257 3790 -38718 22708 20144 -33384 631 26657 -18563
587 -18563 -16634 22551 -536 -26009 8821 16116 -22968 -7129 26404 -10752 -22225 26951
599 26951 7508 -29683 19545 25497 -29228 4482 35428 -23520 -14136 35183 -13636 -28846
611 -28846 28965 159 -35795 18415 13292 -34964 7031 25340 -26252 -3773 33090 -14509
623 -14509 -16912 31134 -2142 -29178 22566 14471 -32488 8728 28642 -28250 -10487 36411
635 36411 -13755 -26166 35909 5186 -38700 22541 21972 -42728 2963 36004 -34351 -17158
647 -17158 43212 -15113 -32666 39420 7591 -40261 24765 28203 -36716 2934 37148 -25753
659 -25753 -20224 33981 -7119 -33304 22569 14000 -33485 4758 29489 -21506 -13595 33707 -2838
672 -2838 -28637 23836 16150 -33737 5083 30059 -26717 -15116 34496 -10014 -29139 29129
684 29129 10013 -32992 15721 24107 -29515 -2536 28121 -19593 -16555 26573 -4633 -22807
696 -22807 18420 7412 -23058 7849 17100 -14796 -257 19985 -7239 -10396 14109 -1365
708 -1365 -15642 8138 6517 -14775 2151 11807 -12569 -5951 14873 -5747 -10452 17486 3391
721 3391 -16583 10965 9229 -21795 2363 18604 -17509 -6316 25210 -10209 -18578 24270 1330
734 1330 -26731 19292 17140 -28935 5991 26942 -27197 -12636 32086 -13653 -25352 31760
746 31760 4793 -34628 19358 21128 -34143 2840 34260 -22965 -15572 35011 -8044 -31300
758 -31300 25076 10412 -34187 10692 26799 -26420 -8076 31626 -11924 -22749 27485 7700
770 7700 -28406 12868 20957 -26523 -6253 26963 -13846 -19880 25107 3077 -26971 13868 16900
783 16900 -25122 164 25766 -15010 -13050 24660 -3682 -22652 16604 8456 -23002 7168
795 7168 17710 -17645 -3665 19747 -9839 -11250 18533 -249 -14893 12253 5610 -17161 4150
808 4150 10408 -14047 -1528 14353 -8570 -7709 14108 -2758 -12421 12445 5343 -14408 7255
821 7255 11718 -15459 -2157 16041 -11165 -10405 19038 -1839 -18312 14956 8040 -22639 6644
834 6644 19344 -19618 -5154 25512 -11454 -18292 24059 1566 -26349 16278 16340 -26796 2178
847 2178 26018 -19986 -13753 28169 -5187 -24696 21875 10997 -29110 6827 23581 -23077
859 -23077 -9786 28956 -8591 -23136 23686 8446 -28852 10569 22700 -24119 -5326 29344
871 29344 -12224 -19884 25588 2569 -27290 15081 16097 -25851 853 23069 -17458 -11987 23129
884 23129 -4973 -18923 16767 6649 -19835 6931 14203 -15052 -2678 16582 -7056 -9563
896 -9563 14231 1242 -12778 8553 7471 -12630 1752 11122 -9854 -4848 12043 -5709 -9885
909 -9885 11507 -167 -13127 9188 5891 -14691 5090 11782 -14097 -1381 15914 -10318 -8151
922 -8151 17591 -3856 -14370 15620 4357 -17758 9876 12490 -17394 902 18102 -12708
934 -12708 -9592 18372 -3897 -17777 13368 7231 -19964 3474 16207 -15128 -7890 19958 -4051
947 -4051 -16487 16317 8514 -20550 5706 18059 -17029 -7268 22301 -7116 -18201 19002 5697
960 5697 -23441 9534 17997 -20217 -3290 23872 -11128 -16170 20995 1072 -23445 11651 12816
973 12816 -22191 -317 19734 -14146 -10644 20725 -2322 -16032 16103 8144 -17708 6517
985 6517 13801 -15072 -3243 15564 -8762 -10317 13108 -937 -12582 8928 5959 -11180 3448
998 3448 9451 -8212 -2070 9349 -5319 -6889 7644 -1569 -9405 6052 3663 -9725 3535
1011 3535 8879 -8464 -480 12812 -5545 -6147 13644 -1969 -12917 10888 3806 -16660 6542
1024 6542 10742 -16951 -308 16857 -12641 -7816 19487 -5082 -15412 16334 4186 -18975
1036 -18975 8509 12322 -17187 -1568 16558 -9282 -9748 15414 1384 -14015 8275 10475 -12639
1049 -12639 -2292 14806 -6133 -12018 12991 3622 -17513 5452 12783 -16442 -4463 18564
1061 18564 -8670 -13209 18501 1748 -18455 12528 11540 -18221 3189 17644 -13234 -6902 17453
1074 17453 -5538 -14008 13085 3579 -15802 5439 10287 -12202 -2660 13036 -5580 -8958 10615
1087 10615 1448 -11659 5995 7186 -11009 380 10393 -8013 -3740 12241 -3425 -7039 11865
1100 11865 425 -10218 9095 3798 -12471 4966 6768 -12824 531 9466 -10980 -4065 11232
1113 11232 -6907 -7244 12145 -658 -9205 9533 4618 -10424 4137 8728 -8115 -1644 10816
1126 10816 -3425 -7643 8410 2613 -10879 3240 9175 -9759 -4203 12581 -5043 -12467 11277
1139 11277 2817 -17015 6498 12371 -15938 -2034 17981 -10205 -11061 18793 45 -15891 14025
1152 14025 9780 -16837 4031 14860 -12610 -5541 15305 -4546 -11833 10377 2719 -13870 2676
1165 2676 8582 -9916 -4290 10804 -2986 -9486 8271 4263 -11150 2834 10325 -8130 -3295
1178 -3295 12674 -2811 -8803 10619 2722 -11328 6673 7870 -10939 688 10075 -8799 -4675
1191 -4675 10329 -4801 -8185 8815 -512 -9856 6137 3459 -9589 3169 6476 -8178 237
1204 237 8572 -5500 -2684 9501 -2512 -5879 8806 1352 -8160 6016 5234 -9310 1089 8163
1218 8163 -7798 -4432 9262 -3676 -8847 8051 2328 -10918 4233 8049 -10002 -1630 11545
1231 11545 -5665 -7821 11536 924 -11810 7540 8017 -12209 801 12915 -8230 -6452 13581
1244 13581 -1602 -12134 9645 5454 -13950 2645 10689 -11115 -4898 12781 -4708 -10271 10516
1257 10516 2835 -12115 5323 9200 -9724 -1127 11513 -4766 -7289 9646 1191 -9964 5030
1270 5030 6449 -9007 -752 8908 -5431 -5840 8355 -240 -8236 5690 4580 -8420 1036 7329
1284 7329 -6521 -3235 8143 -2573 -5924 6943 1195 -7245 4260 4004 -6919 1675 6080 -5550
1298 -5550 -1345 6676 -3825 -4225 6202 -1630 -6041 5362 1627 -6783 3361 4315 -6616 562
1312 562 6925 -4718 -2508 7972 -1937 -6043 6787 1678 -8575 3535 5669 -8365 -1117 8707
1326 8707 -5367 -6075 8913 -338 -9571 6605 5563 -9976 1738 9877 -7662 -4231 11042
1339 11042 -2633 -9113 8934 3521 -10921 4018 8492 -9521 -2669 10568 -4680 -7649 9545
1352 9545 1699 -10362 4718 6762 -9705 -1433 9342 -5456 -6341 9362 387 -9313 5849
1365 5849 5480 -9002 1472 9510 -5657 -3335 9561 -2100 -7767 6504 1747 -8973 2755
1378 2755 5129 -7391 -1047 6445 -4362 -3821 6360 -339 -4511 4996 2487 -4996 1722 3394
1392 3394 -4458 -1019 4186 -2264 -2729 4074 66 -3920 2895 2418 -3928 1545 4174 -3737 -1084
1407 -1084 4906 -3421 -4272 4849 -1514 -6349 4754 2293 -7360 2927 6042 -6621 -159 8894
1421 8894 -3966 -3846 8969 -782 -7714 6248 2680 -9323 2210 6374 -7633 -2057 8557
1434 8557 -3733 -6191 7632 1369 -8205 4272 5981 -7764 -1594 7925 -4717 -6500 7298
1447 7298 782 -8519 4878 6588 -7451 651 9794 -4577 -4427 9591 -445 -8459 6199 3259
1461 3259 -10309 795 6425 -8202 -3552 8284 -3184 -6288 7401 1980 -7178 4242 5443
1474 5443 -6239 174 6889 -3916 -3397 6128 -986 -5277 4770 2489 -5139 2488 4327 -4537
1488 -4537 -688 4669 -3170 -3300 3572 -1969 -4947 2344 217 -4702 1635 2485 -3454 939 4631
1503 4631 -1843 -249 5112 -640 -2451 4338 970 -4233 2223 2520 -4884 -361 4149 -3817 -3016
1518 -3016 4733 -1282 -5357 3821 1834 -6234 1537 4611 -5484 -1554 6593 -2447 -4286 6629
1532 6629 1546 -6118 4331 5268 -5916 -19 7191 -3867 -4376 6667 -354 -7461 3918 3719
1546 3719 -8006 -7 6643 -5773 -4253 7767 -1414 -7549 6222 3280 -8295 2724 7210
1559 7210 -6506 -1346 8786 -3415 -4999 7817 518 -7084 4712 3392 -7333 626 5166
1572 5166 -5192 -2685 5116 -1992 -4371 3830 1496 -4120 1599 3299 -3016 -734 3691 -1297 -2698
1587 -2698 2756 480 -3577 1685 2430 -3112 500 3687 -2369 -1015 4232 -1360 -2645 3724 -713
1602 -713 -4425 2704 738 -5118 1710 2708 -4830 670 4813 -3205 -1000 5381 -1858 -3089 4718
1617 4718 207 -4693 2646 2111 -4992 -5 3982 -3010 -2088 4616 50 -3586 3294 2894 -4336 103
1633 103 4412 -3612 -3424 4853 -1001 -6154 3712 2794 -6492 1469 6529 -4619 -1781 7949 -1563
1648 -1563 -5213 6313 1523 -7087 3078 4206 -6629 -816 5789 -4237 -3737 5676 -312 -5043
1662 -5043 3889 3004 -5094 578 4281 -3573 -2480 4396 -1034 -4085 3430 1984 -4121 1565 4108
1677 4108 -3175 -525 4921 -1330 -2611 3851 -88 -4418 1849 1059 -4484 369 2320 -3566 -709
1692 -709 3281 -2091 -1310 3686 -628 -1821 3564 814 -2649 2413 1537 -3371 862 2712 -2810 -538
1708 -538 3588 -1873 -2565 3146 -182 -3901 2038 1757 -4231 -1 3387 -3270 -2311 4034 -855 -3703
1724 -3703 3863 2411 -3997 1812 4453 -3488 -1391 5351 -1283 -3984 4359 1271 -5501 1630 3503
1739 3503 -5207 -1525 4973 -2616 -3926 4798 456 -5562 2798 3627 -4975 28 5653 -2780 -2770 5489
1755 5489 149 -4696 3510 2800 -4976 665 4502 -3653 -2425 4530 -1469 -4447 3321 1348 -4566
1770 -4566 1545 3344 -3618 -900 3945 -1854 -2455 3612 313 -3084 2376 1850 -3085 711 2680
1785 2680 -2358 -677 2908 -1178 -1708 2204 -545 -2703 1455 465 -2485 1048 1641 -2150 254 2231
1801 2231 -1693 -753 2801 -566 -1631 2673 424 -2604 1388 1409 -3028 158 2915 -2175 -1512 3161
1817 3161 -873 -3194 2664 1270 -3681 1288 3204 -3117 -1012 4132 -1799 -3152 3808 650 -4133
1832 -4133 2399 3065 -4118 -131 4305 -2573 -2434 4485 -256 -4138 2805 2117 -4263 370 3837 -2899
1848 -2899 -1913 4197 -498 -3648 2799 1780 -3989 612 3612 -2804 -1681 3838 -889 -3419 3018
1863 3018 1250 -3837 1377 2973 -3263 -634 3772 -1567 -2215 3334 17 -2972 2098 1365 -2960
1878 -2960 687 1980 -2275 -561 2108 -1414 -1323 1867 -491 -1560 1487 497 -1385 999 1114 -1217
1894 -1217 339 1585 -898 -304 1700 -616 -1230 1431 71 -1889 957 1026 -2236 -62 2024 -1969
1910 -1969 -1443 2610 -840 -2667 2471 1013 -3247 1493 2663 -2966 -197 3874 -1733 -1899 3907
1925 3907 49 -3265 2605 1769 -3790 378 2945 -2859 -1926 3390 -954 -3561 2395 1356 -3801
1940 -3801 640 3232 -2591 -1386 3951 -690 -3131 3075 1594 -3649 1428 3378 -3032 -858 3904
1955 3904 -1713 -2895 3293 349 -3704 1780 1833 -3442 -200 2596 -2132 -1398 2788 -446 -2156 2019
1971 2019 1086 -1992 972 1726 -1403 -198 1878 -686 -1087 1381 -75 -1630 616 529 -1308 80
1987 80 987 -1251 -350 1149 -548 -714 1244 -241 -1165 1252 456 -1239 1030 1208 -1461 260 1825
2004 1825 -1394 -770 2006 -765 -1926 1689 236 -2619 805 1512 -2511 -241 2678 -1380 -1603 2905
2020 2905 33 -2673 2173 1771 -2917 579 3094 -2418 -1411 3187 -823 -2832 2741 1254 -3192
2035 -3192 1065 2508 -2893 -1090 3162 -1308 -2469 2594 469 -3244 1113 2225 -2699 -478 3230
2050 3230 -1244 -1966 2981 440 -2915 1566 1784 -2702 56 2518 -1822 -1404 2350 -509 -2193 1836
2066 1836 904 -2148 674 1592 -1628 -516 1509 -777 -1121 1281 32 -1355 756 660 -1084 74
2082 74 1113 -618 -233 1045 -116 -604 882 -58 -1038 785 505 -1028 482 789 -1269 -59 1305
2099 1305 -1009 -734 1506 -678 -1465 1349 89 -1931 1090 1044 -1948 338 1889 -1359 -652 2236
2115 2236 -414 -1552 1719 827 -2204 652 1621 -1829 -771 2016 -681 -1971 1569 634 -2507 457
2131 457 1952 -2021 -839 2554 -821 -2200 2261 706 -2730 1192 2306 -2368 -230 3043 -1478
2146 -1478 -1619 2774 -15 -2473 1692 1001 -2726 360 1882 -2029 -924 2071 -700 -1646 1532 480
2162 480 -1649 781 1409 -1249 -282 1539 -484 -986 1269 204 -1296 559 832 -1034 53 753
2178 753 -911 -509 874 -486 -809 898 -210 -947 732 360 -968 642 672 -804 465 987 -798
2195 -798 16 1244 -649 -670 1179 -217 -1311 825 311 -1554 235 1092 -1166 -483 1382 -481 -1198
2212 -1198 1355 398 -1511 681 1409 -1308 -275 1958 -606 -1358 1768 438 -2088 930 1523 -2158
2228 -2158 -500 1968 -1461 -1645 2122 -71 -2354 1471 1346 -2323 266 2304 -1590 -982 2377 -314
2244 -314 -1858 1865 876 -2170 606 1619 -1604 -602 1903 -773 -1573 1395 278 -1807 636 1184
2260 1184 -1701 -282 1490 -663 -930 1482 179 -1161 924 946 -1096 347 1164 -762 -241 985
2276 985 -430 -768 688 -200 -1127 451 180 -977 340 477 -731 79 709 -505 -295 900 -349
2293 -349 -583 887 134 -876 703 516 -940 286 903 -811 -275 1144 -457 -1045 1016 136 -1359
2310 -1359 289 827 -1386 -275 1428 -717 -1037 1469 222 -1574 1091 1194 -1635 37 1699 -1125
2326 -1125 -1047 1720 -202 -1881 1110 793 -1845 226 1605 -1450 -834 1973 -362 -1479 1541 605
2342 605 -1722 600 1420 -1409 -557 1472 -638 -1177 1390 402 -1459 691 1061 -1314 -227 1355
2358 1355 -816 -983 1256 -49 -1361 725 605 -1203 183 1128 -757 -278 1257 -131 -487 820
2374 820 60 -736 501 192 -767 114 300 -688 -79 404 -495 -164 497 -287 -212 631 -7 -501 493 253
2394 253 -578 104 404 -595 -210 664 -324 -629 626 214 -909 559 756 -975 -5 1223 -780 -833
2412 -833 1182 -224 -1368 873 608 -1460 398 1323 -1071 -358 1720 -394 -1121 1486 348 -1559
2428 -1559 545 1092 -1433 -284 1349 -811 -1057 1288 125 -1415 842 1139 -1109 -151 1430 -687
2444 -687 -892 1280 -57 -1339 697 807 -1394 62 1247 -728 -599 1255 -103 -995 875 413
2460 413 -1136 192 846 -802 -297 776 -457 -602 615 38 -624 464 349 -512 44 623 -261 -184
2478 -184 530 -91 -372 333 -12 -503 243 170 -431 220 422 -510 -12 617 -514 -258 811 -546 -670
2497 -670 596 165 -916 495 542 -957 202 1000 -708 -369 1175 -281 -937 1007 382 -1241 350
2514 350 844 -1143 -454 1198 -398 -976 1046 129 -1335 664 944 -1116 -97 1327 -704 -912 1213
2531 1213 72 -1272 721 778 -1298 -2 1268 -846 -741 1228 -42 -1203 830 691 -1161 141
2547 141 1028 -908 -431 1275 -243 -829 791 389 -854 363 743 -830 -127 827 -346 -536 565
2564 565 30 -693 310 375 -545 19 397 -274 -175 528 -42 -370 366 133 -311 199 111 -208 90 254 -323
2585 -323 -82 274 -317 -290 387 -121 -399 305 163 -554 213 427 -738 33 701 -521 -364 996 -257
2604 -257 -732 791 306 -876 489 725 -934 -168 977 -622 -737 855 -41 -1147 577 553 -1078
2621 -1078 -28 1126 -542 -565 1138 116 -1069 750 723 -1174 9 1042 -763 -753 1093 -223
2637 -223 -1028 867 589 -1185 383 1033 -905 -409 1107 -372 -806 731 -30 -1014 384 520 -794
2654 -794 -17 803 -242 -305 667 83 -433 195 286 -375 -160 185 -221 -303 285 -22 -333 142 315 -143 76
2675 76 422 -227 -33 315 -205 -118 232 -256 -332 227 -175 -292 327 71 -327 381 289 -441 121 386 -427
2696 -427 -196 649 -409 -565 511 103 -673 518 553 -637 131 912 -462 -423 865 -133 -859 468
2714 468 404 -1018 -70 787 -723 -404 908 54 -752 875 494 -1010 338 942 -764 -341 1084 -340
2732 -340 -967 836 192 -1007 443 790 -805 -150 918 -452 -663 790 104 -921 280 449 -813
2749 -813 -189 677 -384 -509 580 18 -620 425 462 -484 81 580 -258 -178 440 -105 -458 205 38 -351
2769 -351 192 229 -259 34 279 -223 -68 218 -189 -131 209 -168 -349 174 -36 -266 194 131 -373 178 322
2790 322 -171 -116 527 -93 -220 516 173 -474 318 218 -601 -34 577 -330 -418 683 -166 -649 499 334
2810 334 -809 85 700 -648 -365 840 -234 -734 665 282 -886 455 648 -768 -158 923 -472
2827 -472 -691 793 149 -837 398 631 -885 -109 717 -490 -479 776 62 -747 424 444 -769 2
2845 2 671 -345 -354 641 -64 -685 296 331 -673 6 448 -328 -291 312 -95 -403 345 155 -441 82 361
2866 361 -307 -94 271 -205 -75 245 -66 -129 193 -64 -63 255 44 -233 97 84 -141 10 93 -268 -105 209
2888 209 -356 -189 386 -111 -314 330 130 -409 81 485 -360 -234 606 -57 -597 337 293 -692 190 600
2908 600 -576 -320 739 -298 -633 671 223 -723 498 650 -723 -18 697 -435 -494 847 168 -620
2926 -620 363 531 -559 -120 694 -337 -476 462 -25 -701 234 405 -678 -72 507 -283 -391 480 77
2945 77 -671 328 370 -469 52 457 -285 -337 593 -50 -409 328 257 -397 210 306 -356 -140 252 -209 -131 215
2967 215 -129 -176 153 57 -58 180 153 -70 127 165 -162 5 178 -222 -13 159 -200 -135 264 1 -353 121
2989 121 162 -343 144 324 -297 -77 419 -172 -364 487 53 -600 150 414 -351 -70 654 -353 -454 578
3009 578 98 -588 326 450 -663 0 490 -314 -439 647 -3 -589 404 436 -643 -1 614 -337 -395 617
3029 617 -15 -615 370 254 -720 -5 600 -495 -382 645 -131 -635 360 314 -598 218 515 -365 -156 581
3049 581 -74 -436 391 88 -464 110 405 -307 20 254 -109 -283 296 -113 -311 177 34 -177 -31 133
3069 133 -205 -63 61 -70 73 95 -16 29 118 -34 -126 100 72 -152 102 190 -246 1 262 -242 -140 363
3091 363 -158 -287 272 131 -487 198 347 -498 -51 570 -298 -298 602 -58 -668 273 301 -592 122 602 -348
3112 -348 -224 590 -180 -491 380 255 -538 87 521 -351 -196 571 -137 -561 416 370 -508 130 618 -360
3132 -360 -281 460 -118 -447 380 348 -562 73 429 -364 -257 490 -88 -428 350 180 -459 114 444 -399 -149
3153 -149 410 -115 -322 277 17 -284 140 157 -187 -6 161 -44 -39 179 -45 -198 207 -22 -163 55 57 -146
3175 -146 129 45 -102 233 185 -232 66 319 -260 -62 307 -112 -333 329 -30 -366 217 315 -400 18 390
3196 390 -291 -210 450 -7 -364 321 237 -410 81 418 -327 -133 404 -175 -380 304 199 -574 147 469 -481
3217 -481 -271 502 -224 -480 431 226 -547 210 394 -397 -157 555 -209 -407 471 143 -556 99 316 -367
3237 -367 -54 419 -121 -335 383 132 -411 101 423 -363 -141 342 -95 -217 226 194 -268 104 244 -215
3257 -215 -75 193 -176 24 190 59 -100 141 6 -204 37 32 -94 -6 -64 -201 31 -12 -199 104 226 -217
3279 -217 -171 175 -46 -105 260 18 -285 207 163 -297 -10 329 -250 -149 452 6 -336 204 87 -450 151
3300 151 420 -391 -180 508 -276 -369 247 258 -482 136 436 -396 -196 565 -150 -462 349 158 -548 288 370
3321 370 -393 -169 590 -167 -352 485 72 -430 204 347 -536 -92 329 -222 -378 342 183 -434 260 240
3341 240 -287 64 417 -200 -115 318 50 -245 206 207 -329 -12 306 -197 -187 289 13 -205 88 65 -195 72
3363 72 180 -115 -49 143 -113 -52 163 -146 89 88 -71 -158 188 22 -47 258 -32 -282 138 144 -190 22 154
3386 154 -238 -124 224 -165 -100 237 143 -360 125 240 -271 -135 350 -165 -413 350 139 -360 199 309 -344
3407 -344 -107 470 -168 -449 456 4 -378 182 299 -458 -158 590 -270 -281 455 105 -404 208 322 -471
3427 -471 20 448 -212 -331 469 45 -462 271 286 -346 54 287 -153 -245 355 -28 -370 242 107 -333 -19
3448 -19 254 -101 -75 229 15 -126 190 64 -215 125 64 -140 53 73 -37 -18 37 -99 -173 -22 -39 -21 63
3471 63 -40 -132 132 -2 -16 214 40 -35 -23 114 -47 -3 130 -101 -273 147 -27 -294 27 142 -312 -148
3493 -148 340 -60 -389 254 153 -463 158 332 -332 -74 506 -144 -247 324 72 -473 279 298 -451 45
3513 45 452 -295 -284 338 12 -422 309 315 -423 -31 436 -221 -249 334 54 -428 289 283 -410 -8 318 -233
3535 -233 -251 432 -16 -319 165 128 -183 134 237 -202 -13 286 -107 -161 241 97 -257 33 125 -120 -124 117
3557 117 -139 -24 122 56 -52 53 -37 -128 66 -25 -23 92 95 -187 134 131 -90 57 164 -154 -105 288 -41 -159
3581 -159 205 -59 -216 111 219 -219 -37 195 -214 -124 259 30 -295 345 167 -286 18 408 -123 -200 384
3602 384 15 -361 165 190 -379 -51 339 -319 -248 357 32 -431 251 266 -283 -84 345 -259 -164 300 -30
3623 -30 -390 326 245 -474 16 383 -229 -248 408 0 -307 266 83 -299 62 295 -204 -250 247 -31 -202
3644 -202 228 4 -201 142 62 -149 -33 61 -104 -197 149 -86 -133 18 13 -141 11 -37 28 4 64 -16 107 51
3668 51 -177 -29 47 -61 -54 145 35 -43 180 92 -224 159 30 -196 -35 250 -111 -226 267 -98 -370 179
3690 179 25 -332 94 181 -145 -192 291 -85 -395 227 153 -261 25 265 -285 -165 311 -36 -301 268 262 -347
3712 -347 -25 236 -214 -183 392 -67 -353 177 177 -381 56 314 -314 -145 411 -50 -239 211 137 -376 50
3733 50 207 -299 -156 277 -124 -181 237 45 -102 14 162 -127 21 196 -27 -101 71 -14 -43 51 77 -133
3755 -133 27 108 24 -44 -3 -53 -26 -3 -27 -41 -21 -113 -101 109 -9 -72 87 -41 -171 148 72 -99 37 119 -97
3780 -97 9 147 0 -171 87 -11 -326 132 210 -140 -45 275 -67 -214 226 145 -275 186 367 -189 -222 305
3802 305 -97 -318 167 155 -355 158 373 -369 -100 336 -6 -316 314 122 -409 207 298 -335 -210 353 -157
3823 -157 -258 230 23 -399 121 274 -260 -30 288 -107 -114 172 14 -227 147 92 -141 20 240 -48 -112
3844 -112 205 -60 -219 52 45 -138 14 174 -69 -150 113 50 13 150 56 27 4 -6 -81 127 -44 -48 82 61
3868 61 -140 128 -3 -128 -45 97 -125 -91 77 -166 -179 117 126 -18 67 166 -192 -95 264 -134 -129 237 106 -316
3892 -316 77 289 -252 -233 239 -183 -271 243 39 -320 147 71 -311 -102 324 -235 -265 351 20 -387 148
3913 148 259 -305 -23 363 -274 -267 227 -56 -300 88 140 -271 -159 199 -164 -137 238 123 -261 172 150 -215
3935 -215 38 311 -170 -142 182 118 -150 109 134 -193 -18 136 -12 -113 120 10 -150 172 -55 -39 18 -3
3957 -3 -12 -26 7 13 34 53 -23 -8 87 -30 68 14 -107 14 136 -16 -121 106 -50 -160 46 125 -295 9 118
3982 118 -91 -256 230 103 -306 125 219 -264 -23 388 -73 -201 388 59 -294 209 190 -243 67 345 -159
4003 -159 -178 254 31 -316 139 138 -362 2 294 -106 -155 281 -102 -271 218 204 -312 -137 148 -173 -146 312
4025 312 67 -190 7 167 -197 -76 263 -176 -179 178 65 -321 -17 62 -226 -14 79 -107 -97 103 -42 -9
4047 -9 54 96 -50 23 53 -97 -59 74 -69 -87 14 9 -25 -123 -8 -15 92 -108 -58 45 -112 -12 97 33 -192
4072 -192 21 25 -96 -36 197 -75 -122 242 -58 -259 159 108 -138 7 253 -142 -196 190 -166 -221 109 103 -223
4095 -223 3 294 -132 -218 268 -40 -243 153 176 -325 -3 267 -220 -135 314 -67 -258 181 134 -363 -55
4116 -55 71 -164 -131 184 -15 -324 75 75 -147 0 255 -185 -71 249 -83 -213 82 168 -174 32 73 -70
4138 -70 -123 28 -108 -94 37 50 -61 45 3 -31 -12 29 -21 1 0 23 -56 -13 -70 13 63 -6 -74 20 10 -22 65 5
4166 5 -152 -49 98 -58 -10 117 -44 -152 56 -37 -223 13 129 -56 68 177 -168 -171 257 -50 -239 145
4188 145 143 -212 126 132 -187 -74 195 -96 -302 197 66 -258 25 216 -173 -46 231 -72 -255 218 119 -333
4210 -333 76 292 -149 -69 373 -78 -255 166 61 -212 74 274 -214 -141 162 -28 -133 147 81 -152 55
4231 55 124 -103 -97 250 -109 -255 84 -27 -50 6 142 -90 -131 7 -22 36 86 -6 19 -5 33 -2 -42 -93 -32 -54
4257 -54 -21 -22 10 36 -87 43 -79 -37 77 62 -90 -113 74 -60 -118 178 107 -142 -58 180 -117 -44 192 -67
4281 -67 -122 154 138 -236 1 163 -163 -88 304 -33 -205 252 70 -216 86 171 -149 -35 156 61 -103 243
4303 243 45 -293 134 167 -154 -101 275 -18 -205 271 13 -242 50 253 -202 -83 191 -111 -111 147 61 -236
4325 -236 59 148 -51 -62 212 -89 -172 78 121 -117 84 164 -127 -91 109 -7 -114 -16 -57 -80 -112 66 -8 -31
4349 -31 149 57 6 -10 135 -3 -30 -3 4 17 -6 -11 -34 -33 -9 68 -90 -33 68 22 -140 1 187 -174 -5 114
4375 114 -50 -128 126 51 -269 82 228 -182 43 236 -35 -78 151 70 -332 88 182 -250 -97 227 -129 -264
4397 -264 258 63 -322 55 169 -224 -67 267 -191 -145 173 100 -249 123 133 -206 -86 181 -148 -69 225
4418 225 63 -184 -73 63 -162 -48 253 -63 -210 128 51 -118 -98 24 -154 -145 90 -74 -241 126 -47
4439 -47 -79 6 111 -41 12 73 -13 -74 39 -43 34 4 10 -70 93 -15 14 2 23 -8 -7 48 -62 46 -54 -38 39
4466 39 37 -127 46 -5 -107 -90 100 11 -138 60 57 -110 -77 124 -132 -126 173 12 -174 148 172 -170 86 172
4490 172 -98 -112 200 108 -213 126 42 -206 13 223 -119 -53 232 -24 -245 99 105 -185 109 251 -115 -103
4512 -103 152 10 -281 102 93 -221 -127 105 -73 -104 185 -36 -90 148 41 -128 36 142 -106 -50 144 -81
4534 -81 -41 153 143 -96 -30 119 -127 -43 188 3 29 55 -25 -84 -62 -49 -5 -106 -2 2 -5 -131 21 4 15 -79
4560 -79 -1 -45 -40 47 124 -62 -37 83 37 -79 122 127 -22 -26 171 -21 -192 64 -193 -187 53 119 -222 -6 142
4585 142 -85 -87 153 -14 -133 201 77 -201 -6 233 -143 -193 263 -15 -238 86 153 -129 83 256 -177
4606 -177 11 136 -81 -261 45 158 -232 -58 145 -109 -95 145 81 -146 155 60 -194 -4 188 -51 -106
4627 -106 74 -73 -82 53 24 -157 -20 106 -14 -22 81 20 30 96 76 -12 -23 223 -46 -39 -49 29 -34 30 -26 107
4653 107 48 -61 -27 -20 -79 20 56 -26 -186 130 -73 -88 90 -68 -51 20 93 -131 47 104 8 -140 226 -27 -230
4678 -230 -55 113 -103 -45 152 -19 -222 100 57 -237 29 229 -136 -30 247 -58 -152 40 102 -257 85
4699 85 139 -214 -144 132 -84 -198 125 68 -191 36 96 -193 -54 83 -104 -146 162 118 -196 29 140 -116
4721 -116 -75 130 -65 -96 95 18 -138 -23 123 -88 -75 57 -2 -57 84 60 -72 18 67 -96 -39 -5 41 -52
4745 -52 -50 12 25 -35 -62 -80 65 -26 22 49 -169 -34 117 -22 -28 35 5 6 150 -21 -30 23 146 -109 -138 106 -52
4772 -52 -39 31 17 -72 10 147 -66 -121 140 35 -242 10 227 -198 -88 153 -149 -132 180 0 -208 13 211
4795 211 -127 45 147 -41 -160 179 -7 -153 21 150 -226 -36 231 -178 -134 59 116 -118 90 139 -111
4816 -111 -11 -9 -23 -89 -31 83 -84 -93 88 -98 -5 181 20 -56 7 -33 -8 7 69 -158 -23 14 -77 -90 46 4
4842 4 86 83 -36 -27 83 -107 -11 62 -30 7 -1 -43 -11 135 80 -30 75 73 -131 37 170 -156 -45 137 -3 -79
4868 -79 27 -57 -178 42 -5 -45 -90 88 -1 -116 179 68 -198 34 143 -55 -134 197 -16 -81 61 80 -163
4891 -163 -61 176 -26 -43 216 -65 -157 57 122 -172 -74 266 -55 -83 172 138 -103 108 124 -107 -74 173 -114
4914 -114 -146 182 73 -100 156 75 -112 -30 158 -4 -62 84 37 -135 57 131 -76 -55 30 89 -74 -26 30 69
4938 69 58 74 9 14 195 12 -58 79 61 -16 19 5 24 26 -6 108 34 -63 104 112 -28 -43 55 -17 -48 70 15 -115
4966 -115 30 87 -46 -92 138 -29 -149 57 21 -133 -43 106 -83 -59 82 -32 -145 -46 47 -105 49 150
4988 150 -160 -130 221 -88 -177 130 82 -218 -36 55 -186 -84 162 -18 -192 80 54 -211 44 33 -133 -53
5010 -53 201 -49 -178 76 118 -222 12 157 -136 -75 176 -1 -53 -6 42 -52 -28 120 -46 -140 -1 3 -50 -33
5034 -33 68 -30 53 76 132 29 32 34 3 38 -101 15 -1 34 86 -45 5 118 -31 -15 3 100 86 -19 -1 -48 10
5061 10 98 85 -47 -38 124 -9 -162 23 -20 -29 -51 147 -50 47 116 -30 -87 83 -59 -169 122 -11 -42 -55 215
5086 215 -100 -146 123 6 -108 34 23 -97 28 124 -44 -193 109 34 -41 28 118 -128 -68 50 -13 -63 39
5109 39 87 -131 3 172 -71 -94 119 -15 -109 74 6 -85 -13 75 -105 -64 92 -17 -94 146 -2 -34 41 18
5133 18 24 2 24 38 41 -36 15 -19 -88 -83 -62 32 -27 -23 -30 -117 56 -35 -66 -17 -6 84 -23 38 49 -32 48 78 -42 21 144
5164 144 -22 -37 96 117 -134 -54 141 -80 -29 93 -26 -135 -60 24 -138 22 68 -98 -84 52 61 -199 1
5187 1 49 -165 -126 60 -110 -1 130 54 -132 84 127 -97 -48 57 1 -34 30 -40 -180 -33 47 -85 -49 25 18
5212 18 -86 74 -17 -78 -41 69 -99 8 124 -4 -22 39 9 -23 74 42 -29 -96 169 107 -8 97 67 -21 13
5237 13 -22 10 33 17 -43 -48 108 37 -88 -85 74 -11 -13 35 -10 7 27 62 -50 21 -71 90 -25 9 128 -72 -145 -24
5265 -24 19 -98 -74 73 17 -147 112 37 16 -35 73 -113 -13 67 -8 -93 128 89 -109 -99 -11 -25 -79 75 -4
5290 -4 -157 89 148 -67 -45 120 -112 -149 188 37 -179 57 47 -188 11 122 -2 -9 97 -78 -163 152 48
5313 48 -94 -29 96 -26 21 57 79 -98 39 20 -48 -27 66 13 -41 -80 6 30 -106 40 -70 -119 89 -98 -52
5338 -52 39 71 10 -35 16 24 -44 6 104 38 -124 67 68 16 48 -21 -66 -33 9 -26 -9 105 121 23 -8 109 -31 24 162
5367 162 -76 -88 75 -26 -116 36 100 -20 -27 57 111 -169 46 149 -15 -62 67 -23 13 78 49 -61 128 141
5391 141 -49 11 77 -65 -105 100 -38 -165 43 89 -130 63 162 133 -25 -5 -17 -114 26 148 -56 -92 88
5414 88 14 -59 6 34 -49 139 12 32 -23 38 -66 -88 35 25 -8 -43 121 -9 -63 -4 15 33 63 -18 68 4 -41
5441 -41 -75 139 -14 31 -25 78 91 39 14 -29 137 -29 -31 139 -19 -1 -28 53 48 -50 73 8 -93 -9 -15 -163 15
5468 15 -26 -50 -2 72 24 -81 92 25 -155 -81 72 -32 -25 73 -34 -49 32 46 -61 -88 25 -1 -61 145 36 -50
5494 -50 49 34 -70 9 133 -119 -37 101 -38 -56 -59 90 -123 -48 42 -17 -101 17 31 -16 -17 6 -64 19 27 47 -88
5521 -88 -25 104 -55 -14 -52 3 -40 27 34 -49 -17 83 -45 -2 85 29 50 27 50 -20 57 -10 35 21 -35 29 -36 -146
5549 -146 5 11 -41 -52 -17 6 -133 -13 -124 -186 65 117 -51 34 25 -63 -79 -5 15 -93 13 48 -114 -134 106 -69
5575 -69 -31 148 96 -42 53 56 -22 10 129 -20 -36 69 39 -105 6 23 -98 93 119 -11 -74 124 52 -191 144
5600 144 16 -71 -31 103 -65 -92 89 -64 -84 105 -1 -76 63 98 -2 -31 -1 45 72 -77 26 1 -23 81
5624 81 -36 -68 -1 107 -20 -39 101 -9 -161 12 -76 -57 -181 21 16 4 -59 -59 -7 0 -21 -37 -71 1 -13 -28 -93
5651 -93 24 22 -49 -32 88 -61 -77 -2 -15 -13 103 -67 -116 0 114 -64 85 -74 -10 -17 -4 56 -92 -11 8 -69
5677 -69 -96 128 -123 -45 -12 -40 -163 154 34 -176 66 -32 -62 -54 87 -48 -27 111 -64 -128 -26 132 -58 39
5701 39 89 48 -103 -8 55 -29 11 24 -11 -37 58 61 -88 -8 92 -76 -60 56 -39 45 24 83 -118 -1 50 5 -76
5728 -76 63 54 -1 -72 22 -46 137 101 95 -32 -57 6 -76 3 -8 -8 9 -4 -1 -34 -4 -18 -65 8 -14 -126 -48 -57 28 -36 -40
5759 -40 -23 37 12 -43 50 -44 -32 22 37 -2 19 49 -113 16 -37 -129 -93 115 31 -27 37 -42 -216 77 68 -73 79
5786 79 41 -60 -86 -64 27 -60 -78 13 -100 5 60 10 -99 -16 -67 -33 51 15 2 -30 -29 -67 11 140 -25 -20 -39 3
5814 3 -70 45 -50 -35 -72 -19 16 -14 85 79 -46 -24 -4 -76 2 -25 82 -14 -16 15 12 -56 -85 30 74 -83 -36 -63 -1 31
5844 31 32 -50 12 -37 -26 -89 -37 -94 -34 69 157 32 -47 75 1 -65 57 58 -64 32 142 45 8 77 64 9 -23 97
5872 97 29 25 45 -14 -61 28 32 -73 34 78 -113 -32 25 -49 -73 -9 30 -54 -24 34 49 -22 31 -132 -29 115 132 17
5900 17 -58 45 -82 26 -66 26 -97 44 45 -115 60 86 31 -81 61 -26 40 89 73 29 70 -7 -2 -67 61 32
5926 32 -26 -11 1 31 8 -27 -61 28 11 16 86 -53 -68 32 -50 -2 39 73 -135 45 64 14 59 62 -4 24 62 14 -22
5955 -22 13 12 -54 -14 52 -25 -7 38 5 -46 37 -88 -47 -16 113 -82 -40 -7 -21 10 -14 75 -115 -52 -38 -35 -131 -17 -29
5984 -29 -90 -12 88 -27 39 73 -56 -65 -100 35 -74 8 74 134 13 56 20 18 -22 61 -53 13 -51 68 29 -28 67
6011 67 -21 15 57 -55 7 -80 -53 94 104 96 -19 49 -46 75 -75 -142 23 46 18 -38 -20 -23 44 94 -96 -27 -43 45
6039 45 15 -14 8 -50 -27 43 4 11 71 16 9 11 -16 -18 29 72 -86 -70 24 -10 -43 -4 49 -72 -5 192 98 -77 48 1
6069 1 -36 12 58 -9 74 2 36 -1 101 -63 -70 23 -45 -130 -72 -17 59 -38 50 40 -40 48 50 -49 -1 -8 17 -47 -7 -20 -116
6100 -116 31 69 -25 -42 39 37 -98 -32 31 -8 30 27 -50 -48 46 37 -116 -79 124 -66 -21 33 -52 37 17 53 65 18 76
6129 76 -10 62 -15 53 28 31 75 -26 -86 -51 -99 -72 -56 -39 -27 -96 -45 -19 -38 27 8 58 -37 6 -26 -109 66 21 35 49
6159 49 18 -45 -3 92 -18 -78 38 38 -81 23 -30 1 8 62 -4 -25 35 -16 -4 -51 205 22 4 44 -72 -28 -12 -38
6187 -38 -33 -39 12 -10 -49 13 54 -106 39 32 -73 0 79 -52 -117 8 61 -23 -66 46 -15 -97 28 27 -52 123 65 -16
6215 -16 83 -35 1 -1 -43 -36 22 42 -59 -49 -22 62 -30 -53 -165 -3 -48 25 82 91 -49 44 -103 -57 -108 39 -7 -36
6243 -36 75 -66 -19 67 56 46 -5 48 18 10 -86 31 -33 -73 1 24 -70 111 37 43 70 30 -19 -5 148 98 -43 58
6271 58 101 30 56 40 -131 63 104 -28 26 -27 16 -31 -35 56 -36 21 1 31 49 88 16 -46 61 56 141 -86 103 -11
6299 -11 -197 25 117 -26 -25 59 -103 -14 41 11 -36 3 37 33 35 30 63 -98 -68 -50 67 49 -8 -19 -29 -20 31 -66 62
6328 62 102 86 6 78 -76 25 -91 -16 -32 -70 28 -51 -10 39 7 32 72 29 -113 -99 50 -16 -81 4 59 -8 -62 18
6356 18 -22 47 54 35 0 -92 -54 30 -47 25 -13 -77 0 70 -86 -6 21 -6 -65 54 30 -42 -47 21 -65 48 38 -11 84 117
6386 117 -1 -24 4 46 -55 -47 30 60 86 -40 68 -83 3 132 -107 -153 11 -76 116 77 40 0 -34 27 30 -34
6412 -34 63 26 -14 -72 5 47 26 14 14 -19 -1 -109 -47 -72 -41 8 -32 -31 -48 -8 76 58 37 -69 36 72 68 -27 -3 -7 -14
6443 -14 -58 -15 -28 61 40 29 -54 -55 -108 58 -11 68 -35 -111 145 33 44 24 -4 -84 89 62 -34 54 44 -35 -56 74
6471 74 -47 23 44 111 -7 81 -43 31 -70 62 5 -46 12 70 -66 18 39 -66 -23 30 17 -85 -42 63 -2 -25
6497 -25 5 6 7 92 -30 -27 -80 -32 -3 -74 34 -37 43 -45 -34 -12 -90 15 -58 -76 -73 11 159 -99 40 -45 -8 42 -15
6526 -15 33 -13 -37 25 -21 -24 40 -51 30 57 -136 -10 -50 -110 -93 12 36 -23 10 -63 6 -63 86 -27 76 -1 59 -142
6554 -142 -26 34 15 16 44 -10 -41 -23 88 11 85 -68 71 9 31 -74 -24 30 63 23 3 35 -71 -43 121 14
6580 14 -37 19 87 -13 -26 50 -51 -176 -80 36 -34 -63 103 -9 -28 53 18 32 -76 47 -115 24 91 64 -127
6605 -127 36 53 -65 144 -49 -9 57 -34 -12 -13 49 -17 80 23 47 -21 -8 -83 -60 -9 -50 -41 -6 1 -59 -118 65 16 -27
6634 -27 -26 -33 6 44 -73 36 -81 91 -86 -23 41 57 49 11 70 25 -52 -46 -20 18 79 -96 38 22 -40 12 26 -91
6662 -91 -42 1 99 -30 80 43 -31 32 -31 -24 3 16 -77 -23 0 58 35 -90 50 -33 -4 106 75 -112 46 4 -27
6689 -27 -40 -52 4 4 -5 -43 -37 0 34 51 41 0 38 -35 -1 48 -46 28 -41 47 51 -33 70 -41 -116 27 34 -2 -18 78 -89
6720 -89 35 -31 -90 9 53 49 -80 60 75 -62 -40 69 -40 -8 -67 -1 24 46 -49 15 -94 25 -17 -59 83 1
6746 1 47 -22 -102 66 -17 3 -3 62 12 14 -6 22 89 144 -70 47 58 -22 -82 36 -31 27 157 -2 44 56 -19 -76 -22
6775 -22 66 2 -5 17 45 18 -33 -46 -56 3 -25 -59 -72 35 92 4 28 92 56 -58 -64 -35 -34 -49 -101 -98 68 20 19 9 44
6806 44 -28 28 51 48 -61 6 59 -38 4 75 73 -141 116 15 -37 -12 -74 21 -50 -13 -19 -80 33 -64 -66 -32 -37 72 34 44
6836 44 3 -59 -83 31 -20 3 -53 5 -92 -11 105 39 -17 -69 -39 -25 -77 43 -75 -48 60 -39 29 45 -26 -91 43
6863 43 65 -19 -7 30 -5 -116 19 119 -22 35 35 -11 -40 34 84 -20 46 5 44 -49 -27 -29 -53 62 14 -55 22 -23
6891 -23 27 -8 23 33 -64 -54 53 -54 -3 -28 -117 71 -29 46 56 -47 -22 65 -7 -34 27 -40 104 85 -30 -23 -83
6918 -83 28 1 10 19 -81 -4 45 -21 -100 -23 114 -19 -14 20 -25 29 -78 2 -27 -25 39 -48 11 -58 -3 43 57 -61 11
6947 11 12 4 -41 -44 -44 63 -64 85 -22 -56 -5 -12 -12 21 -57 79 43 44 54 -32 -8 -39 -32 -62 -70 -10 -125 4 -27 -183 43
6978 43 76 -16 -70 25 90 -61 -23 19 50 18 -35 85 -7 8 25 56 -49 -18 31 -91 -15 67 -67 6 14 -23 -10 53
7006 53 26 -11 86 -39 -104 25 32 -38 32 -19 -11 -117 -105 7 31 -9 43 30 -102 -57 94 -49 -177 -61 -47 -76 -12
7033 -12 17 -94 -42 70 -7 -27 -12 7 17 26 -13 -5 -30 -20 -23 -12 -4 -49 -30 -14 101 22 -93 53 27 -43 47 71 -35
7062 -35 3 75 29 -28 24 1 37 27 0 16 20 37 -6 -48 -42 -44 -44 -126 122 33 -60 22 -114 -7 -25 -20 -70 37 -79 85
7092 85 -9 35 75 17 114 27 36 10 -48 -30 -51 -3 -6 32 57 48 -25 98 -35 59 92 28 -25 84 32 9 -20 -46 74 40
7122 40 -42 -65 -36 -3 -77 80 58 63 -77 43 -101 -94 -58 -3 -45 -20 47 31 5 79 43 -92 38 -54 18 -57 50 41
7150 41 -47 -14 9 25 75 -81 63 10 -24 -69 -36 53 -29 -63 -68 -9 -88 -16 -82 78 -78 -40 -21 -84 -4 8 -103 -76
7178 -76 -73 -98 -93 97 -26 -43 34 -97 43 -8 -3 -54 -31 -30 -96 -46 -68 -2 56 -67 -13 -43 33 -26 -14 99 -62 19 -59
7207 -59 137 -83 -2 117 -62 107 -57 20 -67 -41 27 4 42 15 -31 87 40 27 -6 -23 -22 -26 90 -64 45 -34
7233 -34 2 78 1 10 36 34 60 -85 23 -104 49 -16 32 119 -97 -19 -18 -55 -29 -24 5 -38 1 -20 -44 -20 105 -34 -11
7262 -11 29 94 -9 -28 -31 42 -49 -28 63 2 0 -27 85 2 78 13 -30 94 30 -132 14 -81 37 -15 -64 97 5 -45
7290 -45 1 -20 -15 20 -89 -64 -13 32 -30 39 -68 12 90 36 73 59 70 21 7 3 -10 -31 74 -10 11 89 -26 54 -6
7319 -6 20 14 12 -21 28 -53 -10 32 -66 -31 -56 26 78 -91 -15 38 -12 -38 -19 -38 -82 19 -24 -121 -13 6 -4 -82 31 3
7349 3 -18 -8 31 -21 -24 12 5 24 24 -61 -11 -76 77 0 -3 57 30 -22 -69 87 -39 -50 93 -31 2 -64 14 64 -108 -12
7379 -12 -91 -47 23 -5 -53 136 38 -106 -80 -20 31 24 118 19 -53 50 76 -97 13 21 9 65 -26 98 -35 16 66 -32
7407 -32 -40 16 -180 29 -34 -18 36 82 -30 -4 -64 -59 -36 -42 14 142 53 -36 79 23 -102 51 81 53 34 15 15 -49 -15
7436 -15 16 5 52 -28 -13 -94 -34 -8 -74 -57 14 -82 115 4 88 76 -50 -12 19 2 -36 25 -2 50 -19 -58 -31 -71 -13
7465 -13 55 -32 -50 -40 -19 9 20 19 -4 79 -35 0 -40 -60 -13 21 -82 -32 72 5 -50 -91 53 25 9 91 9 36 40
7494 40 29 11 53 133 101 -60 -150 -20 -118 21 -68 9 3 -40 52 -104 33 -35 -75 28 4 26 -40 63 100 4 21
7521 21 19 -46 -81 4 36 -16 41 18 49 74 -22 -66 -73 -44 35 56 -26 -4 14 -46 -63 29 6 52 -76 -31 -11 50 0 24 -33
7552 -33 -50 54 31 -59 -60 46 -5 58 -74 47 30 -85 84 -35 56 40 17 -33 20 127 -69 -60 16 1 19 -2 13
7579 13 1 54 36 -87 -43 138 51 66 69 3 -79 29 86 13 -33 -80 21 -8 -95 -69 -23 -81 5 -5 80 -55 -17 -24 -44
7608 -44 51 59 44 37 61 22 -2 77 -14 57 11 21 4 -50 -68 -58 -112 -75 7 8 82 105 16 22 44 -12 -28 44 -23 15 23 -80
7640 -80 -5 -37 90 -10 -3 -39 -39 -48 105 -64 -23 10 83 62 -66 67 -73 -109 1 14 56 -31 49 6 -119 -51 -25
7667 -25 -8 -68 41 -19 -89 -17 14 -31 24 34 10 19 -54 78 71 -30 11 -56 80 27 27 -30 115 103 -65 -62 -13 23 27 -21
7697 -21 8 -62 -42 -59 9 5 -18 -51 10 -64 -121 -41 -22 21 -112 13 50 34 -35 -6 30 -15 -49 -1 -35 -23 52 -3 37 14
7727 14 0 -81 -34 -34 -58 -19 114 -49 10 -84 26 130 31 -22 -64 -36 -49 49 -25 86 18 -41 -22 -18 11 -1 -110 -35
7755 -35 20 12 40 52 12 -18 35 -82 25 14 -88 43 11 60 41 -33 77 -70 -82 55 -67 -167 40 51 57 -51
7781 -51 -75 -31 52 -31 20 -140 14 -51 16 -69 49 -29 -81 -38 19 -69 -17 -13 -27 -32 -32 68 -17 24 2 -100 7 38 -17
7810 -17 -31 2 -14 -32 75 -39 30 -13 -63 118 41 -13 73 -12 -15 35 35 9 -28 -18 -14 -8 37 45 -23 -24 70 -33 -21 13 30
7841 30 -24 74 35 34 -2 114 -40 -29 -13 55 -2 23 15 26 4 23 -61 -47 52 20 -10 4 -80 -59 -35 -38 48 4 -52 -60 -93
7872 -93 -61 -46 -72 -4 12 -26 9 22 23 9 -46 12 13 -18 19 -30 33 -117 4 -45 71 39 3 50 13 -38 -24 -6 -36 -93
7902 -93 48 -75 -44 11 22 -41 114 15 10 -14 -20 32 0 -33 -12 3 -106 -31 -30 32 -100 18 89 -53 -75 -54 -36 -90
7930 -90 -33 -18 -48 -49 38 71 71 -52 -29 -17 -78 -16 -44 -9 54 -7 65 41 -25 17 -54 -97 16 72 -23 -10 -94 -23 0 66
7960 66 -104 -45 -14 -50 41 -111 9 45 -36 -98 75 -160 -20 61 -43 88 32 -23 50 -3 -67 68 199 59 3
7985 3 -58 -95 -57 54 19 -26 -3 96 -16 4 31 3 -86 -34 25 -30 24 -20 -41 8 -44 16 -21 59 -36 14 -87 54 -33
8014 -33 84 64 -35 -42 -24 18 -42 75 -53 74 -30 25 21 -61 23 107 -10 -16 -61 7 -81 9 -25 -67 -7 -34 4 -27 -50
8043 -50 -54 -14 26 -30 -137 -82 69 8 8 68 -152 -27 -10 47 -87 20 18 -23 -90 21 4 -6 -13 -30 -22 -63 -60 110 -145
8072 -145 -25 25 -9 -73 -9 46 15 -3 -22 -66 -13 107 47 49 -10 -49 48 -15 -17 27 64 31 1 28 24 67 -41 -75 -8 -34
8102 -34 -42 -5 -6 17 52 2 -42 -41 3 96 36 -89 19 7 89 6 50 30 -48 -4 39 -12 4 38 1 -21 118 -156 -66 -47
8132 -47 -46 73 -31 14 18 -81 -26 -137 78 -1 -13 57 -42 62 -21 65 -59 44 -3 -110 75 -34 33 9 5 -124
8158 -124 -127 -7 23 50 -33 -53 -77 58 -18 -36 25 -38 -15 -53 -144 -9 -15 -96 -60 18 -12 -51 -90 15 61 57 -80 27
8186 27 17 -13 -59 14 3
8191C
$$ Imaginary data points
##PAGE= N=2
##DATA TABLE= (X++(I..I)), XYDATA
0 0 0 0 0 0 0 0 0 0 0 0 0 0 0 0 0 0 -4 4 -4 4 -8 8 -8 8 -8 10 -12 12 -12 12 -17 18 -18 19 -21 22 -26 27 -28 31 -33 35
42 35 -38 41 -43 48 -50 54 -58 64 -71 79 -91 102 -116 135 -158 190 -233 292 -372 490 -661 929
64 929 -1366 2137 -3649 7161 -18224 110711 469115 -367671 -402277 322252 -259124 -605980
76 -605980 119353 -10138 -466104 79963 241960 -205062 37933 308368 -34318 -22201
86 -22201 259410 86821 -56496 140011 129019 -72357 -10771 125992 -10412 -88889 102910
97 102910 84020 -127086 -4703 91237 -166397 -151516 50786 -147516 -227087 22082 -73954
108 -73954 -210504 45390 67806 -80965 134963 219918 37543 151419 241056 34871 53198
119 53198 146037 -42623 -81862 28464 -103851 -163542 -28186 -90376 -159676 -6394 2490
130 2490 -96280 26742 95643 -42514 -6673 120612 -1193 -77081 79276 50942 -108566
141 -108566 18210 126003 -48906 -26671 165494 30972 -85834 113295 77580 -134480
151 -134480 11759 97322 -146156 -104242 86461 -108243 -178867 83457 13484 -159878 85038
162 85038 153230 -103028 20647 208247 -45786 -80112 184592 25170 -159337 95075
172 95075 80904 -190660 -16248 126323 -136843 -87050 154710 -34917 -124655 126559 48250
183 48250 -136373 59479 102072 -107616 -10226 114266 -62066 -68589 88060 -7650 -82706
194 -82706 57101 44879 -64523 14965 58724 -44152 -26415 48613 -16180 -44597 31980
205 31980 9656 -45773 12459 26933 -34986 1601 43970 -14501 -4877 50105 -6141 -25841
217 -25841 39029 -3594 -48920 25480 8266 -63512 9824 31382 -61732 -9215 57693 -41801
229 -41801 -32973 73917 -4715 -54192 69094 37568 -68934 35799 72694 -64294 -14202
240 -14202 88810 -38242 -68160 75288 5637 -103094 32904 51505 -103423 -23154 86449
251 86449 -59537 -68137 96489 10149 -90898 71191 76052 -86180 15535 112026 -56618
262 -56618 -49311 109533 -7279 -97726 70297 43639 -113554 10129 82383 -89014 -48655
273 -48655 94804 -38588 -91216 76631 19748 -103267 39935 71961 -80569 -634 102484
284 102484 -38731 -40854 98421 6002 -67963 67897 41821 -79470 16825 56908 -71850
295 -71850 -30120 60262 -41846 -58407 51201 -5191 -68380 31349 27536 -59235 10386 53762
307 53762 -34232 -7509 64145 -9133 -27390 56439 14971 -39549 37456 31738 -49596 3004
319 3004 36173 -50700 -29524 39983 -31879 -48847 41893 281 -57278 33412 34289 -55136 13127
332 13127 62747 -40752 -18791 72617 -16342 -52036 63536 20242 -69477 36312 55694
343 55694 -68291 -7690 74167 -47231 -53415 69957 -9730 -85054 43298 34198 -87335
354 -87335 5845 73443 -56732 -31635 90208 -7701 -61839 72479 39201 -75311 27942
365 27942 69923 -65265 -25336 76251 -34201 -65983 61554 9266 -80924 30102 46386
376 46386 -71411 -8702 67121 -39945 -40326 65946 30 -56804 45351 35931 -54023 12441
388 12441 54629 -36439 -19259 55284 -10514 -42419 37497 13221 -50919 12785 32457 -43404
400 -43404 -12096 42238 -25068 -31697 41205 -2842 -44337 30572 20155 -44994 16156 39104
412 39104 -38232 -2316 49014 -25314 -20147 51126 -9873 -37695 42335 5880 -51482 25600
424 25600 23358 -53955 6226 42576 -41202 -14943 51433 -21106 -36360 46513 6278 -46352
436 -46352 29848 30875 -46353 908 43192 -33274 -26381 46229 -5994 -43242 35685 23626
448 23626 -49087 10385 46329 -37952 -18845 56330 -12598 -44980 45302 15530 -59805 18721
460 18721 41379 -52990 -10897 56766 -30827 -38461 54688 -1095 -54535 39158 29852 -55340
472 -55340 12713 50054 -43653 -18823 53750 -20020 -40155 45643 9762 -45743 26120 31284
484 31284 -39205 1306 39006 -23972 -20105 32331 -6294 -32182 15614 8668 -30996 -1921
496 -1921 19955 -14783 -11710 24947 6110 -17837 16275 21097 -19042 869 29087 -15236 -17457
509 -17457 29123 -6930 -32080 25293 5841 -41204 19103 22883 -43048 9214 38256 -42795
521 -42795 -9083 49140 -33485 -27108 56474 -14904 -44085 52709 7948 -53906 40614 31494
533 31494 -54604 18807 46604 -47300 -7929 50814 -31509 -32198 43021 -8351 -44347 26883
545 26883 16196 -41629 3447 32568 -24189 -18328 36355 3077 -32478 23912 29198 -34976
557 -34976 -878 46390 -23145 -28660 48518 -1814 -50813 34819 22865 -58681 11156 43142
569 43142 -50345 -14529 53070 -28780 -34039 50082 -2355 -43915 34463 20037 -41005 13428
581 13428 33278 -27787 -7370 33202 -9278 -20774 22863 8970 -24594 4752 20955 -17589
593 -17589 -13934 23378 -4445 -29346 15612 12607 -33038 3976 28541 -26312 -10774 36663
605 36663 -11879 -22548 36296 4869 -30374 26313 17808 -33726 10078 25006 -31458 -6465
617 -6465 29102 -21072 -18019 29784 -7493 -27867 23996 8310 -31007 14545 24431 -28378 -2994
630 -2994 32270 -19897 -21416 33976 -1682 -33251 27061 18258 -37892 11098 34557 -33044 -9204
643 -9204 42815 -19831 -29379 39667 -1751 -43866 25949 18854 -44322 8440 36497 -31861 -11144
656 -11144 41968 -12459 -27229 34331 8229 -34668 15799 23919 -31163 -6863 30459 -16381
668 -16381 -24528 27829 5602 -32234 14715 25011 -28615 -4325 35162 -15801 -23874 31815
680 31815 1774 -34831 19993 20119 -33479 3081 30492 -23703 -12836 32328 -7980 -22628
692 -22628 25275 5830 -27112 11152 13817 -24499 -1456 19629 -13125 -9038 19123 -3047
704 -3047 -14692 13067 6614 -13556 7308 13040 -11637 -2774 12887 -9259 -11339 13008 -1066
717 -1066 -14583 11762 7730 -17801 4501 14721 -16627 -3250 22269 -9916 -13502 22102 -2928
730 -2928 -25076 17045 10452 -27236 9877 24619 -24623 -5178 31032 -16411 -20388 32219 -94
743 -94 -31093 23375 14866 -36887 6075 28322 -29286 -9955 37057 -12737 -25249 32001 4867
756 4867 -34481 18159 22394 -31295 -163 31170 -21297 -19813 29537 -3008 -28833 21106 16564
769 16564 -28659 4133 27119 -19750 -13418 28686 -3716 -24450 20404 11457 -28461 4612
781 4612 22031 -21257 -8827 27122 -7712 -20286 21263 5194 -24882 11035 16776 -21248
793 -21248 -950 20955 -14132 -11964 19629 -3660 -16360 15661 6245 -16866 7882 11687 -15251
806 -15251 -165 15118 -9591 -6361 14983 -4559 -12842 11173 1700 -14881 7797 9387 -14213
819 -14213 1080 14256 -11591 -7064 17506 -4006 -13836 16284 4846 -20129 8396 13537 -20579
832 -20579 -1479 22131 -13859 -13081 24042 -3213 -23267 18883 11020 -26357 8225 22944 -22855
845 -22855 -7612 27759 -11804 -21134 25534 4628 -27965 14453 19069 -26692 -2135 27668
857 27668 -15820 -17684 27279 367 -27957 16330 16068 -28341 677 27014 -18304 -14731 28496
870 28496 -3303 -25588 20777 12654 -27338 7428 23508 -21486 -7663 26076 -9977 -18786
882 -18786 21387 3115 -22651 11328 12965 -20094 -84 17401 -12411 -9170 16617 -2822
894 -2822 -14061 11269 5425 -14060 4465 11379 -10455 -2299 13519 -5274 -7773 12251 81
907 81 -11643 9077 5146 -13611 4477 9852 -13403 -1318 13723 -10526 -7437 15845 -5053
920 -5053 -13319 14810 2168 -17536 10088 9800 -18136 2801 16449 -14084 -5543 19784 -6267
933 -6267 -13587 17616 3916 -18310 9756 13304 -17819 -2500 18037 -10908 -13868 17267 1133
946 1133 -20018 10111 12991 -19267 -1297 20811 -11340 -12939 21178 408 -21362 13636 12328
959 12328 -22845 1632 21763 -15449 -10837 24015 -3209 -20178 18014 10185 -22697 6103
971 6103 19208 -18281 -7709 21059 -8872 -17521 17225 3191 -20399 9437 12616 -17884 -68
984 -68 17703 -10544 -7866 17168 -2512 -13368 11701 4412 -14308 4973 9331 -11130 -1158
997 -1158 11077 -6084 -5448 10115 -1115 -7848 7483 3031 -9219 3431 6087 -9462 -1387
1010 -1387 8576 -7487 -5972 10805 -2760 -10000 10893 3584 -12882 8221 10510 -13481 2084
1023 2084 15150 -12625 -6603 17520 -7308 -14154 16267 888 -19200 11355 10566 -18541 2906
1036 2906 17122 -13482 -7025 17768 -4499 -14214 12399 5001 -16089 3212 12419 -10797 -6105
1049 -6105 15045 -743 -12696 11111 9560 -14939 1372 16065 -11757 -10149 17395 -3427
1061 -3427 -18378 13115 6768 -20649 5126 15944 -16009 -3532 19973 -7946 -11958 17249
1073 17249 1319 -16127 10336 9155 -15390 853 13509 -9661 -6888 13308 -1570 -11541
1085 -11541 8704 5676 -11874 2193 9568 -9659 -4438 10597 -5286 -8399 10328 -171 -10534
1098 -10534 8575 4706 -11046 5873 9001 -10174 2165 11782 -8638 -2861 12314 -6531 -7988
1111 -7988 11062 -2854 -11404 8829 2180 -12698 4560 6619 -11216 -274 10377 -6111 -4640
1124 -4640 10688 -264 -9039 6674 5998 -9374 1022 11271 -5929 -6603 12226 247 -12910
1137 -12910 8706 8340 -15176 1351 14933 -12843 -8998 16684 -5842 -16969 14250 5132 -19083
1150 -19083 7246 13803 -16048 -2217 17698 -7748 -9270 16177 1589 -13085 9020 8152 -12367
1163 -12367 302 11646 -6962 -6897 10392 -51 -11411 4851 6150 -11217 -1717 10539 -6357
1176 -6357 -7806 10517 -89 -11481 7476 6753 -11017 2743 11266 -8507 -2873 12248 -4412
1189 -4412 -7312 10810 295 -9696 7529 4039 -10393 3281 6566 -9373 -637 7839 -7165
1202 -7165 -4234 8141 -4001 -6766 7544 -161 -8399 6228 4336 -8324 3230 8250 -7081
1215 -7081 -1241 10171 -3932 -6053 9474 693 -9723 5953 5590 -10579 521 9552 -8031
1228 -8031 -5750 10908 -2477 -10574 8714 4510 -12545 3192 10398 -10448 -3913 13276 -4587
1241 -4587 -10051 11847 3198 -12905 6538 10018 -11937 -896 13657 -7003 -8011 12549 -452
1254 -452 -12793 7421 6163 -12813 634 10656 -8503 -5577 11259 -1797 -9639 8059 4843
1267 4843 -9805 2652 8898 -7222 -3629 9374 -2650 -7933 7202 3017 -8806 3238 6828
1280 6828 -7389 -1808 8405 -4026 -5693 7753 143 -7712 4947 3420 -7955 1394 5908
1293 5908 -5983 -948 7463 -3521 -3572 6887 -1214 -5545 5642 1542 -6644 3537 3791 -6853
1307 -6853 557 5598 -5630 -2432 6981 -2841 -4914 6921 583 -7285 4827 4535 -7710 1457
1321 1457 8004 -5894 -3456 9104 -2268 -8167 7241 2741 -10262 3154 7603 -9207 -2349
1334 -2349 10365 -5065 -7611 10001 1063 -10366 6522 7129 -10186 446 10527 -7121 -5867
1347 -5867 10667 -1020 -9543 7537 5091 -10285 1788 9004 -7609 -4164 10025 -2247 -8421
1360 -8421 7354 2880 -10513 2314 7248 -8355 -2365 9711 -3746 -6417 8692 1349 -8303
1373 -8303 5651 5876 -7413 1199 7829 -5470 -3725 6739 -2725 -6146 5025 1119 -6178 2655
1387 2655 3510 -5140 23 4942 -2837 -1840 4899 -430 -3797 3146 1162 -4812 974 2920 -3794
1402 -3794 -256 4791 -2105 -2074 5440 -405 -4125 5064 1710 -6273 2639 3825 -7607 -1064 5891
1417 5891 -6197 -4243 7922 -1898 -6383 7669 2536 -7849 4748 6484 -7590 244 8462
1430 8462 -5552 -4853 8052 -1503 -8174 5771 3960 -8231 1853 7998 -5681 -3492 8541
1443 8541 -1666 -7986 5824 3211 -9355 916 6803 -7522 -3932 8986 -2361 -6762 8737
1456 8737 3478 -8116 4985 7696 -7589 -603 9162 -5078 -5936 7825 -836 -8848 4624 3413
1470 3413 -8579 757 6487 -5533 -2594 7087 -2110 -5212 5527 1385 -6016 3011 4009 -5206
1484 -5206 313 5494 -3089 -1813 5916 -545 -3266 4699 1357 -4273 2091 2122 -4758 -417 2505
1499 2505 -4242 -2323 2961 -2519 -3130 3629 198 -3475 3283 2769 -3357 1718 4750 -2867 -975
1514 -975 5221 -1440 -3636 4527 820 -5520 2384 3546 -5689 -462 5362 -4344 -4095 5599 -1211
1529 -1211 -6396 4189 2633 -7165 1136 5938 -5053 -2129 7766 -1264 -5264 6346 2969 -6708
1543 -6708 2940 6197 -6198 -2042 7727 -3181 -6202 6713 1045 -8717 3423 5187 -8188 -780
1557 -780 7659 -5530 -4985 8091 -1034 -7007 6368 3321 -7321 2992 6352 -5649 -808 7056
1571 7056 -2931 -4087 5383 -42 -5491 2518 2309 -4721 -169 3739 -2437 -2082 3644 -53 -3095
1586 -3095 2233 1777 -3377 316 2814 -2913 -1244 3477 -1622 -2443 3730 327 -3086 3645 1970
1601 1970 -3820 2288 2955 -4324 221 3602 -4257 -2001 4315 -2843 -3625 4558 -409 -4247 3972
1616 3972 2378 -4351 1987 4109 -3882 -1207 4387 -2141 -3597 3478 750 -4612 1594 3660 -3474
1631 -3474 -667 5532 -1027 -3656 4835 1663 -5884 1835 4049 -6418 -1875 5897 -3904 -4847 6413
1646 6413 92 -6665 4865 4450 -6087 1723 6640 -4753 -2368 6502 -2089 -5421 4884 1212
1660 1212 -6071 2030 4168 -4624 -894 5215 -2119 -3400 4382 696 -4652 1865 2435 -4813 -754
1675 -754 3980 -2640 -2396 4600 62 -3251 3741 2284 -3493 1768 3404 -3155 -256 3493 -2716
1690 -2716 -2446 2746 -1744 -3257 2396 -22 -3392 2028 1443 -3246 1072 2657 -2797 -17 3552
1705 3552 -1697 -1394 3713 -337 -3006 2945 1495 -3422 1527 3390 -3184 -894 3726 -2140 -3557
1720 -3557 3187 158 -4705 1901 2651 -4586 -561 4419 -2805 -2865 4982 439 -4218 3571 3344 -4669
1736 -4669 556 5044 -3368 -2439 5457 -693 -5076 3605 1934 -5800 661 4394 -4508 -2290 5319
1751 5319 -1707 -4606 4383 1616 -5245 2069 4369 -4127 -614 5490 -1974 -3372 4457 571 -4657
1766 -4657 2502 2861 -4404 -64 3926 -2997 -2488 3845 -868 -3493 2937 1475 -3586 1147 2526
1781 2526 -3056 -574 3205 -1435 -1413 3081 77 -2198 2128 845 -2365 1067 1610 -2088 186 1904
1797 1904 -2179 -1093 1819 -1394 -1724 2363 187 -2173 1837 1149 -2612 737 2533 -2016 -517
1812 -517 3248 -1193 -2301 2839 295 -3497 1693 2284 -3311 27 3551 -2380 -2315 3728 -486 -3857
1828 -3857 2988 2071 -4144 712 3628 -3502 -1592 4352 -1292 -3406 3858 1266 -4426 1715 3300
1843 3300 -3810 -967 4386 -1795 -3066 3636 527 -4157 1654 2868 -3452 -711 3833 -1866 -2737
1858 -2737 3599 406 -3942 1978 2377 -3753 -110 3639 -2423 -1965 3673 -496 -3223 2707 1340
1873 1340 -3119 1311 2463 -2502 -190 2805 -1478 -1286 2344 -603 -1769 1564 220 -2158 792
1888 792 717 -1808 15 1173 -1235 -423 1493 -708 -822 1458 255 -1191 1373 894 -1623 574
1904 574 1806 -1343 -558 2356 -968 -1874 2376 165 -2875 1523 1662 -3307 62 2874 -2731 -1708
1920 -1708 3452 -1045 -2814 3136 1274 -3445 1681 3061 -2978 -253 4083 -1509 -2397 3516 504
1935 504 -3690 1611 2229 -3583 -702 3417 -1997 -2734 3273 187 -3791 1884 2502 -3536 -49 3820
1951 3820 -2223 -2203 3828 -80 -3280 2962 1852 -3474 897 3048 -2790 -1020 3162 -1482 -2413 2331
1967 2331 173 -2959 1135 1281 -2356 -75 2158 -1128 -902 1944 114 -1323 1366 900 -1355 452
1983 452 1161 -991 -282 1190 -748 -832 1089 -277 -1224 872 99 -1430 629 749 -1502 94 1368
2000 1368 -1343 -478 1905 -752 -1061 2110 423 -1743 1444 1326 -2251 182 2209 -1994 -1309 2424
2016 2424 -976 -2602 2010 572 -3141 1111 2394 -2655 -512 3211 -1451 -2137 2964 324 -3037
2031 -3037 1980 2059 -3112 -10 3056 -1946 -1648 3331 -103 -2920 1999 1582 -3155 138 2645 -2312
2047 -2312 -1795 2949 -591 -2699 2121 1361 -2951 778 2656 -2047 -698 2997 -941 -2054 2230
2062 2230 471 -2490 1189 1532 -2147 -53 1921 -1215 -1033 1843 -144 -1389 1168 618 -1499 317
2078 317 792 -1164 -401 1076 -518 -751 935 -31 -931 675 623 -874 387 768 -930 -48 1074
2095 1074 -862 -435 1386 -389 -961 1389 62 -1546 1083 859 -1856 372 1444 -1872 -605 1762
2111 1762 -1071 -1461 1829 71 -1981 1222 1422 -1871 75 2229 -1016 -1061 2014 214 -1961 1230
2127 1230 1390 -2145 -162 2243 -1310 -1561 2262 -100 -2717 1447 1416 -2875 141 2555 -2054 -1328
2143 -1328 2780 -637 -2269 2451 1022 -2625 1261 2114 -2100 -206 2542 -1158 -1468 1943 -69
2158 -69 -1989 1001 941 -1993 -27 1496 -1141 -836 1493 -78 -1242 1099 676 -1167 390 1104 -901
2175 -901 -323 1132 -357 -713 1096 -7 -895 633 195 -990 329 421 -1141 55 719 -954 -255
2192 -255 995 -667 -515 1261 -218 -768 1156 376 -1072 783 989 -1239 -145 1259 -875 -1014
2208 -1014 1291 -222 -1574 771 685 -1688 -32 1552 -1211 -1006 1777 -152 -1719 1456 1322 -2018
2224 -2018 394 2084 -1386 -772 2392 -389 -2021 1638 731 -2445 577 1742 -2209 -726 2177
2239 2177 -1151 -1735 2120 282 -2251 1260 1569 -1860 -97 2241 -1118 -1182 2098 113 -1708 1296
2255 1296 1089 -1785 187 1645 -1197 -893 1546 -477 -1542 1089 297 -1481 295 1046 -1141 -188
2271 -188 1358 -492 -566 1151 165 -672 956 554 -781 382 619 -906 -61 515 -689 -375 696
2288 696 -363 -653 785 -43 -894 541 317 -977 286 769 -860 -54 954 -556 -591 1195 34
2305 34 -1025 860 700 -1302 161 1251 -1092 -754 1325 -445 -1399 1092 502 -1657 401 1505
2321 1505 -1267 -550 1893 -471 -1232 1748 617 -1749 730 1314 -1689 -366 1731 -913 -1386 1518
2337 1518 99 -1874 999 1181 -1780 118 1664 -1060 -947 1643 -77 -1531 1144 779 -1651 145
2353 145 1430 -996 -742 1457 -224 -1182 1154 536 -1355 358 927 -1119 -312 1098 -628 -837 873
2370 873 -78 -952 702 446 -717 389 772 -523 56 623 -436 -155 406 -336 -582 378 -76 -535
2388 -535 377 182 -549 320 399 -435 127 727 -410 -251 685 -141 -805 546 357 -984 67 943 -696
2407 -696 -457 1162 -214 -964 1012 523 -1321 508 921 -1366 -237 1303 -935 -1072 1413 85
2423 85 -1370 1052 1011 -1408 309 1485 -901 -627 1543 -328 -1320 995 418 -1502 145 1095 -965
2440 -965 -556 1527 -232 -1201 1091 591 -1323 384 1142 -1195 -429 1239 -585 -1136 1045 135 -1177
2457 -1177 735 890 -940 34 982 -606 -476 901 -140 -779 561 243 -799 207 403 -594 -115
2474 -115 546 -257 -236 447 131 -326 371 231 -453 223 369 -368 -11 451 -477 -319 698 -235 -524 640
2494 640 141 -714 652 360 -921 112 790 -889 -306 919 -433 -707 996 141 -1132 605 748
2511 748 -1124 82 1152 -802 -577 1204 -117 -1132 793 622 -1314 172 1153 -970 -735 1271
2527 1271 -273 -1259 934 538 -1263 358 1102 -1167 -401 1375 -433 -1025 1125 276 -1286 452
2543 452 998 -1041 -287 1213 -493 -825 1006 105 -1023 570 766 -817 -46 887 -562 -521 868
2560 868 -91 -657 587 291 -810 5 579 -453 -259 403 -329 -430 342 -50 -482 229 237 -294 98 250
2580 250 -125 39 401 -71 -85 354 -68 -291 398 41 -512 281 247 -626 -47 549 -597 -380 642 -359
2600 -359 -682 647 45 -959 526 502 -961 146 930 -607 -311 1140 -141 -792 868 328 -1022
2617 -1022 201 752 -956 -391 972 -367 -855 813 345 -1047 436 945 -899 -328 1281 -417
2633 -417 -918 998 284 -1241 540 700 -1049 -78 1082 -644 -658 1134 -28 -921 692 452 -948
2650 -948 65 745 -710 -333 593 -231 -644 483 321 -506 228 499 -220 -48 518 -38 -473 191 57
2669 57 -444 7 152 -324 -207 243 -161 -51 471 95 -62 295 75 -200 205 -77 -363 199 128 -446 -26
2690 -26 432 -438 32 642 -232 -250 618 53 -646 411 232 -756 146 557 -594 -258 875 -265 -489
2709 -489 812 371 -655 415 727 -845 -268 972 -520 -861 761 74 -1198 348 590 -974 -158
2726 -158 1094 -477 -599 1059 -43 -1063 532 528 -1029 16 890 -725 -476 1032 -158 -733 740
2743 740 458 -748 236 823 -592 -383 704 -261 -690 470 31 -711 -28 412 -491 -85 545 -199 -262
2762 -262 394 195 -532 206 141 -488 12 237 -360 -175 313 -91 -135 330 117 -167 196 54 -172 133 -26
2783 -26 -230 13 187 -336 -85 288 -267 -215 427 2 -388 308 238 -456 270 434 -443 -280 619 -215 -466
2804 -466 495 180 -678 243 554 -709 -153 788 -396 -654 733 -34 -939 491 628 -835 -47 720
2822 720 -471 -536 963 -2 -809 664 547 -803 86 852 -659 -432 803 -179 -710 606 255 -877
2840 -877 54 598 -608 -283 651 -139 -517 584 197 -549 179 515 -468 -124 570 -196 -384 438 87
2859 87 -539 273 189 -378 -85 388 -223 -184 302 -161 -259 153 127 -271 117 109 -198 196 174 -134 112 249 -49
2882 -49 -29 213 -220 -164 228 -116 -270 168 24 -444 -6 316 -334 -28 405 -189 -228 486 91 -486 447
2903 447 414 -456 21 707 -401 -307 701 -37 -658 485 427 -835 96 664 -652 -424 749 -280 -659
2922 -659 590 292 -731 264 638 -486 -206 726 -275 -486 588 214 -617 233 532 -545 -213 618
2940 618 -169 -648 480 207 -727 117 441 -455 -121 598 -248 -399 538 160 -552 283 269 -341 105 388
2960 388 -305 -143 377 -41 -232 318 23 -284 73 91 -315 -71 -61 -197 -81 98 -92 -12 195 -195 -85
2981 -85 263 -97 -118 225 30 -341 98 265 -276 -37 397 -70 -273 434 58 -450 342 327 -482 30 529
3002 529 -399 -317 502 -114 -536 509 233 -703 259 417 -624 -279 645 -193 -515 507 220 -817 119
3021 119 462 -526 -180 687 -176 -486 577 319 -640 160 505 -471 -247 722 -216 -491 559 85 -615
3040 -615 285 422 -625 -15 572 -310 -284 586 25 -542 210 238 -396 34 372 -299 -250 353 -32 -245 303
3061 303 136 -242 95 158 -125 97 232 -192 -79 45 -35 -98 136 -110 -158 48 2 -154 62 153 -198 79
3083 79 190 -250 -223 347 -153 -267 384 80 -372 233 184 -448 -51 392 -270 -272 521 -36 -536 455 140 -662
3105 -662 107 515 -453 -167 640 -316 -478 541 177 -572 372 381 -487 -101 543 -230 -508 409 22 -581
3125 -581 258 433 -469 -183 561 -145 -481 455 213 -565 157 425 -481 -58 519 -270 -294 487 -3 -608
3145 -608 198 325 -481 14 459 -281 -281 348 8 -298 216 121 -369 -35 215 -163 -67 268 48 -110 188
3166 188 -35 -217 127 -32 -192 -8 153 -270 40 38 -164 15 68 -180 28 346 -123 -166 300 -28 -211
3187 -211 231 244 -321 173 238 -351 -93 450 -133 -331 383 107 -469 236 332 -541 -7 509 -251 -351 478
3208 478 53 -405 273 397 -460 -51 544 -231 -337 584 -5 -628 317 319 -625 -48 475 -317 -386 487 -105
3229 -105 -568 197 248 -346 31 445 -375 -177 446 37 -496 278 318 -419 164 344 -286 -60 458 -8 -415
3250 -415 257 140 -288 131 264 -105 -135 146 -53 -107 320 64 -152 179 94 -249 -12 86 -152 -41 116
3271 116 -172 -24 202 -180 -22 90 -24 -122 253 -48 -155 182 31 -270 83 232 -278 -70 386 -198
3291 -198 -250 334 155 -397 171 305 -331 -58 386 -188 -312 402 20 -424 239 341 -425 61 497 -289
3311 -289 -489 556 15 -526 295 251 -575 54 452 -292 -171 435 -82 -459 398 240 -401 96 467 -375
3331 -375 -145 357 -74 -379 208 123 -472 -16 306 -320 -163 388 -166 -309 199 84 -265 126 214 -173 -27
3352 -27 267 -22 -205 190 -16 -208 82 175 -244 -13 149 -197 -4 58 -68 -126 35 -154 -44 127 -14
3373 -14 -96 229 11 -153 203 127 -188 -6 207 -141 -89 246 -114 -320 235 -75 -304 67 148 -332 -35 258
3395 258 -110 -123 374 43 -357 300 296 -348 -31 411 -207 -280 452 -29 -506 430 243 -411 102 444 -298
3416 -298 -244 487 -51 -436 271 150 -498 92 411 -355 -119 470 -61 -367 344 177 -370 129 330 -444
3436 -444 -84 385 -100 -338 266 46 -378 85 197 -293 -44 327 -111 -159 327 65 -144 171 53 -109
3456 -109 74 51 -161 25 84 6 -89 146 78 -32 98 -9 -133 -14 -116 -33 52 -39 -107 61 32 -158 40
3479 40 78 26 40 211 6 -115 91 328 -176 58 312 -78 -148 243 -11 -420 178 129 -400 10 400 -224
3501 -224 -130 398 -181 -407 311 59 -403 76 336 -340 -166 483 -130 -357 355 161 -477 123 300 -294
3521 -294 -266 353 -125 -266 272 188 -362 164 361 -395 -61 421 -218 -262 258 103 -367 123 278 -269 -152
3542 -152 372 -81 -159 420 20 -325 214 85 -224 47 147 -121 -191 111 -58 -199 130 -28 -114 -40 -46 16
3564 16 0 24 -26 35 -56 -88 77 73 -174 106 119 -74 17 206 43 -203 166 73 -251 -25 153 -195 -104 239
3588 239 -61 -225 234 114 -301 72 286 -347 -117 440 -48 -271 382 60 -350 96 362 -274 -121 429
3608 429 -210 -394 332 74 -368 101 313 -331 -119 524 -104 -337 344 10 -416 177 329 -335 -171 409
3628 409 -267 -222 339 43 -272 200 184 -268 -50 357 -254 -184 295 -107 -293 59 117 -222 -26 210 -64
3649 -64 -22 339 -51 -171 234 3 -188 77 92 15 -86 61 -106 -11 71 12 3 -41 -46 17 129 -32 -64 79 -112
3674 -112 -82 174 111 -162 49 67 -174 -80 207 -58 -215 182 21 -266 100 218 -232 -158 242 -143 -231 265
3696 265 57 -269 98 127 -234 1 433 -140 -276 325 134 -383 98 293 -525 -14 433 -134 -114 364 19
3717 19 -423 245 271 -430 -194 327 -211 -277 290 53 -417 236 201 -299 64 330 -113 -132 349 33 -232 137
3739 137 42 -304 65 191 -125 29 142 -14 -244 123 189 -201 -26 39 -116 -96 117 -58 -101 38 -50 -18
3761 -18 10 -53 -5 145 -45 -107 40 -63 -95 125 56 -92 28 118 -141 12 231 -70 -113 92 123 -195 147
3784 147 134 -325 -2 250 -130 -202 273 -30 -260 141 183 -450 -11 262 -186 -115 207 93 -295 131 287
3805 287 -278 26 374 -210 -261 323 -84 -244 276 272 -353 38 264 -306 -292 296 76 -291 209 67 -354
3826 -354 29 365 -209 -201 286 29 -183 185 67 -267 65 237 -232 -107 292 1 -176 96 35 -150 -22
3847 -22 131 -142 -15 159 -61 -85 82 48 -162 57 95 -31 24 88 35 44 -40 59 29 93 -9 94 112 -35 12
3872 12 106 -113 -74 114 -55 -118 126 118 -213 -27 83 -209 -138 224 50 -115 96 134 -249 51 291 -205 -104
3895 -104 267 -15 -242 122 92 -349 26 324 -205 -137 356 10 -397 242 206 -351 110 350 -249 -84 237
3916 237 69 -301 208 132 -376 -30 139 -202 -183 235 -41 -198 66 114 -251 -18 190 -228 -104 249 -49
3937 -49 -58 118 40 -191 133 159 -188 -119 183 -26 -76 166 104 -179 53 86 -163 82 97 -13 30 53 -32 17 51
3962 51 -87 16 4 -139 -61 146 19 -101 118 -79 -42 53 -34 -149 10 141 -104 -47 200 -116 -168 151 157
3985 157 -346 53 226 -194 -250 229 -88 -348 187 111 -249 144 338 -117 -64 351 -154 -192 237 85 -308
4006 -308 96 292 -266 -225 321 -47 -236 240 67 -351 129 282 -104 -146 259 -107 -166 238 125 -313 71
4027 71 238 -140 -56 218 7 -147 108 -40 -301 16 107 -176 14 199 -111 -306 58 109 -143 46 5 -81
4049 -81 -36 59 -71 -131 186 -44 -100 -73 68 8 112 -19 27 127 -31 -8 11 -26 -60 -29 175 -70 -1 88 -114
4074 -114 -77 121 -4 -182 101 34 -238 36 263 -171 -80 198 -20 -156 295 47 -189 105 178 -297 -102
4095 -102 163 -152 -233 277 17 -269 59 169 -270 13 331 -85 -191 283 125 -311 144 122 -180 -92 303
4116 303 -152 -274 276 15 -210 123 236 -217 -8 287 -77 -147 121 26 -342 13 138 -170 -81 191 -50
4137 -50 -75 172 12 -120 74 187 -141 42 32 -56 -35 155 93 -137 47 -26 -156 70 56 10 35 -56 -44 34
4161 34 -67 56 50 54 -121 -20 38 -126 -3 94 -132 -149 -54 79 -153 -71 110 -47 -71 198 -115 -179 145 36
4185 36 -237 119 283 -115 -90 387 5 -101 174 64 -114 47 181 -277 -63 198 -90 -205 202 72 -210
4206 -210 191 184 -263 -56 275 -123 -110 296 8 -420 17 177 -301 -19 181 -51 -272 201 -37 -194 85
4227 85 107 -227 43 170 -132 -189 77 -62 -183 17 53 -228 -63 195 -1 -8 146 37 -35 -13 53 -58 -15
4250 -15 101 -21 98 -40 -28 22 97 -4 15 44 47 30 18 -25 71 86 12 -146 68 51 -52 28 170 -108 57
4275 57 137 -16 -90 172 53 -266 51 74 -200 -65 119 -265 -280 224 43 -241 124 200 -228 -41 207 -200
4297 -200 -168 185 -18 -244 54 105 -264 -70 306 -65 -242 313 49 -235 18 142 -173 -40 181 -138 -63
4318 -63 232 17 -170 171 123 -202 -23 128 -107 -122 206 75 -184 40 52 -177 -76 179 -99 -119 172 50
4340 50 -163 30 7 -74 -35 46 66 -88 27 76 -50 45 -83 45 -82 -5 6 -67 -4 -4 36 9 -59 104 38 -140
4366 -140 74 105 -93 -27 31 -65 -70 126 -4 -178 152 31 -139 -61 163 -79 -72 225 -49 -235 107 130 -137
4389 -137 16 210 -71 -155 165 -84 -251 166 121 -217 14 235 -259 -53 192 -83 -185 157 72 -278 22
4410 22 158 -200 -101 221 -55 -191 209 197 -242 -2 88 -66 -26 90 -44 -72 58 -49 -204 -46 100 -140
4432 -140 91 86 23 -98 126 41 -84 -16 73 -101 49 104 36 -117 50 74 -15 49 43 28 -11 10 -24 59 16 13 11 -7
4460 -7 -205 6 -64 -76 7 127 -154 2 134 -59 -212 122 67 -57 68 72 -51 -37 241 8 -85 132 116 -163
4484 -163 135 248 -176 -40 273 -135 -102 110 137 -185 108 151 -117 -47 224 -70 -136 138 77 -114 -17 231
4506 231 -128 -32 176 -134 -118 236 -56 -298 82 196 -251 -123 123 -8 -295 203 95 -168 23 166 -77
4527 -77 -44 82 -5 -121 166 -1 -83 94 -16 -65 -123 107 25 -10 76 54 -36 -31 103 -89 -65 73 -32 7 -3
4552 -3 36 -129 -29 -29 70 -77 -22 87 44 46 -64 86 -47 -123 64 69 -58 53 69 -72 -18 218 26 -87 125
4577 125 59 -148 68 78 -91 -60 129 12 -32 232 30 -175 20 39 -281 -107 177 -33 -185 215 25 -267
4599 -267 24 234 -79 -123 199 35 -68 122 32 -146 58 254 -195 9 191 -138 -94 152 -2 -278 -13
4620 -13 68 -78 -125 170 47 -40 93 1 -244 23 99 -28 -55 90 48 -54 87 -22 -18 -23 88 -122 15 6 -6
4645 -6 -115 -96 81 86 29 -71 -18 -68 -9 133 9 0 -54 63 -134 -20 75 -20 -71 168 -14 -129 84 29 -88
4670 -88 -96 151 61 -235 121 18 -230 59 32 -165 -157 73 -14 -163 90 42 -348 -17 169 -108 -121 137 4
4693 4 -178 155 177 -215 16 125 -102 -90 175 16 -206 122 99 -169 10 226 -131 -171 228 74 -176 104
4715 104 171 -199 -71 92 -121 -41 219 43 -88 56 102 -124 23 96 3 -41 79 157 -124 -3 61 -86 29
4738 29 145 -100 -38 -10 18 -8 -8 -30 -34 -72 -4 -60 12 -25 30 24 -70 -55 56 -91 -175 111 5 -63 -30 7 -64 -12 106
4767 106 -21 -58 -44 20 -177 110 99 -5 -56 161 38 -201 10 55 -111 63 71 -125 -23 215 -71 -124 104
4790 104 67 -103 47 84 -78 -35 121 121 -200 66 53 -143 28 116 -123 -34 108 -21 -245 234 82 -257 52
4813 52 164 -83 -197 170 -34 -259 51 124 -129 -70 186 -98 -108 108 68 -73 21 74 -30 39 63 -4 23 79
4837 79 -29 -129 14 -56 -101 7 -51 -32 49 -48 32 36 68 23 13 19 -56 -18 27 -62 43 36 7 -139 -32 -42 -42 86
4865 86 23 -113 30 77 -67 4 169 -3 -68 103 35 -81 100 141 -77 -23 170 -98 -66 70 18 -154 -6
4888 -6 107 -30 -121 224 -142 -160 185 71 -101 99 106 -214 -51 118 -21 -63 187 137 -192 83 169 -167 -99
4911 -99 103 6 -178 154 -47 -137 13 177 -64 -35 185 -124 -37 33 162 -35 73 61 -60 -47 83 43 -118
4934 -118 -24 26 -88 36 92 -100 -28 120 49 -38 40 -64 -29 -87 71 90 39 22 22 -7 67 3 62 -50 -44 106 -20
4961 -20 -59 9 19 -153 -16 22 -73 -43 45 -31 -68 18 97 -130 25 219 -132 -77 195 37 -121 92 95 -97 17
4986 17 124 -94 -208 118 131 -167 132 55 -201 -38 124 -65 -73 172 17 -141 86 42 -120 -19 133 -90
5008 -90 -111 15 62 -194 135 20 -67 -26 126 -6 -99 92 -3 -84 42 32 1 -146 73 -64 -47 44 40 39 -15 51
5034 51 -33 -19 -56 2 -47 16 61 -62 48 24 -20 -59 -56 63 -23 -59 66 -104 -111 -1 50 22 -25 93 6 -93 -17 17
5062 17 -11 -48 94 -33 -130 47 61 -135 -64 138 -71 -14 218 -59 -170 146 109 -144 -27 107 -36 -154 169
5085 169 63 -135 -35 62 -116 -39 152 -89 -90 116 -72 -128 18 -24 -78 -36 120 -106 -140 95 -46 -174 47
5108 47 100 -70 -50 204 -119 -122 105 -23 -73 38 65 -153 22 44 5 -125 19 -88 -82 -36 58 -114 -98 112 -13
5133 -13 -20 119 34 -70 -66 68 67 -30 7 -7 19 -25 23 -32 41 -11 120 31 -91 73 25 -71 -73 78 -113 23 98 -92
5161 -92 23 63 -61 -52 -64 79 -192 -52 173 3 -93 -12 52 -111 -10 88 -14 -70 91 -62 -187 61 74 -130
5185 -130 91 138 -74 -113 151 -64 -188 79 73 -92 -14 51 -156 -19 139 -89 -158 81 6 -118 2 166 21
5208 21 -61 44 70 -126 70 -11 -140 9 110 -15 -55 -8 -29 -75 -16 135 -126 -4 76 -22 -61 8 11 -61 58
5233 58 115 -41 -81 47 -16 -47 5 -6 -51 59 -76 106 18 -4 36 -60 -23 -66 127 19 31 65 -80 -119 136 -53
5259 -53 -46 -45 40 -58 28 16 -103 10 68 -8 -75 13 126 -37 -69 184 -26 -102 97 -46 -136 -31 110 -122 -40 122
5285 122 95 -10 36 21 -96 19 118 -40 39 106 23 31 22 -24 -140 140 137 -99 -2 64 -128 51 -51 102 21 126
5311 126 27 -9 11 119 48 -67 24 -39 -18 -42 72 -59 -25 160 -57 -71 28 -2 -72 80 58 6 -30 36 -18 -107
5337 -107 -18 -32 -40 -111 -7 72 -39 -40 -14 29 -35 -69 8 -47 -12 11 -71 -21 -18 -19 7 61 44 -69 8 87 40 -96 1 117
5367 117 -130 87 63 -157 -7 53 11 -13 66 73 -70 -81 121 -31 -173 39 11 -66 -36 151 -111 -103 50 35 -80
5392 -80 107 4 -70 -24 151 -35 -29 147 3 -122 111 -35 -132 137 3 -29 -23 -23 -30 -73 72 27 -105 121 -100
5417 -100 -123 -2 42 27 -45 54 -7 -28 57 -16 -77 -43 -38 -3 -53 -1 -10 -13 22 -6 56 -7 47 -29 -20 -83 2 -7 -18 -39 93
5448 93 -34 -65 65 55 -4 81 13 -63 15 83 13 -87 96 43 -86 28 117 -184 -13 77 140 -18 69 102 -119
5473 -119 116 154 5 -11 34 39 -25 75 47 -93 67 57 -112 24 137 86 -184 44 -3 -122 80 42 5 -122
5497 -122 46 -6 -120 -6 67 -117 -55 40 -50 -23 -32 16 -32 163 76 -15 -90 -27 -34 33 23 37 -113 19 28 -2 -13 -13
5525 -13 -97 -70 24 -25 94 -36 66 41 -28 1 -17 9 -15 -51 31 -29 -9 -15 -120 -33 -9 -50 -143 15 7 -32 59 48 -10
5554 -10 -39 29 -4 -82 8 -55 0 -41 -30 -20 -2 85 16 -89 -46 72 -52 57 84 10 -139 62 71 -59 16 76 -173
5581 -173 -6 102 38 -144 55 -11 -108 1 91 -165 29 56 -38 -43 151 42 -3 162 70 -129 6 77 34 -24
5605 -24 68 26 -100 139 -15 55 -79 10 23 -4 88 -62 -73 -50 79 15 27 168 32 -76 -78 71 -8 94 -24
5630 -24 -42 -1 -58 40 -59 -74 14 -25 -35 0 41 17 23 134 26 -119 104 84 -78 -92 34 -75 -78 20 -22 -94 5 82
5658 82 -30 -35 96 -83 -63 -54 82 -50 -99 -18 -123 -54 73 -92 -160 112 1 -7 -74 86 -41 -68 119 100 -7
5683 -7 12 115 -71 -11 0 52 -52 33 11 -27 -74 52 -91 -54 87 12 -52 66 67 35 38 93 -104 -42 -10 50 4 16
5711 16 13 -79 108 58 41 30 90 -35 -55 -17 -21 -64 -3 -38 -8 22 37 29 71 -34 -31 79 -12 85 25 70 -72 -76 9 -108
5741 -108 -50 -24 -78 28 146 17 29 72 15 -74 -27 107 -111 73 84 -46 -58 25 -2 -20 60 50 38 -68 19 88
5767 88 4 111 48 -83 116 -29 52 -52 131 -75 27 46 -10 -145 98 111 -88 -56 135 10 -81 -17 83
5790 83 -74 -69 89 6 -129 131 -2 -58 65 31 -133 -6 78 44 -99 28 -20 -120 53 -13 8 105 -24 24
5814 24 -25 8 -22 -72 57 -37 -57 -33 4 -51 -50 77 39 -67 28 67 -84 12 33 -69 -5 -22 -51 -5 -65 64 19 57
5842 57 -14 -11 38 -60 28 16 62 -33 59 -45 -40 37 50 -50 145 80 28 -35 25 -81 -23 12 -25 -29 17 157 -81 -67 88
5871 88 -14 -53 10 -30 -30 -38 43 -135 -3 48 60 3 93 -43 -134 20 150 -39 -79 61 71 -133 2 -72 -142 40
5897 40 82 -55 -20 -81 -4 35 -1 -2 -13 42 9 -5 -17 10 49 -6 -32 -87 43 -37 -7 -74 -49 -15 -153 -63 -6 -125 38
5926 38 -100 -110 -45 -96 39 8 2 35 -25 21 -21 14 76 8 15 36 33 -64 32 28 55 -47 -29 -40 -44 121 -110 -98 27 11
5956 11 -25 -2 56 -26 -32 -111 37 85 -23 45 7 -114 31 -77 11 6 28 -53 2 74 -52 -47 41 -12 -63 81 16 -175
5984 -175 43 104 -42 -66 87 64 -10 2 -9 -144 7 52 -22 -43 86 93 -47 1 0 -106 -31 12 -56 -1 37 32 -71
6011 -71 12 55 11 -39 38 13 15 22 88 79 18 49 -36 41 -4 28 -79 54 -84 -63 -9 58 -6 -74 26 32 -27 -66 21 54
6041 54 30 20 -18 -95 -55 43 66 -59 -125 -2 37 73 -18 48 -44 50 106 56 32 26 45 26 -5 -3 -23 -55 -10 -47 -34 101
6071 101 -92 -21 15 11 -56 47 31 -112 -41 4 -84 45 31 12 -123 71 33 -59 -50 -13 -8 98 -99 101 19 20 49
6098 49 57 -16 -66 -4 -29 45 143 77 80 88 -25 -82 65 -24 32 -5 -7 20 37 -61 12 -1 106 -49 8 -28 -94 -3 -78 -80 14
6129 14 9 -24 -3 -17 81 47 35 -51 -17 22 -53 -75 37 -102 6 108 10 -69 -67 -5 96 -107 92 33 46 -16 13 -54
6157 -54 -8 33 -96 -3 52 35 -132 -34 21 -73 34 15 11 -22 56 35 -57 42 -22 -49 -60 104 -32 15 56 13 -46 62
6185 62 32 -104 -18 33 51 24 55 -41 -159 39 166 -13 39 -30 3 -150 -35 -1 -9 -42 19 28 12 -52 -6 26 -56 47
6213 47 -5 -30 -18 -28 90 36 14 153 -34 95 97 -4 62 39 45 -26 20 49 100 -3 -34 -29 -49 -40 4 -98 38 -31
6241 -31 -46 33 9 -31 -63 6 44 -35 -7 38 -110 39 15 37 -13 -106 -42 -93 46 70 -97 34 -2 -92 4 -40 19 -6
6269 -6 16 108 -74 -51 -38 -32 44 52 43 -91 41 17 -33 31 82 -33 1 -22 -19 -62 55 65 -48 42 130 49 -44 -27 -31 -94
6299 -94 4 2 -48 -91 -85 53 16 76 50 -109 28 -59 -33 56 16 27 -42 23 -8 -25 -5 -70 12 -50 -37 -28 -46 -33 8 -6
6329 -6 -82 -22 -42 -25 -68 67 84 -56 35 -30 -141 -7 54 -5 2 78 -76 -66 3 -52 -61 -34 -16 2 -17 50 20 1 -61
6358 -61 77 -34 -86 -49 12 -66 38 -112 -110 -36 37 -89 5 92 -62 -62 10 -7 -28 18 -17 -45 92 31 -2 -40 -29 -57
6386 -57 -27 8 -18 31 41 72 12 9 2 -63 -27 26 82 -41 -74 -13 89 -17 3 35 126 25 60 -23 -10 -55 -15 35 -89
6415 -89 19 5 -37 -50 5 -53 -26 -6 11 11 14 24 53 58 97 0 10 -57 85 -123 7 73 -3 -41 54 40 27 70 -6 37
6445 37 3 -3 3 -17 31 3 -1 38 -102 -53 53 71 -3 7 19 -42 -46 26 7 12 -35 30 19 32 13 28 -163 -17 81 -34
6475 -34 -97 -17 82 -36 36 17 -89 8 67 56 8 114 65 -108 20 11 -11 -52 1 -8 41 20 -12 -116 -49 24 -20 -98
6503 -98 -54 12 -23 11 -65 -54 -44 131 106 35 -2 -6 -62 -65 30 11 40 -3 42 -19 -13 -85 -94 51 102 -58 22 -28 -3 21 -28
6534 -28 31 44 -26 41 57 8 10 47 -57 -67 80 4 -59 53 12 125 29 109 -55 -8 3 -41 -22 62 55 5 -51 -21 -58
6563 -58 -22 46 -25 -106 8 13 19 -71 79 -40 -10 -44 -27 53 -20 -11 -158 -112 -32 94 -16 -1 93 38 -47 -22 -21 -9 33
6592 33 46 -102 13 50 -46 72 -39 21 -18 105 81 46 33 42 2 35 -71 -21 26 23 35 -35 -9 -49 75 -15 -26 16
6620 16 22 54 10 -51 -46 29 -15 -86 -30 -75 33 -25 99 38 -33 0 -43 45 27 6 -4 -47 -28 69 -49 27 87 -62 -7
6649 -7 43 -33 -85 -6 36 -85 65 53 5 2 56 12 -35 -5 14 -63 -4 -33 -13 -121 14 11 16 66 -45 -36 7 74 4 -98
6679 -98 -39 86 -31 15 70 32 8 45 -97 23 12 -33 -20 74 -33 77 -54 -29 46 44 54 -40 -65 -79 86 -5 -57
6706 -57 22 -32 -47 90 -62 17 -37 -23 -62 -33 112 50 51 74 -22 64 -80 1 115 13 -5 34 17 -102 -8 23 70
6733 70 -17 -12 96 -31 68 -16 -17 57 14 -114 12 29 59 72 9 -15 -12 -33 50 -1 92 3 -12 17 43 -41 -55 24 63 25
6763 25 -23 -14 -26 12 -46 87 -35 -10 18 -47 -20 35 -86 9 37 53 17 27 33 -54 55 73 -93 -141 48 -103 -54 30
6791 30 43 -25 -89 -1 -49 88 44 -40 -88 27 89 -109 -43 -40 42 25 -79 -33 -7 54 63 38 -78 8 80 -29 -8 26
6819 26 21 1 -37 39 -34 40 16 -72 -15 34 0 -59 -15 -46 1 1 -43 38 -58 87 91 -86 -66 -33 -61 -50 89 -62 39
6848 39 12 61 133 -79 23 33 -76 29 102 15 -30 38 -63 -100 22 4 -7 13 -36 -1 38 -64 -47 55 42 -41
6874 -41 -126 62 -19 -113 -46 48 -32 -95 9 33 -42 60 17 53 8 -15 53 36 107 24 -51 -62 111 80 -101 -80 45
6901 45 -19 -25 -27 -7 7 2 -37 -57 -15 104 -45 33 23 -50 -78 -61 -4 -62 -39 -49 -25 -27 -10 -8 -55 -27 105 51 80 83 -44
6932 -44 -130 143 42 -60 13 82 62 -91 62 -2 -47 -42 16 -110 -19 -21 -25 50 -25 57 5 -102 51 -79 -37 27 56
6959 56 82 -37 6 -32 85 48 -4 -66 -26 66 41 -34 88 -46 -47 22 -42 -2 64 35 -72 24 49 -16 20 10 -52 -98
6987 -98 37 11 97 57 -29 -32 74 5 -29 -51 -27 43 -28 31 20 29 19 -21 76 24 5 -60 -33 149 -7 20 22 -2 58 -39
7017 -39 -49 -31 84 -8 7 -66 18 -90 59 -16 106 -21 42 24 -24 1 -123 -4 54 -13 -113 121 33 -68 -4
7042 -4 -58 -26 38 45 29 -86 64 19 1 -29 45 34 9 74 -102 -166 52 24 29 -6 5 -48 13 -78 72 -17 -56 108 0
7071 0 -52 -32 53 -88 -7 5 82 -64 19 83 -57 11 -130 -56 -3 50 34 -69 107 -99 15 85 -9 9 33 55 -33
7098 -33 -19 120 49 117 86 -28 82 29 12 46 36 -36 -37 -132 0 51 -12 30 -101 -56 11 -130 53 96 -6 23 -22
7125 -22 18 -101 -55 -42 -9 63 -80 -22 -24 66 55 66 90 15 -5 32 -6 -72 -26 43 -85 52 80 -9 36 148 -13 10
7153 10 7 47 -89 -67 39 64 -122 1 31 -108 35 -54 0 64 -12 58 -113 57 -36 -54 20 -52 -14 -78 1 -29 4
7180 4 85 -41 -9 -36 -61 1 99 145 -1 -65 -96 -50 -34 44 -5 -20 75 -29 -41 -1 -68 50 68 -9 49 -53 50 -9
7208 -9 44 -45 -15 -2 151 -29 13 29 33 -43 78 40 -71 68 25 -2 114 3 60 -29 -1 14 -111 25 27 -3 5 -30
7236 -30 12 -18 -73 34 14 -46 -2 -48 -30 2 -55 -72 22 -45 -21 -8 84 68 -15 28 -14 -7 -19 -79 42 11 -121 45 -20
7265 -20 28 78 37 -24 36 -21 61 -13 -50 33 64 -25 -70 45 41 7 -35 23 -84 6 -41 -41 -69 44 50 112 -81 44 -32
7294 -32 -57 137 3 -60 -11 74 38 -91 7 47 7 -8 24 56 24 -45 22 -62 0 21 113 12 30 57 42 19 4 11 -73
7323 -73 -12 -72 48 94 90 -32 -7 5 -15 69 60 50 42 -18 -85 2 -55 -91 28 -8 -45 114 2 17 25 26 -7 -5 65 -33 6
7354 6 -99 -136 19 27 -69 -27 55 46 -48 -25 6 52 4 54 -37 -24 4 -83 -66 -68 96 3 -17 -18 9 -8 133 28 9 -67
7384 -67 148 -19 18 33 77 -4 14 23 64 1 3 106 -21 13 -51 -10 -21 29 -90 58 21 -36 -124 -45 48 -42 53 -27
7412 -27 -3 -126 4 -19 -6 -45 -21 -46 -67 -41 -35 -17 48 -1 28 -29 32 -16 -47 57 11 -7 17 5 -6 21 31 -70 20
7441 20 65 22 73 52 6 -121 -32 -34 -16 -107 35 -42 6 5 -115 -150 -119 29 -16 -30 -116 -18 12 -84 83 43 -8 15 -27
7470 -27 38 4 30 -64 5 73 -10 -98 8 38 4 74 58 -60 -41 -19 95 124 -87 -22 -65 -36 -31 109 -55 -16 24 -13
7498 -13 -74 30 -17 12 16 72 20 62 -44 4 11 49 15 24 46 94 61 -41 38 -29 -90 -70 59 -68 -58 17 9 39 64 38
7528 38 23 -46 14 19 -34 -4 -27 75 69 -36 25 90 -38 66 29 58 -35 -6 8 0 -58 -57 -41 -51 40 49 -108 -83 -63 -42
7558 -42 -61 -47 44 -12 -60 -30 -105 -34 42 70 -63 -115 -97 -75 -60 -39 32 -20 -71 38 -58 31 -31 -12 -83 -30 13 103 -49
7587 -49 -9 76 -74 69 21 90 1 79 37 -20 73 8 79 33 56 1 28 55 -116 -62 66 -21 -47 -32 52 -21 73 38
7615 38 -101 -10 -4 -94 161 -45 -7 -27 -41 11 -47 -95 83 44 -89 38 74 62 23 8 19 -87 -23 102 -7 2 12
7642 12 86 14 -31 -13 -35 -12 30 45 75 -17 28 -68 -43 -14 -24 31 62 -67 -16 65 96 -87 -127 41 -54 0 9 52 -27
7671 -27 85 30 -25 11 59 -10 33 25 70 80 39 56 -121 -25 -28 1 -6 49 41 12 -36 -48 -33 -28 -24 -5 70 3 -7 58 13 6 66
7704 66 -54 -16 -2 58 -57 74 82 26 54 23 97 8 85 20 -31 50 -3 -132 -82 18 -19 23 -26 41 -71 -22 -8 1
7732 1 5 52 35 -63 -124 13 27 -30 -31 19 31 -28 71 38 -64 -73 -20 -46 94 1 -11 -83 -66 36 -36 13 -57 -39 -65 37
7762 37 2 -22 -51 68 -37 -15 1 9 14 7 9 -9 -15 -33 16 88 -95 -16 -44 -14 5 -8 4 4 21 -26 -26 -43 20 -39 -34 42 4
7795 4 -3 -59 77 -82 -8 -8 56 -11 -29 -40 -47 -87 110 52 9 -49 -58 8 104 -7 52 13 15 45 -83 -59 66 -73 12 -44
7825 -44 65 -37 -129 -52 -4 63 -58 -44 -55 1 34 -25 -27 48 -42 -51 12 -31 -28 -37 33 22 -7 -1 9 -45 24 35 -1 108 38
7856 38 91 -166 61 -29 -55 15 26 -93 -14 -144 -29 44 -4 14 -102 -50 -56 -29 -82 -50 -13 113 34 -10 -65 -58 55
7883 55 -63 50 -14 31 -7 -31 52 -41 -36 72 -63 -30 -4 155 -63 -80 0 -29 27 95 4 23 40 -13 -2 -12 -7 -46
7911 -46 84 68 -114 -6 -23 -10 -66 127 -24 -39 -47 57 42 82 -83 -67 -119 11 25 49 -38 151 2 -18 -48 83
7937 83 -63 -47 -8 -3 -51 1 -6 -14 2 -52 68 8 -60 -1 -5 -5 -118 2 -11 -69 77 75 120 87 9 -4 -13 16 -28 42 75
7968 75 48 86 48 -55 -4 74 42 -8 -26 -16 -14 -119 -99 -16 3 -42 -19 47 26 -57 -39 -67 -96 -81 29 -31 51 22 40
7997 40 -21 -14 8 147 13 -4 -32 -18 8 -9 48 -102 -90 -20 54 33 8 -71 62 -30 35 56 -102 -12 85 -48 46 10
8025 10 27 33 53 73 -53 18 -60 -12 -67 -47 -53 -52 -32 0 29 -59 19 -83 26 -9 -21 65 -41 116 55 22 65 -1 58
8054 58 56 11 11 87 -111 6 -92 112 -71 -65 -28 -127 61 -22 28 -63 -70 -18 -120 -1 -58 96 44 6 -64 -24 10 41
8082 41 5 -18 -35 -1 66 -29 -32 35 110 -42 17 48 43 -23 -70 33 86 -8 33 11 -92 135 -72 55 -15 0 -14 20
8110 20 49 -90 48 5 -48 -129 -11 60 -29 -21 -23 -68 -12 92 -30 -44 10 -50 -20 41 122 54 -55 51 8 -84 -46 86
8138 86 18 77 5 1 -19 112 -8 36 127 -2 -28 30 81 -84 -19 -4 65 -8 69 12 -27 13 13 32 14 14 -32 -74 -50 -37
8168 -37 93 59 37 -97 -63 1 -1 -21 36 -51 21 45 -24 97 10 -46 -80 -73 20 32 -2 -81 -17
8191a7
##END NTUPLES=NMR FID
##END=
