##TITLE=1H_2PBDE1114
 CDCl3, 8 sc, 
 30.7.2019
##JCAMPDX= 6.0         $$ Bruker NMR JCAMP-DX V2.0
##DATA TYPE= NMR SPECTRUM
##DATA CLASS= NTUPLES
##ORIGIN= UXNMR, Bruker Analytische Messtechnik GmbH
##OWNER= root
$$ XWIN-NMR		Version 3.5
$$ Tue Jul 30 13:58:27 2019 Russian Standard Time (UT+4h)  she@DPX200
##.OBSERVE FREQUENCY= 200.13155
##.OBSERVE NUCLEUS= ^1H
##.ACQUISITION MODE= SIMULTANEOUS
##.ACQUISITION SCHEME= undefined
##.AVERAGES= 8
##.DIGITISER RES= 18
##SPECTROMETER/DATA SYSTEM= spect
##.PULSE SEQUENCE= zg30
##.SOLVENT NAME= CDCl3
##.SHIFT REFERENCE= (INTERNAL, CDCl3, 0, 20.1796)
##AUDIT TRAIL= $$ (NUMBER, WHEN, WHO, WHERE, WHAT)
$$ ##TITLE= Audit trail, XWIN-NMR		Version 3.5
$$ ##JCAMPDX= 5.01
$$ ##ORIGIN= Bruker BioSpin GmbH
$$ ##OWNER= she
$$ F:/spectra/data/she/nmr/H-F/1/pdata/1/auditp.txt
$$ ##AUDIT TRAIL=  $$ (NUMBER, WHEN, WHO, WHERE, WHAT)
(   1,<2019-07-30 13:56:50.01 +0400>,<she>,<DPX200>,
      <created by zg, POWCHK disabled, PULCHK disabled
       configuration hash MD5:
       00 E9 B6 7A A2 85 ED C7 34 08 36 98 17 FE 4E 26
       data hash MD5: 16K
       07 5D 36 0D F5 38 32 B5 2C 88 5A FC 54 80 4F 7D>)
(   2,<2019-07-30 13:57:29.51 +0400>,<she>,<DPX200>,
      <Start of raw data processing
       efp BC_mod = 2 LB = 0.24 FT_mod = 6 PKNL = 1 PHC0 = -9389.093 PHC1 = 30.60097 SI = 16K 
       data hash MD5: 16K
       25 44 EF F2 4D 8B BB 86 0C D0 95 46 99 A5 63 CE>)
(   3,<2019-07-30 13:57:43.37 +0400>,<she>,<DPX200>,
      <pk PHC0 = 4.699512 PHC1 = -5.8 
       data hash MD5: 16K
       4A F2 7C 27 14 33 B3 21 7D 1A 88 5F 45 AF 90 57>)
(   4,<2019-07-30 13:57:46.43 +0400>,<she>,<DPX200>,
      <abs ABSG = 5 
       data hash MD5: 16K
       74 DF 3C 55 8E 3F 84 59 3E 52 A6 3F 7D 0F 56 FC>)
$$ ##END=
$$ 
$$ hash MD5
$$ 3B 56 8C 92 D9 E6 AB F6 78 07 AD 87 B9 65 24 F6
##$RELAX= 
##$RELAX= 
##$RELAX= 
##$RELAX= 
##$RELAX= 
##$RELAX= 
$$ Bruker specific parameters
$$ --------------------------
##$DU= <F:/spectra>
##$EXPNO= 1
##$NAME= <H-F>
##$PROCNO= 1
##$TYPE= <nmr>
##$USER= <she>
##$AMP= (0..31)
100 100 100 100 100 100 100 100 100 100 100 100 100 100 100 100 100 100 
100 100 100 100 100 100 100 100 100 100 100 100 100 100 
##$AQSEQ= 0
##$AQ_mod= 1
##$AUNM= <au_zg>
##$AUTOPOS= <>
##$BF1= 200.13
##$BF2= 200.13
##$BF3= 200.13
##$BF4= 200.13
##$BF5= 200.13
##$BF6= 200.13
##$BF7= 200.13
##$BF8= 200.13
##$BYTORDA= 1
##$CFDGTYP= 0
##$CFRGTYP= 5
##$CHEMSTR= <none>
##$CNST= (0..31)
1 1 145 1 1 1 1 1 1 1 1 1 1 1 1 1 1 1 1 1 1 1 1 1 1 1 1 1 1 1 1 1 
##$CPDPRG= <>
##$CPDPRG1= <>
##$CPDPRG2= <>
##$CPDPRG3= <>
##$CPDPRG4= <mlev>
##$CPDPRG5= <mlev>
##$CPDPRG6= <mlev>
##$CPDPRG7= <mlev>
##$CPDPRG8= <mlev>
##$CPDPRGB= <>
##$CPDPRGT= <>
##$D= (0..31)
0 1.2 0 0 0 0 0 0 0 0 0 0.03 0 0 0 0 0 0 0 0 0 0 0 0 0 0 0 0 0 0 0 0 
##$DATE= 1564480609
##$DBL= (0..7)
120 120 120 120 120 120 120 120 
##$DBP= (0..7)
150 150 150 150 150 150 150 150 
##$DBP07= 0
##$DBPNAM0= <>
##$DBPNAM1= <>
##$DBPNAM2= <>
##$DBPNAM3= <>
##$DBPNAM4= <>
##$DBPNAM5= <>
$$ [...]
##$SUBNAM3= <"">
##$SUBNAM4= <"">
##$SUBNAM5= <"">
##$SUBNAM6= <"">
##$SUBNAM7= <"">
##$SUBNAM8= <"">
##$SUBNAM9= <"">
##$SW= 24.9336996594482
##$SWIBOX= (0..15)
0 0 2 0 0 0 0 0 0 0 0 0 0 0 0 0 
##$SW_h= 4990.01996007984
##$TD= 16384
##$TD0= 1
##$TE= 0
##$TE2= 300
##$TE3= 300
##$TEG= 300
##$TL= (0..7)
0 120 120 120 120 120 120 120 
##$TP= (0..7)
150 150 150 150 150 150 150 150 
##$TP07= 0
##$TPNAME0= <>
##$TPNAME1= <>
##$TPNAME2= <>
##$TPNAME3= <>
##$TPNAME4= <>
##$TPNAME5= <>
##$TPNAME6= <>
##$TPNAME7= <>
##$TPOAL= (0..7)
0.5 0.5 0.5 0.5 0.5 0.5 0.5 0.5 
##$TPOFFS= (0..7)
0 0 0 0 0 0 0 0 
##$TUNHIN= 0
##$TUNHOUT= 0
##$TUNXOUT= 0
##$USERA1= <user>
##$USERA2= <user>
##$USERA3= <user>
##$USERA4= <user>
##$USERA5= <user>
##$V9= 5
##$VALIST= <valist>
##$VCLIST= <CCCCCCCCCCCCCCC>
##$VD= 0
##$VDLIST= <DDDDDDDDDDDDDDD>
##$VPLIST= <PPPPPPPPPPPPPPP>
##$VTLIST= <TTTTTTTTTTTTTTT>
##$WBST= 1024
##$WBSW= 4
##$XGAIN= (0..3)
0 0 0 0 
##$XL= 0
##$YL= 0
##$YMAX_a= 80955
##$YMIN_a= -54715
##$ZGOPTNS= <>
##$ZL1= 120
##$ZL2= 120
##$ZL3= 120
##$ZL4= 120
##$ABSF1= 20.17965
##$ABSF2= -4.754242
##$ABSG= 5
##$ABSL= 3
##$ALPHA= 0
##$AQORDER= 0
##$ASSFAC= 0
##$ASSFACI= 0
##$ASSFACX= 0
##$ASSWID= 0
##$AUNMP= <proc_1d>
##$AZFE= 0.1
##$AZFW= 0.1
##$BCFW= 0
##$BC_mod= 2
##$BYTORDP= 0
##$COROFFS= 0
##$CY= -3
##$DATMOD= 1
##$DC= 0
##$DFILT= <>
##$DTYPP= 0
##$F1P= 0
##$F2P= 0
##$FCOR= 1
##$FTSIZE= 16384
##$FT_mod= 6
##$GAMMA= 0
##$GB= 0
##$INTBC= 1
##$INTSCL= 8.052554e-10
##$ISEN= 128
##$LB= 0.24
##$LEV0= 0
##$LPBIN= 0
##$MAXI= 10000
##$MC2= 0
##$MEAN= 0
##$ME_mod= 0
##$MI= 1.114404
##$NCOEF= 0
##$NC_proc= -9
##$NLEV= 6
##$NOISF1= 3.799351
##$NOISF2= 2.8
##$NSP= 0
##$NTH_PI= 0
##$NZP= 0
##$OFFSET= 20.17965
##$PC= 1
##$PHC0= -9384.394
##$PHC1= 24.80097
##$PH_mod= 1
##$PKNL= yes
##$PPARMOD= 0
##$PSCAL= 0
##$PSIGN= 0
##$REVERSE= no
##$SF= 200.130006456033
##$SI= 16384
##$SIGF1= 3
##$SIGF2= 2
##$SINO= 5.538805
##$SIOLD= 16384
##$SREGLST= <1H.CDCl3>
##$SSB= 0
##$STSI= 16384
##$STSR= 0
##$SW_p= 4990.01996007984
##$SYMM= 0
##$S_DEV= 0
##$TDeff= 16384
##$TDoff= 0
##$TI= <>
##$TILT= no
##$TM1= 0
##$TM2= 0
##$TOPLEV= 0
##$USERP1= <user>
##$USERP2= <user>
##$USERP3= <user>
##$USERP4= <user>
##$USERP5= <user>
##$WDW= 1
##$XDIM= 16384
##$YMAX_p= 363471533
##$YMIN_p= -957026
$$ End of Bruker specific parameters
$$ ---------------------------------
##NTUPLES= NMR SPECTRUM
##VAR_NAME=  FREQUENCY,     SPECTRUM/REAL,   SPECTRUM/IMAG
##SYMBOL=    X,             R,               I
##VAR_TYPE=  INDEPENDENT,   DEPENDENT,       DEPENDENT
##VAR_FORM=  AFFN,          ASDF,            ASDF
##VAR_DIM=   16384,         16384,           16384
##UNITS=     HZ,            ARBITRARY UNITS, ARBITRARY UNITS
##FACTOR=    0.304585238361707, 1,           1
##FIRST=     4038.55335530184, 0,            0
##LAST=      -951.466604777996, 0,           0
##MIN=       -951.466604777996, -957026,     0
##MAX=       4038.55335530184, 363471533,    0
$$ Real data points
##PAGE= N=1
##DATA TABLE= (X++(R..R)), XYDATA
$$ [...]
9148 -273975 -373048 447 291142 94789 41884 -158740 -145917 -49445 -353265 -341943 -251780
9137 -251780 -290845 39962 -63134 157090 -132071 -220930 -69689 -457162 -371657 -279111
9127 -279111 -93632 -305603 -564549 -165985 -136822 136856 -111168 -425150 -99931 271580
9117 271580 282822 159142 120182 -229520 -127089 6988 22017 24415 23000 -49644 -422349
9106 -422349 -344143 -65238 -40780 -42518 -71528 -98887 -166795 135582 -247086 -194008 20575
9095 20575 127729 -343211 -97842 -860 -165376 -107679 9620 161676 -214047 -215037 -208365
9084 -208365 -287328 -21297 71004 -91231 -330078 -183536 -30709 203791 -136671 145722
9074 145722 -58995 -425186 -672227 -387823 -395327 -577885 -256350 -184125 -411404 -253983
9064 -253983 453338 122482 -25384 -123755 -1086 -462541 -312550 -438682 -310854 -580686
9054 -580686 -356511 -105679 -196533 93793 242707 140573 123889 -493651 -296312 252326
9044 252326 -75111 -94427 -427962 -562269 -472871 -409072 -384943 267058 50214 -91617
9034 -91617 -233443 -52080 -273945 -181142 -447679 -371288 -252890 -83135 -94732 -240903
9024 -240903 208135 -200970 -38933 317768 78758 -209595 -95611 -85311 -95284 18303
9014 18303 -327103 82555 159987 -14558 174907 -148395 -297707 -250952 -369037 -341053
9004 -341053 -198430 -269918 104568 73708 -350479 20360 22187 -355320 -205858 -35055
8994 -35055 -80823 68736 94393 81253 -279734 -218936 101594 -215851 179252 352501 482721
8983 482721 289587 353720 380614 119150 99187 435784 161032 434078 664588 96944
8973 96944 69115 190418 559692 61909 29841 313285 221631 537075 -133347 189097
8963 189097 422961 881331 1129954 776684 -17660 312939 563228 602227 586828 392468
8953 392468 582681 465224 400487 563216 743552 681852 474520 785923 853205 657484
8943 657484 408704 762885 598153 264967 696938 562897 665863 1059619 844509 754735
8933 754735 791740 703372 618306 461595 390034 442231 609642 -221178 344696 365341 406644
8922 406644 414672 644438 531040 315524 672889 560044 337970 689036 948605 534690
8912 534690 232117 381208 365455 406379 645559 213208 92259 104475 479222 424559
8902 424559 230928 127518 167655 467290 395651 237112 117619 387511 417071 323978
8892 323978 288223 561007 722882 232106 -43787 -30933 -114074 121158 37654 -158738
8882 -158738 -406997 -134834 154936 353103 51972 78780 -86 211768 266669 -153911
8872 -153911 -130497 32792 -164613 -185188 -107709 -205138 -300134 165867 -105347 40294 212241
8861 212241 -208316 -295323 -415403 -364213 -132847 155122 -157127 62279 12502 -136606
8851 -136606 -217119 -230019 -309685 -510727 -371130 -313034 -169685 -136753 -390057 -520117 -183104
8840 -183104 219973 51565 -245292 -152557 42423 -50594 -74528 26727 -138121 -92
8830 -92 -52963 -289913 -230858 -185531 -182967 -301407 -294734 -825770 -251647 83001 -7960 41481
8818 41481 -90924 -89511 -12062 -333678 -239868 74160 114027 89420 37032 -21094 4709
8807 4709 -270233 -295584 -201751 -294859 -359941 -421838 -330300 -113329 -240471 -307818 -162579
8796 -162579 -161001 -91077 203350 281052 -197206 -284914 100361 270287 133925 -500692 -407468
8785 -407468 -173460 277400 236663 -150034 104671 839 -133771 -71444 -51455 -114045
8775 -114045 -334302 -213889 -32591 -236178 -160598 -61380 -445138 -451480 -145132 -190769 -279678
8764 -279678 -606508 -500551 -225833 -231472 -199593 82720 180981 149868 33482 125676 339800
8753 339800 -284876 -209726 -201761 -74267 -264028 -197556 544238 351741 174353 -36170
8743 -36170 -284641 -193014 135260 167823 145637 5842 -30874 140410 80672 183356 41425
8732 41425 -422832 -275736 -599234 -177836 -167596 96690 381414 126879 108038 54708
8722 54708 -50303 318687 419387 -33954 12028 258971 101535 -220262 -170150 -196466
8712 -196466 -20405 -279068 -245905 -154869 -61097 -358458 -269607 15893 -204326 -211914 -141691
8701 -141691 -1729 206939 125491 -309345 109415 397856 124117 -420041 -525732 -289498
8691 -289498 150980 -203749 -345106 -239983 -210133 -460823 -243938 241802 -30960 27751
8681 27751 -187420 16803 99688 410658 460362 66989 -177346 -350356 -335899 -414825 -361300
8670 -361300 -332783 -510254 -630053 27714 309889 358152 -157018 28304 -99601 -101934
8660 -101934 3280 -182774 -114299 -454158 -69496 -5632 124334 116638 129909 -264554 -234418
8649 -234418 -36266 87363 137813 202337 -165278 19792 165897 -107548 -158566 37311
8639 37311 350740 206117 511857 91839 21950 -248118 -91392 -216749 -330937 -120481
8629 -120481 5676 168485 -271103 -782794 2416 -35449 -101828 -162590 -640692 -471517
8619 -471517 -239312 63393 159836 48561 190655 255357 -91866 -227602 -150872 -101510
8609 -101510 26634 70005 -105403 -116350 -33168 286394 37940 -124832 -94418 82151
8599 82151 -348280 406102 105203 -91397 18757 -242481 -294855 -469194 -491325 -122593
8589 -122593 -144096 -34315 -274977 -715806 -566973 -162481 385182 -140696 -108817 21778
8579 21778 -214964 -166439 168797 241528 252672 46236 18950 -122745 275883 160544 -283509
8568 -283509 185858 -142162 148912 101152 189965 -28858 35208 -138635 -490475 -295847
8558 -295847 -103901 190964 54158 -195876 -266258 129175 82935 223681 -260287 -301734
8548 -301734 180397 430233 357968 223316 82786 -103987 -163605 -246384 -283372 -661435
8538 -661435 -174159 -154805 -107647 -265087 71079 187807 63995 -297013 -200927 -162060
8528 -162060 -558969 -301924 -45481 4621 49918 101620 404808 93568 178848 -20431
8518 -20431 -256840 155948 318884 -63537 -99301 61880 188714 176731 -356879 -59793
8508 -59793 121440 148923 -24609 296325 216219 -189985 -231736 10618 -175970 498899
8498 498899 -307380 -27244 -106339 -10054 -82031 -204144 -118484 -204648 -48044 -70422 -45502
8487 -45502 -319823 172539 280545 -191720 -169616 -229493 510149 -29612 123056 20502
8477 20502 67110 -282413 -232090 -371746 357501 2266891 1360473 765549 269784 235566
8467 235566 219715 447139 271081 72400 -67777 98357 -102858 -221290 206938 191939
8457 191939 -187182 18010 162759 -230001 -45973 254431 274609 418512 96831 -77806
8447 -77806 -190008 -103357 -321493 -97156 -25122 -320776 105765 433183 147057 -114584
8437 -114584 -138651 387927 145409 348559 233428 278641 262950 10094 385471 -95828
8427 -95828 464018 266020 33289 5564 -194057 306812 -6883 321048 360091 337788
8417 337788 501411 264380 560638 -30385 -126879 265584 100326 189265 219543 246119
8407 246119 292220 34876 -327245 2830 193415 -197558 40151 279063 275529 361156
8397 361156 127862 389015 33430 87830 332133 -11445 50703 375732 510158 551354
8387 551354 434259 179987 220493 81075 317399 463524 74301 -125103 -260537 -407490
8377 -407490 -223945 -21385 129043 81018 10782 5349 -170983 145969 434960 109700
8367 109700 -38481 -193381 -380102 -72818 -130623 -308667 -473477 -211767 153245 166593
8357 166593 6916 -142903 271810 133890 -63419 14338 -5601 229881 227186 292939 -164160
8346 -164160 119975 -55100 -90451 -273703 -296998 -4222 165660 406320 427732 123532
8336 123532 176265 56038 -361895 -359882 262184 532562 7314 395228 33878 -163818
8326 -163818 -276733 -13056 11959 -301293 -242481 -26195 203043 322185 153361 332901
8316 332901 170738 -165296 -166102 162185 142225 -24339 -157940 -105282 17043 325749 361697
8305 361697 687204 377648 73725 -191727 263484 261622 203782 335830 122201 -159416
8295 -159416 85447 157211 188501 254143 334790 500419 302612 72537 325539 377527 -154346
8284 -154346 -285880 -55162 57126 -93606 52474 -65331 350137 173857 -289527 -505428
8274 -505428 -430349 -151440 68016 423168 460675 132466 63722 34810 282818 437992
8264 437992 368825 299237 74442 -73969 190094 647087 -139731 22169 191660 151851
8254 151851 480351 359452 653937 422041 393301 24695 401025 150665 294914 204941
8244 204941 249945 245342 262842 -102630 465130 390910 304501 430623 433692 109833 165406
8233 165406 254429 119763 -137206 -59396 485105 604436 452157 219849 454394 639505
8223 639505 737530 435874 966279 1216362 1148312 871993 1157993 797752 1171669 1136123
8213 1136123 1156721 1334049 1696851 1957374 1854767 2640163 2616502 2690817 2594297 2169383
8203 2169383 1904641 2070688 3021942 2196485 2530754 3144013 3137642 2314039 2999044 2752836
8193 2752836 3963656 4388538 3866432 3861040 3003217 3187958 2888755 3256675 2739426 2899144
8183 2899144 3004654 3352452 3278852 3345636 3471423 3186032 2981868 3365580 3227306 2841384
8173 2841384 2142110 1878549 1868760 1357365 901236 1241410 1327496 1390157 1154346 1037059
8163 1037059 1206999 954636 875843 612284 570191 762365 694484 589735 347388 443329
8153 443329 565347 574705 292497 483126 382299 437548 128287 154785 298304 -5421
8143 -5421 259974 381189 443406 561052 359427 174946 761003 557818 496672 128317
8133 128317 64927 19522 -149046 87272 54408 94909 19571 157086 142403 97630 684015
8122 684015 364839 -8570 711163 495965 294334 471102 655912 551317 644444 863970
8112 863970 719742 606150 513991 824945 1012231 922695 989593 1225041 1310796 1081183
8102 1081183 1161841 1623220 1515793 1937886 1760756 1696909 1470028 1498766 1976549 2239187
8092 2239187 2370685 2770155 3283158 3985638 3718809 3900578 4184326 4314531 3949831 3626283
8082 3626283 3497408 3389693 3186637 3246687 3560888 3664020 3743567 4062117 4116772 4092395
8072 4092395 4191346 4176031 3937211 3911362 4152740 4102190 3677127 3374136 3384305 2972862
8062 2972862 2932530 2774374 2708291 2807774 2722155 3142653 2953907 2965616 3144867 2347714
8052 2347714 2223070 2009246 1792114 1346179 1554562 1742049 1467578 1181626 1427807 1327943
8042 1327943 752488 1007242 773237 614248 870240 1163585 1044924 944541 670543 893485
8032 893485 988079 742882 710577 653606 1051368 761887 847631 833504 398833 195978 831458
8021 831458 764845 750589 840284 520364 262535 448113 782527 659779 497964 533120
8011 533120 167216 175750 -42809 59618 201633 356050 490312 446717 206362 130562
8001 130562 465698 740466 242787 543902 99828 4845 290428 170044 686881 679975
7991 679975 771216 785010 871869 956327 761681 586884 397393 250280 442263 233620
7981 233620 583326 571763 479166 946403 775770 672280 1007792 899128 766669 584916
7971 584916 368779 760411 913021 881699 894693 839728 702744 942883 1168771 771827
7961 771827 777313 896486 783084 993146 1265480 1083678 1112452 1065182 833113 866619 861555
7950 861555 762839 557162 1014037 731519 1034109 854007 798477 994599 1057609 1296654
7940 1296654 1324683 1293783 1100118 1065179 1069938 1034501 1430183 1430216 1793683 1854769 1923125 2126352
7928 2126352 2061849 2258462 2435913 2840267 3266606 3608883 3497775 3799512 4733738 5126807
7918 5126807 4908923 4959732 5461296 6209860 6875383 7941083 8037486 11096445 14456105
7909 14456105 18306910 22913736 27675639 31458062 35636441 38991289 42340956 45608325
7901 45608325 47098823 41213469 33820093 26613285 19544086 15440248 12643289 10796692
7893 10796692 9110335 7878462 6818946 6006065 5545731 5236466 4970844 4901517 4749024
7884 4749024 4472353 4081625 3976474 3488939 2903961 2906121 2733969 2255641 2465095 2205325
7874 2205325 2190209 1816928 1586064 1520551 1137588 1156291 1677712 1500461 1092312 1039771
7864 1039771 1149116 731050 858656 1030367 835096 1021612 1257389 1164760 1098591 787627
7854 787627 832200 463297 235291 578753 605340 548872 651137 220781 541967 628619
7844 628619 736776 528354 350141 744466 481053 779118 787360 857552 879213 330244
7834 330244 681876 853470 744583 862726 663259 299238 367037 278528 857114 866917
7824 866917 690515 790700 572098 368810 434560 928354 645631 804739 895900 762568
7814 762568 758107 590986 733110 604526 882006 1026931 613371 751895 881559 636153
7804 636153 529846 345093 532059 609418 721705 788241 772527 718773 676319 691032 832764
7793 832764 830746 725236 307579 770428 444690 627605 859114 711040 822532 442830
7783 442830 241023 450570 566252 1138787 608246 418195 520525 464254 440686 413371
7773 413371 513834 384835 301246 460361 493951 480827 414673 390361 368652 471150 728409
7762 728409 380630 531844 415588 29430 410697 713030 468322 696266 256844 87095
7752 87095 293205 358114 346714 491680 414325 190184 -46533 374154 239632 179156 296619
7741 296619 -33723 -228904 -241762 257570 519957 509977 970450 700923 421991 657967
7731 657967 764265 454124 853550 1047167 653129 465776 521710 540757 661400 523730
7721 523730 490681 54803 322052 549615 625798 544883 652295 542448 854794 444532
7711 444532 557885 452069 233336 182752 321267 409545 169117 99902 251973 615374
7701 615374 399580 -30475 964609 1261955 719675 844247 544938 710726 838852 1113327
7691 1113327 602066 652773 910781 353459 174345 792513 998606 873702 731183 561853
7681 561853 716710 633469 645806 798118 219467 647175 801418 791478 1277488 1239864 798023
7670 798023 587248 851270 979239 820035 609337 749789 691389 905230 915859 777774
7660 777774 788267 889030 789406 602190 667694 707913 707613 540419 720773 383413 736887
7649 736887 546454 299329 374776 676776 520131 508680 379104 425580 825018 1014742
7639 1014742 657931 909434 989067 707783 911971 449084 939305 787222 492315 326137
7629 326137 498255 479099 476250 652667 486571 384612 191709 297729 318374 664951
7619 664951 826473 435794 404372 565756 764805 629720 708920 1059526 910395 1222793
7609 1222793 840768 1338164 703855 386417 452443 756894 1161667 940393 841249 1139608
7599 1139608 1042300 804105 1232018 994037 728556 439074 402810 500071 623585 748489
7589 748489 1063901 1384582 1171597 1134268 1629855 1260199 1050953 1489039 1201020 910987
7579 910987 990606 969636 1043607 1285566 1386489 1087918 962205 1181927 1659550 1071769
7569 1071769 1324464 1345725 1054060 1599581 1271507 899663 595059 861638 1424181 1462957
7559 1462957 1357871 1161292 1503773 1572484 1420885 1080271 1432426 1305521 965069 1218816
7549 1218816 1609806 1321936 969087 1469241 1563462 1327894 1706122 1521713 1329900 1503581
7539 1503581 1753224 1959412 1891479 2211341 2089668 2096186 2163798 2029638 2032528 2024441 2285921
7528 2285921 2325339 2507645 2861970 3016892 2942895 3327074 3718944 3733099 3446259 3488467
7518 3488467 3630791 3561801 3891009 3956800 4351168 4461929 5021582 5230040 5611974 5423894
7508 5423894 5537474 6013615 6195669 6091473 6759448 7379321 6773038 7535330 8085163 8069979
7498 8069979 7913215 8163650 8734273 8658745 8883296 9366950 9192897 9171536 9663098 9974726
7488 9974726 9912966 10116616 10215475 10503512 10841498 10990057 11351253 11346702 11493129 11452725
7478 11452725 11745016 12168801 12000998 12132821 12233880 12818666 13280225 13390218 12839101
7469 12839101 12637732 13207053 13333926 13268566 13418090 13353423 13587769 13465248 13463638 13624100
7459 13624100 13419688 12907733 12911224 13032379 12823054 12859831 12468469 12449591 12522074 12511493
7449 12511493 12852687 12515821 12313939 12461179 12261235 12092943 12253177 12365820 12035584
7440 12035584 11830757 11788285 11278232 11096157 10946316 10863677 10725227 10427375 10347822 9846674
7430 9846674 9669012 9263767 9305009 9108726 9168303 9208620 8804055 8935768 8446224 8169559
7420 8169559 8122868 7881168 8247065 7812809 8020800 7928087 7519875 7500028 7432692 7796518
7410 7796518 8210770 7997315 8113866 7711105 8017576 7922152 8002998 7516951 7095226 7203010
7400 7203010 7270734 6882006 6733054 6990452 7213843 6962113 7105447 7060819 6660031 6875867
7390 6875867 6467554 6939443 6769205 6666837 7135139 6795887 6209626 6322553 6334798 6377491
7380 6377491 6327509 6732397 6901024 6559065 6350677 6568157 6383743 6258156 6530572 7409686
7370 7409686 7251959 6630730 6813743 6630466 6534718 6061147 5976865 6419740 5906156 5691604
7360 5691604 5520642 5040327 5013123 5115939 4732152 4940602 5018115 4744993 5047709 4959388
7350 4959388 4640925 4240974 3907315 4111843 4205170 4149013 4009195 4109206 4053575 4131712
7340 4131712 3352348 3336591 3425455 3519163 3311559 3195675 2776867 2470698 2425692 2574580
7330 2574580 2719883 2721080 2574819 2172558 1907647 2079626 2258407 1748153 1752972 1909177
7320 1909177 1630007 1370127 1710886 1603189 1387274 1388209 1445011 1419659 1112633 1079958 1163039
7309 1163039 1395701 1091931 909898 1214530 1056393 902017 597302 1006235 872711 724056
7299 724056 837543 855607 882976 863742 838349 1326557 1197208 449773 450067 515407 587917
7288 587917 399553 374682 209097 436541 284079 344862 496447 503392 384965 79164
7278 79164 229860 343930 278864 514077 689021 95091 388101 407849 333642 27240
7268 27240 -201335 -46677 -125394 311718 269466 -124696 112111 20112 132797 -183603
7258 -183603 -118092 230099 312741 -27884 -76416 6984 75281 81324 -269696 -162210 -269009
7247 -269009 -122787 -22153 -70012 197975 -117243 516606 30970 -2255 189589 201094
7237 201094 106090 71014 328242 55384 -60845 -70696 38816 5525 256036 361065 274718
7226 274718 304204 108643 -133024 -265988 -752958 -624145 -217874 -109372 -12915 -71115
7216 -71115 -239519 -282266 -122735 1311 -164572 -366367 -170541 -504356 -204687 167633
7206 167633 291167 6980 -100167 95481 32596 147832 296122 796092 358922 -206001
7196 -206001 170998 490964 608111 142327 -46888 629782 208490 91870 32673 111733
7186 111733 22149 172402 20850 26072 131203 98883 68359 153520 85807 -61251 299496
7175 299496 397423 -131843 179254 8017 264417 500745 121728 505166 119140 169563
7165 169563 85636 167422 463714 201177 98550 -78397 -57005 194171 380364 282715
7155 282715 94334 -109989 288989 127159 -46474 90972 -116495 139605 195064 509970
7145 509970 471117 549379 398917 -120616 83950 -70209 -22985 244542 98850 125220
7135 125220 357457 191491 181742 307841 679151 957229 510543 455814 748500 891953
7125 891953 509112 597038 522434 607291 748901 586636 979522 905221 646625 552357 653301
7114 653301 509389 485682 757394 952755 891052 742716 573147 834082 776717 707757
7104 707757 906228 771379 865326 532611 785624 1317034 836664 962440 1141283 989532
7094 989532 351733 986679 1439750 912386 501233 841706 1241311 1481429 1161191 984697
7084 984697 1274530 1344405 1450086 770545 1063210 1489488 1522712 1745243 1574228 1504949
7074 1504949 1788763 1811656 1965168 1441938 1817605 1827081 1667363 2017169 1791398 2182770
7064 2182770 2146250 1444574 1364061 1606850 1401511 1824089 1647072 1986803 2018311 1922230
7054 1922230 1951963 2007858 1892395 1705218 2041072 1936070 2159849 2166724 2088584 1958836
7044 1958836 1938424 1987677 1482419 1845511 2354712 2195520 2375321 2163521 1789081 1531595
7034 1531595 1728558 1937813 2226747 1878196 1621821 1766934 1872885 1855431 2048043 2209836
7024 2209836 2471911 1619489 1433247 1592736 1818170 1924004 1608865 1756884 1411623 1555234
7014 1555234 1836328 1740770 1729540 1168248 1234634 1217544 1279542 1459600 1456116 1265559 1234414
7003 1234414 1161261 1319266 1100802 1401425 1017629 524167 762197 801351 1099750 877043
6993 877043 1012936 1138829 923903 987494 980529 948777 1111292 790353 1066363 981897 1041163
6982 1041163 998003 748833 798209 852703 1106508 1270483 1081266 798674 858469 816190
6972 816190 1082893 976651 834061 1097555 1098765 723400 853041 810855 886835 567034
6962 567034 488229 1049343 809505 65377 239090 544237 617025 856576 811331 1053453
6952 1053453 869877 737592 699397 436996 620205 401319 577275 898701 670999 930520
6942 930520 792805 722848 736296 660955 578282 845589 743472 390282 568955 777890
6932 777890 673852 997687 930002 816320 1060787 938127 463245 442880 280057 658131
6922 658131 868902 582705 647832 524654 571379 840670 596306 1031819 1027265 912003
6912 912003 891268 721814 933248 1070891 1052735 520589 206371 595751 757914 1331318
6902 1331318 984324 784857 687044 747224 578599 862978 673146 871540 693358 744130
6892 744130 975854 1113569 1206479 1206133 1221469 1061013 814076 651242 1218895 1706617 1512989
6881 1512989 1210300 1261216 958946 1258034 1231685 1682341 1213438 1419361 1126183 1020641
6871 1020641 1214833 1283613 962928 1383313 1381536 1255136 1294049 1183614 1341824 1339102 1374295
6860 1374295 1160593 1088575 970057 1231048 1411161 1648707 1565440 1372611 1112286 1320486
6850 1320486 1660202 1286406 1298787 1127967 1280312 1171163 969686 1176708 1010841 1190279
6840 1190279 815136 904314 1143334 1223021 996792 1206086 1062742 1302581 1278506 1229396
6830 1229396 1250407 1167077 1211906 968664 1194750 1080032 1357960 1409912 1571519 1327336
6820 1327336 1241056 1230627 1070598 1417072 1246825 1507843 1484000 1319403 1343604 1219468
6810 1219468 1075554 1151123 1248433 1190496 1642974 1377207 1273069 1468740 1804048 1582041
6800 1582041 1824288 1203216 1350084 1707223 1497458 2009550 1464658 2124344 2071122 1899595
6790 1899595 1863448 1663223 1739250 1374209 1297617 1675708 2198122 2355873 1991599 1993624
6780 1993624 2244571 1989228 1889490 1586509 1575678 1334130 1777423 1592113 1733652 1795053
6770 1795053 1957718 1736229 1955900 2070776 2082702 1745629 1748714 1617813 1696586 1694426 1555601
6759 1555601 1701359 1545396 1395236 1409398 1299779 1205546 1463459 1436093 1277883 1422780
6749 1422780 1452574 1694918 1423201 1149028 1283230 1435546 1874383 1617926 1324271 1339517
6739 1339517 1336186 1227564 1307671 1672989 1788239 1528654 1454323 1290298 1783740 1323803
6729 1323803 1318365 1288428 1208604 1493808 1310757 1482260 1684292 1571839 1615812 1414000
6719 1414000 2069341 1969232 2271415 2095142 2128282 2228266 1735288 1423281 1167057 1238612
6709 1238612 1424808 1666711 1696218 1822159 1645876 1845198 1874113 1929213 2520961 1881854
6699 1881854 1909558 2320800 1618249 1703663 1976461 2163094 2287107 2226746 2518048 2306161
6689 2306161 2404579 2636354 2890445 2942280 3065997 2967798 3159768 2895472 2929605 2901081
6679 2901081 3471517 3000849 2836009 3056494 3209108 3362470 3362814 3282890 3474879 3740665
6669 3740665 3864058 3950973 3946629 4306579 4539761 4770907 4753979 5082008 5364640 5994719
6659 5994719 6070738 6419844 6669613 6825024 7278431 7775747 7854338 8057981 8651701 8828459
6649 8828459 9106781 9503963 9410084 10366693 10471811 10860389 11105098 11505176 12324282 13173585
6639 13173585 13955013 14987094 15431483 16058335 16683164 17516459 18326318 19058871 19394359
6630 19394359 19955610 20784128 21196979 22185212 23522618 24406015 25843611 27266147 28368975
6621 28368975 29607216 30852964 32379857 33036720 33945676 35043130 35284057 35965287 36207411
6612 36207411 35576480 35370389 35094181 34948788 34261140 33674185 33193142 32173339 30921747
6603 30921747 30049823 28629942 27369629 26097235 25266668 23992913 23229413 22244509 20802445
6594 20802445 19307724 18642415 17830179 16826791 16109785 15235835 15294692 14468818 13839486
6585 13839486 13243739 12706689 12301026 11653732 11104049 10634468 10309778 9849542 9322800
6576 9322800 9130102 9009146 8816230 8669499 8340859 8116738 7776638 7621750 7510880 7302722
6566 7302722 7230647 7025742 6669744 6504303 6352076 5794374 5453444 5286245 5230264 5159915
6556 5159915 5288828 4951563 4558340 4893657 4970770 4671674 4651997 4594676 4209918 4064231
6546 4064231 4161588 3863803 4503894 4429747 4360141 3909261 3825720 3896186 4275861 4010929
6536 4010929 3494600 4020428 3724766 3536394 3671580 3759443 3719425 3723812 3536015 3513984
6526 3513984 3523793 3711821 3509446 3177406 3258334 3327819 3406255 3624680 3654373 3497253 3390825
6515 3390825 3576014 3333302 3319792 3320557 3398150 3240879 2974343 3076693 3059406 3443707 3769093
6504 3769093 3349604 3261668 2869196 3052977 2792705 2873590 3049850 2998454 3548090 3608907
6494 3608907 3022252 2923718 3167699 2823329 3425786 3346350 3329957 3146489 3201018 3075381
6484 3075381 2973881 2952172 2861136 3100257 3123697 3193468 2804662 2885099 3374853 2854337
6474 2854337 2675762 2985227 3050262 2885664 3092431 2754907 2841632 2981210 2921961 3391871
6464 3391871 2803219 2809661 3030747 3062369 2945681 2891180 2660378 2721216 2555746 2456890 2981009
6453 2981009 2687859 2514736 2609307 2481890 2844523 3012165 2889275 3073433 2465789 1978449
6443 1978449 2578601 2186334 2134661 2411999 2467143 2311918 2352318 2332231 2280185 1956291
6433 1956291 2548982 2303143 2296010 2715954 2575951 2621404 2481644 2552067 2706951 2665955
6423 2665955 2590584 2506410 2314875 2016210 1877353 2168310 1942061 2191560 2211897 2265347
6413 2265347 1865427 1896435 2131002 2149028 2144869 2031867 1892971 1827155 1764368 1699820 1995447
6402 1995447 1541827 1670523 1577136 1643785 2122679 1864891 1952508 2292439 1813951 1579783
6392 1579783 1810005 1690818 1921802 1478211 1825440 1398622 1452851 2114536 1934460 1767386
6382 1767386 1637234 1675404 1765344 1809872 1642870 1642837 2036402 1968690 1696563 1747503 2170284
6371 2170284 2252881 1878477 1648400 1616560 1867250 1619591 1502914 1566905 1656440 1202376
6361 1202376 1155196 1800025 2080427 1662468 1030771 1009826 977551 1395625 1666294 1579880
6351 1579880 1379505 1490399 1369040 1308785 1488981 1263769 1514943 1367508 1301528 1162121
6341 1162121 1246569 1799615 1626198 1496224 1316307 1070389 781371 916901 1032352 1112501
6331 1112501 1549080 1605511 1136671 1092698 1291975 1560543 1636699 1388636 765147 753050
6321 753050 834024 997171 1463321 1438301 1482593 1105566 1370996 1380855 1568267 1446819 994176
6310 994176 1040999 845555 1087659 983549 1226021 1440373 1545682 1421972 1134395 1370051
6300 1370051 998801 513335 353619 563834 525326 855206 997361 983512 745076 1069720
6290 1069720 1171909 979484 816141 946043 1144859 1230473 1073604 778672 571637 715376
6280 715376 344917 653494 939601 1053669 781341 1169154 1604246 982115 824212 1225108
6270 1225108 1122736 780927 685168 388811 638715 642125 510032 549270 871354 681026
6260 681026 779974 663587 1138331 1009751 761902 527664 546187 897152 991900 902797
6250 902797 1135616 621732 607210 394230 539099 952167 806177 470721 730745 1235146
6240 1235146 1020680 632373 566655 708810 446079 611286 875705 1179506 669625 918606
6230 918606 1082522 900708 976763 622576 930427 1060212 1103409 939631 884913 939247
6220 939247 1146203 982221 767829 749975 954930 809120 801969 1016081 968055 1146609
6210 1146609 896269 1207932 1075278 1045575 1264813 1499559 1334099 1200427 1375948 1381670
6200 1381670 1147041 1833317 1901235 2064838 1855210 1269550 1915277 1789010 2096660 2479589
6190 2479589 2103344 2286518 2915551 3323757 3625633 4140442 4162088 4715090 4875201 5023724
6180 5023724 5377286 5302781 5227134 4753460 4596042 5026762 5522491 5371444 5404008 5696556
6170 5696556 5480435 5187737 4836767 4639910 4143127 3561309 3184423 3196546 2872045 2632868
6160 2632868 2420713 2420230 2566817 2650847 2645155 2919260 3452791 3618157 3695999 4143786 4050606
6149 4050606 4732202 4665544 4701856 5381468 4873931 4994821 5122457 5282276 4704018 4810560
6139 4810560 4679525 4986256 5051456 5371519 5080154 4684746 4709794 4286863 3866198 3404670
6129 3404670 2915574 3571124 3762749 3601698 3913928 4045100 4354599 4880036 4982966 5313152
6119 5313152 5559890 5922474 5978717 5754893 5845341 5715632 5642105 5622609 5626243 5892649 5877201
6108 5877201 5584417 6206907 5928710 4930639 4998442 4753246 4691027 4646141 4361244 4549824
6098 4549824 4655352 5060323 4773118 5016158 5438862 5840887 6334604 6916837 7197486 7585855
6088 7585855 8185134 8421635 8580297 8442017 8378659 8692933 8127991 8148092 8122074 8476845
6078 8476845 8868571 8938820 9138540 9450025 9351943 9293109 9709661 9026285 8549370 7351202
6068 7351202 6412962 6702887 6398869 6239621 6297526 6183450 6381244 6300340 6852243 7451618
6058 7451618 7849971 7742125 7819286 8188198 8002292 8292915 7792086 7701846 7912508 7974700
6048 7974700 7931522 7537448 7744341 7745359 7948561 8019858 8406912 8685610 8751827 8851630 8609834
6037 8609834 8618592 7961615 7770787 8136437 8299906 7542533 7678686 7612603 7591412 7719479
6027 7719479 7458737 7291859 7128193 7237489 6921979 7205332 7218528 7292996 7565008 7746155
6017 7746155 8140145 8837267 8883549 8598088 8922794 9335568 9339903 8522666 8178073 7970059
6007 7970059 7855868 7373169 6877417 6935838 7001438 6937810 7269466 7763627 7812692 8019411
5997 8019411 8146354 8135528 8468714 8665620 8676206 8546807 8534776 8069128 7779322 8181549
5987 8181549 8399436 8576376 9011184 9302661 9429624 10066357 10044470 10076651 10097721 10260062
5977 10260062 9988298 9694748 9225077 9270848 9444976 9191268 8968695 9061673 9656676 9849360
5967 9849360 10117216 10647590 10887389 11164726 11704207 12222193 12422684 12579123 12142350 11834835
5957 11834835 11956292 11928759 11954860 11948052 12130763 12609027 13009149 13141349 13256564 14303864
5947 14303864 15073411 15957361 16447787 17042652 17558911 18113928 18241380 17520498 17183555
5938 17183555 16013626 14929594 14207980 13499696 13015000 12262131 12079972 12240293 12565530
5929 12565530 12550791 12668506 13198389 13319548 13961617 14612700 15084564 15424265 15749720 16054714
5919 16054714 16218210 16068433 15811073 15440263 15196893 14714836 14825169 14807950 14890263 14965597
5909 14965597 15130419 15684725 15866931 16039503 16363954 16361458 16715935 17180212 17882989 18713657
5899 18713657 18927729 19651928 20234679 20691261 21218298 21672741 22029375 22767185 23795049
5890 23795049 24215854 24916955 25549795 26974373 28074692 29096308 30221751 31332023 32445324
5881 32445324 32909926 33235232 33700946 34472153 35056136 35721018 36543086 37374289 38306955
5872 38306955 39553039 40924747 42638358 44667112 46231062 48777674 51493256 54102759
5864 54102759 57543135 60788390 64150287 67560869 70908719 73092313 74381821 75133319
5856 75133319 75201527 74122340 73292887 72714866 72228102 71836190 72454432 73393579 74082218
5847 74082218 75760736 77799378 79472490 81549069 84302815 87993657 91530889 96121674
5839 96121674 101273235 105924511 110699305 114564330 117174120 117953888 117322388 114546753
5831 114546753 110684823 106718952 103148106 99827501 97013584 94837481 93063559 92289195
5823 92289195 91670670 91612781 91967788 91900397 92596729 93987968 96571648 99895360 103620092
5814 103620092 107270994 110509102 112403005 112819061 111543675 108562157 104665783 99319067
5806 99319067 94199728 89272468 84565889 80650689 76990452 73866461 71071420 68853647
5798 68853647 66661344 64846161 63089964 62218462 61283677 61161210 61745665 62482102 63358207
5789 63358207 63642052 62947908 61898667 60221227 57765183 54446475 51184613 47661695
5781 47661695 44645847 41972350 39477409 37462154 35290500 33115071 31315249 29874818
5773 29874818 28040689 26801755 25435417 24559581 24167938 23405078 22822668 22379355 21709179
5764 21709179 21071489 20049321 19035358 18061196 17229439 16300136 15376999 13968156 13446325
5755 13446325 12819058 12281780 11580795 11016700 10305116 9518121 9143702 8608168 8485467
5746 8485467 8008491 7420231 7133977 6652300 6875983 6787946 6168603 5975458 5713274 5655923
5736 5655923 5614088 5325279 5451659 5099374 4732737 4878975 4719666 4337950 4174259 4176442
5726 4176442 4130962 3941610 3704610 3522300 3644197 3530496 3403761 3745310 3459230 2927289
5716 2927289 3187341 3227478 3050019 3267794 3176253 2920473 2601539 2417876 2334252 2147535
5706 2147535 2294107 2597179 2556823 2303005 2395003 2220039 2249510 2461359 2710506 2451584
5696 2451584 2249579 2482434 2719125 2578264 2652551 2611808 2381276 2108654 2067325 2265420
5686 2265420 1975276 2016404 2013614 2310330 1922436 2058066 2240834 1984835 1964398 2258479
5676 2258479 2109717 1960527 2193694 2362290 1978335 2211215 2550827 2231117 2384955 2479247
5666 2479247 2405625 2532350 2362033 2142637 2478004 2505511 2644657 2282833 2037697 2044603
5656 2044603 2263037 2348607 2331480 2472512 2129286 1930097 2279975 2394776 2112356 2029735
5646 2029735 2130353 1733553 2138225 2595235 2247642 2149412 2162185 2138085 2237631 2094996
5636 2094996 2186276 2546577 2221359 2188335 2051362 2048655 2187720 2459363 2157979 1981180
5626 1981180 2277234 2079146 2083006 2064994 1664524 1627734 1612516 1777868 1818340 1805515 1657405
5615 1657405 1629766 1809269 1640571 1689103 1356030 1195954 1320333 1803110 1451935 1472587
5605 1472587 1731389 1780068 1885019 1584069 1623559 1712274 1889658 2064907 1871023 2178111
5595 2178111 2358720 2179646 2558481 2659727 2686738 2456657 2489466 1948604 2350631 2322185
5585 2322185 2188267 2027678 2025918 2306318 2442534 2299500 2444065 2574328 2503888 2256870
5575 2256870 2289739 2352269 2354137 2422394 2547006 2459323 2600349 2972528 3255132 3096525 3110154
5564 3110154 3147295 3195363 3659153 4055149 4316555 4070976 4122646 4542978 4922210 4852364
5554 4852364 5080974 5271965 5705869 6631109 7533346 8689975 9999942 11585961 13082154
5545 13082154 15743228 17942042 19870026 21601347 23101082 24645841 25697730 25572320
5537 25572320 24498138 22565592 20012225 18664530 17227534 16408182 16424558 17583543 17960954
5528 17960954 19351983 21022443 23748816 27296592 31218540 35240161 38472020 42042133
5520 42042133 45254747 47581968 48882084 47532476 44112373 38470107 32826513 27981872
5512 27981872 23944564 20627030 18849490 17515425 16480940 16295771 16546419 17145102 18319853
5503 18319853 19643153 21638425 23107632 24568911 25927164 27048168 27387225 27674884
5495 27674884 26009650 22789560 19360718 16070635 13836679 11923973 10566607 9203630
5487 9203630 8582289 7111168 6594934 6202084 5768825 5426550 5217032 5173647 4735599 4200179
5477 4200179 4074143 3869405 3287718 2929563 2739162 2764180 2856526 2731800 2828899 2848660
5467 2848660 2550303 2074085 2462741 1990307 2030379 1872258 2002516 2053582 1791455 1891345
5457 1891345 1570575 1530851 1513144 1442944 1326670 1117570 1327837 1590218 1346459 1148198
5447 1148198 1196378 1445668 1330644 1115910 1223960 1493221 1554865 1467878 1071563 1431297
5437 1431297 1566723 1629359 1704524 1553006 1232352 1042082 1016372 1491763 1718637 1655254
5427 1655254 1407877 1624072 1715676 1269621 1363635 1229608 1249472 1330790 1300314 1279867 1366910
5416 1366910 1460908 1258637 1132145 1174970 1220606 1722456 1338965 1416816 1654914 1486614
5406 1486614 1362570 1669564 1374542 1469002 1596068 1314482 1052708 1489545 1416811 1348214
5396 1348214 1498254 1589336 1561325 1792046 1517865 1420343 1452799 1413978 1165246 889097
5386 889097 1263377 1149518 1225648 1631421 1483993 1405755 1155946 1365619 1423181 1139795
5376 1139795 1081903 1566868 1464988 1332434 1145497 965546 873428 1049848 1179054 936984
5366 936984 695853 483764 1097384 892105 790960 358872 238332 777844 780719 596301
5356 596301 951331 810996 582193 588279 830227 618997 765268 655518 694287 589738
5346 589738 1038985 748125 906161 708712 549550 608951 664891 189616 550699 679391
5336 679391 487519 347903 305642 219797 243354 302552 592783 351348 312740 809769 479684
5325 479684 685975 405079 488950 432942 464735 617061 549555 300897 550654 536498 491117
5314 491117 454934 352093 183231 505603 567544 152511 248999 188924 144010 282709 481443
5303 481443 601990 525646 425279 110848 196198 629696 721423 661675 387556 117285
5293 117285 155538 708729 942133 603424 753437 928870 800649 594672 905310 755086
5283 755086 565534 469704 8369 -53310 315837 786455 638224 550022 201727 353779
5273 353779 463343 297339 188277 252582 160388 292788 636343 353628 671720 624768
5263 624768 813048 251090 86565 139220 94219 144866 117102 -116746 201258 18760
5253 18760 75149 104455 229029 142555 201835 320881 -9324 -122441 105268 81890 -40492
5242 -40492 45346 -367450 67614 264484 130617 279038 75607 -175970 -19147 32879
5232 32879 -164369 -7302 18764 -180712 -202385 -132314 -171954 -28851 147824 -76072 110282
5221 110282 -139435 131329 136811 299343 509312 248235 12277 -187291 343131 329484
5211 329484 -77128 125731 262806 264063 88553 211706 111785 333552 78105 246706
5201 246706 148643 -18517 38690 -4443 166718 459877 321011 205406 299202 118538
5191 118538 32294 311605 377222 391683 9768 81490 159003 -418894 -119520 506548 237401
5180 237401 304994 130555 325904 467700 311326 388410 353160 279976 480950 548676 432206
5169 432206 417443 329146 426845 207912 761862 488429 671359 574696 708337 666654 454647
5158 454647 468127 360071 561847 576858 562887 626366 239305 237643 316174 708039 421193
5147 421193 607320 253641 348171 335687 434367 304632 205530 429472 318778 587999
5137 587999 591681 839670 399610 223967 204806 375350 500942 223721 186495 250047 410538
5126 410538 354396 120019 -114583 157918 -42564 274167 222110 692723 495455 290689
5116 290689 760301 350626 154769 473661 294987 262494 538003 463189 322184 -24507
5106 -24507 270886 418221 775699 441294 772419 567554 250157 352045 702780 710779
5096 710779 634800 378999 546908 158826 565279 999784 1010372 663900 340766 664754
5086 664754 887417 641506 264798 451992 517960 566696 551219 429699 594243 343566
5076 343566 242646 252068 310010 425289 790198 697413 857483 673549 606231 426582 553067
5065 553067 603761 493736 249259 368250 969911 675177 434643 274651 132601 49398
5055 49398 564269 561101 576831 604672 565118 827199 408312 401689 532988 639833 437858
5044 437858 409075 486491 457055 1122727 749494 598450 502395 705072 791337 962628 832128
5033 832128 499827 531306 939131 788932 567216 324615 290333 416028 499095 380556
5023 380556 642458 330486 759364 1003306 683809 722381 789077 847548 1051481 962005
5013 962005 675603 719470 844254 872478 636395 631798 540563 557552 604159 591386 586521
5002 586521 783549 826689 835035 407849 661393 685050 971086 1220557 981130 817553
4992 817553 897903 933021 763880 517350 500353 810554 664935 240541 217239 760560
4982 760560 970000 917495 709741 905866 674741 866750 772077 432207 595064 822687
4972 822687 782452 593231 825353 697842 1038190 862790 934331 1271389 955543 723576
4962 723576 830994 1021165 1021514 944367 1125442 1093702 1139086 947956 717991 714467 748770
4951 748770 1070597 1151660 1017093 1249988 1202480 1250505 1226919 1212480 1404610 1155899 1331288
4940 1331288 1274690 1363698 1118868 1194512 1053366 1462377 1318962 1183798 1488974 1531113
4930 1531113 1404821 1278860 1270609 1816947 1255851 1448409 1656682 1451419 1464833 1540584
4920 1540584 1545885 1620477 1842699 1492618 1653803 1395662 1427488 1056299 1498238 1655869
4910 1655869 1514523 1887358 1809962 1805259 1748275 2006811 2107782 2263704 2275331 2066348
4900 2066348 1981677 1825274 1981029 1756027 2075108 1724116 1792197 1504410 1378310 1573155
4890 1573155 1415528 1537815 1556068 1826886 1823999 1732329 2005705 1742403 2390156 2005031
4880 2005031 1849479 1853249 1730368 1796476 1918786 1756695 1630553 1808990 1646330 1611293
4870 1611293 1019045 1426591 1919829 1917152 1773852 2048634 2177360 1887549 1291600 1492041
4860 1492041 1760084 1713751 1784767 1711589 1995400 2044409 1871975 1837283 1946424 1929842 2056039
4849 2056039 1958929 2204554 1984113 2081770 1803818 1934030 1661287 1899916 2067892 2271041
4839 2271041 2500001 2751088 2359726 2057006 2132968 2417928 2418082 2344271 2526955 2302191
4829 2302191 2448713 2097630 2067384 2028164 2239356 2133648 2330889 2288746 2370384 1851137
4819 1851137 2162444 2459655 2303824 2447567 2546561 2127415 2367515 2689596 2695599 2558759
4809 2558759 2375662 2537755 2883174 2659180 2182696 2215666 2740969 2446684 2175553 2144092
4799 2144092 2505948 2741085 2682028 2780348 2943364 2872522 2924486 2698525 3027334 2547177
4789 2547177 2452663 2292867 2391023 2677207 2387478 2752151 2437780 2644626 2930671 3063566
4779 3063566 2926775 3160300 3050615 2637781 2609540 2799951 3253019 3011746 2891056 2788213
4769 2788213 2834948 3150274 3309646 3212247 3024383 2900291 2848948 2720751 3069637 3479493
4759 3479493 3551435 3422411 3449385 2798414 2864459 3192313 2838704 3013089 3216470 3407926
4749 3407926 3143278 3149088 3222815 3165750 3090340 3004296 3082655 3083008 3223656 3199625 2927034
4738 2927034 3157429 2970063 3274970 3534440 3442805 3395248 3515037 3672503 3406682 3472378
4728 3472378 3736247 3691983 3973695 3759455 3764369 3779361 3878664 3783823 4120777 3620798 3763074
4717 3763074 4007522 4052538 4342757 4272907 4371526 4317014 4302764 4094989 3959772 4068338
4707 4068338 4356830 4667904 4564589 4494415 4708809 3930360 4010093 4259295 4709546 4718767
4697 4718767 4799042 5105679 4661999 5144559 4917412 4975844 5323616 5694667 5961244 5773342
4687 5773342 6064475 6241314 6455280 6633804 6359918 6628371 6379570 6226574 6266855 6305150
4677 6305150 6422880 6443472 6174767 6010163 6322578 6280664 6231036 6692685 6844473 6677108
4667 6677108 6861890 7165989 7350318 7730361 8011867 8218180 7933105 7775685 8130528 8158746
4657 8158746 8203137 8292241 8884038 8742837 8512301 8374314 9109104 9231145 9359749 9412500
4647 9412500 9124082 8878265 9257146 9458491 9741418 10329238 10405850 10067035 10165752 10562677
4637 10562677 10691066 10461667 10930246 10787301 10806182 11253336 11045871 11156500 10859404 10901881
4627 10901881 10671764 10949458 10948553 11105437 11055401 11136284 10653895 10370308 10219071 10119632
4617 10119632 10571495 10368821 10259034 10552121 10439470 11039317 11054275 11040916 11152575 11435313
4607 11435313 11539443 11608119 12375386 12565357 12414759 12380409 12218112 12260426 11934801 11410691
4597 11410691 11523796 11503337 11233570 10961823 10921459 10851643 10545581 10450828 10910852 11026921
4587 11026921 11548370 11951895 12159685 12586221 13327303 13604392 14086123 14550365 14879552
4578 14879552 15076437 14779097 15341184 16180117 15867702 15677822 15508905 15619126 15887059
4569 15887059 16338468 16292564 16148094 16341252 15846818 15563325 15224764 14989527 15086710 15567778
4559 15567778 15725438 16043699 16851934 17358115 17600368 18164264 18593983 19157105 19980757
4550 19980757 20246245 21009560 21320472 21265769 21435475 21583394 21538360 21353051 20482315 19691909
4540 19691909 18590977 18013115 17069524 16652274 16228633 15564088 15003319 15120472 14986772
4531 14986772 14565137 14405899 14346664 14420865 14026804 14059413 14133294 13880788 13550194 13456373
4521 13456373 13159238 12853916 13131989 13403225 13569308 13376557 12795003 13269113 13502368
4512 13502368 13544419 13652751 13496461 13578274 14010714 14362524 14444871 14925218 15188976 15861057
4502 15861057 16282026 16522042 17542868 18072075 18986374 19735039 20681416 21294328 22875098
4493 22875098 24255992 25214764 27471984 29029293 30847552 33388683 36549493 41014783
4485 41014783 46625331 53668213 62499292 73044442 85076419 98509017 111827990 125545289
4477 125545289 138665114 149987524 155933260 157653735 154779091 146661087 134678371 120164434
4469 120164434 104672700 90192551 77781886 68123653 60898329 55475132 51300089 48635025
4461 48635025 46510167 44952489 44178403 43942840 43993114 43697243 43917627 44233487 44655923
4452 44655923 44562196 44012778 43015888 41915379 40544892 38719315 36890298 35089175 33306814
4443 33306814 31519732 29981498 29037005 28540151 27602771 27385058 27184321 27185693 27211238 26917936
4433 26917936 27060824 26931646 26941976 26749380 26500863 26703993 26651613 26730993 26223612 25993773
4423 25993773 26157675 25670542 25258535 24480668 23627777 22984264 22353525 21759792 21605735
4414 21605735 21437313 21416904 21112175 21043345 20749636 20224860 19780272 19268983 19178008 19057918
4404 19057918 18769538 18643983 18387295 18820927 18855682 18479197 18136380 18752489 18421295 17977495
4394 17977495 18593432 19210729 18825229 18959899 19273019 19446733 19430761 19467256 20005237 20331255
4384 20331255 20287041 20189597 20363868 20664503 21053513 21555435 21280113 21697255 22043281 22008494
4374 22008494 21548125 21818623 21690046 21513119 21639923 21829340 21862676 21729569 22538395 23035716
4364 23035716 22892943 22439677 22557400 22930934 23145058 23451412 23834964 23764693 23686345 24348556
4354 24348556 24599022 24106152 24261433 24435865 24123823 24238925 24326814 24131307 24594266 24422074
4344 24422074 24696846 24338511 24338476 24649132 24711038 24701067 24783897 25334450 25729885 25632618 25653707
4333 25653707 25781142 26449198 26530273 26510296 26915286 26584744 26404084 26542371 26714164 26276280
4323 26276280 25668278 26196322 26313512 25868577 25741443 25391691 25302148 25738501 25802090 26403561
4313 26403561 27003736 27114169 27522110 27520645 27959374 28077833 28325779 28694315 28782185 28550839
4303 28550839 28211811 27807598 27670195 27605336 27263493 27266271 26929762 26667326 26463781 26476040
4293 26476040 26031832 26407269 26808415 26988094 27203141 27194509 27759557 28233462 28106008 28485235
4283 28485235 28555738 28487151 28351198 28330062 27842257 27714266 27643991 27606701 27513883 27259113
4273 27259113 27187391 27101360 27331428 27434915 27757755 27733735 28091927 28412243 28365506 28256449
4263 28256449 28121359 27877693 27798235 27674626 28127450 28116693 27664150 27251367 27144898 26777469
4253 26777469 26282285 25915345 25722948 25260224 25435560 25817367 25652897 26011622 26162200
4244 26162200 26201435 26341390 26670897 26519655 26688471 26179895 25765086 25740507 25758493 25673327
4234 25673327 25916025 25650467 25609653 25501310 25044182 24933771 24100726 24316305 23751746 22892643
4224 22892643 23348853 22867899 22561883 22432825 22637731 22396841 22412015 22575664 22323996 22716084
4214 22716084 22677100 22373966 22303449 22261694 21932667 22000454 22054739 21783657 21876882 21602420
4204 21602420 21267894 21131692 21203321 21660716 21690120 21938499 21996715 22228744 22556945 23088850
4194 23088850 23570429 23471331 23388566 23218383 22999444 22991149 22808692 22436470 22114499 22094579
4184 22094579 21573447 22184177 22519140 23105347 23896420 24635115 25588546 26903740 27850781
4175 27850781 29610303 30695780 31586496 32590335 33053178 33048358 32671566 32508724 32045167
4166 32045167 31527239 30146921 28951668 28598740 28705364 28754819 28688681 29292532 29804150
4157 29804150 30525042 31066925 32148250 33511590 34652391 36206037 37674746 38461317 39615925
4148 39615925 40052518 40609658 40964379 40944356 40125532 39229593 38176986 36638106 35725540
4139 35725540 34787961 34164691 33205178 32111864 31244696 30950877 30742721 30885881 31543419
4130 31543419 32805298 34297644 35647759 36367517 37378512 38616493 39664810 39643168 39730801
4121 39730801 39084885 37834576 36020254 34456073 33104624 31626646 29870526 27936411
4113 27936411 26745986 26275345 25974483 26087909 26201165 26711182 26987592 27696653 27940478
4104 27940478 28535809 29308185 29421005 29895798 30189605 29947683 29794977 29754913 29715859 29813233
4094 29813233 30198215 30018464 30685441 31112257 31055254 31024255 31302415 31127544 30969767 31187430
4084 31187430 31799492 32927693 33835935 34849632 36812477 38748441 42127541 45749346
4076 45749346 49094430 52771258 55978176 59145371 62010649 64746169 66610388 67346988
4068 67346988 66465791 64616724 62247311 59366512 56795399 54617857 52347120 50233173
4060 50233173 48798008 48244889 48032379 48490307 49060452 50041696 51356003 52913566 54616656
4051 54616656 56332967 57992302 59914253 62073433 63813649 65527351 67351349 68589275
4043 68589275 69607456 70126539 70338652 70126831 70400516 70538613 70924117 72161657 74290374
4034 74290374 77160984 81432716 86468181 93100276 100627551 108869455 117646905 126908729
4026 126908729 136036412 144525757 151141823 156340944 159185832 160123183 159838147 157263188
4018 157263188 153298648 149211659 144761466 141412489 139323187 138213466 138939088 141948726
4010 141948726 147690839 155847208 166246593 178386161 192031069 207618911 223935589
4003 223935589 241177522 257108091 270006193 279409025 285271794 288753763 288519267 284821198
3995 284821198 277699857 268702508 258174077 249097693 241115752 233818775 228603474 224703210
3987 224703210 222202516 221664252 223336886 226249162 229630670 234275889 241492379 250017573
3979 250017573 258920142 267815487 275389071 282923064 290062292 296627005 301355184 302566751
3971 302566751 301524285 299634391 297629036 295274770 292278721 289228055 285677003 282265482
3963 282265482 278736970 275273917 272344915 269380609 267048692 266569987 269020183 273341915
3955 273341915 279366198 287911583 297595124 309755731 322961314 335820027 347224441
3948 347224441 355687745 361131452 363471533 361689815 354767726 341605419 322266978 299496059
3940 299496059 275625142 252195464 230531549 211428420 194089026 179253055 166458262
3933 166458262 155344742 146801027 139258770 132619313 127060383 122131269 117509571 113456594
3925 113456594 109482591 105464559 102110003 98390607 94813317 91561685 88374884 85733919
3917 85733919 82791709 79913416 77125950 74945451 72581843 70283005 68509180 66660063
3909 66660063 65782151 64199743 63090719 61650682 60645256 59933065 59086768 58007780 57005392
3900 57005392 56106089 55262628 54521470 53384778 52763688 51532398 50330510 49635786 48712400
3891 48712400 47928367 47091797 46376806 45609677 44622899 44199877 43811088 43259406 42643796
3882 42643796 41985329 41296654 41228988 41117167 40562186 40141776 39952610 39726229 39487071 38974629
3872 38974629 37995323 37460838 36632483 36159887 35947036 35885758 35210559 34540639 34203035 33888934
3862 33888934 33577256 33303494 32897900 32807804 32700664 32214774 31956618 31938591 31501508 31027686
3852 31027686 31319488 30998577 30731346 30498845 30295353 29895915 29674804 29618852 29734650 29473284
3842 29473284 29576662 29618860 29380781 29512524 29524170 29271566 29665924 29492698 29610174 29643364
3832 29643364 30114033 30582425 30749302 31264213 31759452 32291896 32401147 33328369 33702039
3823 33702039 34427324 35276204 36761682 38367503 40713875 42572546 45020666 48365208
3815 48365208 52175490 57049126 61982202 67816616 74235160 80400189 86210160 92184298
3807 92184298 98018073 103641652 107249137 108656514 109233870 109892300 110900586 112680623
3799 112680623 115763448 118811460 121631259 125309156 128687001 132769516 135662771 137973649
3791 137973649 139568078 140466917 140587296 139904368 138470784 137307931 136727803 136511106 135981678
3782 135981678 134564063 132632514 130071983 128043910 127018076 127557209 127730569 127966651
3774 127966651 128188011 129004013 129330930 129250568 128251836 126137016 123955664 121201304 118688215
3765 118688215 116391064 115171726 114672188 114579192 115907846 118200738 120472781 123215846
3757 123215846 125013268 124363888 122905638 121494405 120247901 119519138 118608756 116686388
3749 116686388 114457461 111517358 108830486 106382426 105020152 105961596 108951320 114578427
3741 114578427 122088093 130528757 139438132 148508198 158379254 169142959 179484677 187605066
3733 187605066 191923943 192628512 191485609 190228202 190129045 191178353 192209565 191028914
3725 191028914 185711416 177616172 169245850 161390254 154938773 150799029 148848085 148663453
3717 148663453 149581161 151358535 154349352 157725664 161292754 165488499 168496609 169955559
3709 169955559 169773671 168114940 166955887 166068328 166189362 166879834 167667281 167288985 165363829
3700 165363829 161761592 156274856 149525598 141455925 133539889 125635648 118340068 112438559
3692 112438559 107572825 103682041 100717416 99031250 97528954 96137527 94838888 94012590
3684 94012590 93263938 92138304 91014330 89906032 88343729 86871173 84689190 82349492
3676 82349492 79344134 76025174 72778808 68645694 64788534 60766647 58198227 55846448
3668 55846448 53299813 51322819 49573603 47812445 46491468 45088107 43579698 41391258
3660 41391258 39749399 38078535 36098405 34510683 32472995 30991122 29934654 28026261
3652 28026261 26542271 25458968 24308526 23429990 22800052 22295127 21549614 20990743 20809557
3643 20809557 20203649 19543332 18932492 18484481 17957829 17469229 16924613 16111633 15724724
3634 15724724 15330023 15011482 15016756 14643196 13727917 13809825 13359369 13088646 12871843 12671526
3624 12671526 12248257 12259538 11910692 11554369 11192459 11381690 11411294 11288634 11594594 11298160
3614 11298160 11046091 11077394 10655603 10129508 10146790 10212397 9784513 8885693 9018318 9141398
3604 9141398 9046504 8963285 8993914 8435188 8448163 8403918 8221433 8271692 7556458 8060282 8081394
3593 8081394 7961445 7870898 7663136 7876440 7561290 7468715 7399523 7029391 6974860 6713441
3583 6713441 6349902 6073682 6021599 6192991 6154026 6405736 5721163 5602579 5576886 5374278
3573 5374278 5356050 5466948 5269793 5298409 5116193 5037561 4835716 4992547 5158935 4860250
3563 4860250 4553639 4542417 4457365 4511631 4301272 4381638 4233034 3917107 3912677 4109618 3938623
3552 3938623 3740498 3779796 3488414 3345850 3318797 2844634 3022902 3731907 3655395 3381919
3542 3381919 3440480 3113266 2971896 3223626 3286832 2770859 2869154 3215186 3065396 3205716
3532 3205716 2928716 2900081 2917200 2868197 3387695 3533994 3334863 3619158 3551066 3337561
3522 3337561 3287693 3483161 3106075 2883273 2808503 2992217 3004600 2985805 2699327 2383997
3512 2383997 2933059 2979399 2958196 2900555 2832557 2796246 2856490 2869228 2716782 2635541 2548464
3501 2548464 2520843 2178765 2485755 2290918 2606711 2201077 2326951 2479335 2345975 2364647
3491 2364647 2205457 2378942 2319948 2329918 2500545 2096061 1983847 1805811 2130187 2189270
3481 2189270 2020380 2058630 2083244 1946528 1942835 1883266 1808917 1608542 1893951 2103000 1975995
3470 1975995 1746143 1417202 1593791 1665563 1766079 1858666 1901116 1749919 1725045 1589722
3460 1589722 1700148 1568576 1505659 1352498 805410 968172 1475074 1792090 1693637 1758595
3450 1758595 1617792 1613116 1357641 1246715 1303913 1294908 1441196 1062062 1224684 1314665 1432269
3439 1432269 992215 1084559 907813 667140 441532 752274 1399513 1209955 946553 875243
3429 875243 780222 564801 770369 870012 815495 971337 808566 534918 289724 531163
3419 531163 577191 914312 872776 668489 739447 966486 791532 637437 401318 380363
3409 380363 679614 770077 862768 437105 938076 1067288 1383739 1317482 788397 943292
3399 943292 1087844 653894 1168094 967007 901887 1125470 587520 899980 840486 766434
3389 766434 808720 1077007 1263734 1120941 552812 1063544 1482503 1183465 718924 547918
3379 547918 641309 569728 449109 810215 1050467 1123462 1110229 913077 738823 780431 449194
3368 449194 477520 348699 413214 513813 283646 447502 578693 974302 819956 618501
3358 618501 613344 586398 366281 446733 969648 804580 502246 231333 662708 647378 781365
3347 781365 790369 989574 800750 1059126 779232 516244 685763 443241 731230 491462
3337 491462 468787 555322 1070663 884085 766454 640814 662932 622497 682797 749927 776060
3326 776060 888824 452594 445959 630776 484986 173043 680074 668835 545432 718079
3316 718079 726145 970925 1003402 767235 556362 677578 401237 475159 -14296 -13925 438199
3305 438199 720385 577573 672033 450736 580284 277950 300020 244046 504311 438026
3295 438026 392669 579031 210700 552993 769224 943481 617953 310723 605389 586053
3285 586053 336549 648836 922652 356518 371047 646699 845745 586969 561448 246247
3275 246247 152766 202004 498901 399314 295102 427606 132713 425674 775397 762251
3265 762251 462257 363816 398847 434172 179266 91889 311160 236675 187237 413858 301261
3254 301261 352757 322120 638560 524551 441648 279168 535949 489588 124948 116337 338584
3243 338584 561769 863078 824716 658415 596751 623453 430405 417580 228542 339760
3233 339760 439770 124922 579245 194057 294019 681255 696575 580929 621866 626964 539070
3222 539070 844429 734795 462572 528854 922351 441484 668486 602218 475992 521703
3212 521703 340506 17564 275990 86243 24921 317708 453715 331279 12281 181380
3202 181380 18864 -185659 141292 348977 354860 274295 80163 95484 16662 784744 678589
3191 678589 198275 556222 360601 -10430 -225340 -26278 272492 575166 472813 558889
3181 558889 860072 999520 982302 517319 179007 372468 441314 401586 342678 359303 659059
3170 659059 466472 716824 679608 911648 1151869 1031201 339305 471108 398801 187884
3160 187884 244373 155739 426899 313608 278084 577576 587905 634152 570995 625575 235524
3149 235524 -43356 -168758 106389 378024 103345 635129 672675 130353 228881 220567
3139 220567 37929 271732 2632 -5539 67285 189487 828315 621708 70647 26748
3129 26748 -163281 -34959 376878 308622 -118186 45128 207860 113717 -17200 29234
3119 29234 332470 189513 108358 154828 402273 -21280 -228904 23756 118605 195303 120989
3108 120989 -93385 -18212 378483 209530 -7912 77866 -214217 -317099 -66996 38661
3098 38661 -200200 -63002 -33572 -142922 -77636 248517 -67421 47919 400242 112581
3088 112581 400351 415822 406236 245978 249872 182632 318999 404995 286435 234707 426629
3077 426629 311249 40535 183416 848089 600930 468122 514555 114336 -213862 95082
3067 95082 51111 425639 636297 244325 -4034 40374 -185042 -18506 153509 67390
3057 67390 -26827 131911 421416 120889 135977 26527 118625 223084 225811 139102 -76579
3046 -76579 -46173 -315457 -471468 -354534 172239 414536 215655 362385 492830 287121
3036 287121 70214 63691 203076 280082 56642 -53922 -11859 338666 406135 464804 -36744
3025 -36744 -148942 -36074 -39371 14193 -30866 20977 107688 3190 11528 126755 -30552
3014 -30552 200124 35821 -82772 -43259 -79226 23104 -152675 -191865 -132281 217635 511874
3003 511874 414950 161733 184479 301508 -28602 272297 653546 115545 85975 206594
2993 206594 521922 283967 460815 378771 -155687 -13966 147492 162542 281567 414012
2983 414012 282832 332431 123962 -45370 174578 276011 459557 298456 492579 84507
2973 84507 384332 299522 166378 64563 -155728 88662 19490 408233 394218 23349
2963 23349 225835 413139 171215 508089 254444 256829 259038 82858 35349 151589 480965
2952 480965 450975 315566 -111748 67357 -147289 346216 323302 213693 88163 -35660
2942 -35660 -31608 170444 279109 89193 361334 146008 -39350 -75633 249561 166949 -4178
2931 -4178 26121 191655 -142438 -156307 48146 84687 -200262 89896 71047 29890 402598
2920 402598 257599 -437943 111580 122934 -50091 -54480 125863 244382 105064 -405056
2910 -405056 53002 203811 2587 -213073 -94982 84352 121534 -48546 -309246 82006
2900 82006 204031 291120 201655 112919 325948 631407 400942 122729 269967 331351 373244
2889 373244 2435 -22459 8563 -245969 167745 399679 341214 298287 168844 146819 477190
2878 477190 452516 167650 -195478 -237805 -207792 162451 34291 -50006 -201533 -317787
2868 -317787 -244792 41051 86537 139012 64161 -14327 96600 -113959 266369 198707 285442
2857 285442 499495 459032 361143 124287 354206 -40349 108358 222881 -154948 -219577
2847 -219577 -560928 -449962 -20482 -133442 172991 -236175 -245409 216854 -67970 -461430
2837 -461430 -60860 257658 305205 100345 291950 265930 20258 -179061 121274 175320
2827 175320 -25973 -201068 -227414 2371 -51502 -175651 96984 139588 -120625 204464
2817 204464 147064 52063 -557946 -60102 -207011 -59208 78751 -63502 -85179 134993
2807 134993 246500 -91239 -342832 -77815 -352 158846 227649 125849 173075 -151884
2797 -151884 -330436 -445366 -81628 43381 133687 160298 -39694 -328470 150452 -9053
2787 -9053 14867 92957 -284521 355493 634854 277105 56688 -249881 -90151 413645
2777 413645 666698 238912 -53325 -149323 -203592 120454 185040 -245577 -322989 63334
2767 63334 11799 -169266 -340237 -496533 -192324 181535 -170165 -122289 64027 221286
2757 221286 155164 160006 326325 2772 45112 31721 105904 289977 206890 204027 483362
2746 483362 -79234 -488388 228440 160601 -11815 -471958 -355951 -256829 -48986 -39970
2736 -39970 504495 210354 -128121 338427 409349 232715 98670 -28720 102609 34585
2726 34585 -197916 -194379 -545810 -75181 -173021 176829 -75349 -266960 -105788 140706
2716 140706 -3032 189734 400325 -218524 -366387 -145891 -105658 58604 -97319 -108006
2706 -108006 -418159 -567968 -622128 -383636 224767 146590 240345 37345 -99087 -273348
2696 -273348 -511691 -267018 -386286 -67770 1059 -226230 -284754 -84078 13268 -38084
2686 -38084 -47245 -306145 -129969 29783 375480 207149 92207 42507 431111 123291
2676 123291 -208116 -114390 38640 231467 -322559 -360078 -21105 184399 330533 449123
2666 449123 18507 227786 101901 -393656 51885 110679 -151766 -220373 -548249 -256365
2656 -256365 -108146 -413495 -207843 93484 144946 38278 100808 218536 88434 -55921
2646 -55921 -6028 -281147 398861 425984 -22010 177149 25470 53823 -53198 -148074 -50891
2635 -50891 -256751 -572122 -222242 -139899 -147043 32600 -104885 -6571 -181244 -136925 -438338
2624 -438338 -547909 -194410 -138331 35575 -118470 -331581 -195060 -319080 -146924 -20229
2614 -20229 -54272 -217771 -109538 -186261 -244423 -285987 -367150 244449 369504 355710 345254
2603 345254 -122616 102490 106840 169343 522409 367032 131208 -36616 262406 120800
2593 120800 83537 121469 -150008 102247 274246 109576 8470 -5005 -376014 -50057
2583 -50057 49602 132633 334087 -38601 -223462 -510566 -294055 -295946 -471797 -183190 -117449
2572 -117449 -174599 -59446 25590 293671 151206 -13808 -85805 99560 298015 77136
2562 77136 132103 83756 240574 -323375 19961 -278528 -361662 -20209 -344162 -368498 -409129
2551 -409129 117615 -207951 -597621 -243650 -470514 -150650 -15436 55166 -401391 -276860
2541 -276860 264144 -388778 -157397 -267150 -303433 -427351 -155130 -283606 -525268 -617614
2531 -617614 -538035 -699009 -273256 -254332 -584881 -611044 -110629 132925 111253 -167063
2521 -167063 108753 -254846 -165324 97901 -90355 13527 -47382 -34490 -138746 -366103
2511 -366103 -213311 215270 188500 -27496 -260613 -55415 -302602 -264921 267646 436100
2501 436100 -209678 -514008 37643 136384 362196 83324 3937 43711 311591 -132811
2491 -132811 -96445 331873 89995 134142 -25349 21452 -53986 122372 295158 -72311
2481 -72311 -202763 239547 378457 -21257 -235399 -16600 228323 -203077 -339003 56546
2471 56546 368244 621782 -45473 -309632 -248066 11337 -94054 -206494 -18606 27245
2461 27245 -84000 9221 378474 348770 -280088 -138622 -87188 -234769 1739 179350
2451 179350 -182786 -197230 -246649 50498 -210014 -374476 -75413 363057 -161174 -96877
2441 -96877 -170879 -206395 -362169 -428915 -34392 -150267 -129798 -246541 -228491 294024 519371
2430 519371 -39806 5212 462446 114971 77505 -147116 -476789 -217927 -149704 40491
2420 40491 200627 171447 -17747 -313407 145956 177225 492259 465680 54644 37398 276124
2409 276124 306146 51407 221531 -492854 -403413 -346232 -314864 -113728 -168363 -170822 -31090
2398 -31090 -181179 52064 112313 -147619 -229548 24880 -224910 -168680 -199896 -460637 -256039
2387 -256039 -34890 101862 -74603 93204 -83527 -254127 -52554 -182283 -214911 -580382
2377 -580382 -594039 -513379 -425974 -248385 -317961 -765384 -416003 -302955 -174487 76172
2367 76172 -145222 -224830 -180708 -216127 -290133 -2363 315764 324902 501714 304817 58923
2356 58923 -262102 -218516 -60188 148256 -63771 -22568 114968 473439 646232 447344
2346 447344 340836 -37094 165112 -202252 161557 248280 -269498 195525 -35864 -26159
2336 -26159 -80187 -204425 -34758 -359211 -368979 7561 156019 -421369 -636197 -106356
2326 -106356 287189 -145629 -301328 54272 109442 127567 271871 109487 202154 185347
2316 185347 189031 213229 -101960 -56121 100451 224532 72000 -81640 384395 191597
2306 191597 -64317 -173749 31030 -256854 -315772 -283065 250471 345916 63093 97895
2296 97895 -188529 -150399 -109007 -53213 -274882 -241799 -33761 64527 272006 -232333 -385794
2285 -385794 -132944 174151 -78674 -475359 -371904 -248007 3766 -109048 -52595 -304368
2275 -304368 -326287 -199419 -256430 -119460 -41416 134881 -24581 171313 -154924 -338209
2265 -338209 -263646 -161450 817 -224163 60847 -82891 51573 -52387 -170288 41124
2255 41124 154773 -12345 -102484 184718 -19396 -82858 52909 -76123 -241839 84904
2245 84904 433357 156296 -2834 79519 -56209 -74471 -240236 -361237 -32783 -70393
2235 -70393 -36536 -192767 -344848 -622649 -354848 42080 -96732 -344553 -175243 -188154
2225 -188154 189604 -371730 -68936 -88414 -448288 -18897 -151762 -444848 -599541 -192866
2215 -192866 -335837 -88107 -265511 -340637 -225669 121488 255210 -41667 -326049 77048
2205 77048 158125 -63362 107812 147326 108124 -182258 -110262 -288374 -56095 -174476 -356854
2194 -356854 -375262 -292339 -174219 -358218 -188868 -357975 -259848 -162418 90422 130786 364370
2183 364370 186008 -40300 34227 -152700 34348 245146 152217 97396 -43016 183719
2173 183719 187689 -5044 -247166 130945 46970 84054 419399 -101337 -157656 -184029 -363141
2162 -363141 -122444 7683 41832 -148503 -170659 -1394 -116769 -139364 -339155 -276706
2152 -276706 246740 230863 -33647 -315245 31194 -97156 94401 4794 -223711 225678
2142 225678 98014 10120 76071 -84383 206261 161130 -76116 -159313 -405041 -322872 -444121
2131 -444121 5099 -62106 -103352 -118245 -259047 -469356 -19912 -417741 -401691 -529997
2121 -529997 -265413 93915 -219325 -489026 -221393 -6083 -391583 -187504 -251204 -216978
2111 -216978 -189689 -167112 -384608 -323928 149456 -60381 331 11234 239549 87791 -12736
2100 -12736 -110300 94300 -11339 50053 -196425 -403840 -344702 -179994 -168453 -442619 -283588
2089 -283588 -265197 -570894 -493788 -503317 -420499 106047 -40244 -106044 -195260 -345819 -391855
2078 -391855 -292397 188687 273888 -176311 -157361 -348139 195504 -285389 -47428 26756
2068 26756 -46303 -252430 -225420 -18911 -315336 -163923 -102938 -297882 266343 2670
2058 2670 93638 322382 -88991 -337419 -447468 -201300 124698 218598 122860 -122518 -121326
2047 -121326 81612 316960 -36768 -110167 113449 189966 -62734 -154854 -231363 42189
2037 42189 79600 206237 537397 684025 645022 44335 -12591 -11758 -54770 -171364 34117
2026 34117 -65550 79354 -56631 -43437 -215585 58394 -145296 -333253 -80746 -209674
2016 -209674 -200911 -420764 -157915 234588 -9830 -73116 -298932 -239361 93023 -39812
2006 -39812 -318766 -234762 86314 -61154 -339904 -156084 -75083 -28318 65755 38726 -331545
1995 -331545 -175036 -225464 -44602 -132811 -241704 48399 116019 -115178 -332029 -144518
1985 -144518 -71426 -356113 -156743 -100579 -172987 -11664 -133703 65814 96167 -331279
1975 -331279 -209501 -32886 40711 -384052 -124354 -319781 -275071 -217906 -172537 -300245
1965 -300245 123684 -35838 -632485 -201840 323223 225755 -261683 -143051 -139847 -7678
1955 -7678 -178894 -169041 218276 283612 205563 -253862 -69616 135318 -251744 12649 -31114
1944 -31114 105423 -11992 121975 -198221 54271 -88447 -352188 -87156 -152170 36205
1934 36205 434464 45600 -89434 -176169 -639784 -239997 -141660 7868 92883 129236 -33187
1923 -33187 -443134 -170207 -242200 -265384 -208196 34418 -95823 123441 129771 -5802 -341346
1912 -341346 37261 -9434 214263 59984 -86776 196052 553547 346369 -209129 -81730
1902 -81730 -148051 67959 247316 -207598 -394979 -210531 -134540 278576 340154 202381
1892 202381 49124 273190 -19733 -262681 -131765 101057 385601 166113 -379421 -455367
1882 -455367 -71547 -235923 -290549 -11173 209422 -84400 256197 397 -100215 -111710
1872 -111710 -263764 -51103 -192487 248931 -302200 -321258 38785 214333 281906 -90384
1862 -90384 -41354 -80722 33011 122910 22551 40609 -83099 63385 253152 -32065 -17445
1851 -17445 89747 474744 486900 349131 -28503 -506853 -502775 -399812 -64278 -36884 -115610
1840 -115610 -180132 79131 183500 -190662 -158055 -307348 -426991 28419 27312 -302221
1830 -302221 -159956 53290 327431 462904 247861 82026 29300 276950 361411 30842
1820 30842 -288437 -5610 -64526 72888 -168421 -477034 -555847 -622263 -405266 -35143
1810 -35143 -247690 -128241 12197 -83192 -4289 -224674 -270275 501623 -26943 -162145
1800 -162145 -398111 -311539 -244848 -98561 140112 -248064 71739 195791 29817 -120061
1790 -120061 -219724 -202655 -182879 495515 21064 -81249 148162 109928 -10942 -300727
1780 -300727 -685964 -271560 214787 265181 -161722 -359119 -297179 -691012 -488301 -417775
1770 -417775 -256807 38146 -207189 -212212 -314206 81640 259058 -87430 27580 219771
1760 219771 -1476 -323788 -127704 -263486 -190540 -178246 -123207 -173000 38151 178389
1750 178389 275883 186785 -78656 -129710 -395134 -412278 -116221 -122478 59506 -196305 10607
1739 10607 12131 12930 51110 178879 16700 238930 243223 264347 41014 -289218 -359834 -148117
1727 -148117 -74291 97342 31416 334114 152367 -16349 -457555 -280172 52547 9213
1717 9213 215730 311873 308114 406726 167114 -210809 32734 -104397 -606297 -458145 -215073
1706 -215073 41025 130905 -7502 -193938 -476442 -173295 334747 -282372 -304130 179820
1696 179820 432271 6678 -422725 -190117 -294396 -250557 -128456 -68405 51472 361869
1686 361869 -263363 -423433 -182556 -346588 -238278 -201345 121660 125034 -388127 -419845
1676 -419845 -239128 147310 327837 -114836 -338885 -182487 -200315 -277296 99466 72232
1666 72232 235497 -50570 -144413 172656 254093 -319970 -248421 316695 52497 -40956 -547960
1655 -547960 -333276 -218184 243626 -433801 -354960 -174633 -3886 -66585 201811 257032
1645 257032 25805 -31079 -269633 -10445 84255 -108573 161273 -115583 -99238 62222
1635 62222 -184577 -4488 -141299 -117942 -176757 -247274 -76108 -234011 -293912 -60777 354578
1624 354578 152283 -384726 -288292 -545294 -274597 9519 -179785 -21041 -18681 161152
1614 161152 203241 -99072 -386019 -383865 -65787 -365992 -68101 -416008 -302845 -60350
1604 -60350 -224313 -211797 -925357 -500197 -132361 -87104 53527 63691 -253454 -33317
1594 -33317 141643 230014 75552 -196193 -318726 -373224 -293857 -74217 -156315 -282603 90115
1583 90115 140160 23713 -178654 -39529 -133549 20163 93821 -264902 -231533 102031 432982
1572 432982 417526 237934 -197829 -160791 -181105 -192151 -295747 -216281 143834 112226 36979
1561 36979 -553641 -386840 -342047 -466165 -267742 69859 139473 -189799 -61199 -28850
1551 -28850 -374014 -386082 -149844 156892 43002 -173681 13449 -236360 10107 -1515
1541 -1515 -311718 -307250 -620153 -267674 152326 -9038 -457780 -426448 -355751 -317363 -111269
1530 -111269 -169213 -118892 388852 191572 -113065 -360409 5887 175035 83764 29999
1520 29999 -91396 147378 -106906 -457963 -6875 -207301 -422858 -436487 -666782 -278845
1510 -278845 -624080 -327190 7698 -43272 -235089 336731 -38179 -313475 -100692 -468406
1500 -468406 -145067 -382688 -402842 -217077 83217 260132 -75825 -36362 95267 -190111
1490 -190111 -293947 -372140 -378760 -237239 -32142 -64910 -405360 -558106 -340040 -385585 -192949
1479 -192949 -151192 -396378 -134051 150771 -14054 219095 522874 61428 160167 106509
1469 106509 38862 -243906 125474 97528 -215436 32745 187549 -23105 -378605 244215
1459 244215 -150669 -179527 101098 -79107 -45420 -119725 -388531 -229618 275594 -151211
1449 -151211 -682422 -31568 10784 227366 -366883 -234952 -166320 -183836 160882 -180679
1439 -180679 59373 -93149 -117310 -220919 210711 -9845 20515 -71811 -446632 -65053
1429 -65053 390347 147943 -11838 91125 -123210 -304870 -208569 -224202 -453458 -641702
1419 -641702 -532573 -206666 -161565 -121073 -324319 -279396 191319 296914 101334 414157
1409 414157 164659 -82226 53032 98113 58707 -285336 -342636 -150328 -214312 75353
1399 75353 210075 73165 -152085 -461327 -55199 462023 -35416 -266265 54190 -64223
1389 -64223 -170444 -227616 -370230 -484262 -643623 -573085 98932 14316 -87128 -147493 -127913
1378 -127913 -221837 -173977 -361058 98340 299506 121875 336947 107185 -33616 -217780
1368 -217780 282048 -13889 -101317 22704 -145363 13378 -44964 223166 172656 228360
1358 228360 343788 -183187 -37355 53510 -254078 -361601 -274350 -169809 -78634 268164
1348 268164 92249 31537 117515 -117094 -551059 -240491 -266281 -94921 -133468 -82795 308685
1337 308685 -87362 13175 -87043 -42884 1896 -236520 -434813 -472876 -200743 -194695 234994
1326 234994 138530 -91340 -151895 -298926 -456652 -252861 -56399 -99942 -270813 8945
1316 8945 -7208 -51136 215915 -164607 -259281 -250748 -113697 -61754 -264449 202546 110356
1305 110356 -119970 -201892 -115307 -48829 -364424 -464593 -197707 -67645 -172265 -415940
1295 -415940 -230099 -51192 -19022 -224091 -151648 -386845 -430165 -287616 -249161 70265
1285 70265 140283 274559 150262 191776 -253358 -285116 -365569 -575181 -442894 -68980 -256544
1274 -256544 142557 -245465 -517032 -411953 -147305 -179371 22936 -195316 -185922 -259485
1264 -259485 -164157 96171 47680 -21531 -88150 -370172 -364582 -336822 -296637 -197201 102170
1253 102170 -136323 -296709 -297672 -377451 -215061 -42488 105417 -125031 -25777 275527 10641
1242 10641 -865245 -444232 -62399 -9420 -197267 -196013 50162 182113 179636 -10302 91080
1231 91080 -176142 110455 -39669 -355480 -532511 -584987 -95592 392606 191091 42054
1221 42054 191130 -122288 -206973 -577003 -355111 1878 -3849 157640 84349 -255554 -179635
1210 -179635 225596 329239 381945 609687 321694 -78842 -179611 -169404 -448526 -118181
1200 -118181 200486 -61791 -112570 100465 -117858 86845 32157 77501 -70526 -327991
1190 -327991 -139394 206927 -132711 -62064 -14790 -370416 47823 206213 69740 250431
1180 250431 -323224 -494094 -232984 131570 19288 -100927 -222529 -313182 -69061 -64556
1170 -64556 -47168 22199 -78935 -31358 306051 432071 341327 238043 494467 51275 -284204
1159 -284204 11427 233308 398866 71458 -118524 -416581 146492 289169 8413 -90593
1149 -90593 -179273 -181988 142784 72310 -55348 -169542 -46949 43601 -331403 -38977 -142971
1138 -142971 -59853 225054 -271754 103054 109602 73090 -7735 -232782 319963 326344 233639
1127 233639 -159352 6275 -103239 -103660 -97925 201961 417987 305003 5681 170898 -209194
1116 -209194 28519 -320324 -215927 66284 167951 80176 117183 -285359 -570690 -79719
1106 -79719 -270765 -31538 -241365 -140893 -64229 -310804 -197628 -25386 40277 -29702
1096 -29702 -6187 277052 267298 94302 -139737 -99761 -203471 -198980 3806 -238335 188029
1085 188029 148046 -237149 -661883 -493091 -148673 -361727 -3350 -42837 -346961 -86184
1075 -86184 -105333 11647 -384028 138876 301890 126762 202055 -121139 261343 170105
1065 170105 -81225 146283 -52254 -71612 -135938 21199 231942 149006 64709 149459 131050
1054 131050 -107098 -342513 -413263 90512 188757 311867 89133 -60330 -175977 -299913
1044 -299913 -132423 -311703 -318188 -16389 326650 278812 -117672 -224957 -99515 -9952
1034 -9952 -91810 -312410 75720 181859 186746 63877 190540 261779 -200096 -119166 163018
1023 163018 -214611 -329875 149103 288904 -38856 182396 206026 -50671 10356 -202732
1013 -202732 124454 -316492 -349852 -406576 -127366 -179714 -133373 -208794 157674 -137544 63978
1002 63978 259118 337738 -228740 -265738 -99428 -60046 -172102 -41531 124785 59865 -210732
991 -210732 -83803 172707 164657 324341 260794 -69823 -54484 59161 -39148 45517 92529
980 92529 265431 -252754 -268396 -327776 -61584 -196259 -90713 166307 243202 90579 106510
969 106510 155657 178999 177950 53713 2865 -91757 -566746 -228515 -259455 -125088 -90914
958 -90914 31892 177398 -213049 -396905 -411463 134766 -31900 194375 99573 -37902
948 -37902 82730 -273686 -395455 -569668 -235313 134808 47192 46101 284803 4923 213518
937 213518 136648 82149 59937 127892 210741 -39193 368193 181549 32789 126474 521829
926 521829 420591 244676 -177567 34488 150888 186678 73471 24493 55987 -179131
916 -179131 197055 92920 55037 85816 238552 -70454 121952 186507 76214 94252 78172
905 78172 -225928 -240593 93149 440163 276870 172670 343580 103101 -39361 66623
895 66623 476258 56972 -101704 -341800 -176953 -77984 -409857 -230962 19200 239322
885 239322 -530896 12318 433635 156047 243069 554127 487900 279489 117046 63944
875 63944 62781 369400 112136 -328069 186425 -207109 -521868 -305589 -167235 -473901
865 -473901 -260196 -205146 -55176 -162557 131806 -9417 -150462 46760 82512 119285
855 119285 -164925 -148692 86306 293846 58477 -15391 -252859 -61668 -104102 262414
845 262414 227829 264070 -60835 56935 386654 -63738 -252474 -80617 277462 364973
835 364973 15467 318648 524936 -197891 -247055 200656 -114717 338735 14518 82300
825 82300 5248 303542 75927 136314 368045 117837 184216 270041 458568 -116194 81996
814 81996 72286 74631 15565 306958 142234 91777 405071 46327 -74996 -51112 -33198
803 -33198 -139668 -241904 -77345 -174266 92136 -52859 -16391 -179799 31823 104399 41612
792 41612 54516 322556 351749 370129 73692 185316 278070 -110491 -342351 -200410 -89703
781 -89703 -353154 -345764 -180219 -24426 46263 -114815 65106 -112608 -163115 -75074 83960
770 83960 -74622 -77590 102981 286980 304893 427937 337699 122316 240327 417577 129917
759 129917 181571 -18778 441022 481 -214919 6279 209927 745883 461164 464022
749 464022 121187 -150543 932 184797 31134 203042 479294 55539 -177252 -24562
739 -24562 -140025 59129 217482 326768 243160 -119107 -79228 156642 256883 552659
729 552659 250913 41932 -348634 -354980 -73319 44223 -6723 71938 215533 82727 64205
718 64205 293024 438832 628557 255989 -99336 55150 92608 -134620 451421 249153
708 249153 154172 394004 225491 612403 187067 176396 192939 102119 105743 -26577 -135179
697 -135179 83795 4964 262876 384779 267428 -8580 122756 76812 44093 553669
687 553669 219905 46147 -202176 85666 19692 -146275 -337884 -101551 109900 129982
677 129982 -420431 -131065 207983 259486 97658 -159018 148296 122700 9263 -179648
667 -179648 25382 126283 20213 378091 355022 221592 225601 301232 322401 125896 -106374
656 -106374 -218917 -43886 292617 542046 196900 -173600 17133 49669 186439 98230
646 98230 145820 198770 161766 73194 -169948 33217 365415 86647 93428 389213 -154682
635 -154682 -351170 -262089 -338350 -145776 190415 103845 33808 253386 194511 -75672 -76889
624 -76889 -56742 -26138 52530 352563 -25112 -57068 65389 27642 -77848 118667 254775
613 254775 283051 511690 525919 207999 94693 309238 14013 -59597 -584514 -131567
603 -131567 208742 287238 445902 595958 704672 335172 563570 319037 168849 459475
593 459475 238973 255724 43016 307931 78512 1195 180584 162494 60839 70004 -69003
582 -69003 504020 283071 71419 128034 -346790 -220140 -79606 -203188 216447 379711
572 379711 272215 334697 -7613 334514 34428 295397 -103360 145650 211159 69194
562 69194 98117 -164321 -86663 -46693 -105893 71715 66055 142903 72054 178040 635
551 635 16269 142612 139233 237156 437571 -66207 517531 614866 170639 304879 418876
540 418876 -149666 -177308 -123168 -117650 -80635 -293897 68664 82715 116313 -32555 113871
529 113871 84245 317569 298012 -145711 -22102 185516 359132 -96029 187360 -4438
519 -4438 -88107 40345 44287 219144 64366 42231 -154488 -200274 282313 395418 12061
508 12061 180945 -89436 68606 14575 418330 78561 80219 270319 121864 168257 102258
497 102258 -137266 450880 100563 -368 224271 131013 49443 118047 215430 262573 506853
486 506853 315662 159780 557661 56684 -306329 85555 -240978 197181 462264 277593
476 277593 86907 19594 -303441 -180231 249059 504626 527380 588020 389194 134931
466 134931 52290 -151296 -128341 127984 -31263 171052 136347 -52276 -137125 -233720 257749
455 257749 471216 653657 654313 -11317 -69352 -126945 23668 -41185 5873 -152203 59944
444 59944 472840 265921 484440 322993 -397631 157164 551103 272652 183191 587062
434 587062 845835 548388 182485 276681 528819 405580 130342 373747 438292 -32852
424 -32852 483070 375461 426140 271869 345730 72374 325209 39447 230628 534777
414 534777 480294 87346 173686 -247489 -5360 230768 108418 -264836 18755 91627
404 91627 -216238 -94714 -7997 104559 -9574 55008 -49666 525224 25333 -6255 123440
393 123440 325267 -386046 -65310 37055 149934 443692 201366 249799 249254 587487 255575
382 255575 -52101 -2655 -91682 483266 258226 -178365 -254211 200226 -207133 -702929
372 -702929 -274025 -54549 286405 -6081 -65829 -37094 114233 59061 -76394 205393
362 205393 -197179 -212703 327242 4030 258487 -122214 330444 336039 140224 448046
352 448046 20252 -226115 -241233 -49728 -8350 89607 160400 12546 145802 -130311 -18614
341 -18614 12644 161388 301027 367579 148587 546948 361957 -87835 -17081 -61645 -160824
330 -160824 -111102 335954 -18777 389547 309529 -17821 -104059 -83532 -79962 -88523 -203781
319 -203781 93790 258017 288617 -63589 -109065 -248751 84773 93380 -57951 116465 -51485
308 -51485 -91367 197287 149123 147710 118839 -61306 286300 446747 215717 -158141 349752
297 349752 198922 9617 93651 -86146 -47708 -135271 144974 219522 580070 293263 242537
286 242537 123944 7709 194192 144709 344521 -14310 -237203 -77749 95622 203319
276 203319 2335 42179 135718 262973 133547 -288344 60067 -35835 -237399 163059
266 163059 239990 209043 110283 -653815 -342507 -258420 -694631 -333144 174005 -12238 44909
255 44909 -58836 74051 273248 -115483 229751 568878 466096 -90346 170015 164998
245 164998 267256 204756 55412 -67031 994 -212446 60668 104951 233362 317033 -173082
234 -173082 -190441 179143 350320 346643 376466 -18577 -960 -95107 -284866 -197870 119216
223 119216 205342 -186090 41831 102589 -237749 -223688 -228684 -228351 -224687 158505 185413 -70274
211 -70274 -20231 145382 83411 -99865 168238 371753 364813 64566 344754 -3514 -59573
200 -59573 -22787 -129048 31982 -52442 407310 8957 147848 547470 444349 174856
190 174856 183022 77160 82616 171852 188597 397173 76134 15254 135935 24575 188239
179 188239 159303 -48017 8605 140253 -10470 245907 168913 180071 160497 447069 269977
168 269977 -200896 -3020 45684 72325 129353 -97184 125154 219283 736213 497761 128790
157 128790 120920 328071 296028 190865 134602 433446 348117 6601 -230367 -270563 138681
146 138681 -6275 -209498 -337750 -182089 -16736 66094 88766 284680 332264 310469 272668
135 272668 -68808 39735 22113 262703 81515 -94389 -38277 53062 -31527 -118347 102464
124 102464 -53459 -212529 27460 -20474 224016 222204 34841 395168 199271 74937
114 74937 1578 -96591 -296930 -21242 328039 94359 -16166 93972 -80071 -192412
104 -192412 -146153 98097 -88278 -348290 271409 68054 46117 58697 -19687 129437 39591
93 39591 -24739 147173 376748 171790 177897 86834 68536 142077 3917 -92841 525610
82 525610 194426 580443 120720 357252 50881 217494 17116 -164838 -117608 36307
72 36307 361100 233813 197919 -168391 -64057 -47087 21774 54340 298056 77539 -219324
61 -219324 48705 210516 -52514 54651 -87334 -91577 113823 71073 137020 234503 83203
50 83203 345236 315726 341401 276102 261956 240783 197776 302847 23412 34495 34656 -128773
38 -128773 -145179 -83463 87891 133291 108239 90054 243399 377362 268080 185237 -40475
27 -40475 56176 -73159 -64932 118816 62336 -49020 92200 256629 144204 188260 97274
16 97274 145238 11128 85420 13933 43557 -69928 -25427 918 48533 280887 321028 52990
4 52990 -5854 193512 102052 113196
0 113196
$$ Imaginary data points
##PAGE= N=2
##DATA TABLE= (X++(I..I)), XYDATA
16383 -1886109 -2002692 -1714207 -1655106 -1747371 -1708106 -1514876 -1685507 -1635617 -1611213 -1868548
16373 -1868548 -1605598 -1479552 -1185667 -1382911 -1507602 -1402601 -1444300 -1328514 -1247177 -1122610
16363 -1122610 -1187469 -1241846 -1156370 -1064796 -904865 -1017266 -1261016 -1186610 -1037662 -943744
16353 -943744 -892123 -888888 -1046134 -1120806 -896024 -1047620 -882111 -853251 -795610 -750324 -933338
16342 -933338 -840860 -803776 -584979 -814821 -952298 -706722 -540518 -584458 -479984 -491540
16332 -491540 -596479 -620669 -751763 -662252 -636979 -811644 -533864 -471453 -517441 -330288
16322 -330288 -394387 -572779 -156579 -297007 -199322 97906 -276541 -69406 -128337 266151
16312 266151 4751 14169 -141197 145400 84890 -109443 51714 -4454 33407 135286
16302 135286 64111 175989 128805 270174 125493 281158 454826 524638 377559 23791
16292 23791 391532 395298 333721 591867 662845 474172 423064 544426 778332 811872 503381
16281 503381 527633 594572 691077 1013382 860192 775266 454986 815843 835046 732263
16271 732263 1015024 820895 749598 875133 1491153 1142360 986460 1026809 946807 1246463
16261 1246463 881139 722180 702254 985870 861417 800811 809368 1110810 1257122 1134630
16251 1134630 1213142 1340354 1231817 1357224 1131500 1441303 1580340 1324893 1307019 1243896
16241 1243896 1347495 1403591 1730531 1797189 1602644 1338141 1320960 1674602 1551771 1264996
16231 1264996 1111963 1527920 1420905 1118657 1366947 1397654 1697935 2002958 1714715 1510691
16221 1510691 1393995 1467736 1567451 1563669 1485999 1765027 1758256 1389134 1491325 1759534 1607873
16210 1607873 1796317 1967453 1850771 1969166 1683335 1852920 1776979 1726783 1720600 1434985
16200 1434985 1633090 1834454 2015307 1792248 1898906 1906689 2079327 1964536 1879883 1668646
16190 1668646 1785765 2136915 2092536 2249435 2006007 1773311 2028984 2474738 2423713 1975697
16180 1975697 2031304 1925271 2016020 2134289 2008954 2248519 2002815 2022986 2207105 2350735
16170 2350735 2266650 2364601 2352022 2138033 2046555 2174271 2023641 2334530 2510625 2056152
16160 2056152 2036427 2190210 2141232 1945591 2222923 2550889 2284285 2356757 2408416 2146055
16150 2146055 2137173 2084796 2161673 2180107 2392401 2274276 2320572 2235972 2110810 2309965 2420754
16139 2420754 2350546 2152226 2185649 2185915 1960437 2049210 2228194 2457063 2489678 2132878 2490971
16128 2490971 2561444 2410521 2290388 2796207 2864032 2631884 2668208 2511340 2360333 2704205
16118 2704205 2535774 2498772 2168960 2107324 2440533 2447389 2678744 2611816 2658356 2689921 2705163
16107 2705163 2658698 2624375 2557455 2253344 2086239 2436834 2389701 2391706 2381218 2250589 2340000
16096 2340000 2074512 2369420 2430045 2466051 2594584 2367009 1790521 2084091 2791313 2271853
16086 2271853 1706047 2126783 2374687 2825663 3049936 2862022 2712772 2969152 2565614
16077 2565614 2692271 2611295 2681402 2581814 2485427 2658729 2360037 2696000 2512363 2564808
16067 2564808 2792338 3058516 2818594 2574978 2470403 2264773 2341968 2442962 2586008 2747004
16057 2747004 2313716 2382762 2612193 2505731 2752796 2950011 2928434 2708047 2687520 2765700
16047 2765700 2552965 3282973 2865404 2654093 2159417 2403157 2861797 2611405 2458331
16038 2458331 2515489 2668981 3000802 3164229 2705944 2531192 2585947 2569363 3133109 3150761
16028 3150761 2699690 2929353 2654737 2701483 2889286 3048092 2935293 2545660 2627423 2568485
16018 2568485 2435294 2391944 2589836 2613245 2620054 2978437 2342744 2457723 2494144 2531442
16008 2531442 2395515 2226722 2711697 2476653 2192671 2659670 2793118 2757460 2348433 2417722
15998 2417722 2445132 2633946 2233821 2771897 2905583 2673787 2985765 2846191 3155408 2759900
15988 2759900 2489649 2515300 2370589 2204752 2466703 2851187 2638623 2579046 2578516 2374803
15978 2374803 2793544 2801691 2954544 2923951 2669244 2549000 2659904 2751784 3016544 3046673
15968 3046673 2664969 2293953 2716642 2890507 2960170 2687602 2598611 2891291 2548471 2470714
15958 2470714 2653868 2605224 2912535 3126175 2819522 2775061 3036787 2961941 2808302 2695422
15948 2695422 2928305 2593582 2787517 2906013 2324104 2466661 2609330 2385285 2379426 2241823
15938 2241823 2690518 2672266 2582318 2745573 2725241 2728362 2816343 2951481 3087092 3376789
15928 3376789 2531234 2511013 2470428 2502126 2463816 2500067 2736738 2882555 2893048 2650438
15918 2650438 2571245 2609694 2415355 2196340 2741976 2668660 2807943 3062047 2821419 2639665
15908 2639665 2254339 2547870 2865124 2885228 2905351 2923439 2782262 2389776 2888625 2792309
15898 2792309 2867568 2630529 2966988 3069506 2590901 2503324 2190167 2667945 2688224 2584367
15888 2584367 3072809 3092180 2867607 2637653 2521586 2370127 2114600 2417743 2612964 2923562
15878 2923562 2656944 2518454 2797454 2885432 2579277 2406751 2414943 2686458 2741182 2573762
15868 2573762 2132106 2749084 2519198 2718770 2854261 2691160 2850112 2666971 2848829
15859 2848829 2754103 2349484 2501694 2749254 2397767 2337466 2342779 2697945 2662649 2591194
15849 2591194 2576319 2551472 2672327 2476660 2713979 2508589 2409023 2956925 2457270 2354972
15839 2354972 2439415 2452379 2602653 2706340 2679671 2277287 2341633 2193260 2467746 2375738
15829 2375738 2850311 2914495 2816610 2790159 2385709 2406087 2616861 2769568 2814229 2704307
15819 2704307 2480518 2969471 2706758 2875089 2938977 2882731 2842363 2975257 2712946 2623627
15809 2623627 2344231 2461810 2978096 2556747 2783521 2957883 2927713 3105527 3112183 3099374
15799 3099374 2997299 2933352 2584777 2732579 2918730 2682448 2707498 2784201 2447834 2533447
15789 2533447 3002091 2891501 2730574 2669943 2760494 3018947 2990505 3035195 2664720 2500078
15779 2500078 2473480 2841170 2934750 2545875 2717166 2938866 2660705 2396127 2656763 2764622
15769 2764622 2743549 2449709 2448218 2892993 3025336 2762077 2759138 2669375 2950798 2748286
15759 2748286 2775625 2519271 2349366 2359637 2579775 2810028 2489415 2610383 2752545 2900222
15749 2900222 2346650 2414234 2667333 2469199 2804106 2485600 2438766 2806623 2632748 2910828
15739 2910828 2727514 2785205 2620879 2267924 2250228 2317789 2655638 2664389 2712828 2758486 2567171
15728 2567171 2498847 2424724 2683957 2686077 2887990 2966780 2842376 2776257 2568401 2887256
15718 2887256 2745896 2343082 2635754 2815113 2391690 2457280 2514641 2585987 2604984 2956355
15708 2956355 2784157 2635466 2839118 2977273 2619496 2807889 2621046 2905948 2918289 2544670
15698 2544670 2491235 2624860 2721912 2744992 2795391 2540500 2865496 2778936 2733167 2748958 2897840
15687 2897840 2786964 2714131 2831581 2829890 2379733 2766159 2830235 2590445 2543980 2754894
15677 2754894 2694196 2362514 2718852 2556567 2885020 2524783 2435582 2190589 2199202 2531322
15667 2531322 2345141 2235719 2461959 2470816 2342793 2614867 2421734 2730929 2664819 2807901
15657 2807901 2687323 2604429 2642372 2809069 2690409 2846717 3035181 2981791 2676314 3000333
15647 3000333 2818710 2946028 2870871 3063119 2854309 3053204 2965735 2573590 2526892 2440091
15637 2440091 2602185 2633985 2780282 2739507 2431314 2630682 2952101 2821529 2687276 2813492
15627 2813492 2466424 2510945 2576007 2593352 3063084 2576359 2918306 2613441 2635121 2653946
15617 2653946 2618110 2932542 3182420 3025781 2892465 2770448 2680062 2903411 3011789 2950546
15607 2950546 2938789 2979975 2830740 2938800 2594049 2945973 2843739 2606216 2896833 2794593
15597 2794593 2772769 2781129 2866256 2852773 3029245 2560023 2750415 2820535 2710095 2852899
15587 2852899 2713253 2523973 2628746 2417233 2648333 2888475 2732692 2345495 2722169
15578 2722169 2860030 2905920 2689280 2709294 2609299 2689545 3130360 3134823 2911119 3103286
15568 3103286 2655539 2567829 2551189 2468281 2662963 2774217 2917502 2980669 2739342 2754431
15558 2754431 2831522 2762466 2592089 2981127 3087614 2765549 2852694 2960689 2946282 2658903
15548 2658903 2730526 2594040 3015445 2802401 2721843 2819187 2671155 3265555 3088730 2712872
15538 2712872 2686817 2610501 2869047 2734141 2861421 2618591 2613761 2909031 2950950 2865661
15528 2865661 3252723 3112612 2844525 2555983 2509121 2688293 2931000 3071055 2940075 2832667
15518 2832667 2896538 2681936 2546001 2937751 3161177 2895351 2583621 2773128 2708827 2944768
15508 2944768 2669830 2434650 2817333 2781373 2812596 2842657 2881927 2657158 2650068 2539415
15498 2539415 2783752 2664019 2430100 2747476 2925410 2643923 2654484 2898954 3087719 2929229
15488 2929229 2545862 2602141 2617078 3197316 3406613 3304229 3100805 2790191 2781602 2464039
15478 2464039 2354833 2362350 2805302 2671481 2688129 3284096 3330280 3047715 3241682 2985930
15468 2985930 2830837 2702250 2718507 2753711 2791034 2696457 2517113 2854849 2950030 2797464
15458 2797464 3006327 2974043 2520994 2774115 2987090 2743726 2444639 2904415 2940199 2820896
15448 2820896 2793791 3037210 3182575 3126491 3186449 2984040 2600759 2538598 2668167 2908738
15438 2908738 2990379 3108849 3168056 3274070 2686905 2605397 2262684 2591214 3128554 2658552
15428 2658552 2766599 3018743 3023029 2728327 2922675 3115138 2865341 2654016 2681088 2606965
15418 2606965 2589068 2488997 2436372 2580109 3018495 2952943 2851392 2864526 3197908 3307661
15408 3307661 2957936 2860603 2616588 2623242 2397645 2510388 2563325 2640223 2837298 2270492
15398 2270492 2588180 2944046 3056685 2959448 2664290 2475849 2496774 2881779 2894223 2402075
15388 2402075 2738246 3067035 2984145 3004664 3073675 3017713 3044891 2847836 2867661 3120809
15378 3120809 2824002 3015895 2922059 2789317 3115992 3374483 3078247 3331331 3402788 3180065
15368 3180065 2999153 2851656 2908043 2557922 2583365 2440034 2327597 2441551 2789574 2798979
15358 2798979 2859236 2601005 2561335 2917106 2549322 2583699 2733926 2756068 2474922 2587820
15348 2587820 2663055 2793830 2767391 2832671 2983068 2959894 2900721 2716182 3399904 3562521
15338 3562521 3259534 2777063 2370237 2712173 3054392 2712920 2759267 3074527 2692652 2663287
15328 2663287 2422609 2424677 2529720 2803781 2438414 2779383 2712979 2463961 2799310 2562388
15318 2562388 2518852 2619349 2924012 2932586 3000092 2779042 2484415 2841481 2625887 2449073
15308 2449073 2592553 2655957 2960993 2973465 2887185 2534805 2605665 2656790 2860283 2630411
15298 2630411 2715018 2547630 2406080 2968775 3105037 3033480 2939583 2957331 2885855 3122892
15288 3122892 2921369 2843043 2639359 2663596 2794009 2980021 2949992 2820376 2771395 2802136
15278 2802136 3176031 2869831 2667857 2921381 3113685 2758574 3108946 2718960 2573373
15269 2573373 2796865 3008092 2853323 2702901 2966229 2824084 2636674 2606131 2867230 2953414
15259 2953414 3117466 2499436 2547029 2665019 2658953 2534024 2690019 2915914 3067709 3054944
15249 3054944 3093522 2956067 2541313 2834636 2814564 2997380 3239858 2680991 2685783 2601212
15239 2601212 2953659 2772745 2662003 2922298 2403652 2632232 2570607 2960855 3108227 2917442
15229 2917442 3036983 2889185 3110324 2987939 3070640 2964052 2896737 3030458 2857086 2694659
15219 2694659 2681528 2727126 2767488 2617748 3012306 3099700 2493209 2845696 2917412 2860328
15209 2860328 2666573 2310650 2479342 3135086 2661259 2729491 2726201 2908759 2961341 2895834
15199 2895834 2719520 2618175 2612888 3023936 3100207 3000874 2870776 3136597 2989388 2873316
15189 2873316 2939480 2994303 3032058 2899397 3015701 2553985 2826599 2701945 2864779 3007721
15179 3007721 3119905 2566809 2716110 3278867 3173754 2889909 2626225 2963349 3045449 3250921
15169 3250921 3099246 2622565 2858885 2846768 2722447 2869696 3159252 2874251 2863810 2846276
15159 2846276 2705885 2965855 3078889 2772831 2695584 2794343 2809660 3070017 3137582 3324316
15149 3324316 3149137 2918052 2866603 3007821 2916734 2852551 2905961 2753685 2748328 2953953
15139 2953953 2630300 2991389 3060116 2858235 2909924 2909297 2715490 2837026 2951113 2689276
15129 2689276 2857269 2640426 2852245 3042095 3105922 3217751 3028118 3192060 3396791 2694715
15119 2694715 2991753 2966301 3010371 3239124 2803058 3116736 3170378 2674605 2836056 2651261
15109 2651261 2877779 2828596 3122936 3236428 2837357 3144279 3106828 2971441 3088853 2493527
15099 2493527 2481731 2885617 2580768 2332759 2421689 2381004 2821617 2903164 2371258 2613055
15089 2613055 2712155 2763346 2848244 2696720 2560404 2687221 2522897 2984597 3276986 2890987
15079 2890987 3235238 3273309 2771528 2747129 2901958 3129484 2946161 2788354 2854786 2884579
15069 2884579 2680284 3014371 2506944 2641373 3000703 2829210 2987260 2774579 2560625
15060 2560625 2287695 2520199 2676550 2399453 2647114 2765401 2721320 2839975 2864472 2983666
15050 2983666 3200830 3314207 3006378 2680441 2783929 2570013 2712648 2775297 2870884 2941946
$$ [...]
##END NTUPLES=NMR SPECTRUM
##END=
