##TITLE=1H_2PBC0602
 CDCl3, 8 sc, 
 7.2.2020
##JCAMPDX= 6.0         $$ Bruker NMR JCAMP-DX V2.0
##DATA TYPE= NMR FID
##DATA CLASS= NTUPLES
##ORIGIN= UXNMR, Bruker Analytische Messtechnik GmbH
##OWNER= root
$$ XWIN-NMR		Version 3.5
$$ Fri Feb  7 13:54:03 2020 Russian Standard Time (UT+4h)  she@DPX200
##.OBSERVE FREQUENCY= 200.1315
##.OBSERVE NUCLEUS= ^1H
##.DELAY= (6, 6)
##.ACQUISITION MODE= SIMULTANEOUS
##.ACQUISITION SCHEME= undefined
##.AVERAGES= 8
##.DIGITISER RES= 18
##SPECTROMETER/DATA SYSTEM= spect
##.PULSE SEQUENCE= zg30
##.SOLVENT NAME= D2O
##.SHIFT REFERENCE= (INTERNAL, D2O, 0, 15.7039)
##AUDIT TRAIL= $$ (NUMBER, WHEN, WHO, WHERE, WHAT)
$$ ##TITLE= Audit trail, XWIN-NMR		Version 3.5
$$ ##JCAMPDX= 5.01
$$ ##ORIGIN= Bruker BioSpin GmbH
$$ ##OWNER= she
$$ F:/spectra/data/she/nmr/H-F/1/audita.txt
$$ ##AUDIT TRAIL=  $$ (NUMBER, WHEN, WHO, WHERE, WHAT)
(   1,<2020-02-07 13:52:22.71 +0400>,<she>,<DPX200>,
      <created by zg, POWCHK disabled, PULCHK disabled
       configuration hash MD5:
       00 E9 B6 7A A2 85 ED C7 34 08 36 98 17 FE 4E 26
       data hash MD5: 16K
       6E 0B 93 B5 56 56 83 C9 7E E7 B2 36 7F FE E9 50>)
$$ ##END=
$$ 
$$ hash MD5
$$ 85 A6 82 EC AC F9 37 06 10 44 66 82 7C B9 6D F6
##$RELAX= 
##$RELAX= 
##$RELAX= 
##$RELAX= 
##$RELAX= 
##$RELAX= 
$$ Bruker specific parameters
$$ --------------------------
##$DU= <F:/spectra>
##$EXPNO= 1
##$NAME= <H-F>
##$PROCNO= 1
##$TYPE= <nmr>
##$USER= <she>
##$AMP= (0..31)
100 100 100 100 100 100 100 100 100 100 100 100 100 100 100 100 100 100 
100 100 100 100 100 100 100 100 100 100 100 100 100 100 
##$AQSEQ= 0
##$AQ_mod= 1
##$AUNM= <au_zg>
##$AUTOPOS= <>
##$BF1= 200.13
##$BF2= 200.13
##$BF3= 200.13
##$BF4= 200.13
##$BF5= 200.13
##$BF6= 200.13
##$BF7= 200.13
##$BF8= 200.13
##$BYTORDA= 1
##$CFDGTYP= 0
##$CFRGTYP= 5
##$CHEMSTR= <none>
##$CNST= (0..31)
1 1 145 1 1 1 1 1 1 1 1 1 1 1 1 1 1 1 1 1 1 1 1 1 1 1 1 1 1 1 1 1 
##$CPDPRG= <>
##$CPDPRG1= <>
##$CPDPRG2= <>
##$CPDPRG3= <>
##$CPDPRG4= <mlev>
##$CPDPRG5= <mlev>
##$CPDPRG6= <mlev>
##$CPDPRG7= <mlev>
##$CPDPRG8= <mlev>
##$CPDPRGB= <>
##$CPDPRGT= <>
##$D= (0..31)
0 1.2 0 0 0 0 0 0 0 0.06 0 0.03 0 0 0 0 0.0002 0 0 0 0 0 0 0 0 0 0 0 0 
0 0 0 
##$DATE= 1581069142
##$DBL= (0..7)
120 120 120 120 120 120 120 120 
##$DBP= (0..7)
150 150 150 150 150 150 150 150 
##$DBP07= 0
##$DBPNAM0= <>
##$DBPNAM1= <>
##$DBPNAM2= <>
##$DBPNAM3= <>
##$DBPNAM4= <>
##$DBPNAM5= <>
##$DBPNAM6= <>
##$DBPNAM7= <>
##$DBPOAL= (0..7)
0.5 0.5 0.5 0.5 0.5 0.5 0.5 0.5 
##$DBPOFFS= (0..7)
0 0 0 0 0 0 0 0 
##$DE= 6
##$DECBNUC= <off>
##$DECIM= 24
##$DECNUC= <off>
##$DECSTAT= 4
##$DIGMOD= 1
##$DIGTYP= 9
##$DL= (0..7)
0 120 120 120 120 120 120 120 
##$DP= (0..7)
150 150 150 150 150 150 150 150 
##$DP07= 0
##$DPNAME0= <>
##$DPNAME1= <>
##$DPNAME2= <>
##$DPNAME3= <>
##$DPNAME4= <>
##$DPNAME5= <>
##$DPNAME6= <>
##$DPNAME7= <>
##$DPOAL= (0..7)
0.5 0.5 0.5 0.5 0.5 0.5 0.5 0.5 
##$DPOFFS= (0..7)
0 0 0 0 0 0 0 0 
##$DQDMODE= 0
##$DR= 18
##$DS= 0
##$DSLIST= <SSSSSSSSSSSSSSS>
##$DSPFIRM= 0
$$ [...]
##$SUBNAM2= <"">
##$SUBNAM3= <"">
##$SUBNAM4= <"">
##$SUBNAM5= <"">
##$SUBNAM6= <"">
##$SUBNAM7= <"">
##$SUBNAM8= <"">
##$SUBNAM9= <"">
##$SW= 24.9337058887773
##$SWIBOX= (0..15)
0 0 2 0 0 0 0 0 0 0 0 0 0 0 0 0 
##$SW_h= 4990.01996007984
##$TD= 16384
##$TD0= 1
##$TE= 0
##$TE2= 300
##$TE3= 300
##$TEG= 300
##$TL= (0..7)
0 120 120 120 120 120 120 120 
##$TP= (0..7)
150 150 150 150 150 150 150 150 
##$TP07= 0
##$TPNAME0= <>
##$TPNAME1= <>
##$TPNAME2= <>
##$TPNAME3= <>
##$TPNAME4= <>
##$TPNAME5= <>
##$TPNAME6= <>
##$TPNAME7= <>
##$TPOAL= (0..7)
0.5 0.5 0.5 0.5 0.5 0.5 0.5 0.5 
##$TPOFFS= (0..7)
0 0 0 0 0 0 0 0 
##$TUNHIN= 0
##$TUNHOUT= 0
##$TUNXOUT= 0
##$USERA1= <user>
##$USERA2= <user>
##$USERA3= <user>
##$USERA4= <user>
##$USERA5= <user>
##$V9= 5
##$VALIST= <valist>
##$VCLIST= <CCCCCCCCCCCCCCC>
##$VD= 0
##$VDLIST= <DDDDDDDDDDDDDDD>
##$VPLIST= <PPPPPPPPPPPPPPP>
##$VTLIST= <TTTTTTTTTTTTTTT>
##$WBST= 1024
##$WBSW= 4
##$XGAIN= (0..3)
0 0 0 0 
##$XL= 0
##$YL= 0
##$YMAX_a= 440503
##$YMIN_a= -384511
##$ZGOPTNS= <>
##$ZL1= 120
##$ZL2= 120
##$ZL3= 120
##$ZL4= 120
##$ABSF1= 10
##$ABSF2= 0
##$ABSG= 5
##$ABSL= 3
##$ALPHA= 0
##$AQORDER= 0
##$ASSFAC= 0
##$ASSFACI= 0
##$ASSFACX= 0
##$ASSWID= 0
##$AUNMP= <proc_1d>
##$AZFE= 0.1
##$AZFW= 0.1
##$BCFW= 1
##$BC_mod= 2
##$BYTORDP= 1
##$COROFFS= 0
##$CY= 11.3945322036743
##$DATMOD= 1
##$DC= 2
##$DFILT= <>
##$DTYPP= 0
##$F1P= 16.9975609425685
##$F2P= -3.02152046262296
##$FCOR= 0.5
##$FTSIZE= 0
##$FT_mod= 4
##$GAMMA= 1
##$GB= 0.15
##$INTBC= 1
##$INTSCL= 1
##$ISEN= 128
##$LB= 0.24
##$LEV0= 0
##$LPBIN= 0
##$MAXI= 10000
##$MC2= 0
##$MEAN= 0
##$ME_mod= 0
##$MI= 1.114404
##$NCOEF= 0
##$NC_proc= 0
##$NLEV= 6
##$NOISF1= 3.799351
##$NOISF2= 2.8
##$NSP= 1
##$NTH_PI= 0
##$NZP= 0
##$OFFSET= 15.70392
##$PC= 1
##$PHC0= -9785.008
##$PHC1= 15.60081
##$PH_mod= 1
##$PKNL= yes
##$PPARMOD= 0
##$PSCAL= 0
##$PSIGN= 0
##$REVERSE= no
##$SF= 200.130013532006
##$SI= 16384
##$SIGF1= 3
##$SIGF2= 2
##$SINO= 400
##$SIOLD= 16384
##$SREGLST= <1H.CDCl3>
##$SSB= 0
##$STSI= 0
##$STSR= 0
##$SW_p= 3612.71676300578
##$SYMM= 0
##$S_DEV= 0
##$TDeff= 0
##$TDoff= 0
##$TI= <>
##$TILT= no
##$TM1= 0
##$TM2= 0
##$TOPLEV= 0
##$USERP1= <user>
##$USERP2= <user>
##$USERP3= <user>
##$USERP4= <user>
##$USERP5= <user>
##$WDW= 1
##$XDIM= 8192
##$YMAX_p= 0
##$YMIN_p= 0
$$ End of Bruker specific parameters
$$ ---------------------------------
##NTUPLES= NMR FID
##VAR_NAME=  TIME,          FID/REAL,        FID/IMAG
##SYMBOL=    X,             R,               I
##VAR_TYPE=  INDEPENDENT,   DEPENDENT,       DEPENDENT
##VAR_FORM=  AFFN,          ASDF,            ASDF
##VAR_DIM=   8192,          8192,            8192
##UNITS=     SECONDS,       ARBITRARY UNITS, ARBITRARY UNITS
##FACTOR=    0.0002004,     1,               1
##FIRST=     0,             0,               0
##LAST=      1.6414764,     0,               0
##MIN=       0,             -384511,         0
##MAX=       1.6414764,     440503,          0
$$ Real data points
##PAGE= N=1
##DATA TABLE= (X++(R..R)), XYDATA
$$ [...]
3315B506l265j975L318K107k601k810K850K693k323l135K110L426j535l985J302
3330a317M224j143m306R35M319l52m478j30M539J18m494l97M294J005m221j524
3346b928M592J198l735k042L726K097l417k471L225K620k517k737J839K833j782
3361E01k815J304K880o42l060J69L272M04l223o80K990J159l054j731K943K108
3377B525k816k561K954K569k450l009K238L507k007l989J586L803j295l728J223
3392a450L882p26m291L92M355l57m011l08M143M67l424r90L221J471l648j274
3408b548K807K149k766k147K350K324j937k333J444K656r54k602J41L294m19k906
3424a447l17K706J223l218j217L546J337k835k557L209K115k660k517K812K789
$$ plain form
3315 2506 -759 -2734 584 2691 90 -2720 130 2823 500 -2635 -525 2901 1366 -2619 -1317
3330 -1317 2907 1764 -2542 -1607 2712 2360 -2118 -2248 2291 2409 -2085 -2482 1812 2817 -1404 -2928
3346 -2928 1664 2862 -873 -2915 811 2908 -509 -2980 245 2865 348 -2389 -550 2283 501
3361 501 -2314 -1010 1870 1228 -1832 -1663 1609 2013 -1210 -1890 1100 2259 -795 -2526 417 2525
3377 2525 -291 -2852 102 2671 221 -2788 -550 2957 950 -3039 -1453 2350 1055 -2673 -1450
3392 -1450 2432 1706 -2585 -2193 2162 1805 -2206 -2514 1629 2096 -1328 -2318 903 2374 -1274 -2548
3408 -2548 259 2408 -358 -2505 -155 2169 232 -2101 -657 1999 1045 -1557 -1416 1878 1459 -1447
3424 -1447 -1764 942 2165 -1053 -2270 1276 2613 -222 -2779 430 2545 -115 -2632 180 2969
3439B969k834k741K061L452k327l255K039L192j709l146J282L412j186l190R50
3454a031L401j117k760j40K787L99k574m98K243J042k275r82J589J807j658j870
3470a637J340K077j200k083N37K677l77k953K68K880K65l359m65L189R23l397
3486a315o31L018J005l259j247L426J311k780k091K946K198l106k098K713K025
3501B115j809k955K271K373j717k167J323K416j244k634J171K516o57k652K62
3516a388K524m9k046l80K096N40k144j036K209J270k042j436J617J947j687j586
3532a591R18K373j190k247Q36K426n85k712K72K915ml165M46K172O71k527o61
3549a653K607J007k539j201K214J450k131j543J901J873k191j525J338K379j125
$$ plain form
3439 2969 135 -2606 -545 2907 580 -2675 -636 2556 847 -2299 -1017 2395 1209 -1981 -1031
3454 -1031 2370 1253 -1507 -1647 1140 1539 -1035 -1533 710 1752 -523 -1505 84 1891 233 -1637
3470 -1637 -297 1780 580 -1503 -966 1711 1334 -1619 -1351 1529 1794 -1565 -2030 1159 2082 -1315
3486 -1315 -1946 1072 2077 -1182 -2429 997 2308 -472 -2563 383 2581 -525 -2623 90 2115
3501 2115 306 -2649 -378 1995 278 -1889 -566 1850 606 -2028 -857 1659 1002 -1650 -1388
3516 -1388 1136 1087 -959 -1339 757 1297 -847 -1883 326 1596 -446 -1882 -265 1682 -5 -1591
3532 -1591 -673 1700 510 -1737 -901 1525 940 -1772 -1500 1415 1411 -1754 -1308 864 1535 -992 -1653
3549 -1653 954 1961 -578 -1779 435 1885 -246 -1789 112 1985 -206 -1731 -393 1986 861
3564H61k885J296K839r18k970O31L113o32k507m8K787Q5k534l66K268R19k358
3581d19j045K070J171j861j674K221J441k003j848K173J436j224j571Q47K180
3596A894r09k137L58K169j51k131j34K462k1k237p07K251R38j901j300J701J727
3613A872j806j974J870J970j237k683J468K380j229k400Q23K733q44k719M25K652
3629A301L4k944J02K841Q0k786k33K743M36k506p29K369P90k052j130J817J287
3646A420j422j896J585J662j028j916J062J922j014k224Q62J763N4j823m45K134
3662F96M62k073n93J943J304k506q27K082J200j864j643J859J655j713j786J285
3678e19J885r53j809Q30J998p27k145P10J683J27j746o36J885M12j746o75K091
$$ plain form
3564 861 -2024 -728 2111 1193 -1777 -1146 1967 1335 -1172 -1220 1567 1652 -882 -1248 1020 1939 -419
3581 -419 -1464 606 1777 -84 -1758 463 1904 -99 -1947 226 1662 438 -1133 -286 1894
3596 1894 985 -1152 -794 1375 1224 -907 -1041 1421 1400 -837 -1544 707 1645 -256 -1556 145 1872
3613 1872 66 -1908 -38 1932 695 -1988 -520 1860 631 -1769 -946 1787 943 -1776 -1351 1301
3629 1301 1335 -1609 -1507 1334 1414 -1372 -1605 1138 1574 -932 -1661 708 1498 -554 -1684 133 1420
3646 1420 -2 -1898 -313 1349 321 -1595 -533 1389 375 -1849 -987 776 830 -993 -1438 696
3662 696 1158 -915 -1508 435 1739 -767 -1594 488 1688 -176 -1819 40 1695 -18 -1804 -519
3678 -519 1366 413 -1396 -566 1432 705 -1440 -730 953 1080 -666 -1302 583 995 -751 -1426 665
3695F65R50j993j283K314P93j140j946J661J544j393j429J107J950j683j846J084
3711f45K220p79k097N67K367n57k177J60K256j51k143k22K525j63j575p67J835
3728F54J176k441o61J842Q63j755j020J470J033j187j091Q78J371p80j253R3J798
3745I90j06j819N5J557M90j751o70J952O62j995p39J676J173j560j407J559J450
3762A517j437j791J729J559j062k201J091K112j263j958J053J805k24k282K11
3777a141K258q1k183p1K074j7j896m50K047Q46k188m71J559J065j389j469J294
3794b13J286j244j487J232J235k70j672K79K126m21k049K07K063j22j830lJ302
3811D19N37j626o99J585J295j789j097J517J251j341j142J226J018j066j504J165
$$ plain form
3695 665 1615 -378 -1661 653 1446 306 -1640 21 1565 172 -1257 -150 1800 117 -1729 -645
3711 -645 1575 796 -1301 -734 1633 1076 -1101 -941 1315 1164 -979 -1201 1324 1161 -414 -1181 654
3728 654 1830 -611 -1272 570 1433 -322 -1342 128 1161 -26 -1117 -239 1132 352 -901 -808 990
3745 990 884 -935 -880 677 1167 -584 -1254 698 1360 -635 -1374 302 1475 -85 -1492 67 1517
3762 1517 80 -1711 18 1577 515 -1686 -595 1517 254 -1704 -651 1154 930 -1352 -1141
3777 -1141 1117 1036 -1147 -1218 856 839 -1057 -1507 540 1386 -802 -1273 286 1351 -38 -1507 -213
3794 -213 1073 -171 -1658 -426 809 539 -1133 -854 1272 851 -1198 -991 1072 950 -880 -883 419
3811 419 956 -670 -1369 216 1511 -278 -1375 142 1393 52 -1090 136 1154 88 -1416 -251
3827b51J655r77j639N03J974l04j969J04J987J63j988m9J830K76j874q90K044
3844E95P55j708q40J518J227j507j222J397J378j092j824Q79J971j061j727R84
3860b77J637l81k035J32J911l3j780j37J688M38j622o86J582R47j633r75J514
3877B90J024j307j415P37J746q65j313M71J864n95j837L49J832j91j417k36J736
3894H73M81k374l55K303K50k129m00J633J047j677j029J582J015j118j688J488
3910i8J362j199j310O09J844p83j742M17J709k22j703K70J397K89j535m65J608
3927D48P01j568q45J222J283j623j034J502J631j708j356J005J773j537j364J287
3943a83J430o78j836Q91J706o54j782N72J789l98j837J57J581J35j491m03J852
$$ plain form
3827 -251 1404 427 -1212 -709 1265 961 -1008 -904 1083 1246 -742 -791 1039 1315 -559 -1449 595
3844 595 1350 -358 -1198 320 1547 40 -1182 215 1593 501 -1323 -444 1527 466 -1261 -277
3860 -277 1360 979 -1056 -924 987 954 -826 -963 725 1163 -459 -1145 437 1384 -249 -1224 290
3877 290 1314 7 -1408 -671 1075 210 -1103 -632 1232 637 -1200 -851 981 790 -627 -863 873
3894 873 1354 -1020 -1375 928 1178 -951 -1351 282 1329 -348 -1377 205 1220 102 -1586 -98
3910 -98 1264 65 -1245 -636 1208 425 -1317 -900 809 587 -1116 -846 551 840 -695 -1160 448
3927 448 1149 -419 -1264 -42 1241 -382 -1416 86 1717 9 -1347 -342 1431 -106 -1470 -183
3943 -183 1247 569 -1267 -376 1330 676 -1106 -534 1255 857 -980 -823 758 893 -598 -1001 851
3960H51R7j313k72Q35R78j434m30Q61Q11o65r39L66J430l92j609l2J945O5k176
3979a023K3J789N23k019m68J869O35j819p12J837O27j719r47J701J132j645j034
3996a250J550J279j368j350R78J352j184j403Q83J971j320j365Q30J313n89j402
4012a075J84J658j53j275l6Q61P98j171j010J114J097j158q01M25J331o92j399
4029a302P69J766p73j687L76K223n59k071K85K006M8k010k59J972L35k052r5J554
4047E26Q21j776r86J673P38j291j179J715Q60j220j104J293J225j040j327N24
4063e48J439m06j426M35J352j17j536lJ539K83j305r28J641M56j023j077J298
4080G4J075p69j593J121J394r78j262M04J885o19j668R1J961m41j604L59J521
$$ plain form
3960 851 948 -365 -637 198 1176 -258 -688 173 984 319 -620 -254 1176 784 -825 -857 1088 1153 -1023
3979 -1023 -1000 789 1312 -707 -1175 694 1329 -490 -1202 635 1262 -457 -1404 297 1429 -216 -1250
3996 -1250 300 1579 211 -1139 -161 1191 7 -1396 -513 1458 138 -1227 -397 916 327 -1075
4012 -1075 -891 767 614 -661 -697 164 962 -209 -1219 -105 992 -166 -967 -542 789 97 -1302
4029 -1302 -533 1233 460 -1227 -851 1372 813 -1258 -973 1033 1081 -929 -1188 784 1119 -933 -1028 526
4047 526 1347 -429 -1415 258 996 -295 -1474 241 1101 -119 -1223 70 1295 255 -1072 -548
4063 -548 891 485 -941 -506 846 729 -807 -810 729 1012 -293 -1221 420 876 -147 -1224 74
4080 74 1149 380 -1213 -92 1302 324 -938 -534 1351 732 -936 -845 1116 675 -929 -570 951
4097I51k14j794J57J817K13j559o55J692O09j806l84J387O55j224q84J400J042
4114A403r54j537J239O46q98r25P37J295j59j570J67J221P9j132l78J387L09r11
4132A9j164J413M07q16p08P88J096r45j121J037R93r72j472Q62J805o66j529J56
4150h17J912m77j843L33J938k32j720l18K003J14j746n55K058O54j952n09J569
4167D12N20j493o72J259J274j222j237R37J069r67r58P23J549o22j407J85J142
4184D92M8r99m78J372M85j313q19J640M56q09j105J209R67j188j155J290J079
4201A172r24j512O71J760o98j480L50J989m24j802K25J669R1j838j86K018j77
4218I04j626l25J694N85j570q01J205J291j432j259J478J089j058j284J114J280
$$ plain form
4097 951 737 -1057 -900 917 1130 -429 -1084 608 1217 -589 -973 414 1069 -155 -1039 361 1403
4114 1403 449 -1088 151 797 -101 -1026 -289 1006 847 -723 -556 665 744 -388 -766 621 930 19
4132 19 -1145 268 675 -141 -849 -61 1035 90 -1031 6 999 27 -1445 -583 1222 556 -973 -817
4150 -817 1095 618 -1225 -892 1046 814 -906 -1224 779 893 -853 -1408 650 1304 -648 -1157 412
4167 412 932 -561 -1233 26 1300 78 -1159 -222 847 -120 -1078 -355 1194 572 -835 -650 492
4184 492 540 -459 -937 435 920 -393 -1212 428 884 75 -1030 179 1146 -42 -1197 93 1172
4201 1172 248 -1264 -593 1167 469 -1011 -661 1328 904 -898 -673 996 1087 -751 -937 1081 904
4218 904 -722 -1047 647 1232 -338 -1139 66 1357 -75 -1334 144 1233 175 -1109 5 1285
4234A285j032j217P51J534o20j537L54J217L33j779k34J652L55j467n57J676M85
4251A199j716m16J203Q53j204q91R42J368j244j309Q04J592o94j339K54J452m68
4268C86j289j11J688J97j589j95J482M18j596m96J386R88j445j179J552R68j430
4285b65q96J150J461j163j771J188J308q76j385Q35J501p79j367L71J485j30j746
4302a079J75J694J28j743j00J673M3j376n34J381P49j323n20Q65J094j038j247
4319a158R51J072o81j061M74J213j46j484K2J590k7j554j58J678K28j361p88J712
4337E22P00j396p45J202P97j162j063J138J272j176j239R95J446j227j185P38
4353c83J077j05j635L73J711k53j487j06J533k23q93n97J658L11j343r79J555
$$ plain form
4234 1285 253 -964 -213 1321 701 -836 -482 735 1068 -711 -945 707 1062 -405 -962 714 1199
4251 1199 -517 -933 270 1123 -81 -972 -30 1338 94 -1215 -411 1181 487 -852 -598 854 386
4268 386 -903 -1014 674 871 -718 -913 569 987 -609 -1105 281 1269 -176 -1355 197 1165 -265
4285 -265 -1161 -11 1450 287 -1484 -296 1012 136 -1249 -414 1087 308 -1059 -688 797 667 -1079
4302 -1079 -904 790 918 -825 -925 748 791 -585 -1119 262 1011 -312 -832 33 1127 89 -1158
4319 -1158 -207 865 184 -877 -403 810 664 -820 -798 792 765 -789 -947 731 959 -402 -1190 522
4337 522 1222 -174 -919 283 1080 -82 -1145 -7 1265 89 -1150 -155 1291 64 -1121 -383
4353 -383 694 589 -1046 -673 1038 785 -702 -808 725 502 -391 -988 670 981 -362 -1341 214
4370B14R21r83j241R50J156o83j603J121J542j216j439O73J836p10j506L98J912
4387A342q36j372j9J758j20j594R3J330j5r06n08J189O94j557o37J246Q70j140
4405a82r88Q91J341j126q24K38J311m41j138J18J508J41j795q1J505N69j847l78
4423a178J746N98j842o43J445J001j486q66J401J059j202j581J467J379r47j482
4439a131P53J743j365r68L83J440k26j836J185Q07l2j647J74J265M06j336o11
4456i96J354M49p54q67Q99R10n98j249P12J163p59j454Q33J196k63j589K90J521
4474G98K04j790mJ648N15k014l09J674O35j801p36J562Q19j643p61J546J182j407
4492A18j181J175J208j568q77R62J467j059j576R11J370l45j360q0J567M3j156
$$ plain form
4370 214 1135 152 -1089 -139 1017 334 -1269 -148 1394 178 -1261 -588 1248 538 -968 -570 1342
4387 1342 506 -866 -885 873 753 -841 -748 582 567 -339 -847 342 1036 -521 -1158 88 958 -182
4405 -182 -1170 -279 1062 -64 -888 -650 661 220 -918 -800 708 849 -946 -1027 478 1047 -800 -1178
4423 -1178 568 1166 -676 -1319 126 1127 -359 -1225 176 1235 33 -1548 -81 1298 351 -1131
4439 -1131 -378 1365 0 -968 -585 855 629 -1207 -22 785 753 -894 -720 545 951 -385 -996
4456 -996 358 807 53 -814 85 995 397 -852 -140 1023 264 -1190 -357 839 576 -1013 -723 798
4474 798 1002 -788 -792 856 1371 -643 -952 722 1357 -444 -1180 382 1201 -442 -1203 343 1525 118
4492 118 -1063 112 1320 -248 -1125 -163 1304 245 -1331 -420 950 605 -755 -835 732 775 -381
4509c81n45J561N19j758m59J356R68j491j166J520R56r79j143J133J115j434o97
4526i25O25J600r76j644O61J649n44j368K47J379j97j383L52J228J14j685j39
4543a006J339M22j179o55J023J087j170r94J083J179p98j216J92J593r20j182
4559a202M58J954o23j719M78J307K49j725j59J767k2j806j4J243R54j453p05J175
4577A57J058j267j160J070J354j187j075R03J247p65j372N89J780q19j483N71
4593c99J433n97j156Q2J468Q0j720O2J339K29r15q72J561K62j243q00J123J259
4611A196j182q62N55J400p36j500P78J152k28j515M68J415l29j359k15J775J75
4628I88j662j62J555O79j880l84J485L38q13j454J240J266r44j325R99J319j097
$$ plain form
4509 -381 -926 635 1154 -604 -1063 293 1261 -230 -1396 124 1080 101 -1042 91 1206 -228 -925
4526 -925 -300 1300 324 -1320 -659 990 446 -922 -675 704 507 -876 -524 704 818 -867 -1006
4543 -1006 333 755 -424 -1079 -56 1031 -139 -1133 -50 1129 331 -885 -693 900 -20 -1202
4559 -1202 -744 1210 587 -1132 -654 653 902 -823 -982 785 763 -1043 -1057 186 1140 -313 -1018 157
4577 157 1215 -52 -1212 -142 1212 25 -1050 -147 1100 335 -1037 -448 1332 513 -970 -399
4593 -399 1034 437 -719 -637 831 911 -809 -747 592 821 -94 -966 595 857 -386 -1186 -63 1196
4611 1196 14 -848 -293 1107 371 -1129 -351 801 573 -942 -474 941 612 -747 -962 813 988
4628 988 -674 -836 719 1398 -482 -866 619 957 144 -1310 -70 1196 252 -1073 -74 1245 148
4645A48j028M67J611q29j527N60J641m75j854P89J439k09j384l81J604L65j571
4662f34l45J602M63j660n15Q89J073j266n02R22P85p53j120N35J365o49r71R4
4680f87J272J1j602M01J256qj038n91J434L56j144p79J365Q10j337q08J301P78
4698I90j090j304J170J320q42j273Q12J592j053j442P25J389l29j582j2J862j71
4715G62j599K40J443J33j390k93J164N02j433k76J373K92p65j132J081J156j053
4732B05j299Q76J348n59j396M61J261m37j355L87J381N8j785j95J746K51j306
4749c58n15J266N96j289o01J375Q14j285j325J316J477j417j403J600P80p84j336
4766a089J221Q33j87j831O38J399l75j620L53J345J41j585j14J454M06j297m62
$$ plain form
4645 148 -880 -413 1198 369 -1158 -598 1043 568 -1286 -497 942 733 -651 -1032 572 937 -634
4662 -634 -979 623 1086 -574 -1089 -200 873 -393 -895 27 812 59 -1061 -526 839 190 -781 -687
4680 -687 585 596 -1006 -605 651 643 -395 -986 448 804 -340 -1119 246 1056 -281 -1089 212 990
4698 990 -100 -1404 -234 1086 244 -1029 -217 1375 322 -1120 -395 994 665 -917 -929 933 762
4715 762 -837 -597 846 979 -411 -704 460 962 -471 -747 626 918 153 -979 102 1258 205
4732 205 -1094 -218 1130 571 -825 -364 897 460 -895 -508 873 931 -854 -1049 697 948 -358
4749 -358 -873 393 989 -300 -901 474 1288 3 -1322 -6 1471 54 -1349 251 1031 247 -1089
4766 -1089 132 965 778 -1053 -415 984 609 -1011 -658 687 828 -757 -871 583 989 -308 -770
4783g70R17P96j297o40J149P99j039q10N76J097m09j391J21J869k31j801K24J710
4801H70l50j424j18J812k69j109n64J576R17j810o50J632P00j476j032J458R90
4818A153j245j235J158J513q44j769P55J286k98j465P04Q46j00r98r9J280Kj169
4836e25j85J119L68j276k43J097L47q98p67J197Q20p76j336R46J285q81j411Q54
4854b65J526p17j245L97J263k92j463Q2J568M9j807l08J914M87j861l52J719P69
4872A464j664q85J271Q57j355n33J255P41p75j527J118J258o79j508N45J377k16
4889G44j687L72J464j83j103l28J380j94j084m65J663L95j444p16J531R07j354
4906a02j073J429Q42j151j154R04J533p92j672O49J341k45j762L10J695m4j679
$$ plain form
4783 -770 147 943 -354 -994 155 954 -85 -895 -319 778 369 -1022 -901 968 737 -1064 -840 870
4801 870 520 -904 -1022 790 521 -588 -1152 424 1341 -469 -1119 513 1213 -263 -1295 163 1153
4818 1153 -92 -1327 -169 1344 500 -1269 -514 772 474 -991 -287 559 459 -539 -638 642 644 -525
4836 -525 -710 409 777 -499 -742 355 702 -196 -963 234 1054 278 -1058 -112 1173 292 -1119 -265
4854 -265 1261 544 -701 -304 959 667 -796 -714 854 903 -904 -1212 702 1189 -672 -1024 695 1464
4872 1464 -200 -1085 186 1043 -312 -845 410 1151 376 -1151 -33 1225 546 -962 -417 960 744
4889 744 -943 -571 893 710 -393 -721 659 465 -619 -1084 579 974 -470 -1186 345 1252 -102
4906 -102 -1175 254 1096 -55 -1209 -305 1228 436 -1236 -587 754 509 -1253 -943 752 708 -971
4923i71M1J400L01j493m00J736N24j727p82J564Q27j097j146J093J087q28j004
4940h75N07J633j062j178O79J148k78j486J13J489K35j951n0J847Q6j794k2J539
4958E80L19j442o23J327J198j327j315J355J438j435j309J149J222p84j812J165
4974b94J505n44j745P91J596q37j405M3J808l2j676j67J493K61j226m54J208R68
4992A293j304r92J143J103j075j266J179J165p81j520P31J578n16j660M22J537
5008A037l41j287j00J708l12j581m48J966K55j406n73J390J092j634j026J411
5024A51J023r11j740J372J548j103j508Q14J641r03j812P76J745m51j510j14J819
5041H37j10j721j14J815%j290n79J462Q39j679q44J574P34j270o93J046J080j021
$$ plain form
4923 -971 -930 470 771 -722 -1122 614 1138 -589 -1371 193 1020 -77 -1223 -130 957 129 -875
4940 -875 -368 1265 203 -975 -296 852 574 -912 -799 690 925 -1026 -1076 771 857 -937 -959 580
4958 580 899 -543 -1166 161 1359 32 -1283 72 1510 75 -1234 -85 1137 353 -1459 -294
4974 -294 1211 667 -1078 -287 1309 472 -933 -890 918 886 -790 -957 536 797 -429 -883 325 1293
4992 1293 -11 -1003 140 1243 168 -1098 81 1246 465 -1055 -324 1254 738 -922 -500 1037
5008 1037 696 -591 -691 1017 705 -876 -1324 642 897 -509 -1082 308 1400 -234 -1260 151
5024 151 1174 263 -1477 -105 1443 340 -1168 -354 1287 384 -1428 -652 1093 642 -868 -982 837
5041 837 727 -994 -1108 707 707 -583 -1162 300 1139 -540 -1384 190 924 -346 -1039 7 1087 66
5059F6j241Q58J041k92j640P68J349m61j401P6J403qj425l7J420P11j622q06J690
5078D49O49j584o99J299J084j444r58J182J027p78j560J154J526j007j572Q17
5094d15J538m54j934O60J735m08j754MJ662K51j490m78J849M40j820m70J684M73
5112A073j027j183J453N23p89j035R90J305q68j228K26J493o41j204J45J797j43
5129H87j852J64J627K96j600m48J624P04j826o56J078R32j109q95J010J172j029
5146G9j292J070J506q56j585O75J350o6j952M08J705l49j706J79J887J14k203
5163a036j89J869L02j380o59J526J014j571j423J597J049j483r11J185J264r92
5179A62j293L68J651l45k008P72J637j42k103M88J805J7k096m0J561M91j414p18
$$ plain form
5059 66 -1175 -317 724 432 -1208 -440 909 448 -953 -877 526 518 -907 -944 476 1187 -435 -1241 449
5078 449 1098 -486 -1185 114 1198 -246 -1204 -22 1005 227 -1333 -179 1347 340 -1232 -415
5094 -415 1123 669 -1265 -605 1130 722 -1032 -1028 634 885 -605 -1083 766 1206 -614 -1084 600 1073
5112 1073 46 -1137 316 839 50 -985 5 1310 442 -786 -560 933 292 -912 -767 1030 887
5129 887 -965 -801 826 1122 -478 -926 698 1402 -424 -1080 -2 930 -179 -1074 -64 1108 79
5146 79 -1213 -143 1363 507 -1078 -403 947 881 -1071 -663 1042 693 -1013 -834 1053 1167 -1036
5163 -1036 -1225 644 946 -434 -1093 433 1447 -124 -1547 50 1099 -384 -1295 -110 1154 162
5179 162 -1131 -763 888 543 -1465 -693 944 802 -1301 -813 992 1009 -1087 -1127 434 925 -489 -1207
5197a207J579O80j485r46J452J012j276r95J027J241q23j403M45J707o45j714
5213a351N85J689k01j424l02J839k63j473k42J766O77j957l82J377Q99j647p97
5230a207J469Q94j242j239Q36J700j053j566J277J413q39j681Q46J407l49j731
5246a065K41J934J73j837m13J846J33j845r7J715M04j293j307J540J097j264j294
5263a332J436J151j222j351J229J353r02j348L68J883q94j478N71J690l53j666
5279h65l23K077K99j817n90J720Q42j725j048J897Q83j468j376J840Q22r32j487
5296a251R76J811j092j624P74J642p87j511J89J898j57j913nJ731R9j798k59J754
5314D77N15j091j631J813J204j652r25J419J386j336j840J601J299r17j674P16
$$ plain form
5197 -1207 372 1052 -433 -1379 73 1085 -191 -1186 -159 1082 259 -1144 -699 1008 363 -1351
5213 -1351 -766 923 722 -702 -1004 835 572 -901 -1143 623 1300 -657 -1039 338 1237 -410 -1207
5230 -1207 262 1156 -86 -1325 -489 1211 158 -1408 -131 1282 443 -1238 -392 1015 666 -1065
5246 -1065 -824 1110 1283 -554 -967 879 1012 -833 -930 785 1189 -104 -1411 129 1226 -38 -1332
5263 -1332 104 1255 33 -1318 -89 1264 362 -986 -618 1265 371 -1107 -536 1154 801 -865
5279 -865 -1188 889 1188 -629 -1219 501 1343 -382 -1430 467 1350 -118 -1494 346 1168 236 -1251
5296 -1251 -275 1536 444 -1180 -406 1236 449 -1062 -873 1025 868 -1045 -1050 681 780 -1018 -1277 477
5314 477 992 -99 -1730 83 1287 -365 -1290 129 1515 179 -1661 -60 1239 322 -1352 -636
5330f36J657m52j668L71J688q7j954J62J544N93k352r7J826M53j217j013J325
5347A43Q66j245j148J160J389r36j740J160J972j139j808Q75J862o99j911L39
5363h60J995j80j517l44J857N52k122k75J756K18j462r88J738Q48j359j228J551
5380A80J339j532j225Q03J465p86j676J229J441k69j922M48J575r5j917j26K111
5397A043o3j547n21J736O00j566o42J228J246j462j460J735J057j158j767J188
5413c53J754j022j892R76K001r93j650O21J611j62k111J92K215l34j859l01J966
5430F59O47j589r98J770Q13j542r68J431J026j291j278J060J416p60j794P09J976
5447A287r60j686O32J436J6j402j86J791o1j850m45K007P49j774p42J737P92j742
$$ plain form
5330 -636 1021 569 -1099 -728 960 873 -1081 -919 625 1218 -1134 -1231 595 1048 -169 -1182 143
5347 143 1009 -236 -1384 -224 1165 229 -1511 -351 1621 482 -1326 -451 1411 712 -1199 -860
5363 -860 1135 955 -562 -906 951 1503 -619 -894 862 1080 -382 -1370 368 1216 -143 -1371 180
5380 180 1519 -13 -1238 -435 1030 244 -1432 -203 1238 969 -953 -505 1070 975 -942 -1068 1043
5397 1043 980 -567 -1088 648 1248 -318 -960 268 1514 52 -1408 327 1384 226 -1541 -353
5413 -353 1401 379 -1513 -537 1464 471 -1179 -558 1053 891 -1220 -1028 1187 853 -1006 -1307 659
5430 659 1306 -283 -1281 489 1302 -240 -1208 223 1249 -42 -1320 -260 1156 396 -1398 -689 1287
5447 1287 327 -1359 -727 709 725 -677 -863 928 867 -983 -1428 579 1328 -446 -1188 549 1341 -401
5465d01j169J553J612j481j520J260J664j563j199R13J700q80j757O35J957n96
5481G28k034M52K014k08j747n30K046L44j566n07J324Q24j434p60J115J239j310
5498a0j306J282J432j335j415J034J706j155j186K17J824o3k255J37K348l5j961
5515g41l64J865P12j885q29J624J120j672j179J343J328j342j392J516J459j323
5531B40j487Q90J697j071j529Q61J650o28j570m7K094j20j584j51J386M17j595
5548e47m88J375J054k029n47J341Q91j207j050J134J377j063j482R56J532p76
5564D71j795N51K064o76j658m2J917J09j718l49J998K08j859n70K047N47j711
5581d66j186K121P22j239j159J337J095j136j383O35J897p52j798O30J518j73
$$ plain form
5465 -401 -1570 -17 1595 114 -1406 -146 1518 -45 -1244 -331 1369 489 -1268 -633 1324 728
5481 728 -1306 -854 1160 952 -795 -1325 721 1065 -501 -1008 316 1140 -294 -1054 61 1300 -10
5498 -10 -1316 -34 1398 63 -1352 -318 1388 233 -953 -736 1088 1025 -1230 -1093 1255 1220 -741
5515 -741 -1105 760 1472 -413 -1242 382 1502 -170 -1349 -6 1322 -20 -1412 104 1563 240
5531 240 -1247 -357 1340 269 -1260 -399 1251 623 -947 -994 1100 980 -604 -755 631 1048 -547
5548 -547 -1035 340 1394 -635 -1182 159 1050 -157 -1207 -73 1304 241 -1241 -285 1247 471
5564 471 -1324 -773 1291 615 -1043 -1085 832 941 -777 -1126 872 1080 -779 -1349 698 1245 -466
5581 -466 -1652 469 1191 -48 -1207 130 1225 89 -1294 -659 1238 486 -1312 -682 836 663
5597F63j694J41J749L49k133j68J920M20j877o09J855O03j217j370J773J273j790
5614a12j606J473J655j156j666J107J647p50j852N22J783l4k197M67J874j32j824
5631h01k40J740N97j949o12J873R00j729j003J693P73j255j198J342J380j342
5647A69j393J147J476q50j982O50J992o44j671K85J943l1j691o38J951N49j829
5664e67r45K018Q86j489j341J581J538j669j630J369J698r73j772R91J507n89
5680F13j924M73J940m04k245M40K038n8k103J45J786O30k108o39K019O22j692
5697d67r67J685R26j410j346J474J403j269j339R23J944j272j611N46J608N4j805
5714i23r7K013j46j603l81J780N85j823r04J906Q76j582q58J194J488j599j692
$$ plain form
5597 663 -1031 -890 859 1208 -925 -1093 827 1247 -630 -1239 616 1219 2 -1368 405 1678 -112
5614 -112 -1718 -245 1410 254 -1412 -305 1342 592 -1260 -738 1045 1011 -1186 -719 1155 1023 -801
5631 -801 -1041 699 1296 -653 -1265 608 1508 -221 -1224 469 1242 -13 -1211 131 1511 169
5647 169 -1224 -77 1399 549 -1433 -783 1209 565 -1106 -821 1122 1091 -600 -1238 713 1262 -567
5664 -567 -1512 506 1392 -97 -1438 143 1681 12 -1618 -249 1449 476 -1296 -305 1202 613
5680 613 -1311 -838 1102 698 -1547 -1107 931 873 -1230 -1085 701 1331 -777 -1416 603 1225 -467
5697 -467 -1434 251 1177 -233 -1579 -105 1298 29 -1310 -387 1557 285 -1326 -780 828 882 -923
5714 -923 -1020 993 847 -756 -1137 643 1228 -595 -1499 407 1283 -299 -1157 37 1525 -74 -1766
5731a766J647J258p76j676J041J774p62j860N20J850k37k136K71J737J55k083
5747a043l7J872M37k051m67K055P67j871o33J081J542j693j279J275J360j407
5763i2j235J234J410j064j618Q43J737k65j963L85K146p20j873O3K047k29j821
5780a015l7J451P76j350j034J641J166j586j499J169J829j508j120P81J568p45
5796D87j661P01J533o42j961K62K341Q5k130m17K090N37j887m41J795N35j773
5813e46q08J676O93j145j492J627J381j035j862J145J757j220j576O25J984n12
5829F92k018L19J914M8k071N4K139pj844o00K156L82j839n70J534J255j623j381
5847a460J426J361j193j431P68J991r65j850R81J664n27j822K62J892k00j744
$$ plain form
5731 -1766 -119 1139 363 -1313 -272 1502 740 -1120 -600 1250 1013 -1123 -852 885 1040 -1043
5747 -1043 -1080 792 1229 -822 -1289 766 1533 -338 -971 110 1652 -41 -1320 -45 1315 -92
5763 -92 -1327 -93 1317 253 -1365 -522 1215 950 -1013 -628 1518 798 -1075 -1012 1035 806 -1015
5780 -1015 -1052 399 1175 -175 -1209 432 1598 12 -1487 -318 1511 3 -1117 -336 1232 487
5796 487 -1174 -473 1060 418 -1543 -1281 1060 1145 -985 -1402 688 1225 -662 -1103 692 1227 -546
5813 -546 -1354 322 1015 -130 -1622 5 1386 351 -1511 -366 1391 171 -1405 -780 1204 692
5829 692 -1326 -1007 907 955 -1116 -1062 1077 1070 -774 -1374 782 1164 -675 -1245 289 1544 -79 -1460
5847 -1460 -34 1327 134 -1297 -529 1462 497 -1353 -372 1292 765 -1057 -795 1097 897 -847
5863h47k58J960L88j939q44K156O79j439j353J904J037j477j622J596J680j196
5879D25j859J366J576j089j503O2K079R5k186K8K231l51j858R0J835K77j871n31
5897a184J850J110k206j028J764J101j778j258J621J479j449j586J368J571j004
5912C71j942J145J677n11j942O81J545m68j812Q5J922O70k140l46J463P57j409
5929b54j126J708J027j256j549J468J678j311j919J072J408m57k011R03J813n27
5945F67j948K81J857J38k139J6J974L32k099m37J928N72j691r37J851J419j943
5962a59j334J330J669j499j490J002J966j050j905P13K027p29j795L26J706j9
5978G59j937K50J885K29j995j90J572N25j216j009J401J174j313j480J173J685
$$ plain form
5863 -847 -1105 855 1243 -696 -1540 616 1295 -144 -1497 407 1444 -33 -1655 -59 1621 425
5879 425 -1434 -68 1508 419 -1084 -1022 1057 1152 -1034 -1006 1225 874 -984 -894 941 1218 -653 -1184
5897 -1184 666 1776 -430 -1458 306 1407 -371 -1629 -8 1471 22 -1564 -196 1375 371
5912 371 -1571 -426 1251 740 -1202 -521 1024 556 -1256 -1171 751 1421 -719 -1065 398 1155 -254
5929 -254 -1380 328 1355 99 -1450 18 1696 385 -1534 -462 946 489 -1522 -619 1194 667
5945 667 -1281 -1000 857 995 -1144 -1128 846 1178 -921 -1358 570 1142 -549 -1486 365 1784 -159
5962 -159 -1493 -163 1506 7 -1483 -481 1485 435 -1470 -757 1270 541 -1254 -928 778 759
5978 759 -1178 -928 957 1186 -809 -999 573 1098 -118 -1127 274 1448 135 -1345 -172 1513
5994A513j422j791J255K066j177j590P25J472k06j950J1K205O3k211k14K133K80
6011A162j992n45K075N36j602q55J655J016j571j265J286J728j385j692J106J582
6027A239n66j955L58K235n10k024N43J832k68k091R7K044K49j794r07K059Q08
6044A349j626r73J376J211j258j643J379J666j289j507R10J646p47j721P44J600
6060A117m30j991O72J751j63j892k70K127J77j877m23J817P58j730j035J430J346
6077A384j811j202J802J167j348j109P72J634o82k028R26J694m52j614j50K202
6093A185k84j838L01J187K29j630j78J634O55j855p85J601J159j224j941J837
6109E3J401j041j769J006J728j050j620Q19J763l32k231RK602m41j909L30J453
$$ plain form
5994 1513 91 -1700 -445 1621 444 -1146 -421 1051 845 -1105 -1094 1111 1174 -1037 -1251 882 1162
6011 1162 -830 -1375 700 1236 -366 -1221 434 1450 -121 -1386 -100 1628 243 -1449 -343 1239
6027 1239 673 -1282 -924 1311 801 -1223 -680 1152 884 -1207 -1110 934 1183 -611 -1518 541 1349
6044 1349 -277 -1250 126 1337 79 -1564 -185 1481 192 -1315 -405 1241 494 -1227 -483 1117
6060 1117 687 -1304 -632 1119 956 -936 -1206 921 1098 -779 -1202 615 1373 -357 -1392 38 1384
6077 1384 -427 -1629 173 1340 -8 -1117 -345 1289 607 -1421 -495 1199 747 -867 -1017 1185
6093 1185 901 -937 -636 551 780 -850 -1028 606 1261 -594 -1379 222 1381 157 -1784 53
6109 53 1454 413 -1356 -350 1378 328 -1292 -473 1290 958 -1273 -1264 1338 897 -1012 -682 771
6126G71M40j938m82K313J59j751q04J698R70j713j020J569J121j142j601J502
6142I2J289r55j900O48J936k18j886J37J715K43j857O5J756R7j971n9J477O17
6160A226j386j039J723R54j637j427J455J736j426j434J118J420o17k040O89K103
6176A418o72k005L55K003j27k190J54J996L53k344l05J932P36j801o76J248J006
6193A081j579p84J185J673j250j940J242J422n25j640O27J682p08j571J46K052
6209A113k09k154K32J830M07k075n46K049O29j529j034J284J758k062j336J650
6225GJ218q26j825Q40K353j218j855P55J851o56j886K67K207m6k287j54J943O53
6243A341k039k70J373Q16j513j035J683Q74j396j383J466J411j226j496J236J671
$$ plain form
6126 771 1211 -727 -1209 1104 1263 -488 -1292 406 1376 -337 -1357 212 1333 191 -1410 92
6142 92 1381 426 -1474 -826 1110 892 -994 -857 858 1101 -756 -691 1065 1162 -809 -868 609 1226
6160 1226 -160 -1199 524 1478 -159 -1586 -131 1605 179 -1255 -137 1283 666 -1374 -685 1418
6176 1418 746 -1259 -904 1099 972 -1218 -1064 932 1285 -1059 -1364 568 1304 -497 -1173 75 1081
6193 1081 -498 -1282 -97 1576 326 -1614 -372 1050 525 -1115 -488 1194 486 -1085 -939 1113
6209 1113 904 -1250 -1018 812 1219 -856 -1402 647 1276 -253 -1287 -3 1755 -307 -1643 7
6225 7 1225 399 -1426 -586 1767 549 -1306 -551 1300 644 -1242 -975 1232 1186 -1101 -1255 688 1341
6243 1341 -698 -968 405 1221 -292 -1327 356 1230 -166 -1549 -83 1328 102 -1394 -158 1513
6259A513j053j579N11J722o6k048j38J979J46j697n04K312L0j385j005J833R92
6276A563j990p87J767Q32j483j395J571J359j525j284R09K018j286j736J100J594
6292A227o17j426J09J824n6k236J52K080N44k469j00J750O16j706j168J760J067
6309A351j579p82R59J461j171j708J522R51l33j961P04J646l80j834O2J738L03
6326I49j806l51J984K78j660p31K004O90j844p76J510J251j625j104J269J121
6342A159j265j506J483J695j380j548Q05J640m78j757O07J549l92j861k5K051
6358G77M42k028k47J654Q74k022m84J287J101j412j450J696J143j354j124O20
6374e27J898r74j209L9J710n3j964K47J902j49j798n88K371M03j947m86J328J032
$$ plain form
6259 1513 460 -1119 -608 1114 1048 -1000 -1138 841 987 -710 -1214 1098 1128 -257 -1262 571 1563
6276 1563 -427 -1214 553 1385 -98 -1493 78 1437 -88 -1372 -463 1555 269 -1467 -367 1227
6292 1227 610 -816 -707 1117 1061 -1175 -1023 1057 1601 -868 -968 782 1398 -308 -1476 284 1351
6309 1351 -228 -1010 -51 1410 239 -1469 53 1004 671 -1290 -586 1060 680 -1154 -1092 646 949
6326 949 -857 -1208 776 1054 -606 -1337 667 1357 -487 -1263 247 1498 -127 -1231 38 1159
6342 1159 -106 -1612 -129 1566 186 -1362 -557 1083 605 -1152 -545 1004 612 -1249 -1274 777
6358 777 1219 -809 -1056 598 1472 -550 -1034 253 1354 -58 -1508 188 1331 -23 -1147 -527
6374 -527 1371 397 -812 -773 937 884 -1080 -833 1069 920 -878 -1466 905 1308 -639 -1125 203 1235
6392A235j176j105J543P03j254j516J384J438j419j366J528J431p82j775J96K318
6408A383p44j751R1K176k21j772j91J755N33j994k30J643O52j729r51J808J054
6425A512j511j246J365J042j226j111R35J611j520r30M76J577o72j443L26K000
6441A185l75j648k12J806L3j391m64J498O43j569q40J451J124j091j172Q03J317
6458A098j057j249J004J667r06j650K79J991l77k119L38J757J65k089L67J710
6474I29K97k141k35J808M03j944q63K065J105j562j039J374J046j172j404J367
6490C4J451j212j768J021J735q43j332K77J697j02j769J05J489K14j577n24J635
6507E31O06j785k47J161Q74j334j255J406J145q01j554J128J367n83j831O97J792
$$ plain form
6392 1235 59 -1046 497 1200 -54 -1570 -186 1252 -167 -1533 -5 1426 644 -1131 -935 1383
6408 1383 639 -1112 -1021 1155 934 -838 -1029 726 1259 -735 -965 678 1330 -399 -1350 458 1512
6425 1512 1 -1245 120 1162 -64 -1175 -240 1371 -149 -1079 -603 974 302 -1141 -815 1185
6441 1185 810 -838 -1050 756 789 -602 -1066 432 1075 -494 -1334 117 1241 150 -1022 -219 1098
6458 1098 41 -1208 -204 1463 557 -1093 -814 1177 800 -1319 -981 776 941 -1148 -781 929
6474 929 1226 -915 -1150 658 1061 -883 -1746 319 1424 -138 -1177 197 1243 71 -1333 34
6490 34 1485 273 -1495 -474 1261 418 -914 -637 1060 958 -811 -706 783 997 -580 -1104 531
6507 531 1137 -648 -895 266 1140 -194 -1449 -43 1102 301 -1253 -125 1242 659 -1172 -475 1317
6524A317q10j683M50J690J49j799l55J847J95j692n08J605R31j827o88J305J321
6541A448j245j600J291J718j520j393J411J271r26j890Q89J804l22k051K58J793
6557I36J85k113j94K100J89j739n31J737M79j333j102J776R34j261j126J047J066
6574A050j198j403J508J141p37j537Q77J577p75j448KJ891j9j845k26J603P21
6591A182j964m04J305J069j403j162J569R86j428j395J547J436j085j794R21J683
6607A063n65j994P12J846j94k124M4K339j30k018l00K318q0j696n49K218K63j859
6625g06n21J754N62j366j120J398J202j159j068P75J231p17j453N75J608l09j275
6642e89j18J243Kj414K7J570J49j639l49J366J224j807p73J433J181j273j570
$$ plain form
6524 1317 507 -1176 -726 964 1113 -686 -1041 806 1001 -691 -1199 406 1337 -490 -1178 127 1448
6541 1448 203 -1397 -106 1612 92 -1301 110 1381 455 -1435 -546 1258 936 -1115 -857 936
6557 936 1121 -992 -1186 914 1103 -636 -1167 570 1049 -284 -1386 390 1324 63 -1063 -16 1050
6574 1050 -148 -1551 -43 1098 361 -1176 -299 1278 503 -945 -943 948 929 -916 -1142 461 1182
6591 1182 -782 -1186 119 1188 -215 -1377 192 1178 -250 -1645 -98 1338 253 -1541 -620 1063
6607 1063 498 -1496 -784 1062 868 -1256 -1212 1127 997 -1021 -1321 997 917 -779 -1328 890 1153 -706
6625 -706 -1227 527 1089 -277 -1397 1 1203 44 -1024 -249 982 265 -1188 -613 995 686 -589
6642 -589 -707 536 538 -876 -849 721 870 -769 -1118 248 1472 -335 -1108 325 1506 233 -1337
6659a337P20K044j265j522R86J661n66j929M74J776m8j994K33J385N86k394K94
6676h96J746K42k014l30J571P59j752p03J718O82j156r80J207J053p87j719J213
6693a46J449j168j217M51J833m87j680J40K021k08j936l3J604L01j587o35J619
6710C21J095k017o48J333J269j693j074J489J416j436j369J029J610q14j882M98
6726h73J829k82k049L73J905k3j719j60J627L90j827p95K055P19j169j269J601
6743C33O59j369j151J673J185j253j110Q15J493o50j795N60J637j91j564j22J929
6760A079j14j908l5J602M52j665m29J727N96j649j032J833Q74j527j265J674J112
6777A325r50j627J064J563r21j572P98J253j23j763Q3K161n23j784J0J654O14
$$ plain form
6659 -1337 -617 1427 162 -1360 -374 1287 721 -1208 -734 1042 994 -1000 -767 618 1204 -1190 -896
6676 -896 850 1092 -922 -1252 319 1078 -674 -1377 341 1023 -133 -1113 94 1147 360 -1359 -146
6693 -146 1303 135 -1082 -631 1202 715 -965 -825 1196 988 -948 -981 623 924 -663 -1298 321
6710 321 1416 -601 -1249 84 1353 -340 -1414 75 1491 55 -1314 -285 1325 511 -1371 -873
6726 -873 956 674 -1375 -1002 903 880 -839 -999 628 1018 -809 -1604 451 1170 1 -1268 333
6743 333 992 -377 -1528 145 1330 77 -1033 -218 1275 625 -1170 -610 1027 836 -728 -850 1079
6760 1079 965 -943 -978 624 1076 -589 -1018 709 1305 -344 -1376 457 1331 -196 -1461 213 1325
6777 1325 375 -1252 -188 1375 454 -1118 -320 933 810 -953 -870 1291 768 -1016 -1006 648 1262
6794A262j928n67J851O30j733r79J705J187j646j089R89J680j262j503J081J572
6810A250n73j741M33J777j40k029K95J857o3k204J79J876K52j768o08J805Q37
6827A435j999o52J632P77j382j077J511J000r61j682J263J456r68j708P42J606
6843I93n02j583j54K007K77j963l78K273K01j915m1J195N05j307r91J353J078
6860A048j057j213J187J477j408j218Q49J606n81j609K34J841k83j897K33J646
6876H55N58k338l10J756N50j675o60J748P02j820n13J185J446j472j562J528J366
6893A344q46j733R44J207m87j486M08K089o95j786J33J909Q4k176J20J851J85
6910A065j671p56J593J034j478r30J355J050j035j361J165J426j440j362J284
$$ plain form
6794 1262 -666 -1233 618 1248 -485 -1464 241 1428 -218 -1307 -318 1362 100 -1403 -322 1250
6810 1250 677 -1064 -631 1146 1006 -1023 -728 1129 1066 -1138 -959 917 1169 -599 -1207 598 1435
6827 1435 -564 -1216 416 1193 -189 -1266 245 1245 284 -1398 -135 1321 353 -1355 -613 993
6843 993 491 -1092 -1246 761 1038 -925 -1303 970 1171 -744 -785 410 915 -392 -1383 -30 1048
6860 1048 -9 -1222 -35 1442 34 -1184 -335 1271 690 -919 -685 1156 873 -1024 -791 855
6876 855 1413 -925 -1235 521 1071 -604 -1264 484 1186 -634 -1147 38 1484 12 -1550 -22 1344
6893 1344 498 -1235 -291 916 429 -1057 -649 1440 745 -1041 -908 1001 1085 -1091 -971 880 1065
6910 1065 -606 -1362 231 1265 -213 -1143 212 1262 227 -1134 31 1457 17 -1345 -61
6925f1J398q74j587O09J678n86j739M75J158K83j587k0J762J58j823n30J675O97
6943A086j411r79J477J118j201j155R72J545j228j382O14J631o14j718O64J706
6959A125n68j661M25J525k9j594p8J718J35j685l47J493Q19j751p58J327J199
6976A295j379r84Q07J695j132j747J154J946r05k093P84J943q25j743mK430m18
6993H24j858O6J942J55j964l54J985K13j135q03J198R24j343j259J453J279j292
7010C1j244J049J512j026j416K34J918m58j556K48J594j03j382m25J854pj731
7027i08k61J874M70j588o13R90J024j255j050J355J264r77j875J328J252l06j737
7044a013L54J803n01j635K35J712N4j975K09J707M14k131k78J459P88j518r50
$$ plain form
6925 -61 1337 463 -1124 -515 1163 577 -1162 -687 471 754 -833 -853 909 1067 -756 -1286 389 1086
6943 1086 -325 -1304 173 1291 90 -1065 -93 1452 224 -1158 -544 1087 473 -1245 -581 1125
6959 1125 557 -1104 -679 846 817 -777 -855 863 998 -687 -1034 459 1278 -473 -1231 96 1295
6976 1295 -84 -1068 -261 1434 302 -1445 -291 1655 750 -1343 -559 1384 559 -1184 -1188 1242 824
6993 824 -1034 -968 974 1129 -835 -1189 796 1009 -126 -929 269 1193 -150 -1409 44 1323 31
7010 31 -1213 -164 1348 322 -1094 -860 1058 600 -956 -708 886 783 -599 -1024 830 823 -908
7027 -908 -1169 705 1175 -413 -1026 -36 988 -267 -1317 38 1302 325 -1550 -222 1030 724 -1013
7044 -1013 -659 1144 643 -992 -757 955 1009 -966 -757 950 1364 -767 -1045 414 1202 -316 -1266
7061a266J578J158j843j032J362J388r65j439R02J487j144j336N04J924l47k032
7077a101M03J705j07j740j68J639L05j496k68J245Q84j862o84J585P80j237j159
7094a276J182J278p14j785R74J540n92j847N15J752j16j880R3J994j43j706l12
7111a043J681M59j889k89J593M34j302r68J594J020j342r69Q93J618j218j838
7127a566J149J754j253j412R24J661p76j850M57J741J72k052j57K212m1j651l99
7144a087J587O67j953q42J962J325j956j022J507J433j517j233Q18J529o56j499
7160i37L13J752m21j746L39J713k01j680j76J558P00j803k28J386Q30j741o59
7177a001J513O38j220j287J482J123r53j544R93J628j051j379L07J951n40j691
$$ plain form
7061 -1266 312 1470 -373 -1405 -43 1345 380 -1059 -157 1330 186 -1150 -646 1278 931 -1101
7077 -1101 -698 1007 900 -840 -1008 631 936 -560 -828 417 1301 -561 -1245 340 1120 -117 -1276
7094 -1276 -94 1184 470 -1315 -341 1199 607 -1240 -725 1027 911 -969 -876 1118 975 -731 -1043
7111 -1043 638 1097 -792 -1081 512 946 -356 -1324 270 1290 -52 -1021 -128 1490 272 -1566
7127 -1566 -417 1337 84 -1328 -404 1257 481 -1369 -912 829 1001 -1051 -1208 1004 963 -688 -1087
7144 -1087 500 1167 -786 -1628 334 1659 -297 -1319 188 1621 104 -1129 -311 1218 562 -937
7160 -937 -624 1128 707 -1039 -700 1013 812 -868 -1044 514 1214 -589 -817 569 1399 -342 -1001
7177 -1001 512 1150 -70 -1357 125 1248 295 -1249 -256 1372 321 -1058 -751 1200 660 -1031
7193a031M60J667l12j625l38J899M04j621p15J767R12j797o80J221J036j299j319
7210a371J586J298j209j531J040J476p59j865N94J688l64j840M93J764j98j725
7226i23l15K075K96j700n58J478Q67j675p88J366O84q26j190R87J463j231j291
7243a281J165J131n68j701N86J837o04j573M5J836K43j794j49J449M45j675o54
7260a262J747N26j144j029J327J014j365r88J038J379q13j721R35J492n00k201
7276a565Q69J755n65j488K51J758l38j567L9J572M44j708l67J489M03j491n93
7293a102J368R64j376j176J269J083o58j636N63J703o87j507Q20J570n53j607
7309i62L06J546K08j839m06J774L41j651q08J875Q30j436q20J064J030j046j408
$$ plain form
7193 -1031 -571 1096 784 -841 -1179 720 1124 -497 -1212 555 1467 -330 -1010 211 1247 -52 -1371
7210 -1371 215 1513 304 -1227 -187 1289 530 -1335 -741 947 583 -1257 -764 1000 802 -923
7226 -923 -1238 837 1133 -567 -1125 353 1220 -455 -1243 123 807 -19 -1209 -222 1241 10 -1281
7243 -1281 -116 1015 447 -1254 -668 1169 565 -1008 -963 873 1116 -678 -827 622 1067 -608 -1262
7260 -1262 485 1011 -133 -1162 165 1179 -186 -1174 -136 1243 430 -1291 -356 1136 636 -1565
7276 -1565 -696 1059 494 -994 -743 1015 677 -890 -851 721 1165 -543 -910 579 982 -509 -1102
7293 -1102 266 1230 -146 -1322 -53 1030 372 -1264 -701 1002 315 -1192 -372 1198 645 -962
7309 -962 -656 890 1098 -741 -1147 627 968 -683 -1491 384 1214 -222 -1042 22 1052 6 -1402
7326a402J303J512j091j617J170J238o43j645N53J873n40j849L66J550J08j908
7342a022L05J541L56k033j55J456N41j449o60J514P94j305j167J399J132j127
7358A20j048M22J658n43j841P44J483j78j989K34K176l03j930L8J780K03j579
7375e53m53J593M69j393j021J557J106j456j208J467R73q29j473Q46J392r76j222
7392a181P14J602n51j665L99J157M90j876k15K217k28j573l68J842N19j640n05
7409h62J161R60j395j306J463J127j286j087J036J520j044j244M33J539l61j609
7425i55K17J580Jj535k81J848J82j697k73J433O24j750n78J787K54j016r39J199
7443A01J168j029j540J160J546q58j566M11J653l51j622J3J882j66j792o5J752
$$ plain form
7326 -1402 -99 1413 322 -1295 -125 1113 470 -1175 -622 1251 711 -1138 -772 778 886 -1022
7342 -1022 -717 824 1180 -853 -1008 448 989 -460 -1120 394 1188 -117 -1284 115 1247 120
7358 120 -928 -506 1152 609 -1232 -488 995 817 -1172 -938 1238 935 -995 -957 823 1026 -553
7375 -553 -1006 587 1056 -337 -1358 199 1305 -151 -1359 108 1081 252 -1221 -375 1017 41 -1181
7392 -1181 -467 1135 584 -1081 -682 475 965 -911 -1126 1091 863 -710 -1078 764 1283 -357 -862
7409 -862 299 1259 -136 -1442 21 1148 -138 -1225 -189 1331 287 -957 -524 1015 654 -955
7425 -955 -738 842 843 -692 -973 875 1057 -640 -913 520 1144 -606 -1184 603 857 -159 -1098 101
7443 101 1269 240 -1300 -140 1406 548 -1018 -607 1046 695 -927 -914 968 802 -990 -1055 697
7460F97K51j372o06J496P15j592p33J378R39j277j291J248J079r13j279P61J801
7477A302q89j528R89R64l08j431l9J806p3j879k35K078N91j914j72J314M75j675
7495f24n34J321R77j278j313J288J385q34j798J110J288q06j376O86J737q18j125
7512g14j01J782r6j495n12J497L42j232q52J638Q87j615q61J155J567j449j124
7529a183J172J012p86j470J162J269p14j687P76J719o30j576M8J836j12j724K3
7546h65J550K80j515k42J549M76j509p39J145J071j309j369J486J269j222j015
7562i59R02J162p07j369N78J482n50j484K81J348O8j506Q4J470M72j717m24J470
7580F01O77j608p81J391P56r63j420J554R85q97j376P95J428q03j467P68J520
$$ plain form
7460 697 948 -424 -1030 466 1181 -411 -1144 234 1173 -104 -1395 -147 932 19 -1260 -499 1302
7477 1302 413 -1115 -126 838 530 -901 -940 866 793 -1086 -1321 757 1348 -566 -738 576 1051 -624
7495 -624 -1158 163 1140 -138 -1451 -163 1222 388 -1410 -300 988 182 -1194 -508 1229 411 -714
7512 -714 -815 967 871 -624 -1136 361 703 -529 -1381 257 1144 -471 -1332 -177 1390 -59 -1183
7529 -1183 -11 1001 215 -1255 -93 1176 462 -1225 -449 1270 640 -936 -888 948 836 -888 -865
7546 -865 685 965 -550 -792 757 1233 -276 -1015 130 1201 -108 -1477 9 1278 56 -959
7562 -959 -57 1105 398 -971 -393 1089 539 -945 -664 684 752 -754 -670 800 1272 -445 -869 601
7580 601 1278 -330 -1111 280 1036 73 -1347 207 1192 295 -1081 -286 1142 339 -1128 -360 1160
7597A160o18j784M12J929k88j761J25J755N0j431o35J545O38j599n80J230J269
7614A417k008m59R50J250j334p84J035Q40l25j670O86J098m9j671L32J482L7j634
7632h07k15J847R1j658k62J473N32j444n97J278J051j332j156J222J346r97j755
7649a383J278J226r49j585Q93J441n70j470M27J662n0j580k6J602R0j587m20J747
7667G46O0j469l68J359R13j455j046J148J374j514o91P35J436j066j256N73J423
7684I02m61j292K61J298M8j643R2J564q7j162l61J065Q41j332r00J627Q49j569
7702b60r08J094J456j360j148R08J299o87j321L82J573j96j808J40J885j83j457
7719e91j63J366J63j591j35J357P75j681m81J213R32j432o49Q34J155j216q91
$$ plain form
7597 1160 542 -1242 -830 1099 811 -950 -825 930 980 -451 -1086 459 1097 -502 -1082 148 1417
7614 1417 -591 -1050 -100 1150 -184 -968 67 907 582 -1088 -402 696 647 -1024 -692 790 827 -807
7632 -807 -1022 825 916 -742 -1004 469 1001 -443 -1040 238 1289 -43 -1199 23 1369 372 -1383
7649 -1383 -105 1121 172 -1413 -520 921 351 -1119 -692 970 920 -660 -686 916 1006 -581 -1001 746
7667 746 806 -663 -1031 328 1241 -214 -1260 -112 1262 -252 -943 -208 1228 162 -1094 -521 902
7684 902 441 -851 -590 708 756 -887 -795 769 682 -480 -841 224 1065 -267 -1167 460 1309 -260
7702 -260 -1168 -74 1382 22 -1126 -218 1081 394 -927 -545 1028 832 -976 -836 1049 866 -591
7719 -591 -754 612 775 -816 -951 406 1181 -500 -981 232 1164 -268 -917 -83 1072 -144 -1035
7736a035P14J284o77j354O68J062k93j410M40J399p8j753O6J434O53j728n47J387
7754B32P27j255q31J144J289j179j297J137J354j332j327J089J042m44j551R28
7770b74J445n92j613L11J563j71j210l81J744J74j465n41J381L30j075n89J195
7787B32R67j287q93Q16J515j442j026O82J556r94j070K43J873m18j553M03J221
7804H25p4j378j10J119O86j609k20J385M70j509m62J124R42j434p62J151O48o61
7822A31j039Q46J158o48j538R09J520p04j470K63J351k7j582n8J630K42j713m44
7840a173J529P36j335p43J270Q94j290j224J452R91j091j139J066J153p17j562
7856a183M51J724l53j464J36J664m57j211n9J405R0j702o5J389P65j746o34J534
$$ plain form
7736 -1035 -321 963 286 -1068 -400 662 369 -1041 -601 798 720 -1033 -967 467 1120 -608 -1155 232
7754 232 959 -296 -1127 17 1306 127 -1170 -33 1321 -11 -1338 -249 793 349 -1202 -274
7770 -274 1171 579 -1034 -723 840 669 -541 -922 822 996 -469 -1010 371 701 -374 -963 232
7787 232 1199 -88 -981 -165 1350 -92 -1118 -436 1120 126 -944 -701 1172 754 -799 -396 825
7804 825 751 -627 -737 382 1068 -541 -761 624 1094 -415 -877 247 1189 -245 -1007 144 792 131
7822 131 -908 -62 1096 448 -1090 -181 1339 635 -835 -572 779 752 -830 -888 742 984 -729 -1173
7840 -1173 356 1092 -243 -986 284 1178 -112 -1336 116 1107 16 -1123 -57 1096 379 -1183
7856 -1183 -732 992 639 -825 -689 975 518 -693 -752 653 743 -959 -1024 365 1130 -616 -1250 284
7874B84Q63j281r22J086R55q08j258Q81J188p11j282Q28J111n58j452M04J282
7891F10L22j887K89R44L28j058p02J698K80j137p38J369Q53j096j324J298R34
7908I83q72j265R30R97n75j177O18J338l82j626K38J885k44j630j97J642O36j301
7926bj116J553M59j487k44J016P88j139p32J294O48j000j311R76J557j164j143
7943a047Q38J268m41j523J96J231P1j241n0J662m6j396k55J057N39j152q14J429
7961C26N08r10o45Q97J002j126j029N99J239n27j131O09J062k46j334n7J388m4
7979E81j401k31J518M15j424l14Q20R04j023p60J187R52j106j152Q06J377j204
7996e5r63P33J336o62j451M91J325l16j143Q9J274O0j798N02J155L99j591j87
$$ plain form
7874 284 1147 -134 -1056 30 985 177 -1081 -200 988 277 -1005 -177 934 376 -1076 -672 610
7891 610 932 -955 -666 278 606 -452 -1154 544 824 -313 -1051 318 1171 75 -1249 49 983
7908 983 111 -1154 -224 773 198 -979 -361 977 595 -1031 -793 1092 848 -782 -979 663 1299 -2
7926 -2 -1118 435 894 -593 -837 179 967 -172 -904 390 1038 38 -1273 -297 1260 96 -1047
7943 -1047 -209 1059 618 -905 -709 522 593 -648 -698 964 918 -478 -733 324 863 -289 -1103 326
7961 326 834 -76 -721 176 1178 52 -977 -378 861 334 -797 -188 874 628 -706 -763 625 581
7979 581 -820 -1051 467 882 -542 -856 -36 868 -155 -915 272 1224 118 -1034 -228 1149 -55
7996 -55 -1018 -285 1051 389 -1062 -571 754 438 -705 -616 658 718 -1080 -578 577 976 -615 -802
8014h02J541K61j422o20J297O51j163n78Q35R05p61j064O35J437r23j010M53J176
8032H48k96j558M82R29K33j432p1J500K45j356k51J104P53j284p81J143O14r41
8050a19q33J019R58q81j224O02J444q41j051P24J368n65j515J56J890m97j342
8067g07J71J079K92j368k36J333J53j363l76J652K30j095q80J298Q66j117p52
8084h20N24J315p49j250M25J256K8j664K66J556j55j284o1J236L29j597m17J494
8102D32L90r36r22J230Q42j006r08J189N00p05r19P79J101q04j128O43R56l89
8120C45j316M91J429l35j279KJ258J63j455k31J612N04j348p36J147L95r18o83
8138i55J092R81j178j110J091R33j90j801P99J541r08j364O35J319l26j471RJ314
$$ plain form
8014 -802 739 1000 -422 -1042 255 906 -257 -835 0 905 144 -920 -285 1152 229 -781 -328 848
8032 848 552 -1006 -524 405 638 -794 -865 635 880 -476 -727 377 1130 -154 -935 208 822 -119
8050 -119 -952 67 1025 144 -1080 -478 966 125 -926 -202 1166 601 -914 -758 1132 635 -707
8067 -707 -536 543 835 -533 -769 564 717 -646 -1022 630 860 -235 -1115 183 1049 -68 -820
8084 -820 -296 1019 270 -980 -555 701 729 -935 -669 887 732 -552 -613 623 952 -645 -1062 432
8102 432 822 -114 -1036 194 1036 30 -878 311 811 106 -813 -34 1067 263 -865 -222 734 345
8120 345 -971 -480 949 614 -665 -663 595 758 -697 -928 684 1188 -160 -896 251 646 -272 -955
8138 -955 137 1118 -60 -1170 -79 854 664 -1137 -338 1203 295 -1069 -434 885 559 -912 -903 411
8156D11N28j518j93J257M82j180p06J349M36j095q11J104J199j305j071P61J422
8173A070q15j045O97R73k61j528N45J032Mj187p3J014K78j225m37J582N51j496
$$ plain form
8156 411 939 -579 -772 485 967 -213 -919 430 866 -229 -1040 64 1263 -42 -1113 -352 1070
8173 1070 255 -790 -93 880 619 -909 -364 668 672 -515 -588 426 704 -521 -958 624 1175 -321
8191c21
$$ Imaginary data points
##PAGE= N=2
##DATA TABLE= (X++(I..I)), XYDATA
0@%%%qJ6rRk4L2l2M0n6P2q0R5j20J45j70J99k39K81l24L75m36N00n71O53p45Q44
29D47r51J072j207J352j511J690j884K095k327K585k868L172l509L889m308M770
45B507n289N878o547P306q190R237j0484J2003j3914J6399j9761K4600l2215M5982
59B7512p8464K82117K09338p31320k3666N82467P8342o34609r6228N78980J89980
70C84449n25322j93718M40631K11044m17783k29553L52729K77842k72815k61602
80b34098K12167K71988j72782k89802J04774L04735m8267l09595j6476L07649
90A30293N3004l21667j05748L40752J75219l23212k15656L19926K49685l26678
100b4082l04339L12741L48978k83636l71464K64261L93138k47388m25636K06878
$$ plain form
0 0 0 0 0 -8 8 -1 8 -16 16 -16 24 -32 40 -40 55 -65 80 -90 109 -130 151 -173 202 -234 266 -305 348 -397 447
29 447 -504 568 -639 713 -798 892 -992 1103 -1224 1361 -1507 1665 -1844 2045 -2263 2507
45 2507 -2782 3096 -3451 3855 -4335 4902 -5582 6421 -7493 8906 -10855 13745 -18470 27512
59 27512 -50952 231165 440503 -290817 -314483 267984 346326 -288283 -384511 194469 384449
70 384449 -140873 -334591 106040 317084 -100699 -330252 22477 300319 27504 -234098
80 -234098 -21931 250057 77275 -212527 -107753 196982 148715 -160880 -177356 130293
90 130293 183297 -138370 -244118 96634 271853 -51359 -267015 52911 302596 -24082
100 -24082 -328421 -15680 333298 49662 -321802 -57541 335597 88209 -337427 -130549
110a30549M34716j65835m31102J35807M31422r7357m23777N4492M05254j4762
120A98309l79893j9989L52595N2853l26805q6834K96775J20312k60688j45120
130a98485K29431J67818k06686k01404J71786K26141j39477k44423J16743K72213
140A93657q6486k94933N3703L13911k1934l27415p946L39255M0680l48628p6925
151b23061L44689J06428l38768j36404L27260J63829l09125j87363K87439K10681
161B45605k56226k21161K30370K34571k00060k46618J61914K47447j30981k51207
171a86346R8348K53078o3840k51667L0396K49326K247k43579l2240K41173O5964
182A62860k33462r6685K24567J25422k15563j54092K02522J80577j90263k06401
$$ plain form
110 -130549 304167 138332 -292770 -156963 274459 177102 -246675 -192183 213071 198309
120 198309 -181584 -201573 151022 203875 -122930 -209764 87011 207323 -53365 -198485
130 -198485 30946 198764 -7922 -209326 -37540 188601 49124 -195299 -78556 193657
140 193657 107171 -187762 -134059 179852 157918 -169497 -177443 161812 202492 -146136 -223061
151 -223061 121628 228056 -110712 -247116 80144 243973 -65152 -252515 34924 245605
161 245605 -10621 -231782 -1412 233159 33099 -213519 -51605 195842 64861 -186346
171 -186346 -87998 165080 101240 -150427 -120031 129295 131542 -112037 -144277 96896 162860
182 162860 -70602 -167287 57280 182702 -32861 -186953 15569 196146 5883 -200518
192b00518J71137K27995j52041k45358J33388K63292j07447k74511Q1572K80960
202A78469n6331k85308K8761K84857k33k78420k6970K68544N2883k56590p9676
213a70014K40464J02414k21908j24713K01465J45433j79169j62641J57540J79863
223A68734j33556j94897J09142K05728q5614k17622O1162K27364l6152k33578
233a29289J1442K36387J2641k39846l7935K37879O1967k32394q3291K25758J06571
244A69890k14914j26355K00503J43933j85086j61359J65446J74352j45476j85668
254a64734J22922J96196r8997k02780P4477K07009m9479k10141K3844K10495K861
265A11673k07812k7777K04687N2777j99421p8636J90590J01193j81255j23963
$$ plain form
192 -200518 -29381 198614 46573 -198785 -65397 197895 90448 -184063 -102491 178469
202 178469 122138 -163170 -134409 150448 150215 -128205 -155175 113369 166252 -90338 -170014
213 -170014 70450 172864 -49044 -173757 27708 173141 -6028 -168669 -11129 168734
223 168734 35178 -159719 -50577 155151 69537 -148085 -86923 140441 104289 -129289
233 -129289 -117847 118540 131181 -108665 -146600 91279 153246 -79148 -162439 63319 169890
244 169890 -45024 -171379 29124 173057 -12029 -173388 -7942 166410 20934 -164734
254 -164734 -41812 154384 55387 -147393 -72916 134093 84614 -125527 -101683 108812 111673
265 111673 -96139 -123916 80771 133548 -65873 -144509 46081 147274 -33981 -157944
275a57944J70355J45702j55868j63213J40755J80763j23946j96142J04682K08116
285A53260q5445k17401O4668K24458m2291k26732K0033K26727K151k24003k5388
296a29963K17105M7964k07619o8203J96364Q9670j80561j08858J63321J25148
306A44368j45068j41302J23900J54846j01724j65220P9712J74846n6011j80699
316a12352L2367J84233r718j86397j2604J85338L5613j81500n5719J76391P5099
327A30751j68987r4135J58819J08767j47199j23151J34327J36900j19451j45092
337a28451J03329J53830q7813j60245O9781J63342n2895j64709L5557J64490j6720
348G9496j62344p17J57637J6763j52392l3959J44622M9160j35390o2905J26356
$$ plain form
275 -157944 12411 158113 2245 -160968 -20213 160550 36604 -159538 -54856 153260
285 153260 67815 -149586 -84918 139540 97249 -129483 -109450 117277 119428 -104575 -129963
296 -129963 87142 135106 -72513 -140716 55648 145318 -35243 -144101 19220 144368
306 144368 -700 -142002 -18102 136744 35020 -130200 -50488 124358 68347 -112352
316 -112352 -79985 104248 94530 -91867 -104471 80867 116480 -65020 -120739 55652 130751
327 130751 -38236 -132371 26448 135215 -11984 -135135 -808 136092 16641 -128451
337 -128451 -25122 128708 40895 -119350 -49569 113773 60878 -103831 -68274 96216 79496
348 79496 -82848 -83565 74072 90835 -61557 -95516 49106 98266 -37124 -100029 26327
359B6327P6805j15101q8391J03146R8148r1932j08492P8645J16042o5915j21728
370i2446N2864J26903l9406j31059K6167J31966j3649j32655O66J32311J3156
381G4818j29861k4015J26933L5565j22863m7350J15566N6693j09514o6979J01823
392A0816P5992r2668q3423Q3516R1262p3919r7545O3312J03319n2036j06642M0970
404c7046J11005k9168j13225J7071J13356o298j15158o781J13663J7976j11028
415d5633k8639J10009M0905j04449n1207R9258O1996r3441p1477Q5829Q0305p7546
427E910q8221O8231R5242n8806j02417M7300J06534l5966j10512K5326J13933
438F6554j1695j13967J233J14626J1412j13216k4030J09935L4372j06665m6217
$$ plain form
359 26327 103132 -11969 -100360 2786 100934 9002 -99490 -20845 95197 29282 -92446
370 -92446 -39582 87321 47915 -83144 -56977 74989 61340 -71315 -70649 61662 74818
381 74818 -55043 -79058 47875 83440 -39423 -86773 28793 85486 -24028 -91007 10816
392 10816 86808 -5860 -89283 -5767 85495 11576 -85969 -22657 80662 28626 -78016 -37046
404 -37046 73959 44791 -68434 -51363 61993 55695 -59463 -66244 47419 65395 -45633
415 -45633 -74272 35737 76642 -27807 -79014 20244 82240 -11201 -82678 3151 83456 5910
427 5910 -82311 -14080 81162 22356 -80061 -32761 73773 37807 -72705 -47379 66554
438 66554 54859 -59108 -57875 56751 68163 -45053 -69083 40852 75224 -31441 -77658
449g7658J01152N6715r5033o5833Q8063P3882p9959q1931P0883Q9180o0474r3124
461g4137N1107R8116l8880j01545K8087J02355j8331j03736N051J01729N588r9761
473d4357j6462R7399K8443r2742l8551Q7852M8933q2085n7824P5434O6722o6841
485E921p4779N8790Q1341n0987q9055M0441R2756l2296r6910K1869J01064j1603
497D6552j01612L020J02767P549j01633j7329R9857K5742r7714l4443R3263M2227
509F8246q8269n0480Q1947N5912p5544o3103O7735O8219n8326p1850N0615P7071
521F2173l9973p9378L0113Q1385k0480q3277P765Q3385K159q2674j3661Q1439
533B8976K5392p9598l5803P5832M5907p0240n6140O6278O5042n8202p2168N1902
$$ plain form
449 -77658 23494 80209 -14824 -80657 7406 81288 1329 -80602 -9719 79461 18987 -74137
461 -74137 -23030 75086 36206 -65339 -37252 65103 46772 -56964 -51913 49816 55404 -44357
473 -44357 -60819 36580 65023 -27719 -66270 21582 70515 -11570 -69394 6040 72762 5921
485 5921 -68858 -10068 71273 20286 -68769 -28328 64428 32132 -64778 -42909 58155 46552
497 46552 -55060 -52040 50727 58276 -43357 -60686 39171 64913 -32801 -67244 26019 68246
509 68246 -20023 -70503 11444 67356 -8188 -71291 -3556 64663 6337 -65513 -14898 62173
521 62173 22200 -57178 -27065 54320 33840 -49437 -41672 41713 43872 -38802 -52463 28976
533 28976 54368 -25230 -61033 14799 60706 -9534 -65674 604 65646 7444 -64724 -12822
545a2822P8512m4339q4188L5418Q6556k8184q9587J9811R0438j1498q8676M292
557d4267Q7712K887q3764j0019Q0528J6476p5542k1857P1041K6877o4794l2254
569d6976N7753L7075n2762m1623M4415M5869l7081m8939K9550N3795k0141n6061
581c5126J1799N8639l026o0739n932O0926J4587o0833k3200O0125L0603n8499
593a0676l7923N5627M2677n3016m6958M9662N1527m5530n2358M2604N4198l9562
605A0272n5263L6498N3392l4359n3358L1611N2606k9244n1581K6976N0639k4216
617A3973n0022K0767M8807j7069m7348J2609M6726o804m4614P38M2452M714m0556
630a5627j2128L5916J8393l1765k5052K7252L1921k1374l7049J5693M1513j0049
$$ plain form
545 -12822 65690 21351 -62837 -27419 59137 30953 -58634 -38823 51615 40117 -48559 -44267
557 -44267 43445 46332 -37432 -47451 33077 49553 -25989 -47846 23195 50072 -14722 -46976
569 -46976 10777 47852 -4910 -46533 -2118 43751 6670 -42269 -12719 41076 20935 -35126
581 -35126 -23327 35312 32286 -28453 -34385 26541 41128 -19705 -42905 17220 47823 -10676
593 -10676 -48599 7028 49705 -3311 -50269 -607 50920 5390 -46968 -4364 49834 10272
605 10272 -44991 -8493 44899 10540 -42818 -11207 41399 12155 -39426 -12450 38189 13973
617 13973 -36049 -15282 33525 16456 -30892 -18283 28443 21639 -22975 -22237 20215 24929 -15627
630 -15627 -27755 8161 26554 -5211 -30263 -3011 28910 7536 -29513 -13820 27693 17644
642A7644m5587M548M8500O70n0640n056N2515Q831n4164j2581N4822J4730n6417
655b2185j7224N7803K0304n8623k2169O0178K5162n9944k9385O0090L2483n9629
667a3139l6535N7261M1370n3481m5500M8722M9561m2772n3270L5250N4936k6740
679A5663n5877J9006N5550q628n4001j97N1448Q179m7710j6759M3229K3809l8103
692d391k9795L3640L5130k7760m0084K3278M3171j8482m7339J4571N0085r908
704B2116n2316N930N5682j704n7810k751N8951P070o1099j1727O2486J7044o2219
717b0347k2183O2104K7801o0558l4018N7392L9183n3864m3937M9005M8226m2587
729F217n0654L5689N2114k8388n3030K1019N1370j4305m9392P808M6914j985m2865
$$ plain form
642 17644 -27943 -23395 25105 25775 -24865 -29921 22594 31425 -22739 -35320 19502 34232 -22185
655 -22185 -39409 18394 38698 -19925 -42094 18084 43246 -16698 -46083 14007 46490 -13139
667 -13139 -49674 7587 48957 -4524 -50024 -1302 48259 5487 -47783 -12533 42403 15663
679 15663 -40214 -21208 34342 25714 -28287 -28484 22964 31143 -16567 -33326 9903 33712 -4391
692 -4391 -34186 -546 34584 6824 -33260 -9982 33189 14707 -32632 -18061 32024 22116
704 22116 -30200 -24270 31412 29708 -28102 -30853 28098 35168 -25931 -37658 24828 41872 -20347
717 -20347 -42530 19574 47375 -13183 -47201 10191 49374 -4490 -48427 578 48804 6217
729 6217 -44437 -8748 43366 14978 -38052 -17033 34337 20032 -29360 -21552 25362 23377 -19488
742a9488k815L8885P227l6156j1079L2052J4888k9314j7887K6698K1831k4066
754G76k5565K1140K9572j8906l4455J5316L8952j1704m2871P557M7670k886n1395
767b6799k803N3365Q372n5433j4097N6261J9586n5433k4228N3781K8888n1147
779i687l3372M8062L5795m4523l7501L9737L9395l4761l9939L0502L9584k5726
791G566l9230K0198L7925j5706l6350J1410L5523o668l3450K522L1415K005l0421
804a3261o797K8914J1269k6805j5932K5385K1293k3368k6181K0822L0584j7906
816H017l5035J4754L9335j1353m1480P571M3969m023m4574j6M4653K630m4168
829a9720n233M3073P750m0880r476L9335J0315l6943j1696L4688J2425l2213j3402
$$ plain form
742 -19488 -22303 16582 23809 -12347 -23426 8626 23514 -5800 -23687 3011 24842 776
754 776 -24789 -3649 25923 7017 -27438 -12122 26830 15126 -27745 -20188 27482 24596 -26799
767 -26799 -29602 23763 32135 -23298 -37395 18866 38452 -16981 -41209 12572 41460 -9687
779 -9687 -43059 5003 40798 -3725 -41226 -1489 37906 3145 -36794 -6292 33292 7566
791 7566 -31664 -11466 26459 10753 -25597 -14187 21336 14668 -18782 -16260 15155 17160 -13261
804 -13261 -20058 8856 20125 -6680 -22612 2773 24066 698 -25483 -4661 25923 8017
816 8017 -27018 -12264 27071 15718 -25762 -18191 25778 21755 -22819 -22835 21818 24448 -19720
829 -19720 -24953 18120 25870 -15010 -24486 14849 25164 -11779 -23475 11213 23638 -8575 -21977
842b1977L0220J4723k7426j5375K4277J7038k1992j9047J8331K0626j4386k2648
854a7636J0700K5039o597k6143K208K7509J807k8964o802L0227J1128l0909j5131
867b3564L1118J9575l1087k3654L0301K6516k9714l0142K8997L2468k6885l4730
879c0801K5487L6674k3302l8233K0284L9469j8470l9999J4969M0451j1565m0159
891b5195Q302L9302m477l8401l36L7755M198l6386q543L4212J3649l1676j8073
904b5669K8551K2612k5384k7252K0767L1393j6930l4667J2845L7239p442l9703
916b3640K768M0969K320m1992p112M2596J1280m1606j5540M0875J9584l9039k3439
929c1976L6354K6820l3927l0147L0562L3355k6975l5233K3040L7578j8344l8688
$$ plain form
842 -21977 8243 22966 -4460 -19835 4442 21480 -512 -19559 -1228 19398 5012 -17636
854 -17636 -6936 18103 11506 -14637 -12429 15080 16887 -12077 -18879 11348 22476 -8433 -23564
867 -23564 7554 27129 -3958 -27612 2689 29205 -509 -30651 -1654 30814 3929 -30801
879 -30801 -5314 31360 8058 -30175 -9891 29578 11108 -28891 -13922 26529 14964 -25195
891 -25195 -16893 22409 17932 -20469 -20805 16950 21148 -15238 -23781 10431 24080 -7596 -25669
904 -25669 2882 25494 110 -27142 -6375 25018 8088 -26579 -13734 23505 16063 -23640
916 -23640 -20872 20097 22417 -19575 -26687 15909 27189 -14417 -29957 10918 30502 -8537 -31976
929 -31976 4378 31198 -2729 -32876 -2314 31041 4066 -31167 -8127 29451 11107 -27581
941b7581J3126L9828q404m0385L532M0504J825l9660p014L8870J1648l7631j6033
954b7375L5144K0205l2528k3720L0146K6980k6570k9703K3654L1623j9776l3704
966b5624J6195L4574j2396l4988Q425L5148m232l5273J048L4034K721l2619o955
979a9942L1439J0226k9016j3684K7053J7094k4540k0272K1750K2683j8530k5790
991b1529J5336K8318j2504k9874Q912L1619n446l2821K017L3390J116l3995m217
1004a9678L4187P502l3956j0022L2598J3164l2299j5638L0398J7393k8468j9182
1016b4001K6048K1175k3372k2876K1570K3043j8002k4839J4809K5606j1642k5670
1028a8151Q008K5797m591k5795Q54K5517K507k4897o604K4178R811k2331j3176
$$ plain form
941 -27581 -14455 25373 16969 -23416 -19884 20620 22445 -17215 -24229 14641 26289 -11342 -27375
954 -27375 7769 27974 -4554 -28274 1872 28852 2282 -27421 -3767 27856 8080 -25624
966 -25624 -9429 25145 12749 -22239 -13814 21334 17102 -18171 -17123 16911 19632 -12987 -19942
979 -19942 11497 21723 -7293 -20977 6076 23170 -1370 -21642 108 22791 4261 -21529
991 -21529 -6193 22125 9621 -20253 -11341 20278 14832 -17989 -15972 17418 18534 -15461 -19678
1004 -19678 14509 22011 -11945 -21967 10631 23795 -8504 -24142 6256 23649 -4819 -24001
1016 -24001 2047 23222 -150 -23026 -1456 21587 3585 -21254 -6445 19161 7519 -18151
1028 -18151 -10143 15654 11063 -14732 -13878 11639 14146 -10751 -17355 6823 16634 -5697 -18873
1041a8873K1103J6359j9378j9220J7729K1303j5571k3815J3497K5555j1389k6356
1053a9056Q600K7893o549k8156L538K9157k141k7817j403K8375L871k7658n979
1066a7325K6563Q518k5384j0471K2911J3219k1723j4334J9376J6322j6652j8296
1078a7276J4593J9776j2092k1441R429K2519o152k3435L775K3680p09k4227j573
1091a3133K3493M776k3559o916K3106R568k2007j1984K1480J3740j9978j6428
1103a7842J8959J7489j7134j9031J5322K0431j3445k1195J1315K1936r142k2845
1115a5182O802K3061l938k3612J952K3483N80k2678l449K2077O038k1647q763
1128a5276K0074J1205j8396j4087J7613J5616j4912j8263J3128J9631j0378k1914
$$ plain form
1041 -18873 2230 18589 -789 -20009 -2280 19023 3452 -20363 -6866 18689 7300 -19056
1053 -19056 -10456 17437 10888 -17268 -13730 15427 13286 -14531 -15934 12441 16312 -11346 -17325
1066 -17325 9238 17756 -7628 -18099 4812 18031 -3692 -18026 1350 17672 1020 -17276
1078 -17276 -2683 17093 5001 -16440 -7011 15508 9356 -14079 -10304 13376 12667 -11560 -13133
1091 -13133 10360 15136 -8423 -15339 7767 17335 -4672 -16656 4824 18564 -1414 -17842
1103 -17842 1117 18606 1472 -17559 -2237 18194 4749 -16446 -5131 16805 7663 -15182
1115 -15182 -8380 14681 10743 -12869 -10917 12566 13146 -9532 -12981 9096 15134 -6513 -15276
1128 -15276 4798 16003 -2393 -16480 1133 16749 1837 -16426 -3298 16333 5955 -15959
1140a5959P547K3532n337k4046K726K4990M97k6246l381K6200N789k5841r043
1153a8572K5681J1677k4831j4326K3410J6970k1807j9148J9554K0928j7509k2973
1165b0946J5455K4189j2516k4761R584K5099o253k5314K947K4886J27k3816l766
1178a5085K3122P010k1552r881J9723J2388j7667j4981J5196J7796j2504j9743
1190a6178R479K2159o913k3568M104K4699j301k5514j804K6560M122k6150p281
1203a7586K6207J0151k5669j2052K4223J4533k3250j6006K1395J7285j8751j8782
1215a8302J6968J9312j4120j9754J1315J9606q157j9567N884J8562l189j7053
1227h495k12J6626K712j5112n685J3253Q292j1293j1166J0267J3036q342j5117
$$ plain form
1140 -15959 -8412 15120 9783 -14263 -11537 13453 13950 -12296 -15677 10523 16312 -9529 -18572
1153 -18572 7109 18786 -6045 -20371 3039 20009 -1798 -20946 -1392 19536 2027 -20946
1165 -20946 -5491 18698 6182 -18579 -8995 16104 9851 -15463 -12516 12370 12497 -11319 -15085
1178 -15085 8037 15047 -6505 -16386 3337 15725 -1942 -16923 -1727 16069 3565 -16178
1190 -16178 -6699 15460 8547 -15021 -10917 13782 12481 -13033 -14837 11723 15845 -10305 -17586
1203 -17586 8621 18772 -6897 -18949 5274 19807 -3443 -19449 1946 19231 480 -18302
1215 -18302 -1334 17978 3858 -15896 -4581 15025 6868 -12699 -6815 11747 8558 -8495
1227 -8495 -8707 7919 10631 -4481 -10166 3087 11379 86 -11080 -813 12223 3881 -11236
1240a1236P034J6838n421j9010L891K0714k259k2332P90K3397J105k4290k463
1253a3242K4680L626k5026m880K4098O977k3929p862K2645Q865k1212r910J9443
1266D273J0347j7330j0892J5039J0740j2257j0811R959J0158p204r876M311R609
1279F066j920q976p60Q589L169q543m875P723P277p903r564P560J1875p206j4351
1294a1839P363J5955o598j8010O193J9418n369k0904M353K2169l260k2721J597
1307a1653K3557n45k3052j651K3413K346k1422m474K0427N321j8427o560J6453
1320C733P754j4475q592J2409R177r972r786P889J0506n887j0637L710J0935j751
1334E013j1211J52J1452J747j1979l228J2312N004j2148o894J1840R034j1718
$$ plain form
1240 -11236 -4202 12636 7215 -11795 -7904 12810 10551 -11781 -10991 12406 13511 -10779 -13242
1253 -13242 11438 15064 -9962 -14842 9256 16233 -7696 -15558 7087 15952 -5260 -15170 4273
1266 4273 14620 -2710 -13602 1437 12177 -80 -10891 -932 9226 2022 -7854 -3543 6066
1279 6066 4146 -4830 -5590 2999 6168 -2375 -7250 473 7750 -153 -9717 -2157 9718 2512 -11839
1294 -11839 -4476 11479 4881 -13129 -6936 12482 7113 -13791 -9438 12731 9471 -13250 -11653
1307 -11653 11904 11359 -11693 -13344 10069 12415 -9007 -13481 6946 12267 -6160 -12720 3733
1320 3733 11487 -2988 -11580 829 10006 34 -9752 -1863 8643 2756 -7881 -4171 6764 5013
1334 5013 -6198 -6046 5406 7153 -4826 -8054 4258 9262 -2886 -9780 2060 11094 -624
1347f24j0658J1611J1716j0107j3662R001J5207p837j6131N927J7021l888j7373
1360i797K018J7210N90j7151l072J7133M660j6159o763J5521Q128j4080r998J3026
1374A266J1389j2018j2701J1303J3621j0290j4641Q859J5659p893j5983O360J7133
1387A2064n757j7548M730J7359l068j7609J115J8184k00j7185k216J6651L529
1400A0049j4940n845J3663P694j1816r494R502J1570p522j2836M901J3627k007
1413F546j4996k96J5605K980j6344n837J6949P922j6651j0251J6824J1676j6371
1426b244j3768J6138J5305j5533j6354J4707J7509j4111j8186J2952J8947j1530
1438C832j9608J0425J9305q246j9795O693J9618m845j8275J790J7778N08j6253
$$ plain form
1347 -624 -11282 329 12045 1938 -11724 -2723 12484 4647 -11484 -5557 11464 7576 -9797
1360 -9797 -7779 9431 10021 -7130 -10202 6931 11591 -4568 -11331 4190 12318 -1762 -11760 1266
1374 1266 12655 637 -12064 -761 12860 2570 -12071 -3212 12447 4554 -11429 -5069 12064
1387 12064 6307 -11241 -6511 10848 7780 -9829 -8714 9470 9270 -7915 -10131 6520 10049
1400 10049 -4891 -10736 2927 10621 -1195 -10689 -1187 10383 2861 -9975 -5074 8553 6546
1413 6546 -8450 -8746 6859 9839 -6505 -12342 4607 12529 -4122 -14373 2451 14127 -2244
1426 -2244 -16012 126 15431 -102 -16456 -1749 15760 1649 -16537 -3585 15362 3832
1438 3832 -15776 -5351 13954 5708 -14087 -7394 12224 7379 -10896 -9106 8672 9180 -7073
1451g073l123J5046N815j3430q818J1597J1434r605j3494P474J5368n060j6999
1464a0868K491J8888k39k0312k083K1453M485k2051o370K2377Q258k2420r651
1477a6042K1875J1189k0999j2733K0211J3421j8524j4290J7244J5048j5604j5198
1489a4402J3365J5375j0943j5445Q106J5530n449j5055K917J4402k29j3474l178
1502h480J2710O178j2339q289J0829J1026r659j3562Q552J5633o973j7909O435
1515e848J9027m836k1305L661K2429k854k2551R45K3819k88k3818j274K3557J870
1529A2534k2738k934K2167M021k1014n319J9993N940j8238p128J6720P830j4715
1542b881q782J2296R873r871j0621P133J1057m311j1924J697J2445Q98j2653l814
$$ plain form
1451 -7073 -10196 4850 10665 -2765 -11583 14 11448 1843 -11651 -4177 11191 6131 -10868
1464 -10868 -8377 10511 10272 -10040 -12123 9330 13815 -8236 -14606 7771 16029 -6391 -16042
1477 -16042 5833 17022 -3977 -16710 3501 16922 -1602 -15892 1352 16400 796 -14402
1489 -14402 -1037 14338 3395 -12050 -3944 11586 6137 -8918 -6001 8401 8172 -5302 -8480
1502 -8480 4230 10408 -1931 -10220 609 11635 1976 -11586 -3034 12599 5626 -12283 -5848
1515 -5848 13179 8343 -12962 -9301 13128 10274 -12277 -11332 12487 12199 -11619 -12893 10664 12534
1529 12534 -10204 -13138 9029 13050 -7964 -13283 6710 12650 -5588 -12716 4004 11834 -2881
1542 -2881 -11663 633 10506 635 -9986 -2853 8204 3893 -8031 -6334 6111 7009 -5644 -9458
1556i458J3307O060j3085q972J3295J0976j2942j3109J2617J5244j2166j6874
1568a5107J1411J8773j0980k0207R999K0986q294k1874P237K2346n689k2318M296
1581i421K1911k670k1596P89K0968J060k0051k186J8002M939j7282o404J5408
1594C467Q033j3429j0085J2357J1488j0532j2783Q775J4076o192j5614M080J6872
1607A0513k438j7077l43J8038K243j8369l874J8190O338j7758q516J7562R655
1620A4164j6789j1157J5613J2816j4428j4345J3330J5231j1414j6309R582J6826
1632A3120p771j7346N910J7506k955j8295O75J8781J170j8538l654J8092N922
1645A2617j7373q549J7015J0661j5850j2712J4771J4196j3888j6112J2795J7481
$$ plain form
1556 -9458 3849 9909 -3176 -12148 1147 12123 -819 -13928 -1311 13933 1767 -15107
1568 -15107 -3696 15077 4097 -16110 -6111 14875 6581 -15293 -8056 14290 8601 -13717 -9421
1581 -9421 12490 9820 -11776 -10987 9981 11041 -9010 -11196 6806 11745 -5537 -11941 3467
1594 3467 11500 -1929 -12014 343 11831 1299 -11484 -2709 11367 5175 -10439 -6359 10513
1607 10513 8075 -9002 -9345 8693 10936 -7433 -11307 6883 13221 -4537 -13053 4509 14164
1620 14164 -2625 -13782 1831 14647 219 -14126 -796 14435 3021 -13288 -3706 13120
1632 13120 5349 -11997 -6087 11419 8464 -9831 -9156 9625 10795 -7743 -11397 6695 12617
1645 12617 -4756 -13305 3710 14371 -1479 -14191 580 14776 888 -15224 -2429 15052
1657A5052j1224j8727R988J9441q117k0783O524K0812m381k1167K536K0785J15
1670A0854k0832j589J9642L639j8646o380J7997P752j6358r351J4758J1304j2934
1683a44j3007J0916J4339q722j6192O809J6896m200j7761J984J9031J06j9563
1696i508k506K0010M793j9578p859J9925R572j9547j1309J8888J3341j7982j5055
1709a6815J6732J6535j5174j7833J3333J8681j1404j9475R851K0133p553k0443
1721a3432N613K0167k860k0327N34J9535K222j8750m467J8101O845j7243r151
1734a3213J6184J0908j4578j3091J3202J5066j1553j6144R760J7617p934j8886
1746a2662N733J9591l667k0675K265K0588K93k0755k212K0774L889j9934o350
$$ plain form
1657 15052 3828 -14899 -4911 14530 6413 -14370 -7846 12966 8585 -12582 -10046 10739 10854
1670 10854 -9978 -11567 8075 11714 -6932 -13312 4685 12437 -3921 -13272 1486 12790 -144
1683 -144 -13151 -2235 12104 3382 -12810 -6001 10895 6695 -11066 -9082 9949 10055 -9508
1696 -9508 -12014 7996 12789 -6789 -14648 5277 14849 -4698 -16007 2881 16222 -1760 -16815
1709 -16815 -83 16452 1278 -16555 -3222 15459 4055 -15420 -5569 14564 7011 -13432
1721 -13432 -7819 12348 9488 -10839 -10305 9230 11452 -7298 -11765 6336 13181 -4062 -13213
1734 -13213 2971 13879 -699 -13790 -588 14478 2925 -13219 -3459 14158 6224 -12662
1746 -12662 -6929 12662 8995 -11680 -9415 11173 11466 -9289 -11501 9273 13162 -6772 -13122
1759a3122J9395P671j8014r547J6789J1254j5081j2929J3385J4038j1929j5506
1771a3596J0319J6476q029j6949N757J7703l691j8604J469J8729N58j8809k750
1784a1417J8884M993j8577p038J7860Q920j7399j0539J6353J2421j5484j4157
1796a5180J4386J5387j2570j6756J1256J7445r443j8697P664J8994n706j9184
1808a2404L735J9665j973j9036k29J8166K535j8128m176J6984O592j6030q695
1821a2994J5180J0390j3749j2425J2290J3747j0811j4938Q993J7056p400j8011
1833a2672N680J8365l501j9369J987J9545L95j9952k278K0041M162j9272o139
1846a3008J8798Q082j8493r895J7472J1326j6015j2419J4349J3887j2425j5323
$$ plain form
1759 -13122 6273 13944 -4070 -13617 3172 14426 -655 -13584 -199 13839 1910 -13596
1771 -13596 -3277 13199 5170 -11779 -6022 11681 7990 -10614 -9145 9584 10142 -8667 -11417
1784 -11417 7467 12460 -6117 -13155 4705 13625 -3774 -14313 2040 14461 -1023 -15180
1796 -15180 -794 14593 2023 -14733 -3477 13968 4525 -14172 -6508 12486 6780 -12404
1808 -12404 -8669 10996 9023 -10013 -10242 7924 10459 -7669 -11845 5139 11731 -4299 -12994
1821 -12994 2186 12576 -1173 -13598 -1308 12439 1628 -13310 -4317 12739 5339 -12672
1833 -12672 -6992 11373 7872 -11497 -9510 10035 10430 -9522 -11800 8241 12403 -6869 -13008
1846 -13008 5790 13872 -4621 -14516 2956 14282 -1733 -14152 197 14084 1659 -13664
1858a3664J1235J6226r277j7221P026J7675m818j7985L075J8230r90j7924j769
1871a0181J8399L249j7848n274J7049P398j6482r072J5729J1203j4567j3091J3094
1884c94J4104j1702j5555J0426J7127q660j7771O201J9113m764j9335K594J9208
1897A0592m74j9702j256J9350L645j8814n692J8414P158j7634q899J6313J0729
1910A3730j5226j2297J3896J3639j2344j4660J0884J5234r412j6265P354J7043
1922A1576n409j7670M058J7665j810j7839j31J7547K151j7370m139J6575O270
1935A1474j5728q132J4916R957j3773j1792J2265J3370j0927j4515Q532J6630
1947A2277p235j7331N405J7997l142j8981J206J9613K55j9718k483K0214M276
$$ plain form
1858 -13664 -2429 13797 4520 -12701 -5675 12000 7182 -10803 -7728 10502 9512 -8412 -10181
1871 -10181 8218 11467 -6381 -11655 5394 12792 -3690 -12762 2967 14170 -397 -13488 -394
1884 -394 13710 2008 -13547 -3121 14006 5346 -12425 -6224 12889 8125 -11210 -8616 10592
1897 10592 10118 -9584 -10840 8510 12155 -6659 -12351 6063 13221 -4413 -13312 3001 13730
1910 13730 -1496 -13793 103 13742 1398 -13262 -2378 12856 3444 -12821 -5467 11576
1922 11576 6167 -11503 -7445 10220 8410 -9429 -9560 7987 10138 -7232 -11371 5204 11474
1935 11474 -4254 -12386 2530 12487 -1286 -13078 -813 12557 1630 -12885 -4353 12277
1947 12277 5042 -12289 -6884 11113 7971 -11010 -9804 9809 10064 -9654 -12137 8077 12353
1960A2353j9678n944J9308P606j8793r066J7846J0616j7139j1497J5914J2681
1972A4207j4624j3276J2919J4142j1116j5207R404J5764p786j5321N153J6192
1984A0451l427j5635J013J5344J035j4728l636J4299N848j3759p596J2798R722
1997A1729j1576j1419R969J3326q960j4949P651J6461o338j7387M878J8442l170
2010H657j9228J750J9260l43j9415j546K0011K789j9404m182J9008N662j8950
2023e931o590J7578Q032j6563r030J5249J0163j3897j1339J2523J2282j0614j3678
2036a1815Q553J4490o843j4776M889J5292k575j5627Q3J5639J865j5347m312J5426
2050D942N735j4373p728J3965R449j3618j0813J2272J2654j1747j3701J0532J4362
$$ plain form
1960 12353 -7325 -13269 6039 13645 -5148 -14214 3632 14248 -2891 -14388 1526 14207
1972 14207 -417 -13693 -774 13368 2252 -12955 -3551 12213 4427 -10894 -5741 10451
1984 10451 7024 -8611 -7598 7746 8781 -5947 -9583 4716 10564 -3195 -10791 2007 11729
1997 11729 153 -11266 -1297 12029 3069 -11880 -4229 12232 5894 -11493 -6615 11827 8657
2010 8657 -10571 -8821 10439 10096 -9319 -10865 9146 11935 -7469 -11651 7357 13019 -5931
2023 -5931 -12521 5057 13089 -3474 -12504 2745 12908 -989 -12328 195 12477 1863 -11815
2036 -11815 -3262 11228 4385 -10391 -5502 9790 7215 -8412 -8329 7310 9175 -6172 -10484 4942
2050 4942 10677 -3696 -11424 2541 11990 -1628 -12441 -169 12485 738 -12963 -2431 11931
2063A1931q582j5481P438J5898o021j6164M214J6793k843j7257J486J6922M75
2076H809j6489k375J6417L828j5924n737J4934P217j3768r059J3031J1023j1800
2089A07j1902R998J3520r311j4326P507J5559n812j6395M535J6946k858j7133
2102i565R45J7176N99j7173k173J6754M017j5995n435J5677O835j4780q213J3898
2116B567R141j2870j0223J1295J1413r745j2228Q308J3390p092j3844M803J4854
2129I769l304j5146J333J5715P03j5661k507J5564M388j5591n889J4659P708j4526
2143b785q963J4113R806j2456j1413J1709J2157j0479j3237R088J3774p586j4141
2156a0413O021J4554m401j4471K352J4804r13j4887o60J4284K679j4000m269J3448
$$ plain form
2063 11931 3349 -12132 -4694 11204 5183 -10981 -6767 10026 7183 -10074 -8588 8334 8809
2076 8809 -7680 -10055 6362 10190 -5734 -11471 3463 10680 -3088 -12147 884 11907 107
2089 107 -11795 -1797 11723 2412 -11914 -4407 11152 5340 -11055 -6520 10426 7568 -9565
2102 -9565 -8620 8556 9155 -8018 -10191 6563 10580 -5415 -10850 4827 11662 -3118 -11331 2567
2116 2567 11708 -1162 -11385 -90 11323 1578 -10650 -2342 11048 3956 -9888 -5085 9769
2129 9769 6465 -8681 -7348 8367 9070 -6591 -9098 6466 10854 -4737 -10626 4033 11741 -2785
2143 -2785 -11748 2365 12171 -285 -11698 11 12168 1689 -11548 -2460 11314 3728 -10413
2156 -10413 -4392 10162 5761 -8710 -6358 8446 7533 -7354 -8014 6270 8949 -5051 -9320 4128
2170D128O053j2843p587J1606R199j1032j0620R850J2054q289j3514P488J4487
2183A0980o475j5816N502J6493m168j7217K933J7596j569j7780L13J7605O54j7268
2197h217k358J6910L413j5933m599J4954O141j3763o781J2436P574j1046q898
2210a0167R379R857p783j0317N938J1115m239j1624K124J2224J8j2982j916J3403
2224E030L795j3175n868J3215P691j2729r681J2506J1223j2233j2077J1557J3428
2237A2682j0765j4551J0274J5387r670j5951P947J7036p293j6883N743J7605m698
2250F863j7132L772J6088j555j6383M28J5137J291j4080k621J3146M128j1678
2263b596n839J0478O809q785q387P135R850n818j1102M542J2455l152j2912J013
$$ plain form
2170 4128 10181 -2662 -10249 1357 10556 -476 -11096 -1246 10808 2519 -10995 -3507 10980
2183 10980 4505 -11311 -5809 10684 6516 -10701 -7768 9828 8259 -9521 -9208 8397 9051 -8217
2197 -8217 -10575 6335 9748 -6185 -10784 4170 10311 -3452 -10233 2203 9777 -1269 -10167
2210 -10167 -788 9069 1286 -9031 -3093 8022 3783 -7841 -5717 6507 6525 -6457 -8373 5030
2224 5030 8825 -4350 -10218 2997 10688 -2041 -11722 784 12007 -226 -12303 -746 12682
2237 12682 1917 -12634 -2360 13027 3357 -12594 -4647 12389 5096 -11787 -6044 11561 6863
2250 6863 -10269 -6497 9591 8036 -8347 -7919 7218 8509 -5571 -8192 4954 9082 -2596
2263 -2596 -8435 2043 8852 67 -8320 -1185 8665 2847 -8255 -3713 8742 5590 -7322 -6309
2277f309J3494L28j4047j747J4513L372j4723m862J4826O477j4632q013J4195
2290B872Q734j4070r288J2838J0940j2261j1163J1089J1875r847j2972Q750J3199
2303A0696p573j3404N762J3627m228j3131K041J3588p23j3507r68J2541L313j2323
2317d289m768J2140O179j1050p780J0004R278r665j0543Q809J1409p593j2146
2330a0015O383J3195n546j3608L980J4638l451j4707K136J5041q82j4343q13J4504
2344F512J985j4171l500J3167M918j2670n557J1523O720j0373p417R027Q876q286
2358G54r188N935J0934n068j1592L718J2393k243j3110J302J2969L16j3403k031
2372h314J3637L774j3443m899J3511N878j2924p354J2296Q613j2017r322J1096
$$ plain form
2277 -6309 7185 7513 -6534 -8281 6232 9604 -5119 -9981 4845 11322 -3310 -11323 2872
2290 2872 11606 -2464 -11752 1086 12026 -235 -11398 -309 11566 1719 -11253 -2503 10696
2303 10696 3123 -10281 -4519 9108 4880 -8251 -6210 7378 6655 -6852 -7820 4721 8034 -4289
2317 -4289 -9057 3083 9262 -1788 -9568 436 9714 49 -10494 -1685 9724 2131 -10015
2330 -10015 -3632 9563 4017 -9591 -5611 9027 5576 -9131 -6995 8046 7164 -7179 -7992 6512
2344 6512 8497 -5674 -9174 3993 8911 -3759 -9316 2207 8927 -1446 -8863 164 9040 754
2358 754 -8434 -2499 8435 3367 -8225 -4507 7886 5643 -7467 -6165 6804 7120 -6283 -8314
2372 -8314 5323 9097 -4346 -9245 4266 10144 -2780 -10134 2162 10775 -1242 -10564 532
2385E32J0107r786j0909R241J1636q228j1987O597J2550n703j2785M241J2838
2398H344k816j2561O28J3124P59j2626k137J1895L573j1412n121J0952O504r854
2412g48p907R037R178q227j0583P304J0856n681j1912M403J3076l407j3719K411
2426e919J3989j386j4029m21J4503J234j4114k405J3743L782j2981n429J2704
2439C271N886j1815p400J1050Q572r973r066Q248J0466p600j0785N773J1462m436
2453C653j2188L367J2411j340j3049M14J2824J233j2943k585J2354M097j2336
2466d088n422J1892O923j1318p830J0816Q989j0270r767Q741J0909q076j1084
2479i585O478J2196n776j2263M334J2541k723j2736J287J2658K76j2674j194J2283
$$ plain form
2385 532 10639 853 -10056 -815 10821 2593 -9394 -2797 9753 4050 -8735 -4494 8344
2398 8344 5528 -7033 -6405 6719 7478 -5148 -7285 4610 8183 -3229 -8350 2602 9106 -748
2412 -748 -8655 382 9560 1333 -9250 -1946 8910 3229 -8683 -4280 8796 5389 -8330 -5919
2426 -5919 8070 6684 -7345 -7766 6737 7971 -6143 -8548 5195 8977 -4004 -9433 3271
2439 3271 9157 -2658 -10058 992 9564 -409 -9475 -1227 9239 1639 -9146 -3373 8089 3653
2453 3653 -8535 -5168 7243 5903 -7146 -6732 6092 7325 -5618 -8203 4151 8248 -4088
2466 -4088 -9510 2382 9305 -2013 -9843 973 9962 -308 -10075 -1334 9575 1499 -9585
2479 -9585 -3107 9089 3313 -8950 -4616 7925 5202 -7534 -6247 6411 6687 -5987 -7181 5102
2493E102L129j2140m515J1387N807j1050o814J0081Q122q624r637P945J0524o668
2507B649j1397N365J2052m332j2661L096J3359j814j3225N95J3062R07j3212k176
2521g732J3200L366j3128m111J1940N781j1472o684J0562P821r951q547Q434R546
2535I025p410j0069O347J0683n076j0940L376J1510k121j1921Q19J1689O16j1494
2549d966k129J1639L315j1279m544J0794N714j0525o807R606Q077q547r320Q158
2563h14R931p400j0610N921J1311n158j1516L743J2225k612j2370J515J2118k84
2577F000j2356m35J2023J573j1592k634J1009L909j0273m997R326O451r120p516
2591h632Q386P852o866q860O063R698n239j0249M438J0008k578j0823J518J1105
$$ plain form
2493 5102 8231 -3909 -8424 2963 8770 -2280 -9094 987 9109 485 -9152 -1207 9317 2649
2507 2649 -8748 -3383 8669 4337 -8324 -5228 8131 6317 -6908 -6313 6749 7656 -5556 -7732
2521 -7732 5468 8834 -4294 -8405 3535 9316 -2156 -8840 1722 9543 -408 -8955 -521 9025
2535 9025 1615 -8454 -2107 8576 3500 -7440 -4064 7446 5325 -6596 -5777 5912 6528 -4966
2549 -4966 -7095 4544 7859 -3420 -7964 2830 8544 -1981 -8788 818 8895 348 -8972 -814
2563 -814 9117 1717 -8893 -2972 8339 3181 -8335 -4592 7633 5021 -7349 -5834 6284 6000
2577 6000 -6356 -6791 5232 6805 -4787 -7421 3588 7497 -2776 -7773 1553 8004 -1116 -8632
2591 -8632 -246 7606 740 -8120 -2057 7641 2402 -7847 -3409 6599 4021 -6802 -5284 5821
2605E821l67j1099o82J1008K421j1191l782J0918M670j0340o091J0381P112r543
2619g64p965Q492Q864p474r836O985J0267n966j1183N115J1652m197j1381K733
2633d658J2004j575j2279N79J1787N79j1602j540J1332K952j0692m128J0187M920
2647G866r348o304Q765O730p001q079O314Q950n665r358M656R819l094j0331J462
2662d618J0453l71j0348j087J0719K407j1004l335J0560M684j0568n628R783O931
2676H578q884q224Q741Q879q035r848O851J0469o059j0684N138J1329m426j1346
2690g521K891J1545j613j2097R56J1630j23j1130r93J0573K695j0315l800R843
2704B541M555q941n548P754O569p172p121N922Q334m927q885L809R583l175r789
$$ plain form
2605 5821 5454 -5645 -6327 4681 7102 -4089 -7871 3047 7717 -2623 -8714 1667 8779 -764
2619 -764 -8729 -237 8627 1153 -8683 -1698 8569 2603 -8580 -3465 8187 3990 -7391 -4658
2633 -4658 7346 5771 -6508 -5929 5858 6437 -5165 -6705 4627 7579 -3113 -7241 2946 7866
2647 7866 -1482 -7786 979 7709 708 -7371 -1057 7893 2228 -7130 -2474 7345 4251 -6080 -4618
2662 -4618 5835 5464 -4884 -5971 4748 7155 -3849 -7184 3376 8060 -2508 -8136 1647 8578
2676 8578 -306 -8530 211 9090 1055 -8793 -1942 8527 2468 -8216 -3078 8251 3825 -7521
2690 -7521 -4630 6915 5302 -6795 -5839 5791 5668 -5462 -6455 4118 6813 -3502 -7302 2541
2704 2541 7096 -1845 -7393 361 6930 -242 -7363 -1441 6893 1966 -6919 -3110 6473 3298 -6491
2719f491J687J0407l31j0607o68J0483K176j1197k878J0450M153j0173n126J0086
2733A971N547r061p011Q644P957p705q790P238Q931o449r253N320R791m072j0215
2748g157L353J0420k033j0276O06R972J43r584j430R832K288q760l871Q873M715
2763G091q148n967P326O892o309p858N640Q418m368r477L830R710k832j0086J724
2778d414J0221m64j0185o17J0814J324j0541k174R610L503j0041l944R393M779
2792G264q536n653Q098O395p896o702O481P543n948p974N181Q160m012q212K690
2807c121Q699j812q309M0Q633O27q520j611Q394K658p971l586P265M972p163n939
2823f744O691O472n994o920N105Q052m719q470L894Q634k813r470K235R526j338
$$ plain form
2719 -6491 -4804 5603 5272 -5335 -6003 4480 6656 -4541 -7419 3031 7184 -2989 -8115 1971
2733 1971 7518 -1543 -8554 90 8047 342 -8448 -1210 7721 1272 -7981 -2661 7130 3058 -7157
2748 -7157 -3804 6616 4583 -5693 -5087 4885 5028 -4556 -5986 3846 6134 -2626 -6497 2376 7091
2763 7091 -1057 -7024 302 7194 885 -6973 -1333 7085 2717 -6760 -2930 6780 3948 -6138 -4414
2778 -4414 5807 5343 -4842 -5459 5355 6679 -3862 -6036 3574 7077 -2964 -6908 2485 7264
2792 7264 -1272 -6925 1173 7568 -328 -7030 -549 6994 1046 -6928 -1747 6413 2401 -5811 -3121
2807 -3121 5578 3766 -4543 -4503 4130 4757 -3763 -5374 3020 5678 -2293 -5879 1386 6358 -805 -6744
2823 -6744 -53 6419 425 -6495 -1390 6662 1943 -6527 -2633 6001 3188 -6282 -4047 5479 4141
2838D141r603K34J0259n9r884p55R345J997r193l016R126L463q253m568Q248N025
2854F507p741n182O628N979o249o409N367O985m144p789L603P792k589p652J260
2869c634P775k47p767p85P941J920p651k424O838L497o770m484O329N560n786
2884C12o530N280P015m399p840L734Q828l445r123K463R273j201r786J056R482
2899E119L49j0020q35R460J957r492k519R076L683q888m464Q668M890p926n541
2914f483P014O352o903n932N362O937m753p336M134P067k755p324J546P224l72
2929C778p393k70P108J661p479k315O955L486o952m026O069M874n043o012M644
2944i15O570m340p032L506P893k930q440K306Q404j229q564J85Q983M58q793j076
$$ plain form
2838 4141 -5462 -5228 5031 4972 -4912 -5667 3678 5675 -3518 -6534 2592 6055 -2198 -6766 1482 6507
2854 6507 -1234 -6416 212 6191 -58 -6467 -1100 5885 1741 -6048 -2445 5347 2758 -4894 -3634
2869 -3634 4141 3894 -3873 -4658 3283 5203 -2448 -4872 1966 5463 -1307 -5791 538 6098 312
2884 312 -6218 -938 6077 1678 -6162 -2428 6400 2955 -6168 -3705 5568 4367 -5419 -4363 5119
2899 5119 5468 -4552 -5387 4073 6030 -3462 -5981 3095 6778 -2110 -6574 2094 6984 -942 -6483
2914 -6483 531 6883 -20 -5952 -590 6347 1594 -5742 -1608 5459 2704 -4620 -3074 4150 3778
2929 3778 -3615 -3885 3223 4884 -2595 -4910 2045 5531 -1421 -5447 622 5496 453 -5559 -915
2944 -915 5655 1315 -5717 -2211 5682 2752 -5688 -3382 5022 3793 -4771 -4586 4397 4855 -3938 -5014
2960e014Q225K048q554k245P734L224p277l969P181M026o216n116N879N306m970
2975B62n742M250O424l388p150L101O807j944p166J007P262l28p017q43P356J898
2991D789p439k504P295K690o501l702N899M573n624n029N271N568m495n915L936
3006a188O562l936o329K431P119j946o632J353O438l09o890m14O584J232o442
3021b367k331O811K695o205l030M896M427m925m613M437N148l829n863L449O399
3036E099k706o557J523P420j647p006M24P472j83p206m65P175J049o854j801O856
3052B593K121o370l359O523L317n618l833N359M182m646m792L937M990l206n404
3067d206K847N441k090n539J153N548l53n725m58N937Q30n695j569N528K349n218
$$ plain form
2960 -5014 3211 5259 -3295 -5540 2194 5418 -1859 -5828 1353 5379 -837 -5953 -74 5232 262
2975 262 -5480 -1230 5194 1806 -5344 -2243 4564 2620 -4546 -3539 3723 3395 -3622 -4465 2891 4789
2991 4789 -2650 -5154 2141 4831 -1670 -5372 527 5100 -524 -5553 -282 5286 791 -5124 -1188
3006 -1188 5374 1438 -4891 -2460 4659 2713 -3919 -2566 3872 3563 -3327 -3741 2843 4075 -2367
3021 -2367 -4698 2113 4808 -1397 -4427 469 4896 -29 -4642 -205 4943 1114 -4749 -1300 5099
3036 5099 2393 -4164 -2641 4779 3132 -3874 -3450 4022 3839 -3367 -3832 3343 4392 -2462 -4263 2593
3052 2593 4714 -1656 -5015 1508 4825 -793 -4626 733 4915 269 -4523 -586 4404 1198 -4206
3067 -4206 -1359 4082 1992 -3547 -2394 3154 2801 -2924 -3382 2555 3385 -2310 -3879 1649 3998 -1220
3083a220k847M910L294m518m163M258M663m241m849L649N193k754n634K299O179
3098D219k191o568J632O523r64o031r6O479L34o457n29N802J787n779k368N402
3114A195K865m900l434M512L833l909m537L776M445l084n190K380O010j945n887
3129c870J635N773q71o395N30N950Q20o221j413O118J762n568k614O128K504n003
3145g35l502M705L736m211m033L448N041l179m960K555N152k108n431J665N228
3160C371n05n599k53N546O99n271j566N370K301n028k641M604L229m337l470L325
3176b25M498l630m666L294M975l049m918J997N692j701o068J538N800p79n794
3191c036L93N317L27n470o95N203J403n102j697M914K002m073k877L935K915l517
$$ plain form
3083 -1220 -4067 843 4137 -381 -4544 -286 4377 136 -4713 -1064 4129 1375 -4259 -1960 4219
3098 4219 2028 -4540 -2908 3615 2651 -3380 -3476 3003 3337 -3120 -3649 2153 3940 -1839 -4207 1195
3114 1195 4060 -840 -4274 238 4071 162 -4375 -599 3846 762 -4428 -2048 3962 2017 -3870
3129 -3870 -2235 3538 2667 -3728 -3198 2752 3572 -2649 -4062 2056 3818 -1750 -4364 1764 4268 -735
3145 -735 -4237 468 4204 -7 -4040 -592 4449 1270 -3690 -1135 4017 1909 -3522 -1857 3371
3160 3371 2866 -2733 -2986 2560 3259 -2012 -3578 1792 4093 -935 -3576 1028 4257 -80 -3550 -225
3176 -225 4273 643 -4023 -729 4246 1197 -3721 -1724 3968 2267 -3801 -2263 3537 2758 -3036
3191 -3036 -2643 2674 3001 -2469 -3164 2039 3442 -1660 -3357 1557 3559 -514 -3391 544 3459 -58
3207e8l615L360L610k522m063J835M222j268m703J329M458k09m768o28N022Q86
3223B888m585j787M655K021m572k322M292L189m646l071L996L322l491l808L379
3238e40L788k482m191K122M681k366m319J586M698j241m305L84M280Qm341l87
3254b625M230J102l929j463L534J999l443k554L413K492k679l229K338L707j874
3269A019m041K020L852j053m726R50M856p38m472j34M977L42m516j291M859J063
3285B967m616j518M567J982m407k254M334K650l928k921L545L005k849l358K368
3300d33L587k176l357J537L426j163l467N19L410J15l472o29L423J004l221j622
3316b519L419J494k473k316K337K985k415l190K284L402k126l533J410M002r02
$$ plain form
3207 -58 -3673 -313 3297 775 -3288 -1453 2769 1501 -3202 -1873 2585 2376 -2392 -3020 2002 2888
3223 2888 -1697 -3484 1171 3192 -1380 -3702 590 3779 -867 -3938 58 3380 -111 -3919 -540
3238 -540 3248 766 -3425 -1303 3378 1012 -3307 -1721 2977 1736 -2569 -2185 2095 2103 -2238 -2625
3254 -2625 1605 2707 -1222 -2685 849 2848 -595 -3149 264 2756 77 -3152 -814 2893 1019
3269 1019 -3022 -1002 2850 1797 -2929 -1979 2877 2139 -2333 -2467 2510 2852 -1664 -2955 1904 2967
3285 2967 -1649 -3167 1400 3382 -1025 -3279 1055 3705 -223 -3144 401 3406 557 -2801 -433
3300 -433 3154 978 -2379 -842 2584 1421 -2046 -1527 1883 1998 -1474 -2103 1320 2324 -897 -2519
3316 -2519 900 2394 -79 -2395 -58 2927 512 -2678 -394 3008 882 -2651 -1241 2761 1859
3331A859m274P52M283o27m418L72M244K35m342p37M626N70m274j139M231J149
3347B510l912j445L582J986l457k229L083K696k983k350K253K706k099l083J921
3362h21K734p06l347O17L097k92k958j16L062P41l088j136K978J589k930k166
3378b742L008K410k966k465K309L232k179l597J791L898j373m280J337M072p85
3393A670m437J001M220m86m136k27M240L83l909p88M122P52l505j010L000J628
3409B518k766k171L038J685k188k252J814K422j287k626R29K675J52l275l91L200
3425A477O04l224o94L030J369l373j721L169J850k974k190L138K352k775k886
3440b848K612K968k291l250K185L511k078l287J403L349j322l320J287L126n90
$$ plain form
3331 1859 -2415 -1663 2620 1993 -2425 -2053 2191 2426 -1916 -2653 1973 2543 -1731 -2870 1361 2510
3347 2510 -1402 -2847 735 2721 -736 -2965 118 2814 -169 -2519 -266 2440 341 -2742 -821
3362 -821 1913 1207 -2140 -1523 1574 1282 -1676 -1792 1270 2011 -1077 -2213 765 2354 -576 -2742
3378 -2742 266 2676 -290 -2755 -446 2786 607 -2990 -1199 2699 1326 -2954 -1617 2455 1670
3393 1670 -2767 -1766 2454 1968 -2168 -2395 1845 2228 -1681 -2469 1653 2405 -1100 -2110 890 2518
3409 2518 -248 -2419 619 2304 116 -2136 -322 2100 813 -1813 -884 1791 1943 -1332 -1723 1477
3425 1477 2081 -1143 -1837 1193 2562 -811 -2532 637 2487 -487 -2677 461 2813 38 -2848
3440 -2848 -236 2732 441 -2809 -624 2887 809 -2478 -1075 2274 952 -2368 -1081 2045 1455
3455A455l110J14L121p0k947j14K490Q91k733p80K060J173j810j347J558J628
3471A579j006k374J004K317m65k896K78L140k06l102j32K787R47l170r15L301
3487A087Q35l156j130L248J266l042j707K853J956k786k026K596K399k674k124
3502b405K104K384j716k734J796K590j860k319J457K436p70k639M47K584j58k662
3518a465M9K367M79j919j066K178J094k118j204J822J230j221j974J235K048q18
3534G17k420O64K895q53k529N90K726l36k954J77K635O57k413j215K525J261k693
3551e66j274K624J394k280j644J921J749j646k164J632K178j311k358R37K808
3566B000j250k520Q88K415l75k405k17L231l7l156m7K709M02k567q82K851P44
$$ plain form
3455 1455 -1655 -1541 1580 1510 -1437 -1551 939 1830 -903 -1683 377 1550 -260 -1607 -49 1579
3471 1579 573 -1801 -797 1520 1055 -1841 -1563 1577 1371 -1731 -1863 924 1871 -1299 -2214 1087
3487 1087 1922 -1234 -2364 884 2150 -892 -2599 254 2210 -576 -2602 -6 2393 -281 -2405
3502 -2405 -301 2083 367 -2367 -571 2019 159 -2160 -703 1733 963 -1676 -1229 1355 1197 -1465
3518 -1465 -1416 951 1430 -489 -1555 623 1717 -401 -1605 217 1447 226 -1748 -513 1535 717
3534 717 -1703 -1039 1856 1003 -1526 -936 1790 1454 -1500 -1323 1312 1969 -444 -1659 866 2127 -566
3551 -566 -1840 784 2178 -102 -1746 175 1924 278 -1886 -254 1924 613 -1745 -808 2000
3566 2000 750 -1770 -882 1533 1158 -1247 -1464 1767 1730 -1426 -1473 1236 1638 -929 -1811 1040 1784
3583A784k313j484K139J919k350j381J740J516j337j719J133J548n77k114N99
3598h97K220m54k200K64J973N71k191r76K326N82k061r79J977J120j484j718J788
3615a39J576j089k087J271K239j412k454J527K391j084k899Q10L060n48k644Q6
3631a396K879O1k909l29K776J92k146q56K574Q71k553q13K014J224j866j401J619
3648e9J463j103j962J368J764j039j815P15K046k11k413J82J864O21k410k99K324
3665A036N60j884j301J779J577k110j087J701J150j324j686J378K091j177k217
3680a514J054K163r24k196P36K128o32k016K75K090n0k004l7J666N51j887q43
3697a440K038J043j574j160J407J321j066k132J449J700j355j648P27K218p80
$$ plain form
3583 1784 -529 -2013 126 2045 -305 -1686 54 1570 233 -1486 -353 1195 618 -1496 -897
3598 -897 1323 869 -1331 -1067 906 1477 -714 -1690 636 1218 -843 -1822 155 1275 -209 -1927 -139
3615 -139 1437 348 -1739 -468 1771 359 -2095 -568 1823 739 -2160 -1350 1710 1162 -1482 -1396
3631 -1396 1483 1544 -1365 -1694 1082 1274 -872 -1728 846 1717 -836 -1649 365 1589 -277 -1678 -59
3648 -59 1404 301 -1661 -293 1471 432 -1383 -668 1378 1167 -1246 -1064 800 1421 -989 -1288 1036
3665 1036 1596 -288 -1589 190 1767 -343 -1430 271 1421 97 -1589 -211 1880 703 -1514
3680 -1514 -460 1703 779 -1417 -681 1447 815 -1201 -926 1164 1114 -890 -927 739 1290 -597 -1440
3697 -1440 598 1641 67 -1093 314 1635 569 -1563 -114 1586 231 -1417 -690 1528 748
3712G48k086L24K509n35k537N79K160m3k271j83K483K07k191o03K127O12j821
3729e21j187K303P26j559r99J394R40j273q16Q06J116q79j353O87J552m91j366
3746i20j42J709L55j678n45J598R92j931r05J864R62j613j423J762J574j702j650
3763a693J636J702j344k059J370K202j435k010J023K026m43k355N99K068j70k316
3779a199K00J886j59j459o41K064P65k284l63J623O52j424q09J292J048j216j285
3796a309J162J460o37j752O70J764n07j710L1J717L05j959l35J777O61j759p09
3813a130J586R27j464j368J857J023j306j605J354J666j280j637J047J550p80
3828D40j577K97K305o53j861K14J885K33k209m7J775M89k123n64J898N95j263
$$ plain form
3712 748 -1338 -1014 1495 960 -1577 -998 1162 1119 -1152 -1335 1148 1355 -836 -1439 688 1300 -521
3729 -521 -1708 595 1321 -238 -1237 157 1097 -176 -992 -186 930 51 -1302 -615 937 446 -920
3746 -920 -1062 647 1002 -676 -1221 377 1369 -562 -1467 397 1359 -254 -1677 85 1659 -43 -1693
3763 -1693 -57 1645 301 -1758 -388 1814 379 -1631 -608 1418 975 -1380 -781 1287 1117 -1199
3779 -1199 -999 887 728 -731 -1372 692 1457 -827 -1190 433 1085 -339 -1148 144 1192 -24 -1309
3796 -1309 -147 1313 676 -1076 -406 1358 851 -859 -828 889 1194 -765 -1100 677 1338 -421 -1130
3813 -1130 456 1383 -81 -1449 408 1431 125 -1480 -126 1540 260 -1377 -330 1220 440
3828 440 -1137 -840 1465 812 -1049 -835 1050 1283 -926 -973 802 1291 -832 -1396 502 1097 -166
3845a66j183J613J428j808j417J639J339j417j471J107J565q45j769P36J907p89
3861D69j816M38J928m6j860l29K070m11j533l01J696N32j431p65J182J364j071
3878A16j673J272J613r17j756P36J861j033j667O37K154m68k206M17J605N5j736
3895i90J13J918q0j740o31K205j2j293r34J849R46j781r94J371J331j484j021
3912a227J315J331j288j207N78J579m05j578L60J245J07j651L1J720K57j846k80
3929i59J516M42j084j224J475J326j217j494J305J168o74j787J075J676j188j536
3945a180Q24J889q62j396L37J485j42j707j59J925l16j452k8J262N07j523k75
3962h11Q55J036j305r09J082J121p49j474Q49J508o73j575K88J614Qj708l36K019
$$ plain form
3845 -166 -1349 264 1692 -116 -1533 106 1445 28 -1443 -336 1229 384 -1385 -649 1258 469
3861 469 -1347 -909 1019 973 -887 -1216 854 443 -1090 -1391 305 837 -594 -1359 -177 1187 116
3878 116 -1557 -285 1328 411 -1345 -609 1252 219 -1448 -811 1343 875 -1331 -914 691 746 -990
3895 -990 -877 1041 961 -779 -1410 795 783 -510 -1444 405 1351 -430 -1424 -53 1278 -206 -1227
3912 -1227 88 1419 131 -1076 -498 1081 676 -902 -542 703 810 -841 -810 910 1167 -679 -959
3929 -959 557 999 -85 -1309 166 1492 275 -1219 86 1254 580 -1207 -132 1544 356 -1180
3945 -1180 -356 1533 671 -725 -388 1097 955 -752 -911 1014 698 -754 -782 480 987 -536 -811
3962 -811 44 1080 -225 -1134 -52 1069 320 -1154 -305 1203 530 -1045 -757 857 865 -843 -1179 840
3980H40J28j607m67J636N11j627q99J786P96j696q89J773J253k031q82J219J278
3997A122j184j208J118J251j223j126R64J216q01j200O36J170o03j107K78J445
4013G48j48j309J66R11M09j193o45J247J038j544m77J173P13q32j313O44J572
4030A160o16j700N31J544k24j610J62J724M6k066n9J920K83j761l57J586P82j930
4048e85n83J493J366j959p84J237J041j077j395J435J040q62j387P18J598m65
4064H31j612J30J779o01j177RJ290K84j277o32J287R76j513q11J483N68n54j709
4082a249J026J700r62j743J134J551j130j388M00J818m34j998O90J716n41j673
4098a083K90J699K12j916j77J710J16j422m47J199R67j780o83J511Q55j110j082
$$ plain form
3980 840 968 -639 -1106 530 1041 -586 -1485 301 1097 -599 -1488 285 1538 -493 -1375 -156 1122
3997 1122 -62 -1270 -152 1099 -124 -1250 -286 930 129 -1071 -435 735 132 -975 -697 748
4013 748 600 -709 -543 368 777 -416 -1061 186 1224 -320 -797 376 1089 257 -1056 -412 1160
4030 1160 544 -1156 -625 919 695 -915 -753 971 1017 -1049 -1108 812 1095 -666 -1023 563 1345 -585
4048 -585 -1168 325 1691 -268 -1052 185 1226 149 -1246 189 1229 367 -1020 -302 1296 831
4064 831 -781 -651 1128 527 -650 -641 649 933 -344 -976 311 1287 -226 -1037 446 1014 460 -1249
4082 -1249 -223 1477 515 -1228 -94 1457 327 -1061 -661 1157 723 -1275 -585 1131 590 -1083
4098 -1083 -793 906 1118 -798 -975 735 851 -571 -1018 181 1148 -632 -1315 196 1051 -59 -1141
$$ [...]
8191h94
##END NTUPLES=NMR FID
##END=
