##TITLE=1H_2PB2506
 CDCl3, 8 sc, 
 26.6.2019
##JCAMPDX= 6.0         $$ Bruker NMR JCAMP-DX V2.0
##DATA TYPE= NMR FID
##DATA CLASS= NTUPLES
##ORIGIN= UXNMR, Bruker Analytische Messtechnik GmbH
##OWNER= root
$$ XWIN-NMR		Version 3.5
$$ Wed Jun 26 15:25:09 2019 Russian Standard Time (UT+4h)  she@DPX200
##.OBSERVE FREQUENCY= 200.13155
##.OBSERVE NUCLEUS= ^1H
##.DELAY= (6, 6)
##.ACQUISITION MODE= SIMULTANEOUS
##.ACQUISITION SCHEME= undefined
##.AVERAGES= 8
##.DIGITISER RES= 18
##SPECTROMETER/DATA SYSTEM= spect
##.PULSE SEQUENCE= zg30
##.SOLVENT NAME= CDCl3
##.SHIFT REFERENCE= (INTERNAL, CDCl3, 0, 15.7039)
##AUDIT TRAIL= $$ (NUMBER, WHEN, WHO, WHERE, WHAT)
$$ ##TITLE= Audit trail, XWIN-NMR		Version 3.5
$$ ##JCAMPDX= 5.01
$$ ##ORIGIN= Bruker BioSpin GmbH
$$ ##OWNER= she
$$ F:/spectra/data/she/nmr/H-F/1/audita.txt
$$ ##AUDIT TRAIL=  $$ (NUMBER, WHEN, WHO, WHERE, WHAT)
(   1,<2019-06-26 15:23:44.43 +0400>,<she>,<DPX200>,
      <created by zg, POWCHK disabled, PULCHK disabled
       configuration hash MD5:
       00 E9 B6 7A A2 85 ED C7 34 08 36 98 17 FE 4E 26
       data hash MD5: 16K
       83 9B 74 AE AD 1B 6F 8B 90 A7 98 27 22 65 B7 42>)
$$ ##END=
$$ 
$$ hash MD5
$$ FB BE 07 5A 2A 10 B9 1B 0A 82 3F 53 A0 56 FE 63
##$RELAX= 
##$RELAX= 
##$RELAX= 
##$RELAX= 
##$RELAX= 
##$RELAX= 
$$ Bruker specific parameters
$$ --------------------------
##$DU= <F:/spectra>
##$EXPNO= 1
##$NAME= <H-F>
##$PROCNO= 1
##$TYPE= <nmr>
##$USER= <she>
##$AMP= (0..31)
100 100 100 100 100 100 100 100 100 100 100 100 100 100 100 100 100 100 
100 100 100 100 100 100 100 100 100 100 100 100 100 100 
##$AQSEQ= 0
##$AQ_mod= 1
##$AUNM= <au_zg>
##$AUTOPOS= <>
##$BF1= 200.13
##$BF2= 200.13
##$BF3= 200.13
##$BF4= 200.13
##$BF5= 200.13
##$BF6= 200.13
##$BF7= 200.13
##$BF8= 200.13
##$BYTORDA= 1
##$CFDGTYP= 0
##$CFRGTYP= 5
##$CHEMSTR= <none>
##$CNST= (0..31)
1 1 145 1 1 1 1 1 1 1 1 1 1 1 1 1 1 1 1 1 1 1 1 1 1 1 1 1 1 1 1 1 
##$CPDPRG= <>
##$CPDPRG1= <>
##$CPDPRG2= <>
##$CPDPRG3= <>
##$CPDPRG4= <mlev>
##$CPDPRG5= <mlev>
##$CPDPRG6= <mlev>
##$CPDPRG7= <mlev>
##$CPDPRG8= <mlev>
##$CPDPRGB= <>
##$CPDPRGT= <>
##$D= (0..31)
0 1.2 0 0 0 0 0 0 0 0 0 0.03 0 0 0 0 0 0 0 0 0 0 0 0 0 0 0 0 0 0 0 0 
##$DATE= 1561548223
##$DBL= (0..7)
120 120 120 120 120 120 120 120 
##$DBP= (0..7)
150 150 150 150 150 150 150 150 
##$DBP07= 0
##$DBPNAM0= <>
##$DBPNAM1= <>
##$DBPNAM2= <>
##$DBPNAM3= <>
##$DBPNAM4= <>
##$DBPNAM5= <>
##$DBPNAM6= <>
##$DBPNAM7= <>
##$DBPOAL= (0..7)
0.5 0.5 0.5 0.5 0.5 0.5 0.5 0.5 
##$DBPOFFS= (0..7)
0 0 0 0 0 0 0 0 
##$DE= 6
##$DECBNUC= <off>
##$DECIM= 24
##$DECNUC= <off>
##$DECSTAT= 4
##$DIGMOD= 1
##$DIGTYP= 9
##$DL= (0..7)
0 120 120 120 120 120 120 120 
##$DP= (0..7)
150 150 150 150 150 150 150 150 
##$DP07= 0
##$DPNAME0= <>
##$DPNAME1= <>
##$DPNAME2= <>
##$DPNAME3= <>
##$DPNAME4= <>
##$DPNAME5= <>
##$DPNAME6= <>
##$DPNAME7= <>
##$DPOAL= (0..7)
0.5 0.5 0.5 0.5 0.5 0.5 0.5 0.5 
##$DPOFFS= (0..7)
0 0 0 0 0 0 0 0 
##$DQDMODE= 0
##$DR= 18
##$DS= 0
##$DSLIST= <SSSSSSSSSSSSSSS>
##$DSPFIRM= 0
$$ [...]
##$SUBNAM2= <"">
##$SUBNAM3= <"">
##$SUBNAM4= <"">
##$SUBNAM5= <"">
##$SUBNAM6= <"">
##$SUBNAM7= <"">
##$SUBNAM8= <"">
##$SUBNAM9= <"">
##$SW= 24.9336996594482
##$SWIBOX= (0..15)
0 0 2 0 0 0 0 0 0 0 0 0 0 0 0 0 
##$SW_h= 4990.01996007984
##$TD= 16384
##$TD0= 1
##$TE= 0
##$TE2= 300
##$TE3= 300
##$TEG= 300
##$TL= (0..7)
0 120 120 120 120 120 120 120 
##$TP= (0..7)
150 150 150 150 150 150 150 150 
##$TP07= 0
##$TPNAME0= <>
##$TPNAME1= <>
##$TPNAME2= <>
##$TPNAME3= <>
##$TPNAME4= <>
##$TPNAME5= <>
##$TPNAME6= <>
##$TPNAME7= <>
##$TPOAL= (0..7)
0.5 0.5 0.5 0.5 0.5 0.5 0.5 0.5 
##$TPOFFS= (0..7)
0 0 0 0 0 0 0 0 
##$TUNHIN= 0
##$TUNHOUT= 0
##$TUNXOUT= 0
##$USERA1= <user>
##$USERA2= <user>
##$USERA3= <user>
##$USERA4= <user>
##$USERA5= <user>
##$V9= 5
##$VALIST= <valist>
##$VCLIST= <CCCCCCCCCCCCCCC>
##$VD= 0
##$VDLIST= <DDDDDDDDDDDDDDD>
##$VPLIST= <PPPPPPPPPPPPPPP>
##$VTLIST= <TTTTTTTTTTTTTTT>
##$WBST= 1024
##$WBSW= 4
##$XGAIN= (0..3)
0 0 0 0 
##$XL= 0
##$YL= 0
##$YMAX_a= 314661
##$YMIN_a= -416798
##$ZGOPTNS= <>
##$ZL1= 120
##$ZL2= 120
##$ZL3= 120
##$ZL4= 120
##$ABSF1= 10
##$ABSF2= 0
##$ABSG= 5
##$ABSL= 3
##$ALPHA= 0
##$AQORDER= 0
##$ASSFAC= 0
##$ASSFACI= 0
##$ASSFACX= 0
##$ASSWID= 0
##$AUNMP= <proc_1d>
##$AZFE= 0.1
##$AZFW= 0.1
##$BCFW= 1
##$BC_mod= 2
##$BYTORDP= 1
##$COROFFS= 0
##$CY= 11.3945322036743
##$DATMOD= 1
##$DC= 2
##$DFILT= <>
##$DTYPP= 0
##$F1P= 18.9103706918063
##$F2P= -1.10871071338519
##$FCOR= 0.5
##$FTSIZE= 0
##$FT_mod= 4
##$GAMMA= 1
##$GB= 0.15
##$INTBC= 1
##$INTSCL= 1
##$ISEN= 128
##$LB= 0.24
##$LEV0= 0
##$LPBIN= 0
##$MAXI= 10000
##$MC2= 0
##$MEAN= 0
##$ME_mod= 0
##$MI= 1.114404
##$NCOEF= 0
##$NC_proc= 0
##$NLEV= 6
##$NOISF1= 3.799351
##$NOISF2= 2.8
##$NSP= 1
##$NTH_PI= 0
##$NZP= 0
##$OFFSET= 15.70392
##$PC= 1
##$PHC0= -8498.685
##$PHC1= 14.60097
##$PH_mod= 1
##$PKNL= yes
##$PPARMOD= 0
##$PSCAL= 0
##$PSIGN= 0
##$REVERSE= no
##$SF= 200.130013532006
##$SI= 16384
##$SIGF1= 3
##$SIGF2= 2
##$SINO= 400
##$SIOLD= 16384
##$SREGLST= <1H.CDCl3>
##$SSB= 0
##$STSI= 0
##$STSR= 0
##$SW_p= 3612.71676300578
##$SYMM= 0
##$S_DEV= 0
##$TDeff= 0
##$TDoff= 0
##$TI= <>
##$TILT= no
##$TM1= 0
##$TM2= 0
##$TOPLEV= 0
##$USERP1= <user>
##$USERP2= <user>
##$USERP3= <user>
##$USERP4= <user>
##$USERP5= <user>
##$WDW= 1
##$XDIM= 8192
##$YMAX_p= 0
##$YMIN_p= 0
$$ End of Bruker specific parameters
$$ ---------------------------------
##NTUPLES= NMR FID
##VAR_NAME=  TIME,          FID/REAL,        FID/IMAG
##SYMBOL=    X,             R,               I
##VAR_TYPE=  INDEPENDENT,   DEPENDENT,       DEPENDENT
##VAR_FORM=  AFFN,          ASDF,            ASDF
##VAR_DIM=   8192,          8192,            8192
##UNITS=     SECONDS,       ARBITRARY UNITS, ARBITRARY UNITS
##FACTOR=    0.0002004,     1,               1
##FIRST=     0,             0,               0
##LAST=      1.6414764,     0,               0
##MIN=       0,             -416798,         0
##MAX=       1.6414764,     314661,          0
$$ Real data points
##PAGE= N=1
##DATA TABLE= (X++(R..R)), XYDATA
$$ [...]
2539d291j44R084L91r282k72R243N94r723m19R599K71j0009n56J0255J65j0574
$$ -4291 -4435 4649 5040 -4242 -4514 4729 5323 -4400 -4819 4780 5051 -4958 -5514 4741 4906 -5668
2555e668N7J0920n47j0857P59J0893j212j0710J410J0760j703j0847K210J0233
$$ -5668 -5611 5309 4762 -6095 -5336 5557 4345 -6365 -4955 5805 4102 -6745 -4535 5698
2569E698j982j0580L117J0111k987j0035L758R216l339r119L394R484l915q562
$$ 5698 3716 -6864 -3747 6364 3377 -6658 -2900 6316 2977 -6142 -2748 6736 2821 -5741
2583e741L407Q795l953p893L403Q215l184q819L614Q287l288q403L585Q319m020
$$ -5741 -2334 6461 2508 -5385 -1982 6233 3049 -5770 -2156 6131 2843 -5560 -1975 6344 2324
2598B324q236L837Q722m374q476M099Q827m828q840M919Q855n379q438N414P981
$$ 2324 -5912 -2075 6647 2273 -6203 -2104 6723 1895 -6945 -2026 6829 1450 -6988 -1574 6407
2613F407n495q139N848P832o069p600O117P684o752p033O601O882o312o826O643
$$ 6407 912 -7227 -1379 6453 384 -7216 -1099 6585 -167 -7200 -599 6283 -29 -6855 -212
2628b12O774o879o289O827N865o573n694O711N916o699n814O861N631o564n351
$$ -212 6562 -317 -6606 221 6086 -487 -6181 530 6446 -253 -6067 794 6425 -139 -5490
2643e490O336N635o663n505O674N411o642n491P102N013o885n004O564N582p598
$$ -5490 846 6481 -182 -5687 987 6398 -244 -5735 1367 6380 -505 -5509 1055 6637 -961
2658i61n367P597M956p452m670P115M691p573m699Q136M370q601m062Q273M027
$$ -961 -6328 1269 6225 -1227 -5897 1218 5909 -1664 -6363 1773 6143 -2458 -6520 1753 5780
2673E780q722l415Q621L031q367l043Q544L120q695k657Q438K360q278k118Q352
$$ 5780 -2942 -6357 2264 5295 -3072 -6115 2429 5549 -3146 -5803 2635 4995 -3283 -5401 2951
2688B951K415q263k120Q476J762q185j765Q148J513p780j728Q153J686q190j528
$$ 2951 5366 -2897 -5017 3459 5221 -2964 -4729 3419 4932 -2848 -4576 3577 5263 -2927 -4455
2703d455Q294J398q536j174Q367J167q169j743Q711Q66q401p19Q515K40q404n28
$$ -4455 3839 5237 -3299 -4473 3894 5061 -3108 -4851 3860 4726 -3675 -4394 4121 4361 -4043 -4571
2719d571Q699k89q456lQ920m35q716Q96Q398j150q019P41Q252r72q322J154Q136
$$ -4571 4128 3839 -4617 -4620 4300 3865 -4851 -3955 4443 3293 -4726 -3985 4267 3295 -5027 -3873 4263
2736D263j647p396J576P460j381p865J955P567j600p580K004P208j738p116J504
$$ 4263 2616 -4780 -3204 4256 2875 -4990 -3035 4532 2932 -4648 -2644 4564 2826 -4290 -2786
2751b786P579j656p443J621P812j644p894K412P601k750q200K996P949l049p783
$$ -2786 4793 3137 -4306 -2685 5127 3483 -4411 -1999 5602 2852 -5348 -2352 5597 2548 -5235
2766e235L410P933l957p590L842P394m176p154M070O982m382o881M580O298m264
$$ -5235 -1825 6108 2151 -5439 -1597 5797 1621 -5533 -1463 5519 1137 -5744 -1164 5134 870
2781H70o478M325N945m296n700M097N559l940n730M191N578l983n472L851N856
$$ 870 -5608 -1283 4662 366 -5334 -1237 4322 382 -5348 -1157 4421 438 -5034 -1183 4673
2796D673l912n972L998O163l870o250M052O433m644o123M970O471n623n622N241
$$ 4673 761 -5211 -1213 4950 1080 -5170 -1118 5315 671 -5452 -482 5989 366 -5256 -15
2811a5N496m909n662N780N219n861n009N800M823o052m445N824M587n913m216
$$ -15 5481 572 -5090 690 5909 48 -4961 839 5662 -390 -4835 989 5576 -337 -4553
2826d553N660L639n961l417N536L575n544l475N144L727n586l374N309L541n668
$$ -4553 1107 4746 -1215 -4632 904 4479 -1065 -4540 604 4331 -1255 -4629 680 4221 -1447
2841a447l581N516L686n405l987O022L812n918l786N838L923o297l556O788L058
$$ -1447 -5028 488 4174 -1231 -5218 804 4616 -1302 -5088 750 4673 -1624 -5180 1608 4666
2856D666o660k745O792K935p099k474P322J736o956j536P016J154o439j249O896
$$ 4666 -1994 -4739 2053 4988 -2111 -4585 2737 4473 -2483 -4019 2997 4151 -2288 -3537 3359
2871C359O39o402q36O231P42o079q51N875N53n425m89M769J426n430j438N906
$$ 3359 3998 -2404 -3240 2991 3733 -2346 -3197 2678 3231 -2194 -2683 2086 3512 -1918 -3356 2550
2887B550J047n861j581N958J197o068j452O698J287o655j637P047J276p340r06
$$ 2550 3597 -2264 -3845 2113 3310 -2758 -4210 2488 3775 -2880 -4517 2530 3806 -3534 -4440
2902d440P930k20p609L33P560k95p815J209P400j529o999J868P061k334n893K041
$$ -4440 3490 3270 -4339 -4006 3554 3259 -4556 -3347 4053 2524 -4475 -2607 4454 2120 -3773 -1732
2918a732N821k281n608K568N088k402m663K110M667j646m517J754M170j130m877
$$ -1732 4089 1808 -3800 -1232 3856 1454 -3209 -1099 3568 1922 -2595 -841 3329 2199 -2678
2933b678J342M597r72m908P05M853o27n427O23O149j220o673J661O217j559o280
$$ -2678 -1336 3261 2289 -2619 -1914 2939 2312 -3115 -2492 3657 2437 -4236 -2575 3642 2083 -4197
2949d197J971O323k524o355K692O478l206o063L164O093l824n586M206M918l908
$$ -4197 -2226 4097 1573 -4782 -2090 4388 1182 -4881 -1717 4376 552 -5034 -828 4090 182
2964A82m943M489M494m414l858M111L839l565l980L256M031l376l332L299L393
$$ 182 -4761 -272 4222 -192 -4050 61 3900 335 -3645 -389 3642 266 -3066 233 3626
2979C626k647m099K789M228l101m151L011M624l124m686L329M457l467m597L759
$$ 3626 979 -3120 -331 3897 796 -3355 -344 4280 1156 -3530 -201 4256 789 -3808 -49
2994d9M317m010m832M669M555n031m058N047L638n277l399N514K718n228k679
$$ -49 4268 258 -4574 95 4650 -381 -4439 608 4246 -1031 -4430 1084 3802 -1426 -4105
3009d105N076K524n220k165N159J740m787j671M376J933m293j711L791J968l582
$$ -4105 971 3495 -1725 -3890 1269 3009 -1778 -3449 927 2860 -1433 -3144 647 2615 -967
3024i67j873L650K253l619k466L733K628l720k907M514K597m238l008M547L035
$$ -967 -2840 810 3063 -556 -3022 711 3339 -381 -3288 1226 3823 -415 -3423 1124 4159
3039D159m893k675N220K659n677k386N718K024o079j793O144J218n837r22N959
$$ 4159 -734 -3409 1811 4470 -1207 -3593 2125 4149 -1930 -3723 2421 3639 -2198 -3120 2839
3054B839K31n386j28N033k1n340M00M682m98m540K85M434m19l869L6M042k5l891
$$ 2839 3070 -2316 -2444 2589 2568 -2772 -2372 2310 1812 -2728 -2443 1991 1572 -2297 -2261 1781 1756 -2135
3072b135j74L738K19l859l16M246P48m281n82M235P98m980m91M654R57m916k49
$$ -2135 -2309 1429 1648 -2211 -2527 1719 2467 -1814 -2396 1839 2637 -2343 -2834 1820 2777 -2139 -2388
3089b388N026R5m998N3N546n72n294O03N248r31n335J510N118j910m417J375M384
$$ -2388 2638 2733 -2265 -2212 3334 2762 -2532 -1929 3319 2388 -2947 -1437 3681 1771 -2646 -1271 3113
3106C113j736l859J591L640j636l758J632L664j731l564J225L768j691l482J700
$$ 3113 1377 -2482 -891 2749 1113 -2645 -1013 2651 920 -2644 -1419 2349 658 -2824 -1124
3121a124L419j378l450Q48L630j206l503J113L901j593l684J727M112j891m205
$$ -1124 2295 917 -2533 -1685 1945 739 -2764 -1651 2250 657 -3027 -1300 2812 921 -3284
3136c284K317L934k205m112K409L958k449l764L182L322k834l150K751L137k897
$$ -3284 -967 2967 762 -3350 -941 3017 568 -3196 -14 3308 474 -2676 75 3212 315
3151C15l018L017K568k550k493K688K690l078k096K354K427k819j933K113K634
$$ 315 -2703 314 2882 332 -2161 527 3217 139 -1957 397 2824 5 -1928 185 2819
3166B819k711k478K255K713k528k688K336K848k670k618K317L248l195l040L057
$$ 2819 108 -2370 -115 2598 70 -2618 -282 2566 -104 -2722 -405 2843 -352 -3392 -335
3181c35L010l310k711L417K588l425k416L582K177l469k255L885J885l729j717
$$ -335 2675 -635 -3346 71 2659 -766 -3182 400 2577 -892 -3147 738 2623 -1106 -2823
3196b823M348J077l711j247L623J323l405j308L521P34l059p71L216Q24l238o95
$$ -2823 1525 2602 -1109 -2356 1267 2590 -815 -2123 1398 2132 -927 -1698 1518 2342 -896 -1591
3212a591K735J455l040j493K696J509k936j364K823J478l191j732L758J244l453
$$ -1591 1144 2599 -441 -1934 762 2271 -665 -2029 794 2272 -919 -2651 1107 2351 -1102
3227a102j214L537O76l348j153L643Q50l743m46L529M17l613k36L511L68l732
$$ -1102 -2316 1221 1897 -1451 -2604 1039 1889 -1854 -2300 1229 1646 -1967 -2203 1308 1676 -2056
3243b056j47L481P9l062l89L697j29l291K66L398n3l368K33L041l06k664M1L139
$$ -2056 -2203 1278 1357 -1705 -2094 1603 1474 -1817 -1551 1847 1794 -1574 -1341 1700 1394 -1270 -1229 1910
3261A910o1l145J49L101j89l044K14K944j37l158p1L456k83l180J70L176m80l232
$$ 1910 1849 -1296 -1147 1954 1765 -1279 -1065 1879 1742 -1416 -1487 1969 1686 -1494 -1324 1852 1372 -1860
3279a860N86K982m22l495P89L433r52l418J207L029j335l211J374L216j444l100
$$ -1860 -1274 1708 1286 -2209 -1420 2013 1061 -2357 -1150 1879 544 -2667 -1293 1923 479 -2621
3295b621J491K890j708k261J067K954j170k559J012K963j175k911J251K416r97
$$ -2621 -1130 1760 52 -2209 -1142 1812 642 -1917 -905 2058 883 -2028 -777 1639 642
3310F42k290J202K769j671k191J088K549j210k192J076K331j555j969J564J971
$$ 642 -1648 -446 2323 652 -1539 -451 2098 888 -1304 -228 2103 548 -1421 143 2114
3325B114j681j955J612K120j458k366J599J846j459k216J547K030j335k330J750
$$ 2114 433 -1522 90 2210 752 -1614 -15 1831 372 -1844 -297 1733 398 -1932 -182
3340a82K052k060j695J873J760k107j965K480J789k690j371K355J497k529j426
$$ -182 1870 -190 -1885 -12 1748 -359 -2324 156 1945 -745 -2116 239 1736 -793 -2219
3355b219K308J545k352j393K731R87k083j408K225J158k113j087K323J259k411
$$ -2219 89 1634 -718 -2111 620 1607 -476 -1884 341 1499 -614 -1701 622 1881 -530
3370e30j225K307J203j955j022J873J211k051j233J802J482j871j353K307J302
$$ -530 -1755 552 1755 -200 -1222 651 1862 -189 -1422 380 1862 -9 -1362 945 2247
3385B247k539j060K053J278k467j126K516Q44k341j424K731J021k965m66K471
$$ 2247 -292 -1352 701 1979 -488 -1614 902 1746 -595 -2019 712 1733 -1232 -1698 773
3400G73N78k523p95K723N99k958K21K284K18k563K33J942K94k245m07K472j18
$$ 773 1351 -1172 -1967 756 1355 -1603 -1382 902 1120 -1443 -1210 732 1026 -1219 -1626 846 728
3417G28j808k66K473j93j616n38K148L83k000l18J547J014k230l23K164N05k644
$$ 728 -1080 -1346 1127 934 -682 -1220 928 1311 -689 -1007 540 1554 -676 -999 1165 1670 -974
3434i74Q0K213J62k627R1K552K9k529n0K713l20k719M39K382k75k550M84K581
$$ -974 -894 1319 1481 -1146 -1055 1497 1526 -1003 -1053 1660 1340 -1379 -940 1442 1167 -1383 -899 1682
3452A682r85k162Q97K163j158j940R84J651r67j767J087J338r19j388R74J241
$$ 1682 697 -1465 -568 1595 437 -1503 -519 1132 165 -1602 -515 823 -96 -1484 -510 731
3468G31m28j465L10J471k55j372K37J897m90j576%K293m05j946M40K310q00j980
$$ 731 303 -1162 -852 619 364 -1008 -771 1126 636 -940 -940 1353 948 -998 -558 1752 952 -1028
3486a028M66K484q52k348R90K282j591j845J328J932j337j978J393K182j978j704
$$ -1028 -562 1922 1070 -1278 -288 1994 403 -1442 -114 1818 481 -1497 -104 2078 100 -1604
3502a604K042J209j531j482J246J241j287j222J578O56j159j044J171J109j272
$$ -1604 438 1647 116 -1366 -120 1121 -166 -1388 190 846 -313 -1357 -186 923 -349
3517c49j062J031Q92o44j047J039J068r78j360J297J046q90j310R47J438j105
$$ -349 -1411 -380 512 -132 -1179 -140 928 -50 -1410 -113 933 43 -1267 -320 1118 13
3533A3j349J299J545j607j286J546J178j326j349J778J104j960n88J870N48j815
$$ 13 -1336 -37 1508 -99 -1385 161 1339 13 -1336 442 1546 -414 -1002 868 1416 -399
3549c99j98J334M63j684r7J464L43j414o95J259L88j228k43J241J05q17p27J079
$$ -399 -597 737 1200 -484 -581 883 1226 -188 -883 376 764 -464 -707 534 639 -178 -905 174
3567A74Q47j124j381J642M90j097p37J244R70j514j099K219O21k089n60J837O05
$$ 174 1021 -103 -1484 158 648 -449 -1186 58 1028 -486 -1585 634 1255 -834 -1394 443 1048
3584A048k188Q4J823j97j779J63K006l38k079Q24J853k23k246R99J292m46q32
$$ 1048 -1140 -1056 767 570 -1209 -1046 960 622 -1457 -633 1220 997 -1249 -250 1042 596 -236
3601b36K06M54O1p63M7Q86j07o01m31J136J53j101j2J069J25j496l27J340O23
$$ -236 -30 424 485 -278 -231 655 548 -53 -484 652 805 -296 -308 761 886 -610 -937 403 1026
3620A026j638l78J442L89j960M71J661j99k144L83J586J39k130O52J701o92j969
$$ 1026 -612 -990 452 841 -1119 -648 1013 814 -1330 -947 639 778 -1352 -700 1001 309 -1660
3637a660J054J674j170j078R12J214j145q27P39J402p20j213Q48P80o60o50M65
$$ -1660 -606 1068 -102 -1180 -268 946 -199 -1026 -287 1115 395 -818 30 810 150 -500 -35
3654c5Q17m78n72q6J118k13q89L6J323m73j035J67J464l80j381K70J446k52j842
$$ -35 782 304 -268 -354 764 551 -338 -302 1021 548 -487 -320 1144 764 -617 -347 1099 847 -995
3673i95Q23J387j014j676J347J433j064j207M61J317j222q81J489P40j596n73
$$ -995 -172 1215 201 -1475 -128 1305 241 -966 -505 812 -410 -1291 198 938 -658 -1231
3689a231J242O23p89r10J151J61m26o27P51O69r42l43P75N62m68m06j09J049m70
$$ -1231 11 634 -155 -1065 86 247 -179 -806 -55 614 -328 -671 104 666 198 -208 -317 732 262
3708B62n29K63R46l54j379R78R81j086q03J296P58j196j105J171P21j008o79J349
$$ 262 -267 -4 942 588 -791 187 1168 82 -721 575 1333 137 -968 203 924 -84 -763 586
3726E86O84j947k56J685k25j221m56K005k57j033m64J488j33j022j68P23O53j125
$$ 586 1270 -677 -933 752 527 -694 -1150 855 598 -435 -899 589 456 -566 -734 -11 642 -483
3744d83k85N89L71q50j28P13O06r19j78M35P54q78n38Q70N12o33p93J046O42j244
$$ -483 -768 -179 192 -658 -786 -73 533 -386 -564 -129 625 -253 -791 79 591 -42 -835 211 853 -391
3764c91l40J361J45j064n60J128J096j712J02J353j24j575J52J584m26j542O45
$$ -391 -731 630 775 -289 -849 279 1375 -337 -235 1118 994 -581 -429 1155 729 -813 -168
3781a68P02j73j113O79R93o44p12J81P52m43l10q8L29L94o55q7L97j31p4o37Q86
$$ -168 534 361 -752 -73 920 276 -436 -255 497 54 -256 -344 -15 379 -276 -363 34 -97 -171 -808 78
3802G8J63j089Q9R22J91r97j75J019M33j111j78J191m1r33J53J060o51q93O30
$$ 78 241 -848 -759 163 354 -643 -818 201 634 -477 -655 536 495 -438 -285 775 124 -769 -139
3821a39J251r23q83P57P38l29r16N25J068r40q63P12Q46o17o67M00L29J17j065
$$ -139 1112 189 -694 63 801 472 -444 81 1149 209 -654 58 904 287 -380 20 349 466 -599
3840e99O14L97J78j215K46J301o82r13L15P19j38r58K01Q26j81j046M52Q42k97
$$ -599 15 412 590 -625 -379 922 240 -673 -358 361 223 -735 -534 292 111 -935 -483 359 62
3859F2q86N47P29q04n97O58R34j133m08J159L37n52q34Q87N18o10o25Q02N20m13
$$ 62 -824 -277 452 -352 -949 -291 643 -490 -898 261 598 46 -788 99 617 7 -618 184 704 291
3879B91o91N66N80p24l86N47N26l30r53J026J84m37l67K71N74o79n70M03Q01o83
$$ 291 -400 166 746 22 -364 183 709 379 -574 452 636 199 -168 103 677 -2 -572 -169 632 -51
3899e1o95Q25N81r69k39M65O70p69o17Q30M28q63l72O77O43r38k10O95J67m96
$$ -51 -746 79 660 -309 -548 -83 587 -182 -799 31 459 -404 -776 -99 544 -394 -604 91 258 -238
3919b38q3M26L76j006j0Q88Q5p12m0J94Q85n64m01M92K71m89m01O05M39m55p17
$$ -238 -321 105 481 -525 -535 353 438 -274 -314 -120 765 201 -200 292 563 74 -327 278 717 262 -455
3940d55Q23L88q15m23P24M48p75l61J104J35o38o11J083J13r82O7P78m05p52m54
$$ -455 368 756 -59 -482 242 690 -85 -446 658 793 155 -456 627 740 -242 -175 603 198 -554 -1008
3960a008J358J95j057J78N71J78j030J30Q04O7r96J23P28o5p47K38O83n0o12k1
$$ -1008 350 545 -512 -334 237 415 -615 -485 319 386 -610 -487 241 176 -571 -333 350 300 -312 -333
3980c33M63Q8m90K11L45K23o11m02O65M08r90J70P29K22q21j28Q33k44q39M09
$$ -333 130 218 -272 -61 284 507 -104 -506 159 567 -423 -253 476 698 -123 -251 582 338 -501 -92
4000i2J120n98o26L6Q47k97q88M02P47n03o00L87N82j75p84J02Q07k86l51N7K52
$$ -92 1028 430 -196 -160 687 390 -498 -96 651 148 -452 -65 517 342 -442 -340 467 181 -170 -113 139
4021A39k99m55M37N53j86q69N48J25L30q94k7J086k13q43K99P60j67p21k21Q55
$$ 139 -160 -615 -178 375 189 -680 -132 -7 323 -571 -598 488 275 -568 -269 491 324 -397 -618 237
4041B37l18m94M75Q16j85n46K21L52k17o19K92Q15m52o95J99P35k21n83O43L01
$$ 237 -81 -575 -100 716 531 -15 206 558 341 -278 14 829 377 -318 -119 616 395 -188 455 756
4061G56r29j5K36K46m20R1M14k64l5k27L73M16o95m81M74J19m08k93M06L43n35
$$ 756 -173 -188 48 294 -126 -35 379 115 80 -147 226 642 -53 -534 -60 59 -349 -642 -236 107 -428
4082d28l40L90O45o84j48J16Q58n29o36N51N21l65n44N15K59q4k07J44L97k58
$$ -428 -768 -378 267 -417 -565 -449 409 -120 -756 -205 316 -49 -593 -78 181 97 -110 34 431 173
4102A73o48P26j03j32m89O92L72m13m61P55K48q94j1O54m7p50K44J83M08n34K08
$$ 173 -475 251 148 16 -473 219 591 178 -283 472 720 -174 -185 469 422 -328 -84 99 507 -27 181
4123A81J14M64r15n80Q70M6m33p3N33nm93m17Q05K97p67k24M56L00l66l83L07
$$ 181 295 759 -156 -736 134 180 -253 -326 207 202 -291 -708 97 394 -373 -597 -141 159 -207 -590 -283
4144b83L13m38l48P09L06p51K29M13k9k48l33Q67K70r73K92L82L31p68R4M64l7
$$ -283 30 -408 -756 -47 259 -492 -263 150 121 -127 -460 407 677 -296 -4 378 709 -59 35 499 462
4165D62p58M55L92J20p86lO83Q1m99j06L59n5n63J0M89k25Mk04N02k37m77K55
$$ 462 -296 159 551 671 -115 -118 565 646 147 41 400 345 -218 -208 281 56 60 -144 358 121 -356 -101
4187a01K01n9m55j87P36j42l18L47j26K18o47M0L98J98m83J2K04M33n45q7L34
$$ -101 100 41 -414 -601 135 -7 -325 22 -104 114 -533 -493 -95 103 -380 -368 -164 269 -276 -363 -29
4208b9L11n23j38P32k57m34J37Q58n8r81j12J080l18k48k65P96J7n59J01K71j36
$$ -29 282 -241 -379 353 96 -338 -201 657 599 -382 -494 586 268 20 -245 551 568 9 110 381 245
4229B45l34L52J15k03m73J28M86J1n18P0O72p72m03J34P68j06r48N01N21m07l82
$$ 245 -89 263 378 175 -298 -170 316 327 -191 -121 551 -221 -624 -490 278 172 -776 -275 246 -161 -543
4250e43K78M04k39m97L33N91k86m36p5Q41n26J4K36J76j62n14K32J65l5l31K63
$$ -543 -265 139 -100 -597 -264 327 41 -395 -470 371 -155 -141 95 271 109 -405 -173 -8 -43 -374 -111
4271a11J90L42l12M6N85k90o45K50L00m3k81k0M43k19m44K52N46l15o11N86L85
$$ -111 79 421 109 155 740 450 -195 55 355 312 31 11 454 235 -209 43 589 274 -337 249 634
4292F34o11n27P33Pl89k40L45N21o86k08P14n7n76p7K18N88m80p26R07R3l29m23
$$ 634 23 -504 229 236 -153 -393 -48 473 -213 -421 293 236 -340 -417 -199 389 -91 -817 90 183 -146 -569
4314e69L99L00n45O4L58K83m52j77N24kj12k8l34J95O9k4l7L73k3j08%L08l22
$$ -569 -170 130 -415 -351 7 290 -162 -339 185 183 71 43 -291 -96 -27 -51 -88 285 262 154 154 462 140
4337A40n05P28J07j05n84L93M91o70j07K14K60n63j7K08L58p40J09P88j93o18
$$ 140 -365 363 470 365 -219 174 665 -5 -112 102 362 -201 -218 -10 348 -392 -283 505 312 -306
4357c06K8M37J02o98j38N90K15l95k06N32J27n98k8K33N61p96J76N5L15k72k49
$$ -306 -278 159 261 -437 -575 15 230 -165 -371 161 288 -310 -338 -105 456 -340 -164 -109 206 -66 -315
4378c15O09J40l65m03P90J93o74l81L21L32m01k53O29j4j45m9P91m22m51O2N07
$$ -315 294 434 69 -334 456 649 -25 -406 -85 247 -154 -407 222 208 63 14 805 383 -68 -6 501
4399E01j04p51N24K21j34l35l34P33j81l41J03L60R6o65j13N93J02m07K0J53K49
$$ 501 397 -354 170 391 257 -78 -412 321 140 -201 -98 262 358 -307 -420 173 275 -132 -112 41 290
4420B90n43k18O47P8k18k44M93k03o34K63O25m05k40kQ20k78n33L27K99J11n37
$$ 290 -253 -471 176 254 36 -208 285 82 -552 -289 336 -69 -309 -311 509 231 -302 25 324 435 -102
4441a02J51L37k27m08L86M78n32l10J67N27l00k54J77M87j78o46M56N8k56k35
$$ -102 49 386 159 -249 137 615 83 -227 -60 467 167 -87 90 577 399 -247 209 267 11 -224
4461b24M03J5K2n71N3L41L66o63K26LJ07p35L09O75m57m62J93M79l08j54P6P41
$$ -224 179 194 216 -355 -302 39 405 -258 -32 -29 78 -657 -348 327 -130 -592 -399 80 -228 -382 -306 435
4483D35m07m79L98L08l19m56N31L93l17o08O36L3M9o05N32L37l32k44K83Q4J36
$$ 435 28 -451 -53 255 -64 -520 11 404 87 -521 115 148 197 -408 124 461 129 -115 168 252 388
4504C88m67J11O02k25n26J44N07k70m26K65L81l59m01L64O71q04o27M32K44o8
$$ 388 -79 32 634 409 -117 27 534 264 -162 103 484 125 -276 88 759 -45 -672 -240 4 -64
4524f4l38K49K68k02p45P00N01o04o56O59L28m8o80Q28K29o01j80L02L63o21l34
$$ -64 -402 -153 115 -87 -832 -132 369 -235 -891 -232 96 48 -632 196 425 -176 -356 -54 309 -312 -646
4545f46P47K84m72P1K62J17l99k54N07N02n23k13l3O17k29o53N25N05o25l93M33
$$ -646 101 385 -87 -16 246 363 -36 -290 217 719 196 -17 -50 567 338 -315 210 715 90 -303 130
4566A30P3l47P7K22M71n27l95K23J78k73k77P67j5p01L4M18K29o48J41O30k86
$$ 130 203 -144 -67 155 626 99 -296 -73 105 -168 -445 322 307 -394 -360 58 287 -361 -220 410 124
4587A24m34j12K89K63l66j2M15j89m72J73J83M95q47K46N95k46k15l26P19k59
$$ 124 -310 -422 -133 130 -236 -248 167 -22 -494 -321 -138 357 -490 -244 351 105 -110 -436 283 24
4607B4r8l10N39O6o0k74L23K30p16K06L47K36p43N2N35J31p79l6P88r9p41J03
$$ 24 -74 -384 155 221 161 -113 210 440 -276 -70 277 513 -230 -178 357 488 -291 -327 461 362 -379 -276
4629b76N81o5l04j61P06l8q08k9O23p6n08J47K72j00l94j06O90K00j004J13R33
$$ -276 305 240 -64 -225 481 443 -365 -394 229 153 -355 -208 64 -36 -430 -536 154 354 -650 -537 396
4650C96k12j58l17N51m4l65k57N33m6k45K50K63j7n84J62P88k36o29n1M28K06
$$ 396 184 26 -291 260 216 -149 -406 127 81 -164 86 349 332 -252 -90 698 462 -167 -218 210 416
4671D16j104N90M48k93k73K11N51j58n95L77J68J16o07J79L37k11o92M17N88j57
$$ 416 -688 -98 350 57 -216 -5 546 388 -207 170 338 454 -153 26 363 152 -540 -123 465 308
4691C08p85N31K12k7p11K43M89m56l91M27O22m48l70J57P70o03l84J06O06j89
$$ 308 -477 54 266 239 -472 -229 260 -196 -587 -160 462 14 -356 -199 571 -32 -416 -310 296 107
4711A07n60O21K51l59o42N67K09j72m74P65K36m38k61M12r7j65l53O40M15n18
$$ 107 -453 168 419 60 -582 -15 194 22 -452 313 549 111 -150 262 165 0 -353 287 702 184
4731A84n66N32N30m24o26O91J44m60m15J47P37n35l98O59J54k81o24O45m6k62
$$ 184 -382 150 680 256 -370 321 465 5 -410 -263 474 -61 -459 200 354 73 -551 94 48 -214
4751b14k48N96L35r34k1N30M34n66l69N01M32n08m87O49l0n10j76P72J49o13p7
$$ -214 -462 134 469 -465 -486 44 478 -88 -457 44 476 -32 -519 130 100 -410 -586 186 335 -278 -355
4772c55O86M10q28j66L23L21j72n54N76M04r19j61O99K04K2n73N22J82n49k06
$$ -355 331 741 -87 -253 70 391 219 -335 241 645 -274 -435 264 468 490 -83 439 621 72 -134
4792a34M80K24n49l11M62M20p58m61R50J17n87k39N04J69n53l54P83K06q80M7
$$ -134 346 570 21 -290 172 592 -166 -627 323 440 -147 -386 118 287 -266 -620 163 369 -511 -464
4812d64O62L3o79j07O71j75m24J18N57Q3q23j55R16J13p86L59P52p0r51k27J086
$$ -464 198 231 -448 -555 116 -59 -483 -365 192 275 -548 -703 213 326 -460 -101 651 581 -370 -597 489
4833D89m78k27J93L76l0m77q2R11m40l48nM48N8o95r0M52L59m71r7N26l2p70M19
$$ 489 11 -216 -23 353 323 -154 -236 675 235 -113 -118 330 388 -307 -397 55 414 -57 -154 372 340 -430 -11
4856a1K44j44m19J59M44K26j204M78N53j17p68L12N80o19k38m2Q19m59j08o2M43
$$ -11 233 89 -330 -171 273 499 -705 -227 326 209 -559 -247 333 -286 -524 -566 253 -206 -314 -376 67
4877F7j17n47L74N33k08q02M63P56m61m93L88M56J14p27K61N44l97o37L23P71
$$ 67 -50 -597 -223 310 102 -700 -237 519 58 -435 -47 409 523 -204 57 601 204 -433 -110 661
4897F61k48q45M85M37l94n75P54Q8j7l54j44Q33r24l32P75R7n7l17l34J063n21
$$ 661 413 -432 53 490 96 -479 275 363 346 -8 -152 681 -243 -575 200 297 240 -77 -411 652 131
4918A31o48L35N60j25j022P18L02k38l25M08K74k13p92M14L84k6o83L51M95m51
$$ 131 -517 -182 378 253 -769 -51 251 13 -312 96 370 157 -635 -221 163 137 -546 -195 300 -151
4938a51j18J77L45k43l39L68N71n99l58N22M33n03m42L76P11o51m67N98K34l54
$$ -151 -269 -92 253 10 -329 39 610 11 -347 175 608 105 -337 39 750 99 -368 230 464 110
4958A10l35L41K74n10m2K87J19l48j22K99N02p26l06O60M42o81l89O20Lm68l21
$$ 110 -225 116 390 -120 -162 125 244 -104 -226 73 575 -151 -457 203 645 -36 -425 195 198 -270 -591
4979e91Q01M0n63k57P15J01o33k02N36J90l88r8L69L29r29K32K06M84o34O3L37
$$ -591 210 250 -313 -570 145 246 -387 -589 -53 137 -251 -349 20 349 -580 -348 -142 342 -292 -229 108
5000A08K54n33p4L84L70n98j16M39M42o92k98O28O0j64n83O18K8p1m73Q17k7p09
$$ 108 362 -171 -245 139 509 -89 -205 234 676 -16 -314 314 374 210 -373 245 273 202 -271 546 519 -190
5022a90o6Q74j76q13J44O26k79n31k5N36p3o54K41O90J38p59N0M29Qq97L61K79
$$ -190 -256 618 442 -371 -227 399 120 -411 -436 100 27 -627 -386 304 442 -317 -267 162 170 -727 -366 -87
5044h7M22q96M47L30o3n30LQ43k80p54j52R35K98p10k18P80L8o67L4Q08k8p48
$$ -87 335 -561 -114 216 153 -377 -374 469 189 -565 -717 218 516 -194 -412 368 406 -261 -227 581 553 -195
5066a95m1Q90k0p80r7P14j22n44J87J68k7n52M01M25Q6r11L65P64m42j095O92
$$ -195 -236 654 634 -146 -243 471 349 -195 -8 160 133 -419 -18 407 493 -418 -53 711 269 -826 -134
5087a34M01j03o23K61P71l75p42L56L85o5m97K29L25k16n27N03M02j21o82L3N26
$$ -134 267 164 -459 -198 573 198 -544 -188 197 132 -365 -136 189 -27 -554 -51 351 230 -452 -419 107
5108A07l17m7J69L62j97n12M46N31k54o80M23M11k61o71O26M15r55j21O47N30
$$ 107 -210 -257 -88 274 77 -435 11 542 288 -392 31 442 181 -490 136 551 -404 -525 122 652
5128F52m35l56J60L23k52n68N20N33l01n08L94J78j57o35L51M52k76o39J71O30
$$ 652 217 -139 21 344 92 -476 44 577 276 -232 162 340 183 -452 -101 351 75 -564 -393 237
5148B37l36k58o2Q37n71l82J59N35k66l39M79K46m38l7J34o4N6j40L19K70m26
$$ 237 -99 -357 -419 418 -153 -535 -376 159 -107 -446 33 279 -159 -196 -62 -126 -70 -210 109 379 -47
5169d7l33M88L16p08P4O41K3k89p34P74J47k47l03O68k5m80q05J051L6n01J14
$$ -47 -380 108 424 -284 -210 431 454 165 -569 205 352 105 -198 470 445 -35 -840 211 247 -254 -140
5190a40M90j91k51j33L76L61p85k81Q45Pn33j49M85J71l81l38N23J85n72n0M43
$$ -140 350 159 -92 -225 151 512 -273 -554 291 298 -235 -384 101 272 -109 -447 76 261 -311 -361 82
5211H2K37m54l94O28j30j65j63P84Pq26K0P07k8n68J85M12M9n41j77N42Q0n33
$$ 82 319 -135 -529 99 -31 -196 -359 425 432 -394 -374 333 305 -263 -78 334 383 -158 -335 207 287 -246
5233b46p8Q03j34n46N1M79J03q18K29M68k25j73k41N91K95q36L3K89K00l84j28
$$ -246 -324 479 345 -201 -150 329 432 -386 -157 311 86 -87 -328 263 558 -278 -245 44 244 -140 -268
5254b68O74j11o33kO85k31q38L61O18J8n11J3O38k81m76O1M83L4q87L15P48l10
$$ -268 406 295 -338 -340 345 114 -724 -363 255 273 -238 -225 413 132 -344 -283 200 234 -653 -338 410 100
5276A00q25N87N04l53j06k05R66l79o99K69L59K54p09L21L33k26m05K39M78n2
$$ 100 -725 -138 366 13 -93 -298 668 289 -410 -141 218 472 -237 84 417 191 -214 25 503 451
5296D51n78KM46r5m78K44L20m09l54M02M93n47l12M43J33J7o89O34K12l79o47
$$ 451 -127 -125 321 226 -252 -8 312 -97 -451 -49 444 -103 -415 28 161 178 -511 123 335 -44 -691
5317f91M37O44n54k43K91J85l42rQ6K44l8j40K35k4k00l93M72K64K5n89L11N43
$$ -691 -254 390 -164 -407 -116 69 -273 -282 -196 48 10 -130 105 81 -119 -512 -40 224 249 -340 -29 514
5339E14k76p01M26J92Q4o36K73N95l77m04M79L41m43k59K79L50l72m44P50L05
$$ 514 238 -463 -37 155 239 -397 -124 471 94 -310 169 510 67 -192 87 437 65 -379 371 676
5359F76r90J31K25K62l39n44P62L84n64m52M27L39m84k23P25K39q45p9N05%m64
$$ 676 -314 -183 42 304 -35 -579 183 567 3 -449 -22 317 -167 -390 335 574 -271 -350 155 155 -309
5380c09j09L13M04o10k92K96O12m98o0K95M14m48l69M55K20k87n1J74M37j071
$$ -309 -418 -105 299 -311 -603 -307 305 -193 -253 42 456 8 -361 94 314 27 -24 150 587 -484
5400d84L66M67M42p55l59Q54o5n67k65N54N68j167Q0O75P9p14RL97K08o42J57
$$ -484 -118 349 791 36 -323 531 466 -101 -366 188 756 -411 -331 344 423 -291 -282 115 323 -319 -162
5421a62J25M32n11m90O47j1l08p0N42K03m89m35M21K8j14j17N16r6o23R5N22K27
$$ -162 -37 395 -116 -606 41 30 -278 -348 194 397 -92 -527 -106 -78 -192 -309 207 111 -512 -417 105 332
5443C32n44p3M13J38j76m62N55L6n61L08kL39m07j39P43k28l66j26L30K26o55
$$ 332 -212 -285 128 266 90 -372 183 219 -342 -34 -36 303 -104 -243 500 272 -94 -220 110 336 -319
5464c19j4O36K6l97r3N73m42m00M01J94J28o96L48K65Jk08m25Q08l20n44M01K54
$$ -319 -333 303 329 -68 -161 412 -30 -430 -29 165 293 -403 -55 210 211 3 -422 386 66 -478 -77 177
5486A77j65k98J95N59m12o02M35K80j43m81M33L31m35l9jL38r8l82j22R43k04
$$ 177 12 -286 -91 468 56 -546 -111 169 26 -455 -22 309 -126 -165 -166 172 74 -308 -430 513 309
5507C09o30k26R99k65n47L8J001n55o86N28N65l2p80J25M56N9q40K92O52k31l59
$$ 309 -321 -547 452 187 -360 -322 679 124 -562 -34 531 499 -281 -156 300 359 -481 -189 463 232 -127
5528a27N8L54j18n15L69M59m61l44L03L54l00l52L18J30k31l02L31R9m0n06L50
$$ -127 -69 285 167 -348 21 480 19 -325 -22 332 32 -320 -2 128 -103 -405 -74 25 -15 -521 -171
5549a71O31n11l93L17L88l24l73K95L87j61l98L14L22m00j31J94L52j47j25J59
$$ -171 460 -51 -444 -127 261 -63 -436 -141 246 85 -313 1 323 -77 -208 -14 338 191 66 225
5569B25o1l88Lj52R42o36L5j4K75k5n45M52jk37l54O69L36l81m14J33K75k10p6
$$ 225 164 -224 -221 -373 569 -67 -32 -46 229 204 -341 111 110 -127 -481 188 524 143 -271 -138 137 -73 -149
5592a49L49j14o8l43L76J17Pn04K58J94K5q34N41L25m40k66P08P4n32J94J73K67
$$ -149 200 86 18 -325 51 168 175 -329 -71 123 148 -686 -145 180 -260 -526 182 256 -276 -82 91 358
5614C58o68j36N63J76l41m43P09L0k14j31L99j35l07M0L89j21j01j60j36N15k83
$$ 358 -310 -446 117 293 -48 -491 218 248 34 -97 302 167 -140 -100 289 168 67 -93 -229 286 3
5635CJ9Q8l8j32p8J54L42l32j41K34J63l59j11N17j22m6n35J98M51n68p8M78L88
$$ 3 22 110 72 -60 -138 16 358 26 -115 119 282 -77 -188 329 207 161 -374 -176 275 -293 -371 107 495
5658D95o69M2M79j68k97k24L24P8l73J17M82k21j34j03O55m62k53K84J38K89o70
$$ 495 -174 -132 347 179 -118 -342 -18 60 -313 -196 286 65 -69 -172 483 21 -232 52 190 479 -191
5679a91j06M98J6m24j87O82r8q0M6K85m35k53K12M40O6r14L20J73L73o91K30L46
$$ -191 -297 201 217 -207 -394 288 190 110 156 441 6 -247 -35 405 471 -443 -123 50 423 -268 -38 308
5701C08j66m13k05O10k98j3k4J23L92k12k74K23P1n48J57K22K81o58J28J53K60
$$ 308 142 -271 -476 134 -164 -177 -201 -78 314 102 -172 51 122 -426 -269 -47 234 -424 -296 -143 117
5722A17o9l10K91J41l65J36Q4K79o78N78p2P4o39K21K19J16m06J06L87J22m01
$$ 117 48 -262 29 170 -195 -59 25 304 -374 204 132 206 -433 -212 7 123 -283 -177 210 332 -69
5743f9J37L59l20k79J97L24m54L3NO70m62l57j1O01j23n79J23M29k74j80J88L27
$$ -69 68 427 107 -172 25 349 -105 -72 -67 603 141 -216 -227 374 251 -328 -205 224 -50 -230 -42 285
5765B85J7m49J40j94Q3M4N9j73M47k28N1q0K58k78l6K62k76j32K17L08l66l01
$$ 285 302 -147 -7 -201 -118 -74 -15 -188 259 31 82 2 260 -18 -54 208 -68 -200 17 325 -41 -342
5787c42K5M39m7m26L88L84m61kM6J74k1l79K53M22l46j32J57Qo3m20K28O37n51
$$ -342 -317 122 75 -351 37 421 -40 -42 4 178 157 -222 31 453 107 -25 132 140 77 -343 -115 522 -29
5810b9j17L61J43k68l49J40K48m58K0K10K88n63j01L62M32m08j08J91K37l33k42
$$ -29 -146 215 358 90 -259 -119 129 -329 -309 -99 189 -374 -475 -113 319 -89 -197 -6 231 -102 -344
5831c44N94n35K73l89J66L06m7l86L93K08k87Po1K49m57K35L1l5j54KN46J12k13
$$ -344 250 -285 -12 -401 -235 71 24 -362 31 239 -48 -41 -102 147 -310 -75 -44 -79 -233 -231 315 427 214
5854B14m22K98J85l78m0L34o9r0%l5K4L3k62M83J19n54l74M39j28kk53N29L3l43
$$ 214 -208 90 275 -103 -143 191 122 32 32 -3 21 54 -208 275 394 -160 -534 -95 -223 -225 -478 51 84 -259
5878b59pJ27L06j92k47L12M44m20m39L28O0l21k74O64o5k03l0J10L39l62j10M99
$$ -259 -266 -139 167 -25 -272 40 484 64 -375 -47 13 -308 -582 82 17 -186 -216 -106 233 -129 -239 260
5900B60p7l50P1J82N2j67j67L44L16k06k78K32l8n34K01K36P2j67J98j03j37l52
$$ 260 183 -167 -96 86 138 -29 -196 148 464 258 -20 212 174 -360 -159 77 149 -18 180 77 -60 -412
5922d12L25J97M50q21J47J25j02m51P3P14R1m47O2K27J78o67LN92j94m71J39K20
$$ -412 -87 110 560 -261 -114 11 -91 -542 -469 245 336 -111 -49 178 356 -311 -308 284 90 -381 -242 -22
5944b2%j51j27L96q0j27J12k1J44J43m52M70q2m82K85N90k64m62Q7M10k11k56
$$ -22 -22 -173 -300 96 16 -111 1 -20 124 267 -185 285 203 -279 6 596 332 -130 -43 367 156 -100
5966a00j09N44J15p43L15J08j3l02L9K90o7K7j86M68l80N1j39L50l20K2k7K41
$$ -100 -209 335 450 -293 22 130 117 -185 -146 144 77 104 -82 386 6 57 -82 268 -52 -30 -57 184
5988A84J00n07J17K57m8n60L70L52j95k04k7m5L52n11K54j79M74p14M54L59J01
$$ 184 284 -223 -106 151 103 -457 -87 265 70 -134 -161 -206 146 -365 -111 -290 184 -530 -76 283 384
6009C84o65K20L76Jo35K16N36l77Q7j12Q8j96l01L00M14k83k93J15K20J13m00
$$ 384 -281 -61 315 316 -319 -103 433 56 143 31 119 -77 -378 -78 336 53 -240 -125 95 208 -192
6030a92L84J92n19k11L11J49K10k92k32M41k03l80L29K3J6l75K28K06Q9l94Q5
$$ -192 192 384 -135 -346 -35 114 324 32 -200 241 38 -342 -13 10 26 -349 -121 85 174 -220 -135
6051a35K92k55l44L58rK26l31K51L6L5l34j66O65m51k46M45J87k67l74L19K86
$$ -135 157 -98 -442 -84 -93 133 -198 53 89 124 -210 -376 289 -162 -408 37 224 -43 -417 -98 188
6072A88j70j73p7L25K02o0n28L96o1k32N94K87n39l24J15L70j84l00J99J79m6
$$ 188 18 -155 -232 93 295 235 -293 103 42 -190 404 691 152 -172 -57 313 129 -171 28 207 161
6093A61n45M38M68m28l73L53M38n31j77J15L79l24n39M76M09l31k59K53K7l6l5
$$ 161 -384 54 522 94 -279 74 512 -19 -196 -81 298 -26 -565 -89 320 -11 -270 -17 10 -26 -61
6114f1K6L70j46n21N67p6l47k94N72j07Q4l02L60J18k85k10M26M5j18l51L58j23
$$ -61 -35 335 189 -332 235 159 -188 -482 90 -17 67 -235 125 243 -42 -252 174 219 101 -250 108 -15
6136a5M1L5K16R8k52j14O2K63j39k78N0K41k70p4L65j73l69J8O05j21k39l21N55
$$ -15 26 61 277 375 123 9 71 334 195 -83 -33 208 -62 -136 229 56 -313 -295 310 189 -50 -371 184
6159A84R1n98R3J37j35R8j1O1M39n89J71K57j70j48k97O22j64j06nK15l7l05P1
$$ 184 275 -323 -230 -93 -228 -130 -141 -80 359 -230 -59 198 28 -120 -417 205 41 -65 -70 145 108 -197 -126
6182a26M87k01m55mM76L22o41K18n2L92l99j94J09L31l49q7J8K71Ml01L55M5m79
$$ -126 361 160 -295 -299 177 499 -142 76 24 416 17 -177 -68 263 -86 -173 -155 116 120 -181 174 219 -260
6205b60J10K26r4K8l78M57k42j91N6M69N1n22m4L33J42l15J36L83l08l25L69j27
$$ -260 -150 76 -18 10 -368 89 -153 -344 -288 181 232 -290 -334 -1 141 -174 -38 345 37 -288 81 -46
6227d6M29q59J30N70l82k1q3M37J93q09K28L52L15m92p1M64k07k11j07K91J65
$$ -46 383 -476 -346 224 -158 -179 -262 175 368 -441 -213 139 454 -38 -109 355 148 -63 -170 121 286
6248B86p04N5N65J87n21j70N25j67k99J05Q1k07j70K62L03k18j58J63L80l02k69
$$ 286 -418 -363 202 389 -132 -302 223 56 -243 -138 -57 -264 -434 -172 131 -87 -245 -82 298 -4 -273
6269b73O3J05L04j88j57M85k50j54N3K80j98k80K10j99R9K5K30j59L83m84J76
$$ -273 -210 -105 199 11 -146 339 89 -65 -12 268 70 -210 0 -199 -100 -75 155 -4 379 -105 71
6290G1N5J27l42q1K60j00m74J73L15K62n23L63l3K12m41N5O12m08m99L1N37l55
$$ 71 126 253 -89 -170 90 -10 -484 -311 4 266 -257 106 73 285 -156 -101 511 103 -396 -365 172 -183
6312a83M6L71o1l10k52K85L21k48l12K03L30j93m97O11K75m21k84K68L51l71l45
$$ -183 -137 234 173 -137 -389 -104 217 -31 -343 -140 190 -3 -500 111 386 -35 -319 -51 300 -71 -416
6333d16K18M01k03k72K17K82j14k64J21QK1l53L47O2j28K8J87L6j00k59L90Q9
$$ -416 -198 203 0 -272 -55 227 113 -151 -30 -22 -1 -354 -7 55 -73 -45 142 178 78 -181 209 298
6355B98r4j87K50j31k24k99M29L68m58l99N44K35n84m4K30K77m80pL40j47J57
$$ 298 204 17 267 136 -88 -387 42 410 -48 -447 97 332 -252 -296 -66 211 -269 -276 64 -83 74
6376G4m78K57M07j03o63M75M52o82M4M35l37R8l43O45J71p32n0K55J89k83m11
$$ 74 -404 -147 260 157 -506 -31 421 -261 -217 218 -119 -21 -364 281 452 -280 -330 -75 114 -169 -580
6397e80O82K37l60l15P22L8o78L74n3K23n52M3K59P9l75p3P27l51j43K69j53L39
$$ -580 102 339 -21 -336 386 424 -254 120 67 290 -262 -219 40 119 -256 -329 398 47 -96 173 20 359
6419C59m76j77N32K59p99J05K61jq1m8L04R5l10l4L42Lp42q4O72J88o14j60L85
$$ 359 -117 -294 238 497 -302 -197 64 63 -18 -66 238 333 23 -11 331 334 -408 -492 180 368 -246 -406 -21
6442b1J12k26N9k4N47o56m30N24L43n93N7O14L8o33K56Q3k07j6p5O86n43j97K39
$$ -21 91 -135 -76 -100 447 -209 -639 -115 228 -365 -308 306 344 -289 -33 50 -157 -173 -248 438 -105 -302 -63
6465f3J32q4r3o3L97r4m57K35K20K50n27Q3N49k60j09k19L86j45l05m2M23o1m6
$$ -63 69 -15 -108 -171 226 132 -325 -90 130 380 -147 -64 485 225 116 -103 283 138 -167 -209 214 153 107
6488A07k52N16k47p16M92L02K12q65J16L11K90n18J26J91N8m44M40Q8l10k53M17
$$ 107 -145 371 124 -592 -100 202 414 -451 -335 -24 266 -252 -126 65 123 -321 119 207 -103 -356 61
6509F1M8J5n24J32O56l30p06N72M01r7m61J93N62r6q15M58J66m9l69J06M18j69
$$ 61 109 124 -400 -268 388 58 -648 -76 325 228 -233 -40 522 426 -389 69 235 186 -183 -77 341 172
6531A72m27L89L43k40m48n0N33j57l84K99K25k28k73J66K67l69M4K10l2k3l58
$$ 172 -255 134 477 237 -211 -261 272 115 -269 30 255 27 -246 -80 187 -182 -138 72 40 17 -341
6552c41L40L84n10r6K93K61m73N7r5J83j1k68J15L58j45k31O26k42j08k91P0M00
$$ -341 -1 383 -127 -223 70 331 -142 -85 -180 3 -8 -276 -161 197 52 -179 447 205 97 -194 -124 276
6574B76j71l32J32M10m81O3L1K68l93j60M32N00p23j10N41K20m16l66M90j2l06
$$ 276 105 -227 -95 315 -166 -103 -72 196 -197 -357 75 575 -148 -258 283 503 87 -279 211 199 -107
6595a07J2J26N32o02l51P12q4p16j39J069m44k71K8J16N92m68k05N37j78m73j29
$$ -107 -95 31 563 -39 -390 322 238 -478 -617 452 8 -263 -235 -119 473 5 -200 337 159 -314 -443
6616d43N77J3j64m38M15K2k4l04P66j18n77K04N2L19m00n3L06J43l42M5K01J93
$$ -443 134 147 -17 -455 -40 -18 -42 -346 420 302 -275 -71 -19 300 -100 -153 153 296 -46 -1 200 393
6638C93l83k97M79J80o61R7N05Mm80J03M83j07m33l44Q35k1p58J19N92p5n51j51
$$ 393 10 -287 192 372 -289 -192 313 317 -163 -60 423 316 -117 -461 374 353 -405 -286 306 231 -320 -471
6660d71P74m17l19LQ59j76o78o1Q14o0p55J26N88M0n69j88M83Q9n59J1O55K7m09
$$ -471 303 -114 -433 -430 429 253 -425 -486 328 268 -487 -361 227 267 -302 -490 -7 82 -477 -466 189 216 -193
6683a93Q9M64l53k30l52P39L69p24J2L41K18o47L0O02j43k10o7L51k34m39K57
$$ -193 -104 360 7 -223 -575 164 533 -191 -179 162 380 -267 -237 365 222 12 -55 296 62 -377 -120
6704a20P79n74k31m6O94k50o10K55L69k1m83K12M37q6p99N11K44m5l37j27M62
$$ -120 659 85 -146 -192 502 252 -358 -103 266 245 -238 -26 411 325 -474 37 281 236 -101 -228 234
6725B34j63m99M50K4L46p58M95L05k49n92J38N99k29m68K70N52k56o31P35M4l36
$$ 234 71 -428 22 46 392 -366 129 434 185 -407 -269 330 101 -367 -97 455 199 -432 303 347 11
6746A1n82L77N73m34j62K16L60n80j41O78O0l25m35M78K84l43m48L19L45n51O
$$ 11 -571 -194 379 -55 -217 -1 359 -221 -362 316 376 51 -384 94 378 35 -413 -94 251 -300 -294
6767b94Q8N57k69o28M73L85l12m04P54k21j37j09j60M72l95o8J38J27P2n76L84
$$ -294 -206 351 82 -546 -73 312 0 -404 350 129 -8 -117 -277 195 -200 -268 -130 -3 69 -507 -123
6788a23K95M4o87L13K46k81j83K71M85l03l40K35M35l55k50K82M23l72n58M87
$$ -123 172 216 -471 -158 88 -193 -376 -105 380 77 -263 -28 407 52 -198 84 507 135 -423 64
6808F4M11n63k65Q38j3l81j82K36L59q29k0L89J28j04l33M61J53m80j16M2O07
$$ 64 475 -88 -353 485 472 91 -91 145 504 -325 -345 44 172 68 -265 196 349 -131 -247 -205 402
6829D02n75m8M07J97n02l49M36M98o12p6N97j14l72l74P49N7o47J1N27k12n72
$$ 402 -173 -221 186 383 -119 -468 -32 466 -146 -222 375 261 -111 -485 264 321 -326 -315 212 0 -572
6850e72M45M51j36m77l27R62m58j14j92N30ql00R9K86M22q75J9N57K88p61j68
$$ -572 -127 324 188 -289 -616 346 -112 -226 -418 112 104 -196 -97 189 611 -264 -245 312 600 -161 -329
6871c29O64j40m74K29J97K2k43QJ00m0j86N5L46J64o20N8L74L1m63M1M46Qp62
$$ -329 335 195 -279 -50 147 169 -74 -66 34 -6 -192 -137 209 373 -247 -189 185 216 -247 -206 240 248 -514
6894e14K78O05k16q60K56R26k78m65J02L78j27m75K49N44m61k86L9P29l85m22
$$ -514 -236 369 153 -707 -451 475 197 -268 -166 212 85 -390 -141 403 -58 -344 -305 424 39 -383
6914c83L94L11k35k31N9L44J01o66J71P85o36k56L27K67m09k46k3O13N1n40J45
$$ -383 11 322 87 -144 -85 259 360 -306 -135 650 14 -242 85 352 -57 -303 -326 287 338 -202 -57
6935e7M46l5o91N41J48k75m45P9M14J20m71K01J80J38q85N33J32L22m37l2J41
$$ -57 389 354 -337 204 352 77 -368 -289 125 245 -226 -25 155 293 -592 -59 73 395 -42 -74 67
6956F7r5m11O21mk26m64K09N14k45j38L01N26j006r0N70M42o01l51L71M13m35
$$ 67 -28 -439 182 178 -48 -512 -303 211 -34 -172 129 655 -351 -441 129 571 -30 -381 -10 403 -32
6977c2k23K84L61m19k42K18M03j44p71O28O06o60m07N53k2l26k21O01K59m31l59
$$ -32 -255 29 390 -29 -271 -53 350 206 -565 63 669 9 -398 155 133 -193 -414 187 446 15 -344
6998c44M53L4j8n27P77j90m53P9M27ml61j33K39J74l14j22N44J21n06l35N19J16
$$ -344 109 143 125 -402 375 185 -268 -189 238 234 -127 -260 -21 153 -161 -283 261 382 -124 -459 60 176
7020A76m53j42M92J83m00k27N96N5l02l30O18L34n54m59O87K47q95K24K13M76
$$ 176 -277 -419 73 256 -144 -371 225 280 -22 -352 266 600 46 -413 274 521 -374 -150 63 539
7040E39o25LO26j18n62j72M40L08n74j41L21L53q05L74L33l6n93j92Q52J0m52
$$ 539 -86 -83 543 425 -137 -309 131 439 -135 -276 45 398 -407 -33 300 264 -329 -521 331 341 -111
7061a11l43P89k17o37K74K25O43r19N4P25j89p53L20L21K33m31j63O31l77n46
$$ -111 -454 335 118 -519 -245 -20 623 -296 -242 483 294 -459 -139 182 415 -16 -179 452 75 -471
7081d71L96J36J7l49j95Q60j98j12m16O23L9m81J23M99k72n67L1P74q4o27n3M67
$$ -471 -75 61 78 -271 -466 394 196 84 -332 291 330 -151 -28 471 199 -368 -337 437 353 -274 -327 140
7103A40K64m85%L03R7r87L21R14n36j06k17N78r7l10nK57q9k75K02O31k70n84
$$ 140 404 -81 -81 222 319 -668 -347 567 31 -75 -292 286 189 -121 -126 131 42 -233 -31 600 330 -254
7125b54K30L84j48l96J20O78n11l81K16L29k66n96O62K59j10q48R12J51k27k24
$$ -254 -24 360 212 -184 -64 614 103 -278 -62 267 1 -595 67 326 216 -632 280 431 204 -20
7145b0KL05k99j98K00K00k89k23Q8Q45m76m07L9Q72m55n19m9P21k77K0j2J55l90
$$ -20 -18 287 -12 -210 -10 190 -99 -322 -234 611 135 -272 -233 639 184 -335 -384 337 60 80 68 223 -167
7168a67k89P22j39k28k87M29l7j49r8KN12j35m70P01p4j47l48J33M79n14j87L51
$$ -167 -456 266 127 -101 -388 41 4 -145 -243 -241 271 136 -334 367 293 146 -202 -69 410 -104 -291 60
7190F0J56k26m51N47M30m82m96L98K96l38N7o1M32l40m82N06K53J5n91L21L81
$$ 60 216 -10 -461 86 516 34 -462 -64 232 -106 -49 -110 322 -18 -500 6 259 274 -317 4 385
7211C85l77l76O42J65o38J58K08L68o64m7M14J7m51q9L36K53l27l02P47j14l50
$$ 385 8 -368 274 439 -199 -41 167 535 -129 -176 238 255 -196 -285 51 304 -23 -325 422 308 -42
7232d2m25O28J16k90j8J60K07o11M9K15M78n80k24K40M39m79r8K84L37m34l02
$$ -42 -467 161 277 -13 -31 129 336 -275 -226 -11 467 -113 -337 -97 342 -137 -235 49 386 -48 -350
7253c50K99J94n31Q0P20j33m09J7J72N0J1l39M95K14o09j60P35j57l66j19M36
$$ -350 -51 143 -388 -308 412 279 -130 -113 59 109 120 -219 276 490 -119 -279 456 299 -67 -186 250
7274B50j39n25M27ml98j21J80M61j05l20M38J9j97l52J27P04k06n26j32N81K50
$$ 250 111 -414 13 9 -389 -510 -330 131 26 -294 144 163 -34 -386 -259 445 239 -287 -419 162 412
7295D12p27p6N90Q3p44J10M04L77n25PM44k15q5j94M77L1m43k31M89j74j2j51
$$ 412 -315 -391 199 282 -462 -352 52 429 -96 -89 355 140 55 -139 338 369 -74 -305 184 10 -2 -153
7317a53M67k46l02r8M23J86l21r9L46q6l04J20M04m38m52L09N02l16k88l10J054
$$ -153 314 68 -234 -332 91 277 -44 -143 203 117 -187 -67 337 -101 -553 -244 258 -58 -346 -656 398
7338C98j14l65rM48j99n68K10O32l71m53K33M83l89k94L45M0P2l31K7M50m8m00
$$ 398 284 -81 -90 358 159 -409 -199 433 62 -391 -158 325 -64 -358 -13 27 99 -232 -205 245 197 -203
7360b03J84M56k26n11P7N27m87j9K97K99n13k40K24L83l33p0o1N75j49k33k17
$$ -203 -19 437 211 -300 -223 304 -183 -202 95 394 -119 -359 -135 248 -85 -155 -216 359 210 -23 -240
7381b40J63K87l94K77N01n16n29N92J53j10o20N91J99o95l69N84Q0k44r9L38J76
$$ -240 -77 210 -184 93 594 78 -451 141 294 184 -436 155 354 -341 -710 -126 -46 -290 -389 -51 125
7402A25r7j95K29O6j11p16N82N84k65m41N86j0l24j7j22L07k89k00N88K85m79
$$ 125 28 -167 62 128 17 -699 -117 467 202 -239 347 337 13 -4 -126 181 -108 -308 280 565 86
7423H6l11L43J03k04m94M39N10o58k19L89K75l72J54J76k23n6j75M49K42o32L9
$$ 86 -225 118 221 17 -477 -38 472 -186 -405 -16 259 -113 41 217 -6 -62 -237 212 454 -178 -139
7444a39L79j63j44n8L08K07p50J93M01J96q36N10n0K05m03k44K62J43l66Q3K71
$$ -139 240 77 -67 -125 183 390 -360 -167 234 430 -406 104 54 259 -144 -388 -126 17 -349 -266 5
7465EJ59m13O2K78J63m93O3J82J99j93n3K60l8j21j00L06q1m26o1L06pl81j4O93
$$ 5 164 -249 -187 91 254 -239 -176 6 205 12 -41 219 181 60 -40 266 185 -241 -302 4 -3 -384 -398 295
7489B95j18k83l8K98L76p20M4M90j12m02R1K01K5j77l37Q93m09m09K40L63M0o71
$$ 295 177 -106 -144 154 530 -190 -146 344 232 -170 -79 122 147 -30 -367 526 117 -292 -52 311 351 -320
7511c20j05O99j78l19J19J21L5n03O21R8j18l51K59K58m3m41L8O43j39q31L16
$$ -320 -425 274 96 -223 -104 17 52 -451 170 268 150 -201 58 316 273 -168 -130 513 374 -457 -141
7532a41K82k8m17K44L14k1l50M3L91j9m57l6M69k03k94lL94k0m41P0M64J92p84
$$ -141 141 113 -304 -60 254 233 -117 -74 317 298 -159 -195 274 71 -223 -226 168 148 -293 -223 241 433 -351
7555c51M67j12R4n80K97K75q1j19p4L33o5l03L99O9j60l33J30M95k78k29R8M06
$$ -351 116 4 98 -482 -185 90 9 -110 -184 149 84 -219 180 249 89 -244 -114 381 103 -126 -28 378
7577C78j40r16M09O70n47m0K9M08j42o75N37J75qm6k29N35l89k36J92N01n59O7
$$ 378 238 -678 -269 401 -146 -186 -157 251 109 -566 -29 146 138 92 -137 398 9 -227 -35 466 -93 -26
7599b6k21L28J58o25M31J82p2n45K24N36o27pJ77L99k99l03j08O44l88K1L60k5
$$ -26 -247 81 239 -386 45 227 155 -390 -166 370 -257 -264 -87 312 13 -290 -398 246 -142 -121 239 214
7621B14l54m28M74L96j53m06M05Q4l58p0J80M84p02j63L82P4m7k89M97j02k56
$$ 214 -140 -568 -94 302 149 -257 148 232 -126 -196 -16 468 -234 -397 -15 59 12 -277 220 118 -138
7642a38m5l9L44m46O4M00j6l56J68J45L43n55OJ90j69J03k99N87l04J99k15J31
$$ -138 -183 -222 122 -324 -260 140 124 -232 -64 81 424 -131 -125 65 -104 -1 -300 287 -17 182 -33 98
7664I8J70l53j57L24J65l06n01P46j09k58Q6K86m3j60o02R20k99r1l21L57M75
$$ 98 268 -85 -242 82 247 -59 -560 186 77 -181 -95 191 148 -12 -614 306 7 -84 -405 -48 427
7685D27q58O6M44J89m28j36M44pl90n2K22Q2m8l01M33r1k20K98k25J74m79K19
$$ 427 -431 -365 79 268 -160 -296 148 141 -249 -301 -79 3 -45 -346 87 -4 -224 74 -151 23 -456 -237
7707b37L50O9l57j20N60N3m10M1K80k7l20j69K54J14l54J7N05j91l6o6K05K62
$$ -237 113 182 -175 -295 265 318 -92 -51 229 202 -118 -287 -33 81 -273 -256 249 58 22 -44 161 423
7729D23q77J07M33J47m66K87J55J94n48K43J18j21n42K94N6K82n70l7O34m3l86
$$ 423 -454 -347 86 233 -233 54 209 403 -145 98 216 95 -447 -153 -97 185 -385 -422 212 169 -217
7750b17J99j27M8j71K1J21L94m43K09K04k26l91P81j68K6m77K50K38k33m4k55
$$ -217 -18 -145 -97 -268 -247 -126 268 -175 34 238 12 -379 402 234 260 -217 33 271 38 -6 -261
7771b61N15j5n73J39O83n50k77M30J6j63j63j15P03j70m60K46M76l12j94k20L94
$$ -261 254 239 -334 -195 488 -62 -339 91 107 -56 -219 -334 369 199 -261 -15 461 149 -45 -265 129
7792A29j74l39K98K94K0m37J53K62k79o9K33J9O8n80M35J78l20k07K44M26l86
$$ 129 -45 -384 -86 208 228 -209 -56 206 -73 -142 91 110 178 -402 33 211 -109 -316 -72 354 -32
7813c2l52K13L46L4l48K36L57m92J95j60K73k85l84M24Jj95K3jM77l22m42O82
$$ -32 -384 -171 175 209 -139 97 454 -38 157 -3 270 -15 -399 25 26 -169 -146 -147 330 8 -434 248
7835B48j47k39l5K3M27k08l48K11K72m29j3M29q5Ol75M59M6l81k49M63J28k79
$$ 248 101 -138 -173 -150 277 69 -279 -68 204 -225 -238 191 106 112 -263 196 242 -139 -388 75 203 -76
7857g6k06J70M58n19j37K33M95k23l28J41J69n47O8J73M40m44k43K44L02m43P1
$$ -76 -282 -112 346 -173 -310 -77 418 195 -133 8 177 -370 -302 -129 311 -133 -376 -132 170 -273 -202
7878b02L69J23m97K1J43K39q8k98J58L76j50k21k2J41k78k33M84J02j67J05q8
$$ -202 167 290 -207 -186 -43 196 108 -190 -32 344 194 -27 -49 92 -186 -419 65 167 0 105 17
7899A7l4K45o94L95K45k10O5n4J55l51PK85K68m57j37K18k2o3KK10R4m34M9J24
$$ 17 -17 228 -466 -71 174 -36 29 -25 130 -221 -214 71 339 -118 -255 -37 -59 -122 -120 90 184 -250 -201 -77
7923g7K63k87j96N63l8l00j99N08Qo64K05K56m7L9j64L07k70O6k60M46Q4k75k19
$$ -77 186 -101 -297 266 228 -72 -271 237 245 -419 -214 42 -5 34 -130 177 -93 -27 -287 159 243 -32 -251
7946b51L10Ml20L85O2m9j94q2p4j4j17Q3N74R6q83J66M53J32l11k62L48J38n53
$$ -251 59 63 -257 128 190 141 -53 -135 -209 -223 -340 -257 317 413 -470 -304 149 281 -30 -292 56 194 -359
7969c59K76L26k62J42j32P5ml58J09K17k3m8j00N31m21l1L8L54j77n46J80M53
$$ -359 -83 243 -19 123 -9 66 62 -296 -187 30 7 -41 -141 390 -31 -62 -24 330 153 -393 -213 240
7991B40R3m93L46K46k81l52R5L86J1p56L55N43m39j38J9K35k7l16L23L51k01n92
$$ 240 333 -160 186 432 151 -201 -106 280 291 -465 -110 433 -6 -144 -125 110 83 -233 90 441 240 -352
8013c52L71K20j41k93J55J31O8k30K95j69j69m6j65L47k27J58JL13j60k01K76
$$ -352 19 239 98 -195 -40 91 159 -71 224 55 -114 -160 -325 22 -205 -47 -46 267 107 -94 182
8034A82k77K27n38L48K27j6n09L57N07m86k44M34K9j75l63K78k6K14n29L41K76
$$ 182 -95 132 -406 -58 169 153 -356 1 508 22 -222 212 241 66 -297 -19 -45 169 -360 -19 257
8055B57p1k55l0M70m21j12J60L78l89l33M56J14k81k93j44O10l43j14L63J87l48
$$ 257 186 -69 -99 371 -50 -162 -2 376 -13 -346 110 224 -57 -350 -494 116 -227 -341 22 209 -139
8076a39n0M42L13m06k71J03K85m39J84J10L17n60k15M37l3j29O9J20r6k82J11
$$ -139 -189 253 566 160 -111 -8 277 -162 22 132 449 -111 -326 111 78 -51 18 138 42 -240 -129
8097a29M91O0j73k36j04L25k94k98N08K92m02l97L92J2%l43J58L01m00k43O07
$$ -129 362 422 249 13 -91 234 -60 -358 150 442 40 -357 35 47 47 -296 -138 163 -237 -480 127
8118A27K38k43m74M90k5j91p3K24LQ2l80L72L65n37k65L39R3J7k43J64qk58l3
$$ 127 365 122 -352 138 113 -78 -151 73 76 158 -222 150 515 -22 -287 52 145 162 -81 83 75 -183 -216
8141b16Q6L42n75M05M7M12n87j1P8K11l49L33l32K58j14j45K47L14l69k46K11
$$ -216 -130 212 -363 42 89 501 -86 -97 -19 192 -157 176 -156 102 -12 -157 90 404 35 -211 0
8162@J12k6j7j40K52l82M5L61k17P5j31j22J54J6k40L54Q9j53k16J25J61r0m53
$$ 0 112 86 69 -71 181 -201 -156 205 -12 63 -68 -190 -36 -20 -260 94 183 30 -186 -61 100 10 -443
8185d43M67j56j38J12N48l48
$$ -443 24 -132 -270 -158 390 42
8191D2
$$ Imaginary data points
##PAGE= N=2
##DATA TABLE= (X++(I..I)), XYDATA
0@%%%%%%%Qj6J6j6K4l2M0m8N6p2Q4r5J15j36J55j79K08k41K76l11L52m00M53n09
$$ 0 0 0 0 0 0 0 0 8 -8 8 -8 16 -16 24 -24 32 -40 44 -51 64 -72 83 -96 112 -129 147 -164 188 -212 241 -268
31b68N73o45P18q00Q92r93J100j218J353j499J657j832K031k255K498k775L098
$$ -268 305 -340 378 -422 470 -523 577 -641 712 -787 870 -962 1069 -1186 1312 -1463 1635
48A635l466L891m396N012n770O727p987R731j2300J6451k4256M3695j72799k72966
$$ 1635 -1831 2060 -2336 2676 -3094 3633 -4354 5377 -6923 9528 -14728 28967 -143832 -416798
62d16798N47417J81226m90615j20521N31192Q2760n09007q8753M54987L3359m09289
$$ -416798 130619 311845 -178770 -299291 231901 314661 -194346 -283099 171888 205247 -204042
73b04042l74M00471K300l50523j2882K98150j416k70484j0591K59130L7658k34284
$$ -204042 -204416 196055 198355 -152168 -165050 133100 131684 -138800 -149391 109739 147397 -86887
85h6887o0286K30044Q2036k31364j03705K44505J17057k71116j34184K97072J44639
$$ -86887 -147173 82871 164907 -66457 -170162 74343 191400 -79716 -213900 83172 227811
96B27811l18706j35779L52328J22970l86649j13097M06652Q9146m19659n2486
$$ 227811 -90895 -226674 125654 248624 -138025 -251122 155530 244676 -174983 -227469
106b27469M37123K2881m44690L83M30012l5397m17827O5930M03755q1239l77374
$$ -227469 209654 232535 -212155 -211772 218240 182843 -234984 -169054 234701 153462 -223912
117b23912R3998L45845j05251l21378J02058K94333r4024k68569Q5402K53149
$$ -223912 -129914 215931 110680 -210698 -108640 185693 91669 -176900 -91498 161651
127A61651o9404k43455M8545K36719l2742k40059J9457K52031o049k66481J556
$$ 161651 92247 -151208 -102663 134056 101314 -138745 -119288 132743 126694 -139787 -138231
138a38231K85588k513l06228J0616L29371k2000l46465M1265L59115o6898l69034
$$ -138231 147357 144844 -161384 -150768 178603 156603 -189862 -148597 210518 143620 -225414
149b25414R3855L71781j20170l65363J47696L53893j69592l33992J90736L11006
$$ -225414 -131559 240222 120052 -245311 -97615 256278 86686 -247306 -56570 254436
159B54436k07080k87834K11906K57863k15117k30980K12671K08200k01863j87993
$$ 254436 47356 -240478 -28572 229291 14174 -216806 -4135 204065 2202 -185791
169a85791J87274J70848j72853j62333J56060J60038j40053j63614J23646J68915
$$ -185791 1483 172331 -522 -162855 -6795 153243 13190 -150424 -26778 142137
179A42137j13837j80890J09756J96701j08279k12013J12684K26125j23845k38454
$$ 142137 28300 -152590 -42834 153867 45588 -166425 -53741 172384 48539 -189915
189a89915J38790K48931j56779k52581J77943K52937j98685k47060K20242K37678
$$ -189915 -51125 197806 41027 -211554 -33611 219326 20641 -226419 -6177 231501
199B31501k38608k22964K53194K04023k63202j82541K71491J62884k70986j42662
$$ 231501 -7107 -230071 23123 227146 -36056 -218597 52894 215778 -55208 -197870
209a97870K66723J23011k59125j07306K47328R5127k34581q7714K20049Q4514
$$ -197870 68853 191864 -67261 -174567 72761 167888 -66693 -154407 65642 150156
219A50156k07288q4912J95707Q9642j87381r7185J81038J04131j81311j14270
$$ 150156 -57132 -142044 53663 143305 -44076 -141261 39777 143908 -37403 -151673
229a51673J84269J21733j90416j28901K00182J32111k11418j32713K24277J28842
$$ -151673 32596 154329 -36087 -164988 35194 167305 -44113 -176826 47451 176293
239A76293k38301j22500K50115J13167k60039r9255K68017Q4556k71279o8532
$$ 176293 -62008 -184508 65607 178774 -81265 -180520 87497 172053 -99226 -167758
249a67758K72584N3011k70790l7078K65712K4090k56701j2513K47874N037k36157
$$ -167758 104826 157837 -112953 -150031 115681 139771 -116930 -129443 118431 123468 -112689
260a12689R03K26397l317k16892K186K07896R10k01610n010J98440J0081j97332
$$ -112689 -111786 114611 111294 -105598 -103412 104484 105394 -96216 -101226 97214 107295 -90037
272i0037j5051J99202J9509k04143k2771K08512K3322k17558k1938K24024J8237
$$ -90037 -105088 94114 113623 -90520 -113291 95221 118543 -99015 -120953 103071 121308
283A21308k32084j1437K38621L342k44581O243K47134j8108k48653K8931K46833
$$ 121308 -110776 -122213 116408 119750 -124831 -118588 128546 110438 -138215 -109284 137549
294A37549m1093k42936N1948K37582n9906k29915O8092K20869p3147k11787P6609
$$ 137549 96456 -146480 -94532 143050 83144 -146771 -78679 142190 69043 -142744 -66135
305f6135K02452p7546j93371P7382J86876p4500j79950P2521J76022o8553j73199
$$ -66135 136317 58771 -134600 -57218 129658 55158 -124792 -52271 123751 55198 -118001
316a18001O5466J71922o3074j72045O0795J74620o0375j75982O1973J78914o4831
$$ -118001 -52535 119387 56313 -115732 -54937 119683 59308 -116674 -54701 124213 59382
327E9382j81675O8500J82920p4540j84657Q0564J84305q7962j82864R4912J79976
$$ 59382 -122293 -53793 129127 54587 -130070 -49506 134799 46837 -136027 -41115 138861
338A38861j01833j76412J07707J70575j14713j65219J18164J58404j22064j51492
$$ 138861 37028 -139384 -31677 138898 24185 -141034 -22870 135534 13470 -138022
348a38022J24283J45519j25836j38606J26364J32636j26061j27581J24903J23390
$$ -138022 -13739 131780 5944 -132662 -6298 126338 277 -127304 -2401 120989
358A20989j23957j20142J23614J18237j22081j15774J22472J15233j22304j14175
$$ 120989 -2968 -123110 504 118741 -3340 -119114 3358 118591 -3713 -117888
368a17888J23509J13499j24750j12559J27425J12140j29831j09693J33089J08202
$$ -117888 5621 119120 -5630 -118189 9236 121376 -8455 -118148 14941 123143
378A23143j36400j05533J39451J01722j42566r8924J45237R4669j47295q9949
$$ 123143 -13257 -118790 20661 122383 -20183 -119107 26130 120799 -26496 -116445
388a16445J49243Q4850j50284q0574J50406P5139j51631p1842J51164O6689j51352
$$ -116445 32798 117648 -32636 -113210 37196 112335 -39296 -111138 40026 106715 -44637
399d4637o2663J50131N9813j49652n6268J49183N3269j48980n1016J48328M7980
$$ -44637 -107300 42831 102644 -47008 -103276 45907 99176 -49804 -100820 47508 95488
410I5488j48723m5808J49059M3602j48903m0462J49999L8355j50090l5153J50955
$$ 95488 -53235 -99043 50016 93618 -55285 -95747 54252 92607 -57483 -92636 58319
421E8319L2432j50644k9797J51630K7217j51520k3901J52733K1147j52239j7998
$$ 58319 90751 -59893 -89690 61940 89157 -62363 -86264 66469 87616 -64623 -82621
432h2621J52160J4810j51902j2067J51631R409j51384o298J51361L675j50920
$$ -82621 69539 84349 -67553 -79620 72011 81420 -69964 -76262 75099 78774 -72146
443g2146j422J50278k123j50794M412J49451p679j50269J0680J49927j3618j49337
$$ -72146 -73568 76710 74587 -76207 -71795 77656 69977 -80292 -69612 80315 66697 -82640
455h2640J6951J48492k0317j48143K3178J46029k7190j45059K9858J43536l2870
$$ -82640 -65689 82803 62486 -85657 -62479 83550 56360 -88699 -58841 84695 51825
466E1825j41035L6094J39322l8213j36173M0362J34184m2149j31927M4461J28864
$$ 51825 -89210 -53116 86206 47993 -88180 -47818 86366 44217 -87710 -43249 85615
477H5615m5147j26736M6986J25109m7188j22824M8422J22187m9273j21217N0602
$$ 85615 40468 -86268 -39282 85827 38639 -84185 -35763 86424 37151 -84066 -33464
488c3464J20852n2036j19870N3639J20042n5128j19979N7363J19293o0244j19966
$$ -33464 87388 35352 -84518 -30879 89163 34035 -85944 -28581 90712 30468 -89498
499h9498O3244J18100o5976j17513O9248J16248p3048j14435P6112J12347q0233
$$ -89498 -26254 91846 25870 -91643 -22395 93853 20805 -93630 -17518 94829 14596
510A4596j09691Q2202J05897q5502j02898Q7057R9342q8627r5815R0049R2614
$$ 14596 -95095 -12893 93004 7502 -95396 -8339 91003 2376 -93439 -3390 89224
521H9224r0359q8925R0645Q5919r0891q4005R0684Q1546r0011p9729R0038P9320
$$ 89224 -1135 -90060 585 86504 -4387 -88392 2292 83838 -6173 -85902 4136 83456
533H3456q9003p7941Q9538P8158q9480p7708R0519P7828r1585p7089R3379P6969
$$ 83456 -5547 -83488 6050 84208 -5272 -82980 7539 85367 -6218 -83307 10072 87041
545H7041r5199p5712R7281P4073r9511p2098J01245O9732j04417o5808J05733
$$ 87041 -8158 -83870 13411 87484 -12027 -84125 17120 86852 -17565 -83373 22360
556B2360O2548j07481n8316J08183N4189j09180n0482J08688M4915j08573m1789
$$ 22360 84908 -22573 -80889 27294 81483 -27697 -78179 30509 75424 -33149 -74938
567g4938J07110L8182j06467l4803J05160L2460j02928l0713J01346K8776j00527
$$ -74938 32172 70354 -36113 -70916 34244 66704 -36224 -66937 34409 63185 -37342
578c7342k8704R9354K8530r8250k8760R8410K9300r8328k8771J00044K8949j01426
$$ -37342 -66046 33308 61838 -36412 -65172 33238 62538 -35790 -64561 35483 64432 -36994
590c6994k7672J02832K7098j04944k5207J07607K3018j09161j9345J11639J5417
$$ -36994 -64666 38166 65264 -39680 -64887 42720 65738 -43423 -62768 48871 64288
601F4288j13038j0889J14190N989j14358j339J13944l825j12804R028J10807j3208
$$ 64288 -48750 -59639 54551 60540 -53818 -55157 58787 54962 -57842 -48814 61993 48785
613D8785j09118J6530J06164k0496j03427K2336J00057k4102r7261K4953R4546
$$ 48785 -60333 -43803 62361 41865 -61562 -39226 60831 36729 -60532 -35579 58967
624E8967k5554r2009K4056R0190k3427q9630K2224Q8200k1149q8436K0226Q9478
$$ 58967 33413 -58596 -34540 55650 32223 -57407 -35183 53017 31868 -56568 -36342 53136
636E3136j9228r0215J9554R1943k0266r2837K1544R3971k3277r5462K7096R6143
$$ 53136 33908 -56307 -36753 55190 34924 -57913 -36369 57602 34325 -61137 -34041 62102
648F2102k9876r5756L3745R6466l7867r4879M2224R3496m6477r1128M9580Q9292
$$ 62102 32226 -63530 -29785 66681 28814 -66065 -23841 69655 23178 -67950 -18370 70922
660G0922n2718q6283N5553Q3483n7313q0642N8869P6851n9242p5515N9136P3240
$$ 70922 18204 -68079 -12526 70957 13644 -66998 -8129 68722 9480 -66035 -6899 66341
672F6341n8790p2017N7837P0712n7029p0167N5808P0408n6686p0792N5663P1071
$$ 66341 7551 -64466 -6629 64083 7054 -63113 -7305 63103 6417 -64375 -8712 62359
684F2359n6445p1528N6955P2009n8660p1963O1338P1376o3134p0983O5703O9861
$$ 62359 5914 -65614 -8659 63350 4690 -67273 -5935 65441 2307 -68676 -2973 66888
696F6888o8354o8168P1035O6148p3506o2687P6260O0202p7580n6424P8432N4248
$$ 66888 -1466 -69634 1401 67549 -5957 -68644 7616 67818 -9762 -66186 12246 66494
708F6494p9303n0612P9589M7003p8496m4381P8723M2818p7870m1363P6914L9785
$$ 66494 -12809 -63421 16168 63171 -15325 -59706 19017 61835 -16035 -57398 19516 59301
720E9301p5893l9420P5394L8610p5274l8724P5426L8213p5416l8416P5653L7711
$$ 59301 -16592 -56012 19382 57992 -17282 -56006 19420 57633 -17783 -56199 19454 57165
732E7165p7464l6710P8190L4715p9941l3790Q1605L0852q1996k8419Q2911K4885
$$ 57165 -20299 -57009 21181 55896 -24045 -57835 23770 54622 -27374 -55793 27118 52003
744E2003q3505k1266Q3511J7531q3462j4849Q3187J2166q1854r047Q0709P162
$$ 52003 -31502 -52768 30743 48274 -35188 -50037 33150 45316 -36538 -45585 35124 42286
756D2286p8476n784P7499N204p6083n183P5541N648p4251n428P3411P073p3792
$$ 42286 -36190 -41974 35525 40729 -35354 -40537 35004 40652 -33599 -39027 34384 41457 -32335
769c2335p040P4752Q015p6808p564P7858P343p9912o297Q1453M847q3636k074
$$ -32335 -39375 35377 43392 -33416 -40980 36878 44221 -35691 -41988 39465 44312 -39324 -41398
782d1398Q4718l75q6859L367Q6823p176q7231J1172Q5807j5457q4006J8776Q1611
$$ -41398 43320 42945 -43914 -40547 46276 39100 -48131 -36959 48848 33391 -50615 -31839 49772
795D9772k1863p8819K3937P5133k6242p1801K7403O8334k7884o5992K8245O3801
$$ 49772 27909 -50910 -26973 48160 21918 -49883 -22480 45854 17970 -48022 -19777 44024
807D4024k7095o1263K5955O0177k4792n9519K3782N9642k2920n9424K1906O1577
$$ 44024 16929 -44334 -18379 41798 17006 -42513 -18731 40911 17991 -41433 -19527 42050
819D2050k1195o2667K2324O3672k2856o5005K4734O6311k7312o6509K9728O6912
$$ 42050 20855 -41812 -19488 44184 21328 -43677 -18943 47368 20056 -46453 -16725 50187
831E0187l2645o6133L6322O4511l9557o3069M2606O0236m4748n8405M6400N4934
$$ 50187 17542 -48591 -12269 52242 12685 -50384 -7778 52458 7710 -50695 -4295 50639
843E0639m7954n1660M7903M9265m8468m6750M7633M4420m6822m3788M5238M2139
$$ 50639 2685 -48975 -1072 48193 -275 -47025 608 45028 -1794 -45582 -344 41795
855D1795m3772m1807M3130M1837m2531m2670M2458M3949m3172m4747M3422M6103
$$ 41795 -1977 -43784 -654 41183 -1348 -44018 -1560 42389 -783 -45530 -2108 43995
867D3995m4569m6398M7017M7229m9447m6603N2564M6494n5261m4831N7796M3099
$$ 43995 -574 -46972 45 47274 -2173 -48776 3788 50282 -4979 -49810 7986 51085
879E1085o0340l9943O2331L7345o3847l3651O5023L0198o4960k6988O4632K3326
$$ 51085 -9255 -49198 13133 50478 -13369 -47020 18003 48201 -16759 -43747 20885 44211
891D4211o3510k0619O1805J8392o0521j7292N8999J6077n7254j5815N4837J6003
$$ 44211 -19299 -39918 21887 40279 -20242 -37534 21465 37542 -19712 -35527 19310 35313
903C5313n4439j7049N3786J7845n4301j9012N5035J9529n5516k0960N7577K0139
$$ 35313 -19126 -36175 17611 35456 -18845 -37857 17178 36707 -18809 -39769 17808 37947
915C7947n9117j9775O1432J8720o3546j7290O5429J5517o6640j2025O7281R537
$$ 37947 -21170 -40945 20487 39207 -24339 -41629 23800 39317 -27323 -39348 27933 37470
927C7470o7517o527O7876L987o7616o75O6208j576o3511L340O2458n137o0067
$$ 37470 -30047 -36574 31302 35289 -32327 -33002 33206 31630 -31881 -28541 33917 28780 -31287
940c1287O168N8044n928n6963N782N5071n652n3461M720N3710m511n3476L066
$$ -31287 -25119 32925 26997 -29966 -24184 30887 25235 -28226 -23506 30204 25693 -27783 -24717
953b4717N4590l754n5167L437N5682m570n6746N483N7719p105n9390Q954N9629
$$ -24717 29873 26119 -29048 -25611 30071 25501 -31245 -25762 31957 24852 -34538 -25584 34045
966C4045j1215o0102J3751N9529j6660n8858J9461N7755k1845n5773K4049N3710
$$ 34045 22830 -37272 -23521 36008 19348 -39510 -20049 37706 15861 -39912 -15863 37847
978C7847k5370n1205K6226M9147k6568m7256K7280M5136k6557m2988K6251M2175
$$ 37847 12477 -38728 -12502 36645 10077 -37179 -9899 35237 8680 -34308 -8057 34118
990C4118k4597m1854K4413M1456k3448m1462K2484M2505k2435m2899K2064M4196
$$ 34118 9521 -32333 -7920 33536 10088 -31374 -8890 33615 11180 -31719 -9655 34541
1002C4541k2925m4850K4200M5525k5765m6767K7902M6555l0338m6795L2763M5238
$$ 34541 11616 -33234 -9034 36491 10726 -36041 -8139 38416 8078 -38717 -5954 39284
1014C9284l4660m4833L7167M2690l9224m0763M0364L8262m1790l5898M2145L3482
$$ 39284 4624 -40209 -3042 39648 424 -40339 25 38287 -3503 -39401 2744 36226
1026C6226m2363l1065M1968K9108m1364k6999M0146K5891l9204k4706L7955K4478
$$ 36226 -6137 -37202 4766 33874 -7490 -34489 5657 31548 -7656 -32362 5593 30071
1038C0071l6783k3945L6222K4112l5156k4275L5428K4683l4934k5733L6000K6151
$$ 30071 -6712 -30657 5565 29677 -5479 -29754 5674 30357 -4577 -30310 5690 31841
1050C1841l7164k5785L8663K5680l9343k5044M0642K4495m2259k3398M3587K1800
$$ 31841 -5323 -31108 7555 33235 -6108 -31152 9490 33985 -8274 -31672 11915 33715
1062C3715m5234k0126M5922J8362m6803j6892M7245J4481m7332j2536M6218J0752
$$ 33715 -11519 -31645 14277 32639 -14164 -31056 16189 30670 -16662 -29198 17020 27772
1074B7772m6001r716M5028Q552m4630p297M3145O714m2307o455M1917O091m1673
$$ 27772 -18229 -27945 17083 25635 -18995 -26292 16853 23567 -18740 -25195 16722 22813 -18860
1087a8860n694M0871N947m0684n432M0962N354m0897m922M1537M975m2032m256
$$ -18860 -24554 16317 22264 -18420 -23852 17110 22464 -18433 -23355 18182 23157 -18875 -23131
1100b3131M2741M017m2903l622M4314K130m3913j160M4629n07m4661J836M4791
$$ -23131 19610 23627 -19276 -22898 21416 23546 -20367 -21527 23102 22595 -22066 -20230 24561
1113B4561l056m4521M275M3696n119m3708O393M2799p570m2316Q515M1697r524
$$ 24561 21505 -23016 -18741 24955 19836 -23872 -17479 25320 17750 -24566 -16051 25646 16122
1126A6122m1156J0117L9765j0987l8836J0983L8110j1603l8008J1782L7404j2379
$$ 16122 -25034 -14917 24848 13861 -24975 -13992 24118 12515 -25493 -13711 23693 11314
1138A1314l7248J2931L6658j3099l6415J3652L6301j4088l5610J4057L5956j4306
$$ 11314 -25934 -13003 23655 10556 -25859 -12207 24094 10006 -25604 -11547 24409 10103
1150A0103l5742J5005L5544j5056l5553J5554L5981j6020l5273J6914L5652j7846
$$ 10103 -25639 -10634 24910 9854 -25699 -10145 25836 9816 -25457 -8543 27109 9263
1162I263l5065J8663L5055j9504l4627K0439L4090k1597l3863K2990L3087k4069
$$ 9263 -25802 -7139 27916 8412 -26215 -5776 28314 6717 -27146 -4156 28931 4862
1174D862l1830K4801L0470k5730k9481K6281K7824k6807k6807K7032K4839k7115
$$ 4862 -26968 -2167 28303 2573 -26908 -627 27197 390 -26417 615 25454 -1661
1186a661k3704K6543K2908k6948k1543K6011K0652k5190k0645K4750K0181k4359
$$ -1661 -25365 1178 24086 -2862 -24405 1606 22258 -2932 -23577 1173 21354 -3005
1198c005j9949K3674K0558k3748k0484K3838K1103k4149k1615K5239K1775k5738
$$ -3005 -22954 720 21278 -2470 -22954 884 21987 -2162 -23777 1462 23237 -2501
1210b501k1895K7621K1718k8727k0795L0224K0397l2086j8948L3912J7337l4631
$$ -2501 -24396 3225 24943 -3784 -24579 5645 26042 -6044 -24992 8920 26257 -8374
1222h374j5444L5668J3270l6626j0694L6309Q320l5647o807L5203M511l4015l097
$$ -8374 -23818 11850 25120 -11506 -22200 14109 22429 -13218 -20025 15178 19689 -14326 -17423
1235a7423L2660J568l0693j378K8820J144k7541j679K5882K264k5194l676K4398
$$ -17423 15237 16805 -13888 -15266 13554 14698 -12843 -14522 11360 13624 -11570 -15246 9152
1248I152M854k4326o432K5125P295k6102q263K7359Q963k8983q699L1000Q367
$$ 9152 14006 -10320 -16752 8373 15668 -10434 -18697 8662 17625 -11358 -20057 10943 19310
1261A9310l2870o996L5036N393l6642k870L7690O52l7871J918L8367n011l6947
$$ 19310 -13560 -20556 14480 19873 -16769 -19639 18051 18703 -19168 -17250 21117 16106 -20841
1274b0841P212L6807j0087l4556J1984L2473j3592k9750J4634K6924j4532k4892
$$ -20841 -13629 23178 13091 -21465 -9481 22992 9400 -20350 -5716 21208 6676 -18216
1286a8216J4109K2280j2801k0916J1276J9719r615j8990P064J9318n854k0212
$$ -18216 -4107 18173 5372 -15544 -4268 15451 5836 -13154 -6090 13228 7374 -12838
1298a2838M043K1373l263k3351K483K5140k355k7590L242K9115m579l0773O673
$$ -12838 -8795 12578 9315 -14036 -11553 13587 11232 -16358 -13116 15999 11420 -19353 -12680
1311a2680L2445r401l2901J2054L2635j4466l2231J7586L1153k0098k8663K1890
$$ -12680 19765 10364 -22537 -10483 22152 7686 -24545 -6959 24194 4096 -24567 -2677
1323b677K6697k3560k3702K4739K0768k4164j8302K4148J5821k2947j3403K1416
$$ -2677 24020 460 -23242 1497 22265 -1899 -20201 3947 19768 -3179 -16582 4834
1335D834J1957j9322j1294J6952J1599j5232j2274J3634J3160j2259j4984J1817
$$ 4834 16791 -2531 -13825 3127 14726 -506 -12780 854 14014 1755 -13229 -1412
1347a412J6765j2146j8762J2605K0204j3987k1967J5760K2655j8387k3156K0926
$$ -1412 15353 3207 -15555 -2950 17254 3267 -18700 -2940 19715 1328 -21828 -902
1359i02K1911k2921k1789K6007J9540k7888j6705K8873J4378l0088j1533L0445
$$ -902 21009 -1912 -23701 2306 21846 -6042 -22747 6126 20504 -9584 -21117 9328
1371I328Q551k9853n526K8334L504k6328j588K4706K88k1791m41K0326M71j7795
$$ 9328 17879 -11974 -17500 10834 14338 -11990 -13578 11128 11416 -10375 -10816 9510 9981 -7814
1385g814j296J6113L318j4736n137J4380P557j4898r410J5766J1543j7290j3229
$$ -7814 -9110 7003 10321 -4415 -9552 4828 12385 -2513 -11923 3843 15386 -1904 -15133
1398a5133J9175J3986k1945j3869K4397J3065k7465j1908L0036R320l2197o439
$$ -15133 4042 18028 -3917 -17786 6611 19676 -7789 -19697 10339 19659 -12538 -18977
1410a8977L3455K902l3767j68L3705l856l2218O540L0205r232k7895J0631K5750
$$ -18977 14478 17380 -16387 -16555 17150 13294 -18924 -12384 17821 8589 -19306 -8675 17075
1423A7075j2136k2432J2342J9387j1474j6789J0658J4630q496j3203O930J2020
$$ 17075 4939 -17493 -5151 14236 2762 -14027 -3369 11261 2765 -10438 -3508 8512
1435H512l765j2262J391J3549M40j4682j807J6649K947j8733l228K1675K401k3805
$$ 8512 4747 -7515 -6124 7425 7865 -6817 -8624 8025 10972 -7761 -10989 10686 13087 -10718
1449a0718j096K5871l31k8028L722K8546o910k8932R817K8298j3091k7210J5333
$$ -10718 -11814 14057 13726 -14302 -10580 17966 11056 -17876 -8059 20239 7148 -20062 -4729
1462d729K5730j8422k2939K0057J9626k0817j7120K1015J3876k0578j1595J9280
$$ -4729 21001 2579 -20360 -303 19323 -1494 -18614 2401 16277 -4301 -15896 3384
1474C384R017j7186p631J5179O723j2806o590J0499P588q608r028P228J1006o333
$$ 3384 12401 -4785 -12416 2763 9486 -3320 -9910 589 8177 -431 -9459 -2231 8775 2442
1488B442j2896O522J4771o371j7288Q094J9402j0213k0193J2724K1248j5429k1103
$$ 2442 -10454 -3932 10839 4468 -12820 -4726 14676 4463 -15730 -3006 18242 2813 -18290
1501a8290J8202K0664k1198j8969K3492J7059k5194j4413K6385J1848k7507q619
$$ -18290 -88 20576 -622 -19591 3901 20960 -4234 -18647 7738 19586 -7921 -16540
1513a6540K7034N293k5897l240K4362J125k2488L13J9753j458j6995R51J4818
$$ -16540 10494 15787 -10110 -13350 11012 12137 -10351 -10038 9715 8257 -8738 -7787 7031
1526G031o07j3321o93J1705K365j0505m599J0239O519j0618q656J1542J0764j3515
$$ 7031 6424 -6897 -7590 4115 6480 -4025 -8624 1615 8134 -2484 -11140 402 11166 -2349
1540b349j1930J6011J2293j7777j2455K0774J1759k3321j0448K6114Q285k7376
$$ -2349 -14279 1732 14025 -3752 -16207 4567 16326 -6995 -17443 8671 16956 -10420
1552a0420n861K9209L105k9605n2K9355k914k8109N956K6353p739k4592R464K2101
$$ -10420 -16281 12928 16033 -13572 -13624 15731 12817 -15292 -9336 17017 9278 -15314 -5850 16251
1566A6251j0419j9670J0674J7187j0613j4679R095J2837p797j1505N594J0835
$$ 16251 5832 -13838 -3164 14023 3410 -11269 -2174 10663 2866 -8639 -3045 7790
1578G790l935j1181K234J1366k66j3132q82J4298J433j6040j856J7986J321j9897
$$ 7790 3855 -7326 -5092 6274 6008 -7124 -8006 6292 7725 -8315 -10171 7815 9136 -10761
1592a0761n40K2266j296k3344K837K4565m930k4746P541K4151r400k3495J1908
$$ -10761 -11301 10965 9669 -13675 -10838 13727 8797 -15949 -8408 15743 6343 -17152 -5244
1605e244K2515j3498k0873J5160J9144j5598j6878J5940J4628j6004j2479J5355
$$ -5244 17271 3773 -17100 -1940 17204 1606 -15272 668 15296 -708 -13187 2168
1617B168J1530j4472j0286J3026R731j1582r635R965J0343r247j0952P918J2108
$$ 2168 13698 -774 -11060 1966 11697 115 -9520 445 10788 1541 -9411 -1493 10615
1630A0615p902j3558P975J4311p877j6198R143J6527j0253j7905J1939J8280j4261
$$ 10615 2713 -10845 -2870 11441 3564 -12634 -3491 13036 2783 -15122 -3183 15097 836
1643H36j8230J6249J7221j7529j6167J9096J4574k0385j2376K1022J0804k1569
$$ 836 -17394 -1145 16076 -1453 -17620 1476 16050 -4335 -16711 4311 15115 -6454
1655f454q743K1140P387k0788n402J9695M665j8601l199J7124L022j5695k642
$$ -6454 -15197 5943 13330 -7458 -12860 6835 11500 -7101 -10300 6824 9846 -5849 -8491
1668h491J4428L194j2970m060J2423N436j2378o623J2676P298j2586q660J3504
$$ -8491 5937 9131 -3839 -7899 4524 9960 -2418 -9041 3635 10933 -1653 -10313 3191
1681C191R171j4628r947J6189J0090j8334r609J9534Q603k1198p301K1705O381
$$ 3191 12362 -2266 -12213 3976 14066 -4268 -13877 5657 14260 -6938 -14239 7466 13847
1694A3847k3160m455K3626K437k3944o70K3571j295k2858K574K2001l982k0982
$$ 13847 -9313 -13768 9858 12295 -11649 -12319 11252 9957 -12901 -10327 11674 7692 -13290
1707a3290N110J9772n354j8506N876J6898n024j5881M857J4783l921j4208L074
$$ -13290 -8180 11592 6238 -12268 -6392 10506 5482 -10399 -5542 9241 5320 -8888 -5814
1720e814J4394k414j3882J348J5104r24j5268m7J6862l35j7599Q07J8666j725
$$ -5814 8580 6166 -7716 -6368 8736 7812 -7456 -7503 9359 9024 -8575 -7768 10898 9173
1734I173j9289K106K0251l377k0934M739K1032n959k1105P061K0775q702k0132
$$ 9173 -10116 -8010 12241 8864 -12070 -7331 13701 7742 -13363 -6302 14473 5771 -14361
1747a4361R542J8971j0304j8318J0948J7335j1646j6267J1240J5205j1141j4532
$$ -14361 -4819 14152 3848 -14470 -3522 13813 2167 -14100 -2860 12345 1204 -13328
1759a3328J0860J3746j0485j3206J0150J3012r098j3257Q937J3350q561j3746
$$ -13328 -2468 11278 793 -12413 -2263 10749 1651 -11606 -2669 10681 2120 -11626
1771a1626Q581J4457q756j4671Q937J5638r416j5888J0373J6479j1080j6547J2400
$$ -11626 -3045 11412 2656 -12015 -3078 12560 3144 -12744 -2371 14108 3028 -13519 -1119
1784a119J6032j2734j6182J3893J5650j5230j4451J5692J3857j6483j2635J6451
$$ -1119 14913 2179 -14003 -110 15540 310 -14141 1551 15408 -1075 -13710 2741
1796B741J1640j6604j0909J6367R567j5799r411J5870Q512j5548q438J5084P856
$$ 2741 14381 -2223 -13132 3235 12802 -2997 -12408 3462 11974 -3574 -12012 3072 10928
1809A0928j4704q219J4404Q102j3866q903J4439Q677j4084r127J4692R041j4547
$$ 10928 -3776 -11995 2409 10511 -3355 -12258 2181 10858 -3226 -12353 2339 11380 -3167
1822c167r614J5650R112j6008q967J6945R055j7427q598J8325P343j8053o627
$$ -3167 -12781 2869 11981 -4027 -12994 3951 13006 -4421 -13019 5306 12649 -5404 -12031
1835a2031J8977N811j9144m877J8740M552j8933l936J8991L166j8212k958J8203
$$ -12031 6946 12757 -6387 -11264 7476 12028 -6905 -10841 8150 11316 -6896 -9854 8349
1848H349K350j8035j992J7558J841j7312k012J6988K038j7112k230J7380J638
$$ 8349 10699 -7336 -9328 8230 10071 -7241 -9253 7735 9773 -7339 -9569 7811 9449
1861I449j7530j929J7639J654j8316j140J8394Q78j8782m38J9247j72j9356L38
$$ 9449 -8081 -10010 7629 9283 -9033 -10173 8221 9099 -9683 -10121 9126 8954 -10402 -10064
1875a0064J9899j513j9142J903J9163k751j8774L226J8927l828j7896M329J7736
$$ -10064 9835 8322 -10820 -8917 10246 7495 -11279 -8053 10874 7046 -10850 -6521 11215
1888A1215m820j7347N073J7434n058j6590M967J6219m968j6332N201J6261n283
$$ 11215 6395 -10952 -5879 11555 6497 -10093 -5126 11093 6125 -10207 -5006 11255 5972
1901E972j6079N015J6306m974j6682N312J7098n959j7053O190J6911o868j6966
$$ 5972 -10107 -5092 11214 6240 -10442 -5130 11968 6009 -11044 -4854 12057 5189 -11777
1914a1777O751J7142p510j7036P958J6816r182j6029R024J6374j0210j5380R907
$$ -11777 -5026 12116 4606 -12430 -4472 12344 3162 -12867 -3843 12531 2321 -13059 -3152
1927c152J4773j0008j4588J0113J4206j0107j3476J0076J3598j0213j3433J0458
$$ -3152 11621 1613 -12975 -2862 11344 1237 -12239 -2163 11435 1222 -12211 -1753
1939a753J3304j0370j3129J0518J3253j0522j3409J1187J3567j1317j3283J1720
$$ -1753 11551 1181 -11948 -1430 11823 1301 -12108 -921 12646 1329 -11954 -234
1951b34J3879j2697j3570J3368J2904j4028j2630J4541J2498j5118j1958J5633
$$ -234 13645 948 -12622 746 13650 -378 -13008 1533 14031 -1087 -13045 2588
1963B588J1511j6513j0285J6202R476j6392q876J6120P809j5642p257J5276O302
$$ 2588 14099 -2414 -12699 3503 12979 -3413 -12289 3831 11640 -4002 -11259 4017 10319
1976A0319j4272o784J3776O537j3661o680J3506O512j3096o789J2867P146j2793
$$ 10319 -3953 -10737 3039 9576 -4085 -10765 2741 9253 -3843 -10632 2235 9381 -3412
1989c412p338J3095Q107j3849q210J4226Q552j5166q387J6876Q257j7395p670
$$ -3412 -10750 2345 10452 -3397 -11607 2619 11171 -3995 -12382 4494 12751 -4644 -12314
2002a2314J8001P025j8276o136J9134M998j9382l817J9004L240j8937k311J9104
$$ -12314 5687 12712 -5564 -11700 7434 12432 -6950 -10767 8237 11477 -7460 -9771 9333
2015I333J189j8626m92J7798k77j7095L08J6255l69j5987N77J5251o15j4495k08
$$ 9333 10522 -8104 -8596 9202 8925 -8170 -7862 8393 8024 -7963 -7386 7865 7250 -7245 -7453
2030g453J4825j09j4669r05J4902M60j4714j075J5471J331j6218p91J6063J487
$$ -7453 7372 7263 -7406 -8311 6591 7051 -7663 -8738 6733 8064 -8154 -8945 7118 8605
2044H605j7830j46J7681j43j8507J477J8533j576j8923L161J8842m563j7805N070
$$ 8605 -9225 -9371 8310 8167 -10340 -8863 9670 8094 -10829 -7668 11174 6611 -11194 -6124
2058f124J7444n846j6616O556J6027o374j5187O543J4654o629j3632O317J3149
$$ -6124 11320 5474 -11142 -4586 11441 5067 -10120 -3577 11077 4448 -9184 -2867 10282
2071A0282n898j3246N553J2953n099j2984M396J3319l914j4159M216J4034m441
$$ 10282 4384 -8862 -3309 9644 4545 -8439 -4043 9276 5362 -8797 -4581 9453 5012
2084E012j4870M388J5250m915j5975N653J6846o864j6932P526J6956q784j6471
$$ 5012 -9858 -5470 9780 4865 -11110 -5457 11389 4525 -12407 -4881 12075 3291 -13180
2097a3180R725J5813j0850j5519J2223J4358j2277j3512J2824J2357j2720j1331
$$ -13180 -3455 12358 1508 -14011 -1788 12570 293 -13219 -395 11962 -758 -12089
2109a2089J2963J0122j2289r323J1785R274j1312q526J0366Q385r384q394R046
$$ -12089 874 10996 -1293 -10616 1169 10443 -869 -9395 971 9356 -28 -8422 624
2122F24R029q995r131Q181J0343q605j0896Q865J1466r357j2005J0312J1705j1190
$$ 624 9653 658 -8473 -292 10051 1446 -9450 -585 10881 1524 -10481 -169 11536 346
2136C46j1905J2048J2157j3487j1783J4116J1179j5147j0105J5368R189j6289
$$ 346 -11559 489 12646 -841 -12624 1492 12671 -2476 -12581 2787 11976 -4313
2148d313q227J6111P371j6740n566J6366M430j5327m109J5151L502j4082l295
$$ -4313 -12540 3571 10942 -5798 -11364 5002 9432 -5895 -10004 5147 8649 -5433 -8728
2161h728J3240L266j2436l478J2100L921j1764m649J2018M930j1574n334J1902
$$ -8728 4512 7778 -4658 -8136 3964 7885 -3879 -8528 3490 8420 -3154 -8488 3414
2174C414N999j2413o300J3414O185j3756o997J5762O012j5942n214J6399M142
$$ 3414 9413 -3000 -9300 4114 10299 -3457 -10454 5308 11320 -4622 -9836 6563 10705
2187A0705j7132l345J7490K189j7847j107J7707j1j7578J530J6399k097j5978
$$ 10705 -6427 -9772 7718 9907 -7940 -9047 8660 8649 -8929 -7399 9000 6903 -9075
2200i075K432J5026l029j3964K838J2902k545j2255K452J1695k189j0839J267
$$ -9075 -6643 8383 5354 -8610 -5772 7130 4585 -7670 -5218 6477 4288 -6551 -5284
2213e284J0693q10j0802j68J1703N75j1894j094J2729J873j4105q20J4218R61
$$ -5284 5409 4599 -6203 -6371 5332 5907 -5987 -7081 5648 7521 -6584 -7404 6814 7775
2227G775j5322n10J6665r15j6854K124J7312k942j7578M864J6885n459j6793O937
$$ 7775 -7547 -8057 8608 7693 -9161 -7037 10275 7333 -10245 -5381 11504 6045 -10748 -3811
2241c811J5614p453j5481Q666J3936r101j2751R227J1856r344j0762Q431R726
$$ -3811 11803 4350 -11131 -2465 11471 2370 -10381 -1154 10702 1358 -9404 -973 8753
2254H753p908r538P254Q993o363r084N612R125m838r949M659J0500m867j0925
$$ 8753 845 -8693 -1439 7554 1191 -7893 -2281 6844 2006 -7943 -3284 7216 2349 -8576
2268h576M765J1341m473j2553N460J2890n632j3667P135J3876q111j3867R674
$$ -8576 -3811 7530 3057 -9496 -4036 8854 3222 -10445 -3310 10566 2455 -11412 -1738
2281a738J3088j0176j2833J1470J2328j1911j1483J2482J0353j2674q975J2405
$$ -1738 11350 1174 -11659 -189 12139 228 -11255 1227 11580 -1094 -10069 2336
2293B336Q231j2303p298J2060O363j1334n954J0558N835j0420n682R782N436q887
$$ 2336 10567 -1736 -9034 3026 9389 -1945 -7899 2659 8494 -1926 -7608 2174 7610 -1277
2307a277o374Q607O438q271p016Q232P540q840q066R188Q432r846q887J0637R080
$$ -1277 -7651 956 7394 -877 -7893 339 7879 -961 -9027 161 8593 -1253 -10140 497 9577
2322I577j1559q543J2248Q285j3078p815J3849P113j4512n963J4604N291j5215
$$ 9577 -1982 -10525 1723 10008 -3070 -10885 2964 10077 -4435 -10398 4206 9497 -5718
2335e718l311J4608L091j4236k216J3661J934j3225j159J2368R93j1570j124J1147
$$ -5718 -9029 5579 8670 -5566 -7782 5879 7813 -5412 -6571 5797 6790 -4780 -5904 5243
2349E243J152j0433j240J0065K139j0170k646J0143K638j0472l214J0878L528
$$ 5243 6395 -4038 -5278 4787 6926 -3244 -5890 4253 6891 -3581 -6795 4083 7611
2362G611j1415l600J1892L484j2664l681J3590K926j4116k313J4513J081j4906
$$ 7611 -3804 -7404 4488 7972 -4692 -8373 5217 8143 -5973 -8286 6227 7308 -7598
2375g598l36J4694n6j4591J082J4305j905j4103K821J3363l137j2937L672J1657
$$ -7598 -7934 6760 6704 -7887 -6805 7500 5595 -8508 -5687 7676 4539 -8398 -4726 6931
2389F931l051j1326L893J0655l544j0364L159J0113k611r667K368R621j813r903
$$ 6931 3880 -7446 -3553 7102 3558 -6806 -3647 6466 3855 -5812 -3444 6177 4364 -5539
2403e539J819J0239j712j0405J300J1330j680j1585J896J1505k076j1897K433
$$ -5539 -3720 6519 4807 -5598 -4298 7032 5352 -6233 -4337 7168 5092 -6805 -4372
2416d372J2644l784j2393M555J2304n173j2784N975J1919o585j1852P207J1399
$$ -4372 8272 4488 -7905 -3350 8954 3781 -9003 -3028 8891 2306 -9546 -2339 9060
2429I060p947j0215P579R881p621r348P369Q781p552q009P268P509o491p366O357
$$ 9060 1113 -9102 -1523 8358 737 -8611 -1242 7539 -13 -8022 -754 6755 264 -7102 -745
2444g45P668o284q015O365P694n815p851N612Q578n918q669O172R271o366r230
$$ -745 6923 639 -7376 -1011 6683 868 -6983 -1371 7207 1289 -7380 -1208 8063 1697 -7533
2459g533P092R098p836q744P931Q849q535q687R455Q275r760p946J0177P211j0709
$$ -7533 -441 8657 821 -7923 8 8857 322 -8365 1090 9365 -395 -8341 1836 9047 -1662
2474a662o581J0363O148j0199o032J0513M672r887m679R507M728r719m386R349
$$ -1662 -8243 2120 8268 -1931 -7963 2550 7222 -2665 -7344 2163 6891 -2828 -7214 2135
2488B135L889q801m360Q796M349q437m352Q397M635q137m999Q507M676q509n067
$$ 2135 6024 -2777 -7137 1659 6008 -2429 -6781 1616 6251 -1886 -6885 1622 6298 -2211 -7278
2503g278R238N225r975m568J0486M322j0486m242J0998M023j1296l436J1542L292
$$ -7278 1960 7185 -2790 -7358 3128 7450 -3036 -7278 3720 7743 -3553 -6989 4553 7845
2517G845j1856k726J1706K077j1486j661J1527J036j0862j079J0787L97j0475
$$ 7845 -4011 -6737 4969 7046 -4440 -6101 5426 6462 -4400 -5479 5308 5705 -4770
2530d770n48J0292J87j0061j11R827j06r294o29R531J10r270k80R077O09r667
$$ -4770 -5318 4974 5161 -4900 -5011 4816 4710 -4584 -5213 4318 4428 -4842 -5122 3955 4564 -5103
2546e103l18R679L73r435r54J0422L27j0335j40J0568l44j0470L99J0728o97j0812
$$ -5103 -5421 4258 4631 -4804 -5758 4664 4991 -5344 -5484 5084 4740 -5730 -5331 5397 4700 -6112
2562f112J440J1242j733j1200K162J0815k577j0360K996J0215k855j0447L534
$$ -6112 -4672 6570 4837 -6363 -4201 6614 4037 -6323 -3327 6888 4033 -6414 -2880
2575b880J0079l550r429L775Q613l488q858L297Q981l468r148L986Q203l427q503
$$ -2880 7199 3649 -5780 -2005 6608 3120 -5738 -2441 6540 3072 -6076 -2090 6113 2686 -5817
2590e817L722Q259l707q517L436Q333l556q411L395Q757l921q655M133Q624m370
$$ -5817 -2095 6164 2457 -6060 -2624 5709 2153 -6258 -2863 5894 1973 -6682 -2549 6075 1705
2605A705q757M741Q307m657q357N212Q263n347q182N741Q229o001p910O268P347
$$ 1705 -7052 -2311 5996 1339 -7018 -1806 6457 1110 -7072 -1331 6898 897 -7013 -745 6602
2620F602n925p546O757O881o466o833P031O806p065o303O777N928o556o019O709
$$ 6602 677 -6869 -112 6769 303 -6530 501 7307 242 -6061 716 6644 88 -5931 778
2635G78O122o977n650O577N403o677n497O801N626o836n490O450N349p104m878
$$ 778 6900 -77 -5727 850 6253 -424 -5921 880 6506 -330 -5820 630 5979 -1125 -6003
2650f003O621N150o565n503O804N290o998n284O974N131p200m916P433M681p411
$$ -6003 618 5768 -797 -6300 504 5794 -1204 -6488 486 5617 -1583 -6499 934 5615 -1796
2665a796m799Q075M596q172m205Q304L781q143m107Q646L731q416l222Q204L815
$$ -1796 -6595 1480 6076 -2096 -6301 2003 5784 -2359 -6466 2180 5911 -2505 -5727 2477 6292
2680F292q964k523Q225K564q389k636Q691K313q251k014Q098K046q324j673Q149
$$ 6292 -2672 -5195 3030 5594 -2795 -5431 3260 5573 -2678 -4692 3406 5452 -2872 -4545 3604
2695C604J818q377j496P883J490p956j872Q314J361q054j365Q312Q17p901j188
$$ 3604 5422 -2955 -4451 3432 4922 -3034 -4906 3408 4769 -3285 -4650 3662 4479 -3422 -4610
2710d610P844J274q378r08Q187O44q559m09Q942J07q726o9Q779m24q426P09Q124
$$ -4610 3234 4508 -3870 -4778 3409 4053 -4506 -4915 4027 4134 -4592 -4661 4118 3694 -4732 -4023 4101
2727D101p19q172J032Q385j098q298J668P567r50p925J348P977j397p269J156
$$ 4101 3382 -4790 -3758 4627 3529 -4769 -3101 4466 3516 -4409 -3061 4916 3519 -3750 -2594
2742b594P130j473o996J131P578j494p541J737P456j855p457J682P459j739p505
$$ -2594 4536 3063 -3933 -2802 4776 3282 -4259 -2522 4934 3079 -4378 -2696 4763 3024 -4481
2757d481J713P961k431p737K315Q035k901q203L317P852l828p582L788P598l905
$$ -4481 -2768 5193 2762 -4975 -2660 5375 2474 -5729 -2412 5440 1612 -5970 -2182 5416 1511
2772A511p448L715P441m133p026M371O745m287o611M496O184m370n797M189N877
$$ 1511 -5937 -2222 5219 1086 -5940 -1569 5176 889 -5722 -1226 4958 588 -5209 -1020 4857
2787D857m005n814M221N451l899n495M072N449l511n829M081N908m054o042L879
$$ 4857 852 -4962 -741 4710 811 -4684 -612 4837 1326 -4503 -422 5486 1432 -4610 -731
2802g31O614n050n683M412O219m982o281N492N672m781o506N755N521o114m939
$$ -731 5883 833 -4850 -438 5781 799 -5482 10 5682 901 -5605 150 5671 -443 -5382
2817e382N478N201n760n259O339M427o345l942O096L552n902m075O315L521n668
$$ -5382 96 5297 -463 -5722 617 5044 -1301 -5243 853 4405 -1497 -5572 743 4264 -1404
2832a404l816N686L740n521l497N187L946n243l711N267L867n261m023O010L853
$$ -1404 -5220 466 4206 -1315 -4812 375 4321 -922 -4633 634 4501 -760 -4783 1227 5080
2847E080o165l331N936L684o294l549O746L377p071k961O857K862o992k451P073
$$ 5080 -1085 -4416 1520 5204 -1090 -4639 2107 5484 -1587 -4548 2309 5171 -1821 -4272 2801
2862B801K232p207j981P202J446o839j447O660Q69o048j104O079O93n927j130
$$ 2801 5033 -2174 -4155 3047 4493 -2346 -3793 2867 3736 -2312 -3416 2663 3356 -2571 -3701
2877c701O133N94n489j001N506Q22n425j113N493J516o111j177O100J301o179
$$ -3701 2432 3026 -2463 -3464 2042 2864 -2561 -3674 1819 3335 -2776 -3953 2147 3448 -2731
2892b731j715O704J382o561j561P179R80o988p90P757M19p777J47P772n41p815
$$ -2731 -4446 2258 3640 -2921 -4482 2697 3677 -3311 -4101 3656 4075 -3702 -3555 4217 3676 -4139
2908d139J458P272j344p105J593P351k402o585K082O442k314o062K472N217k132
$$ -4139 -2681 4591 3247 -3858 -2265 5086 2684 -3901 -1819 4623 2309 -3753 -1281 3936 1804
2923A804n396K140M865j867m743J808M340j074n007J082M871j227m431P41M729
$$ 1804 -3592 -1452 3413 1546 -3197 -1389 2951 1877 -3130 -2048 2823 1596 -2835 -2094 2635
2938B635q65n364J075N339q97n686J139O110j718o072J773O567k146o916L077
$$ 2635 1770 -3594 -2519 2820 1923 -3763 -2624 3486 1768 -4304 -2531 4036 1890 -5026 -1949
2953a949O206k624o222L138O026l554n621M008N329m045n044M271M727m151m173
$$ -1949 4257 1633 -4589 -1451 4575 1021 -4600 -592 4737 692 -4352 -81 4646 495 -3678
2968c678M116L834l504l975L244M010l540l682L385L582l090l605K657L595k633
$$ -3678 438 4272 768 -3207 37 4047 507 -3175 210 3792 702 -2903 -246 3349 716
2983G16l810K497M363l292m499L322M703l560m815L994M321m115m610M752L872
$$ 716 -3094 -597 3766 474 -4025 -703 4000 440 -4375 -381 3940 -175 -4785 -33 3839
2998C839m496m327M810M295n350l327N478K977n718k327N447K536n132k383M909
$$ 3839 -657 -4984 -174 4121 -1229 -4556 922 3899 -1819 -4146 1301 3837 -1295 -3678 1231
3013A231K278m705j922M447K035m376j590L887J817l722k015L565K761l575k765
$$ 1231 3509 -1196 -3118 1329 3364 -1012 -2602 1285 3102 -620 -2635 930 3691 116 -2649
3028b649L700K325l648k655L835K850m198l067M425K889m664k790M660L049n595
$$ -2649 1051 3376 -272 -2927 908 3758 -440 -3507 918 3807 -857 -3647 1013 4062 -1533
3043a533k113N399K317o086k045N964J412o016r70N846O45n793j93N208L27n133
$$ -1533 -3646 1753 4070 -2016 -4061 1903 3315 -2701 -3671 2175 2820 -2973 -3166 2042 2369 -2764
3059b764j54N117m36m525J12M701j98m051J13L604M33l654j48M040K62l914l31
$$ -2764 -2918 2199 1763 -2762 -2650 2051 1853 -2198 -2085 1519 1952 -1702 -1850 2190 2452 -1462 -1793
3076a793L676P08l890o96L950J147m773j067N026N34m999k72N043L49n135j76
$$ -1793 1883 2591 -1299 -1995 1955 3102 -1671 -2738 2288 2822 -2177 -2449 2594 2943 -2192 -2368
3092b368N230k62n264O62M824q18n257J341M891j387m848J341M629j783m080J768
$$ -2368 2862 2600 -2664 -2002 2822 2004 -3253 -1912 2979 1592 -3256 -1915 2714 931 -3149 -1381
3108a381L890j583m019J533L669j546l532J529L571j455l542J863L158j005l715
$$ -1381 2509 926 -3093 -1560 2109 563 -2969 -1440 2131 676 -2866 -1003 2155 1150 -2565
3123b565J493L469j068l683R22M207j265m126J170M611j752m043J868M064k015
$$ -2565 -1072 2397 1329 -2354 -1432 2775 1510 -2616 -1446 3165 1413 -2630 -762 3302 1287
3138A287m175K628L845k669l685K646L544k958l562L024L600l372l128K911L092
$$ 1287 -2888 -260 3585 916 -2769 -123 3421 463 -3099 -75 3525 153 -2975 -64 3028
3153C028l015k680K749K171k389k606K595K391k557k287K301K482k331k443K043
$$ 3028 13 -2667 82 2253 -136 -2742 -147 2244 -313 -2600 -299 2183 -148 -2591 -548
3168e48K660k228k686K258K677k316k884K902K892k916k940K940K884k890k694
$$ -548 2112 -116 -2802 -544 2133 -183 -3067 -165 2727 -189 -3129 -189 2695 -195 -2889
3183b889L159L245l912k571L877K111l484k296L636K106l797j653L771J568l774
$$ -2889 270 3515 -397 -2968 909 3020 -464 -2760 876 2982 -815 -2468 1303 2871 -903
3198i03j532L811J171l295j372L322J342l464j028K903J213l374q57L010R40k809
$$ -903 -2435 1376 2547 -748 -2120 1202 2544 -920 -1948 955 2168 -1206 -2063 947 1887 -922
3214i22j317K788J511l009j634K896J595l046j375K984J812l893o00L329J107
$$ -922 -2239 549 2060 -949 -2583 313 1908 -1138 -2513 471 2283 -1610 -2210 1119 2226
3229B226l847j111L890J036l623r53L998L77l672r9L535L87l973K35L414K52l554
$$ 2226 -1621 -2732 1158 2194 -1429 -2382 1616 1993 -1679 -1778 1757 2144 -1829 -1594 1820 2072 -1482
3246a482Q8L384j18l284J24L182R2l578M19K818j08k877J91K824j39k823L8L180
$$ -1482 -1394 1990 1872 -1412 -1288 1894 1986 -1592 -1173 1645 1537 -1340 -1149 1675 1536 -1287 -1249 1931
3264A931m51k929l26L325r1l642M37L413m75l001R4L006p7l321M55L141o95k961
$$ 1931 1480 -1449 -1775 1550 1459 -2183 -1746 1667 1192 -1809 -1715 1291 1214 -2107 -1652 1489 794 -2167
3282b167J001K801p46l436Q51L520q27l296J194K818r89k646J314K688j220l004
$$ -2167 -1166 1635 889 -2547 -1696 1824 997 -2299 -1105 1713 724 -1922 -608 2080 860 -2144
3298b144J602K288q37k781J453K668j501k418J315K580j239k271J163K271j612
$$ -2144 -542 1746 909 -1872 -419 2249 748 -1670 -355 2225 986 -1285 -122 2149 537
3313E37k028J399K406j742k164J509K127j669k237J394K339j480k303J047K432
$$ 537 -1491 -92 2314 572 -1592 -83 2044 375 -1862 -468 1871 391 -1912 -865 1567
3328A567j529k115J511K344j864k016J574K389j843k105J293K449j855j990J950
$$ 1567 38 -2077 -566 1778 -86 -2102 -528 1861 18 -2087 -794 1655 -200 -2190 -240
3343b40J981j681k291K426J679j824k030K182J710j983j817K461J401k372j399
$$ -240 1741 60 -2231 195 1874 50 -1980 202 1912 -71 -1888 573 1974 -398 -1797
3358a797K514J164k599o27K218J183k097j492K540P64j881j244K200J143k282
$$ -1797 717 1881 -718 -1345 873 2056 -41 -1533 1007 1771 -110 -1354 846 1989 -293
3373b93p56J796R13k060j075K002R87j971j323K138J213k124j432K279J267j985
$$ -293 -1049 747 1660 -400 -1475 527 1514 -457 -1780 358 1571 -553 -1985 294 1561 -424
3389d24j396K114J253k634j168K613J066k330j111K881N57k577p58K661M26k118
$$ -424 -1820 294 1547 -1087 -2255 358 1424 -906 -2017 864 1421 -1156 -1914 747 1173 -945
3405i45o58K616N07k666j48K530J22k137L8J668K92j835l70K046L69k012j99K146
$$ -945 -1603 1013 1520 -1146 -1294 1236 1358 -779 -741 927 1219 -616 -986 1060 1429 -583 -782 1364
3423A364J83j976m28J794O68k304l14K231L08k292m39K468K50k479k95K323J49
$$ 1364 1547 -429 -857 937 1605 -699 -1013 1218 1526 -766 -1205 1263 1513 -966 -1261 1062 1211
3440A211k612J4K389K33k888J64K926o97k689O97K338p30j994M01K753j188k161
$$ 1211 -1401 -1387 1002 1235 -1653 -1489 1437 740 -1949 -1252 1086 356 -1638 -1237 1516 328 -1833
3457a833J137K067j172j753J081J841p16j662P98J246n87j163M36J338J1j737
$$ -1833 -696 1371 199 -1554 -473 1368 652 -1010 -212 1034 447 -716 -280 1058 1069 -668
3473f68K14J775k41j715J75J906l51k035P1K277k11k262K60K555r80k087P21K256
$$ -668 -454 1321 1080 -635 -460 1446 1095 -940 -869 1408 1197 -1065 -805 1750 770 -1317 -596 1660
3491A660j038k199R06K200j404k026J195K104j435j732J638J242j410j132J223
$$ 1660 622 -1577 -671 1529 125 -1901 -706 1398 -37 -1769 -131 1111 -299 -1431 -208
3506b08J260j429j398J788P01j085p36J197O91j017j134J357R80q73j138J272
$$ -208 1052 -377 -1775 13 714 -371 -1107 90 781 -236 -1370 -13 967 94 -1044 228
3522B28J051q73j235R10J456j133j706J082J838j171j519J345J623j588j501J608
$$ 228 1279 406 -829 81 1537 404 -1302 -220 1618 447 -1072 273 1896 308 -1193 415
3538D15J302j797j378K007R88j763j184J922P78j704q03J638N79j579l89J565
$$ 415 1717 -80 -1458 549 1537 -226 -1410 512 1290 -414 -1217 421 1000 -579 -968 597
3554E97K31j463l55J304L12j339k72R79Q07j350q10J449N09r94o77J164Q44j319
$$ 597 828 -635 -990 314 626 -713 -985 -6 801 -549 -1359 90 599 -395 -1072 92 936 -383
3572c83j058J598R25j375r24J884P18j689n63J759L66k032K4J650M99k410M01
$$ -383 -1441 157 1082 -293 -1217 667 1385 -304 -867 892 1258 -774 -750 900 1399 -1011 -610
3589f10J752j89j927N87J302m34j242M69J358m65j449P18J002k59j277J17J256
$$ -610 1142 953 -974 -387 915 481 -761 -292 1066 601 -848 -130 872 613 -664 -547 709
3606G09k00j069J48O14L50j349M3R63L87r91j106J716N83j729m61J776K63j611
$$ 709 509 -560 -412 202 552 -797 -754 209 596 -395 -1501 215 798 -931 -1392 384 647 -964
3624i64K8J513Q7k042N91J793p9j791j6K312p83j559O41J801r44j636J221J070
$$ -964 -936 577 664 -1378 -787 1006 927 -864 -880 1432 649 -910 -269 1532 588 -1048 173 1243
3642A243o77j208N83J284q45r73O87J050j034p24N74Q67m73p69P59K17j07j181
$$ 1243 566 -642 -59 1225 380 -593 94 1144 110 -614 -40 827 354 -415 344 561 454 -727
3660g27P36L29J12j134K80J092n65r74K96J192r5j913P20J314m42j437O06J532
$$ -727 9 338 450 -684 -404 688 123 -851 -555 637 542 -1371 -651 663 221 -1216 -610 922
3678I22q18j228R40Q70r27r90R42J300j132q01Q95O76r69o7N84P07q57n94R85
$$ 922 104 -1124 -184 686 -241 -1231 -289 1011 -121 -922 -27 649 -320 -387 197 904 47 -547 438
3697D38K85o95m03O53K35j90r39Q77N29m45p60r4J527p15r70O26J052o69j233
$$ 438 723 28 -375 278 513 323 -616 261 790 345 -415 -509 1018 303 -667 -41 1011 342 -891
3716h91J009R00q88j195J223J123j674q35J377N20j259n12J290K95j469k20J804
$$ -891 118 1018 130 -1065 158 1281 -393 -1228 149 669 -590 -1102 188 483 -986 -1206 598
3733E98j41j197R3J338k87j132L6Q91J46q34j19Q61K18r61j31Q25J96l09l91P91
$$ 598 457 -740 -647 691 404 -728 -692 199 345 -489 -608 253 471 -490 -621 204 400 91 -300 491
3753D91M12q42n11R02N28p65o03J112L57j207n41J197P98j731k59J383M18j846
$$ 491 903 61 -450 452 980 215 -388 724 1081 -126 -667 530 1328 -403 -662 721 1139 -707
3771g07n8J449j91j131l66J379jj367K37J670j017p20K51J348p53q09M70N93k65
$$ -707 -765 684 493 -638 -1004 375 374 -993 -756 914 -103 -823 -572 776 23 -786 -316 277 12
3790A2o53K86P28m4o70l2O81J15r53K19P36K41j022k47Q66K10r69J21J080K11
$$ 12 -641 -355 373 329 -341 -373 308 423 -530 -311 425 666 -356 -603 263 473 -496 -375 705 916
3810I16j437K37J147q2j128J42J146l73j179N64J012o57r30K97R11o85n50R80
$$ 916 -521 -284 863 781 -347 -205 941 568 -611 -47 965 308 -622 -325 586 -99 -649 331
3828C31L99q26o00N89N82l96n51M06M98p17k80K93M74j59q46L10L64R4r81L88
$$ 331 730 -96 -696 -107 475 79 -472 -66 432 -285 -565 -272 202 43 -803 -493 -129 -35 -1016 -628
3848f28J221m12j132O44J118p93q03K45J370q24n16N32R05p73q91R85P39r45p00
$$ -628 593 181 -951 -307 811 18 -785 -540 830 6 -510 22 927 154 -737 248 987 42 -658
3867f58O43R56o76o17N81O53j080j36J110M3p52p7N06J94q25j47N39K24l75m20
$$ -658 -15 941 265 -352 229 882 -198 -334 776 819 67 -10 496 690 -135 -282 257 481 106 -314
3887c14L46L64n50j77k8O00j85q35M14R85r08p46P84P45n08p67O69P87j185m35
$$ -314 32 396 -154 -331 -359 241 56 -779 -365 620 -288 -1034 -250 495 -13 -780 -111 676 -509 -944
3907i44R47O11j105l97R34M30q72m43J196N64j094k11Q87q1m44m2L49M41n94n64
$$ -944 3 614 -491 -888 46 476 -396 -839 357 921 -173 -384 503 422 -22 -64 285 726 132 -432
3927d32J000P8n75j46N51P2n24j33M88J45o81j68M49K15l40n27R00R0r22k31Q82
$$ -432 568 646 71 -75 476 548 24 -109 379 524 -157 -325 124 339 -1 -528 372 462 -460 -691 191
3948A91N50j475J12O87N03r50m30J004K86j010j90Q61M2p72j16J105j53q39K87
$$ 191 741 -734 -622 65 568 -382 -812 192 478 -532 -722 139 181 -591 -707 398 245 -594 -307
3967c07P50p4p97K37L22J6k39j57N57j08k43k57O86K06o11l59R43l54n76K99L09
$$ -307 443 369 -428 -191 131 147 -92 -249 308 200 -43 -300 386 592 -19 -378 565 211 -365 -66 243
3988B43J55o15J26O32j53p14j9P91j38r57L13R63n36q87N85Q01k09j068K35Q27
$$ 243 398 -217 -91 541 388 -326 -345 446 308 -649 -336 627 91 -796 -211 590 381 -687 -452 375
4008C75m55n39L2R85m08p34M14O49l32m33K07K70j72m27K97N12k58l03J37O93
$$ 375 -80 -619 -587 398 -10 -744 -330 319 -13 -446 -239 31 -141 -568 -271 241 -17 -320 -183 510
4028E10o11j72K60M05l51l12M06O75o98l12J04P21j05j088O45L14k35l51L05M97
$$ 510 -101 -273 -13 392 41 -271 135 810 112 -200 -96 625 520 -568 77 391 156 -195 110 607
4048F07o66l75M11M23n68k74N71L15n71n40M65P85o50m24N73J03n47r1pP12o98
$$ 607 -59 -434 -23 400 -168 -442 129 444 -127 -667 -202 583 -67 -491 82 185 -362 -453 -460 252 -446
$$ [...]
8191d83
##END NTUPLES=NMR FID
##END=
