##TITLE=1H_2Mal-2
 CDCl3
 8 sc, 
 6.6.2023
##JCAMPDX= 6.0         $$ Bruker NMR JCAMP-DX V2.0
##DATA TYPE= NMR FID
##DATA CLASS= NTUPLES
##ORIGIN= UXNMR, Bruker Analytische Messtechnik GmbH
##OWNER= root
$$ XWIN-NMR		Version 3.5
$$ Tue Jun  6 15:24:58 2023 Russian Standard Time (UT+4h)  she@DPX200
##.OBSERVE FREQUENCY= 200.13135
##.OBSERVE NUCLEUS= ^1H
##.DELAY= (6, 6)
##.ACQUISITION MODE= SIMULTANEOUS
##.ACQUISITION SCHEME= undefined
##.AVERAGES= 8
##.DIGITISER RES= 18
##SPECTROMETER/DATA SYSTEM= spect
##.PULSE SEQUENCE= zg30
##.SOLVENT NAME= D2O
##.SHIFT REFERENCE= (INTERNAL, D2O, 0, 15.7039)
##AUDIT TRAIL= $$ (NUMBER, WHEN, WHO, WHERE, WHAT)
$$ ##TITLE= Audit trail, XWIN-NMR		Version 3.5
$$ ##JCAMPDX= 5.01
$$ ##ORIGIN= Bruker BioSpin GmbH
$$ ##OWNER= she
$$ F:/spectra/data/she/nmr/H-F/1/audita.txt
$$ ##AUDIT TRAIL=  $$ (NUMBER, WHEN, WHO, WHERE, WHAT)
(   1,<2023-06-06 15:23:59.54 +0400>,<she>,<DPX200>,
      <created by zg, POWCHK disabled, PULCHK disabled
       configuration hash MD5:
       00 E9 B6 7A A2 85 ED C7 34 08 36 98 17 FE 4E 26
       data hash MD5: 16K
       23 ED C4 B5 E8 D2 CA 62 A2 57 19 47 39 74 9A 58>)
$$ ##END=
$$ 
$$ hash MD5
$$ EA 0F 4F 96 0D BB 6E 57 48 F1 90 A0 31 41 77 FD
##$RELAX= 
##$RELAX= 
##$RELAX= 
##$RELAX= 
##$RELAX= 
##$RELAX= 
$$ Bruker specific parameters
$$ --------------------------
##$DU= <F:/spectra>
##$EXPNO= 1
##$NAME= <H-F>
##$PROCNO= 1
##$TYPE= <nmr>
##$USER= <she>
##$AMP= (0..31)
100 100 100 100 100 100 100 100 100 100 100 100 100 100 100 100 100 100 
100 100 100 100 100 100 100 100 100 100 100 100 100 100 
##$AQSEQ= 0
##$AQ_mod= 1
##$AUNM= <au_zg>
##$AUTOPOS= <>
##$BF1= 200.13
##$BF2= 200.13
##$BF3= 200.13
##$BF4= 200.13
##$BF5= 200.13
##$BF6= 200.13
##$BF7= 200.13
##$BF8= 200.13
##$BYTORDA= 1
##$CFDGTYP= 0
##$CFRGTYP= 5
##$CHEMSTR= <none>
##$CNST= (0..31)
1 1 145 1 1 1 1 1 1 1 1 1 1 1 1 1 1 1 1 1 1 1 1 1 1 1 1 1 1 1 1 1 
##$CPDPRG= <>
##$CPDPRG1= <>
##$CPDPRG2= <>
##$CPDPRG3= <>
##$CPDPRG4= <mlev>
##$CPDPRG5= <mlev>
##$CPDPRG6= <mlev>
##$CPDPRG7= <mlev>
##$CPDPRG8= <mlev>
##$CPDPRGB= <>
##$CPDPRGT= <>
##$D= (0..31)
0 1.2 0 0 0 0 0 0 0 0.06 0 0.03 0 0 0 0 0.0002 0 0 0 0 0 0 0 0 0 0 0 0 
0 0 0 
##$DATE= 1686050639
##$DBL= (0..7)
120 120 120 120 120 120 120 120 
##$DBP= (0..7)
150 150 150 150 150 150 150 150 
##$DBP07= 0
##$DBPNAM0= <>
##$DBPNAM1= <>
##$DBPNAM2= <>
##$DBPNAM3= <>
##$DBPNAM4= <>
##$DBPNAM5= <>
##$DBPNAM6= <>
##$DBPNAM7= <>
##$DBPOAL= (0..7)
0.5 0.5 0.5 0.5 0.5 0.5 0.5 0.5 
##$DBPOFFS= (0..7)
0 0 0 0 0 0 0 0 
##$DE= 6
##$DECBNUC= <off>
##$DECIM= 32
##$DECNUC= <off>
##$DECSTAT= 4
##$DIGMOD= 1
##$DIGTYP= 9
##$DL= (0..7)
0 120 120 120 120 120 120 120 
##$DP= (0..7)
150 150 150 150 150 150 150 150 
##$DP07= 0
##$DPNAME0= <>
##$DPNAME1= <>
##$DPNAME2= <>
##$DPNAME3= <>
##$DPNAME4= <>
##$DPNAME5= <>
##$DPNAME6= <>
##$DPNAME7= <>
##$DPOAL= (0..7)
0.5 0.5 0.5 0.5 0.5 0.5 0.5 0.5 
##$DPOFFS= (0..7)
0 0 0 0 0 0 0 0 
##$DQDMODE= 0
##$DR= 18
##$DS= 0
##$DSLIST= <SSSSSSSSSSSSSSS>
##$DSPFIRM= 0
$$ [...]
##$SUBNAM2= <"">
##$SUBNAM3= <"">
##$SUBNAM4= <"">
##$SUBNAM5= <"">
##$SUBNAM6= <"">
##$SUBNAM7= <"">
##$SUBNAM8= <"">
##$SUBNAM9= <"">
##$SW= 18.05172834244
##$SWIBOX= (0..15)
0 0 2 0 0 0 0 0 0 0 0 0 0 0 0 0 
##$SW_h= 3612.71676300578
##$TD= 16384
##$TD0= 1
##$TE= 0
##$TE2= 300
##$TE3= 300
##$TEG= 300
##$TL= (0..7)
0 120 120 120 120 120 120 120 
##$TP= (0..7)
150 150 150 150 150 150 150 150 
##$TP07= 0
##$TPNAME0= <>
##$TPNAME1= <>
##$TPNAME2= <>
##$TPNAME3= <>
##$TPNAME4= <>
##$TPNAME5= <>
##$TPNAME6= <>
##$TPNAME7= <>
##$TPOAL= (0..7)
0.5 0.5 0.5 0.5 0.5 0.5 0.5 0.5 
##$TPOFFS= (0..7)
0 0 0 0 0 0 0 0 
##$TUNHIN= 0
##$TUNHOUT= 0
##$TUNXOUT= 0
##$USERA1= <user>
##$USERA2= <user>
##$USERA3= <user>
##$USERA4= <user>
##$USERA5= <user>
##$V9= 5
##$VALIST= <valist>
##$VCLIST= <CCCCCCCCCCCCCCC>
##$VD= 0
##$VDLIST= <DDDDDDDDDDDDDDD>
##$VPLIST= <PPPPPPPPPPPPPPP>
##$VTLIST= <TTTTTTTTTTTTTTT>
##$WBST= 1024
##$WBSW= 4
##$XGAIN= (0..3)
0 0 0 0 
##$XL= 0
##$YL= 0
##$YMAX_a= 855132
##$YMIN_a= -953632
##$ZGOPTNS= <>
##$ZL1= 120
##$ZL2= 120
##$ZL3= 120
##$ZL4= 120
##$ABSF1= 10
##$ABSF2= 0
##$ABSG= 5
##$ABSL= 3
##$ALPHA= 0
##$AQORDER= 0
##$ASSFAC= 0
##$ASSFACI= 0
##$ASSFACX= 0
##$ASSWID= 0
##$AUNMP= <proc_1d>
##$AZFE= 0.1
##$AZFW= 0.1
##$BCFW= 1
##$BC_mod= 2
##$BYTORDP= 1
##$COROFFS= 0
##$CY= 11.3945322036743
##$DATMOD= 1
##$DC= 2
##$DFILT= <>
##$DTYPP= 0
##$F1P= 15.7292609196834
##$F2P= 12.9074282941183
##$FCOR= 0.5
##$FTSIZE= 0
##$FT_mod= 4
##$GAMMA= 1
##$GB= 0.15
##$INTBC= 1
##$INTSCL= 1
##$ISEN= 128
##$LB= 0.24
##$LEV0= 0
##$LPBIN= 0
##$MAXI= 10000
##$MC2= 0
##$MEAN= 0
##$ME_mod= 0
##$MI= 1.114404
##$NCOEF= 0
##$NC_proc= 0
##$NLEV= 6
##$NOISF1= 3.799351
##$NOISF2= 2.8
##$NSP= 1
##$NTH_PI= 0
##$NZP= 0
##$OFFSET= 15.70392
##$PC= 1
##$PHC0= -19905.11
##$PHC1= 8.85272
##$PH_mod= 1
##$PKNL= yes
##$PPARMOD= 0
##$PSCAL= 0
##$PSIGN= 0
##$REVERSE= no
##$SF= 200.130013532006
##$SI= 16384
##$SIGF1= 3
##$SIGF2= 2
##$SINO= 400
##$SIOLD= 16384
##$SREGLST= <1H.CDCl3>
##$SSB= 0
##$STSI= 0
##$STSR= 0
##$SW_p= 3612.71676300578
##$SYMM= 0
##$S_DEV= 0
##$TDeff= 0
##$TDoff= 0
##$TI= <>
##$TILT= no
##$TM1= 0
##$TM2= 0
##$TOPLEV= 0
##$USERP1= <user>
##$USERP2= <user>
##$USERP3= <user>
##$USERP4= <user>
##$USERP5= <user>
##$WDW= 1
##$XDIM= 8192
##$YMAX_p= 0
##$YMIN_p= 0
$$ End of Bruker specific parameters
$$ ---------------------------------
##NTUPLES= NMR FID
##VAR_NAME=  TIME,          FID/REAL,        FID/IMAG
##SYMBOL=    X,             R,               I
##VAR_TYPE=  INDEPENDENT,   DEPENDENT,       DEPENDENT
##VAR_FORM=  AFFN,          ASDF,            ASDF
##VAR_DIM=   8192,          8192,            8192
##UNITS=     SECONDS,       ARBITRARY UNITS, ARBITRARY UNITS
##FACTOR=    0.0002768,     1,               1
##FIRST=     0,             0,               0
##LAST=      2.2672688,     0,               0
##MIN=       0,             -953632,         0
##MAX=       2.2672688,     855132,          0
$$ Real data points
##PAGE= N=1
##DATA TABLE= (X++(R..R)), XYDATA
0@%%%%%%Ll%%Mj2J6j6J6j8K6l4L7m2N0o0P2q4R6j09J25j45J67j89K11k36K66l02
34a61L40l77M18m64N16n72O33p01P73q49R34j031J133j242J366j505J659j830
52i60K021k235K479k763L094l485L955m529N245o168P395r095J1581j5482K2247
67A3300l5913P2363l16361o22249J631405k48303j447874J062138M56193j113809
77e49110O26866M97386j082068L28364O73435q59444J97905P94910q31669k23755
87d27180Q00729m34216j92821P08603n04116m05511P94993k80208n45340Q62449
97C77382l450r24806M82543M51544o18339J83030L87172n14885K5928L41597l60427
108a72711J40109M25569n32482j90886N72852j87073l04450M58299k4346m44917
$$ plain form
0 0 0 0 0 0 0 0 3 0 0 0 4 -8 8 -8 8 -10 16 -18 19 -23 27 -33 39 -45 51 -58 67 -78 89 -100 111 -125 141 -161
34 -161 179 -198 220 -244 272 -300 333 -368 405 -444 490 -541 592 -650 716 -789 870 -960
52 -960 1061 -1174 1305 -1458 1636 -1849 2106 -2423 2822 -3346 4049 -5046 6535 -8947 13300
67 13300 -22613 49750 -266611 -888860 742545 494242 -953632 108506 564699 -549110
77 -549110 77756 575142 -506926 -178562 494873 -364571 -166666 628244 -203425 -427180
87 -427180 373549 -60667 -253488 455115 -49001 -454512 340481 60273 -485067 377382
97 377382 373932 -550874 -68331 383213 -235126 -52096 335076 -179809 -153881 187716 -172711
108 -172711 -32602 392967 -139515 -330401 242451 55378 -249072 209227 184881 -260036
118b60036K04058J76759k01600J27554J07969k69495l0421K07414p242p4629N0434
129C0765M3727j17322j33226J82925K02418k20019j23573K07117p5395j42482
139a45065K32552N0075j91118L9972k2226p4567K19652P259k26100J33818L0524
150E4776k41028K00980J88387k77868L3772J39833k74698J16844L22976l17037
160e3063r6899L36862k62613j72358M72302q5630l51603K94612j4816l13083L58226
171A11937J08199m23247K11963J71607m43484K00570M01378m32892q1590L88852
181B13293l03871j20214M72369j90503k92537L60933j08914l06394M28600O3544
191B16306m41105K23987J57792l77700J94132K94949l63948j1260K67307k86196
$$ plain form
118 -260036 -55978 120781 -80819 46735 154704 -114791 -145212 62202 54960 -19669 30765
129 30765 74492 -42830 -176056 6869 209287 -10732 -134305 72812 -2583 -145065
139 -145065 87487 137562 -53556 -13584 -35810 -110377 109275 116534 -109566 24252 54776
150 54776 -186252 14728 203115 -74753 -40981 98852 -175846 -59002 263974 -53063
160 -53063 -149962 186900 -75713 -248071 224231 138601 -213002 81610 66794 -246289 111937
171 111937 220136 -203111 8852 180459 -263025 -62455 338923 -93969 -175559 213293
181 213293 -90578 -210792 261577 71074 -221463 139470 30556 -275838 152762 216306
191 216306 -224799 -812 156980 -220720 -26588 268361 -95587 -106847 160460 -125736
201a25736p623L84164k30048k08871L11113j14407k15851L48024K1661l24156
211a61730J67911Q3032k56703J81576J88132k88668Q8J94300j98281k260K72396
222A79793j45612j63986J78756m8775j14444K10462R955k06891Q3772N4541j37212
233i9641J16387J25818j79801l7310J17957q3737n017J61187p2739j32512Q5922
244c486R353o6464J15601L8357j49912n03Q1153n3952K6253R9911q8534r2269
256h4492P7294J3249l3409Q6159j132j25744J9679P3645l8135L0806O2326j00793
268b0547o0346Q9867O388k5329P1988l3839j10878N2242O5931m0492L6118K7930
280E9033j09525j8122R4119j0293j1867N1920o5003p4209P7390M1416l3671L5607
$$ plain form
201 -125736 -133359 250805 20757 -188114 122999 8592 -207259 140765 162426 -161730
211 -161730 6181 89213 -167490 14086 202218 -86450 -86362 107938 -90343 -92603 179793
222 179793 34181 -129805 48951 176 -114268 96194 106149 -100742 -16970 37571 -99641
233 -99641 16746 142564 -37237 -74547 43410 -40327 -45344 115843 43104 -89408 -3486
244 -3486 5867 -60597 55004 93361 -56551 -57054 24099 -29853 -3600 96311 7777 -84492
256 -84492 -7198 6051 -27358 58801 57669 -68075 -48396 25249 -12886 17920 80246 -20547
268 -20547 -80893 8974 15362 -9967 62021 28182 -82696 -30454 35477 -5015 31103 59033
280 59033 -50492 -68614 25505 15212 3345 55265 -9738 -83947 -6557 34859 1188 36795
292C6795j1051r2219K5411P7013j8614r26J7261p0014k6426P6177K0717k0100
304A4024J4439l5760n1702M4661N1909j3227n973j5245m9691Q040N8556J4278
316C4309j5030j4994l4525j2007M2962L5956o508k4132l0110j5561K3208M0426
328B3994J4829k3284l6471j2945J5161K9387K8793o222m7258k3318J9312J7785
340b37K3850J9125m1965m5714K3787K3132O008L4272j5504p1204Q745M4359j0167
353a513K4474K4748p6713k9605O7055q33o126N5513n0226p8332O5815L1705m1462
366a5500N7488J919j14308L1501Q1226n4564K2270O2142j11900l5584J16304k8731
378A2263l5891R4777o5279j07137J12640L2614q5551Q5404J2498j51509O1233
$$ plain form
292 36795 25744 -66475 -41064 35949 17335 16409 33670 -36344 -62770 13407 34124 14024
304 14024 28463 -7297 -58999 -14338 37571 24344 18371 3126 -46565 -38525 20031 34309
316 34309 19279 4285 -30240 -42247 715 36671 30163 6031 -24079 -39640 -16432 23994
328 23994 38823 15539 -20932 -33877 -18716 10671 39464 33242 -14016 -37334 -18022 -237
340 -237 23613 42738 773 -44941 -21154 1978 7986 42258 26754 -44450 -35705 8654 -1513
353 -1513 22961 47709 -29004 -58609 8446 7613 1487 57000 6774 -71558 -5743 25962 -15500
366 -15500 41988 43907 -70401 -38900 42326 -12238 10032 72174 -39726 -75310 40994 12263
378 12263 -23628 71149 5870 -101267 11373 43987 -41564 43840 56338 -95171 -33938
389c3938J04573r9242K9360Q6542j45522k6316J52348o0709m6726J24976q5146
400B00j13088J47381J7922j03760J04821j182j60186Q9358R3162j15597N0609
411I640P3355j60742P156J49580q3929k7015J18898j05824q7086J50095l131q8176
423d7179R7647j7497j30704Q6980P4626q4804L2404L9905j05741O178R1536l1015
435A2336j1580L3923o0279k5720O5189P445j3400J7224l2440l5053K9211L2123
447A8979P681j3490k5960n923m009J0028N2289p984n9372J9556M291l8284P6891
460C4693L3368j13649K0518O7072j01480L6439J36371j26932o8563J42808p4693
471a4048o7730J89194n9575j68802J64612M409j80813J89501P9640k65643R2332
$$ plain form
389 -33938 70635 -28607 753 87295 -58227 -84543 67805 7096 -39630 85346 200
400 200 -112888 34493 52415 -51345 53476 52294 -107892 -18534 74628 -40969 9640
411 9640 82995 -77747 -70591 78989 -4940 -31955 86943 -18881 -105967 44128 40997 -47179
423 -47179 50468 32971 -97733 -10753 63873 -20931 11473 51378 -54363 -48185 43351 12336
435 12336 756 34679 -25600 -51320 13869 21314 7914 25138 -7302 -42355 -13144 18979
447 18979 26660 13170 -12790 -18713 -22722 -12694 39595 31611 -27761 -8205 -3914 -42198 34693
460 34693 68061 -45588 -25070 42002 -59478 -23039 113332 -13600 -82163 60645 -14048
471 -14048 -81778 107416 47841 -120961 43651 48060 -132753 56748 136388 -129255 -36923
482c6923J56794k27647O6905K21673k46721m9071K56619j90570q8267L26184j48304
493D0672k43402L00187j6653k69217K74325P3054l34542J70284J45556l02798
503a62534J58201K24016l62028L1844L17682l02874n6595L97760k42790k30674
513b27992L85263j03549k82342L80416L036m09528K79520J71543l97582J62774
523c8441K90134l62110l2569L06468k01443o3288K60350j75443j11779K44185
533A16064j33058j17497K89786r6178k41226K44470K5603k34976J98232Q4202
543A35422k68587J04444J44422k20323O8333J98941k13231o4120K05271q6770
553C802q0417J55791n2380r9824J02626l1376n7479J38707l0758j49603R9171
$$ plain form
482 -36923 119871 -107776 -40871 180802 -65919 -114990 141629 -48941 -137208 188976 40672
493 40672 -202730 97457 80804 -188413 85912 158966 -175576 -5292 140264 -162534
503 -162534 -4333 219683 -142345 -110501 207181 -95693 -152288 245472 2682 -227992
513 -227992 157271 53722 -228620 151796 154832 -254696 24824 196367 -201215 -38441
523 -38441 251693 -110417 -142986 163482 -37961 -101249 159101 -16342 -128121 116064
533 116064 -16994 -134491 155295 59117 -182109 62361 87964 -147012 51220 135422
543 135422 -133165 -28721 115701 -104622 -36289 162652 -50579 -114699 90572 3802
553 3802 -76615 79176 26796 -73028 29598 -1778 -59257 79450 48692 -100911 -1740
564a740P0483j20799K5408J08165o6919q3855M9318O2388k6462m4373M3857J5191
576C0662r4016L1486J13420q6082n0459J24633p3371j11221J76514L2350j85480
587i1564P5879R6675j45104K0973J22941p6518k2002L4353p2835O5074P1886j39533
599e9775M1176J23627j81857j5639K27192j25805j18313K03130q0642j54124K31371
610I0341o900k18447J84822M6324k59417J62812J62725k64756N4265J90057k41953
621a00127J5638K60983k17519q2040K87298j80913j79938L45935m1317l00478
631a92478K42554Q1943k97971J53900J73078k52025M8294J60878k14671L7736
641e8762K12000j99855m7038K19367j59779r3567K52676q7567j61573K09191m5675
$$ plain form
564 -1740 68743 -52056 -26648 81517 14598 -69257 -19939 42449 15987 -28386 15471 30662
576 30662 -63354 -31868 81552 -4530 -54989 69644 -3727 -114948 61566 93916 -91564
587 -91564 -15685 80990 -64114 -43141 79800 3282 -18720 15633 -57202 7872 79758 -59775
599 -59775 -18599 105028 -76829 -92468 134724 8919 -109394 93736 13094 -141030 90341
610 90341 83441 -135006 49816 96140 -163277 -465 162260 -102496 -48231 141826 -100127
621 -100127 -84489 176494 -41025 -123065 164233 -16680 -196618 149317 108000 -192478
631 -192478 50076 132019 -165952 -12052 161026 -90999 -42705 118173 -96498 -58762
641 -58762 153238 -46617 -93655 125712 -34067 -127634 125042 37475 -124098 85093 39418
652C9418j90597K22480M4487k53915J39099J27793k47465O0365K14401j85888
662b9822o1391J84802j08125p9021J84122n7526j25612J43296j6309j39906J37798
673C2306N9375j62022M6333Q9181j16915J8971J12509q9321l8352R2376n6490
684a2049m5737J12317j6191r7277O1848L1786p6187L8458O0361o9374k0300N3007
696B0662l1524j3795O6258k3604o2345M8433J9580n8628L7900N1122p6003k0054
708d1998P1174k9942k9877P2434k2855p4147O1749K3908p0428N1452M5753j00148
720d2925P294Q6580o2945j9339Q9837n7927o5313R4984n961p2082Q1681P936j07639
733f5819N9328O1274r2929K7276P4526r9569j5463J04085n3936m0097R4773m4297
$$ plain form
652 39418 -151179 71301 115788 -138127 972 128765 -118700 -58335 156066 -29822
662 -29822 -91213 93589 -14536 -93557 90565 33039 -92573 50723 34414 -105492 32306
673 32306 91681 -70341 -24008 65173 -51742 -32771 79738 -9583 -47935 44441 -12049
684 -12049 -57786 54531 38340 -58937 2911 34697 -41490 -3032 57329 -12045 -32345 20662
696 20662 -10862 -24657 41601 17997 -44348 4085 23665 -34963 2937 54059 -21944 -41998
708 -41998 29176 -766 -30643 41791 18936 -55211 6538 30446 -39982 11470 57223 -42925
720 -42925 -35631 50949 -11996 -31335 58502 575 -64738 30246 24285 -47797 33884 41820 -65819
733 -65819 -6491 54783 -38146 -10870 63656 -35913 -51376 52709 -1227 -41324 53449 9152
745I152p8797R5528J0054q4001O8355K5693j04186M0769P1831p8026N756P1694
757E3822p5574k6548R1304l1633m7071P1711k1405p0562O6509K5174o6859L5358
769D226L0157p2334J6543O1482m6823j0511M9805m2910k8068O2461q176l9332
781b3480L9867m116m8272L7217K7938m1324J1045K1969m2036M153M3119k2790
793C290j4856K7730k1468k0059L7642L281k6023J6178N00k7428J8627K1075k1297
806b808o42J0429j9588R22K5128o334j2010Q643o945q891J7062P254j2175j715
820a670P50p358N117J2844k826r515j78M96k208P588Q130j0130r254O341m34k674
836d981J3443J85j8638L871R790r152P163J3982k0367q226J9214p438o551K3178
$$ plain form
745 9152 -69645 25883 35937 -48064 20291 45984 -58202 -17433 54398 -23628 -17872 53822
757 53822 -21752 -48300 43004 11371 -35700 36011 14606 -55956 10553 35727 -31132 4226
769 4226 34383 -37951 -21408 40074 -6749 -17260 32545 -10365 -38433 24028 15852 -23480
781 -23480 16387 12271 -36001 1216 29154 -12170 -1125 20844 -21192 -17039 26080 3290
793 3290 -11566 16164 -5304 -25363 12279 15560 -10463 5715 6215 -21213 -2586 18489 -2808
806 -2808 -3450 6979 -12609 -11687 13441 7107 -4903 3740 -3205 -12096 4966 12220 45 -1670
820 -1670 -920 -8278 -3161 9683 6857 -2658 -2836 -2340 -4548 3040 11170 1040 -8214 -1873 -2307 -4981
836 -4981 8462 8647 -9991 -6120 3670 -5482 1681 15663 -4704 -12930 6284 -1154 -7705 15473
850A5473r496k4234K0186O403j9491J9254Q912l2043O854K1269k0624M321K2453
863A9237k5643j0581K7485j0380j0242K6272j1920k3777K3293K954j8122J9129
875G705L924k6695R769J4122j4325O857J0172j7356j046J0601n242M210M713j1225
889c816J136K621n913J2124K203j6620R102L746j7440J7437J1280k9016R863J6883
903A3590l1173J1882L1853l8211l389M0714l6281j1815N6936l2005l5676O1069
915B7494j9236n0439O9455J21p4716O0693K3276q7651N3096N5147j01589K3646
927b0703Q3842r8457o068J13125q4298m9966J24023n2690q3827J26771j4335j17106
939g9689J07705K6217j30925Q5096O5300j39766M8057R8307j32815J3335J28211
$$ plain form
850 15473 5977 -18257 1929 8332 -11159 8095 17007 -15036 -8182 13087 -7537 -3216 19237
863 19237 -6406 -16987 10498 118 -10124 16148 4228 -19549 3744 6698 -11424 7705
875 7705 11629 -15066 -5297 8825 -5500 1357 11529 -5827 -6873 3728 -1514 2696 7409 -3816
889 -3816 -2680 -59 -5972 6152 8355 -8265 837 4583 -12857 4580 15860 -13156 -3293 13590
903 13590 -17583 -5701 26152 -12059 -15448 25266 -11015 -22830 34106 2101 -33575 27494
915 27494 8258 -42181 27274 27395 -47321 13372 36648 -51003 2093 57240 -44349 -20703
927 -20703 63139 -35318 -41386 71739 -12559 -62525 61498 8808 -75019 51752 37417 -79689
939 -79689 28016 54233 -76692 8404 73704 -66062 -18005 80302 -52513 -39178 89033
950H9033j18789l2627J45293q9752p2880J54077n0812j15389J42975l325j41163
961i3359J20428M5307j56294Q0128Q7472j51027L8127J19845j34389r871J38553
972H4920j04566m9721J44720o6901q6711J33756k4692j08381J12054J4009j18189
983f9702Q0936M5426j13916M9808O8402j01330J6742P9756p9905q807Q1132n6939
995h397k8217P4226l5760l8893O4149j6832m3800M9815q79m2363L5175P914l5663
1008a9525K1878J2406k6900J0336J1297j4378M066J502l47P099j7125N156K6079
1021B1544l2324p989N0036l4252l3795O8234j5893o3322O8475J3327q4590N2537
1033A988M6139q7197K4671O2700p6753O492O7666o8339O4P2558p6920p674R9097
$$ plain form
950 89033 -29756 -62383 82910 -6842 -79722 74355 23543 -91846 51129 47804 -93359
961 -93359 27069 72376 -83918 -3790 83682 -67345 -29218 90627 -43762 -53633 84920
972 84920 -19646 -69367 75353 8452 -78259 55497 30805 -77576 34478 48487 -69702
983 -69702 11234 56660 -57256 -7448 60954 -40376 -23634 56122 -23783 -32590 48542 -8397
995 -8397 -36614 37612 1852 -37041 27108 10276 -33524 16291 15412 -26951 8224 16138 -19525
1008 -19525 2353 14759 -12141 -1805 9492 -4886 -820 682 335 7434 -9691 -4535 21544
1021 21544 -10780 -18769 31267 -2985 -36780 31454 15561 -47761 20714 34041 -50549 1988
1033 1988 48127 -39070 -14399 48301 -28452 -21960 45706 -22633 -22569 49989 -26931 -34605 64492
1046F4492q1677l8877J27888o8598q6864J48331k6373j35849J38918K8304j71605
1057a01910J07401R3385j80793M9796J38978j62886p166J67616j28984n5843J75837
1068I5431r7541j00367J88661n0531j52241J76525J3142j92715J36651Q8019j98027
1079i2993O9246J31886j73420J1915J57254j35355l6373J56731j00854o7571J57454
1090G7920o6308r4273J48988m2427j21536J52956J165j61204J32178O1398j91311
1101a02454Q2644J36559j77217l630J68697j21685p1834J65792m9972j09962J24560
1112D1498J05j14666Q9318L9915j08248M6097N7392r1386J8924P4113p1103j2478
1124c0519P1617m9834l1175P5475j9739n6628N5051J1000o0240L0792M0459m7765
$$ plain form
1046 64492 -17185 -56062 71826 3228 -83636 64695 38322 -97527 41391 69695 -101910
1057 -101910 5491 98876 -81917 -32121 106857 -56029 -63195 104421 -24563 -80406 95431
1068 95431 -2110 -102477 86184 35653 -116588 59937 73079 -119636 17015 105034 -92993
1079 -92993 -23747 108139 -65281 -53366 103888 -31467 -67840 88891 -11963 -79534 77920
1090 77920 11612 -82661 66327 23900 -97636 55320 56485 -104719 27459 88857 -102454
1101 -102454 -19810 116749 -60468 -64098 104599 -17086 -88920 76872 26900 -83062 41498
1112 41498 41603 -73063 16255 56170 -52078 -5981 51411 -39975 -21051 53062 -18041 -30519
1124 -30519 41098 -8736 -39911 35564 15825 -40803 14248 25248 -34992 -4200 36259 -11506
1136a1506r561M0510j8954k0423L3391K53k8888J5710R266k4676J6683K1866l6691
1149a3020l628L9636k7916k1833N5473j2382n5475M7563J9372o4540L7341M6620
1161D7211q0416M782P9431o5942k9169R8579m2314p6080R1786O654q8324O9604
1173A5802L2699j00195M3183O2029r3692K1794Q5719r6086k1608J10070o0392
1184f77n5520J08787l1831q8867R4899R775r5448P7340L4946j14885M8105P6819
1196F3443j01676R910R4948q7249l2336J04663m7059n3139R4562k9177p9950Q7957
1208B4897J2308q9511O4266L8953r9809K9937P1649p4721j406P2473o3929k8046
1220d2939Q1409l2249m4907P2384j6160o8093O1204K3141o5694L3624L3165o6229
$$ plain form
1136 -11506 -21067 19443 489 -19934 13457 13710 -15178 532 9798 -14878 1805 23671 -13020
1149 -13020 -16648 22988 -4928 -26761 28712 16330 -39145 8418 27790 -36750 591 47211
1161 47211 -33205 -28423 51008 -14934 -44103 54476 12162 -63918 27868 34522 -53802 15802
1173 15802 48501 -51694 -8511 53518 -40174 -18380 67339 -28747 -50355 59715 -677
1184 -677 -56197 52590 20759 -68108 26791 36566 -58882 18458 53404 -61481 -13376 63443
1196 63443 -38233 -28323 66625 -20624 -52960 51703 4644 -48495 46067 16890 -63060 24897
1208 24897 37205 -52306 11960 50913 -48896 -18959 52690 -22031 -23437 49036 -14893 -42939
1220 -42939 38470 6221 -38686 33698 17538 -50555 10649 33790 -31904 1720 34885 -31344
1232c1344J3298N3370m5924o322N0878m2020k7355O0940j1582m0017M3224j053
1244A6093m9932L4457K6319m2946J3685K5778m4620K720M5460k7005j6442L7244
1256B0811k1260k9396M1884O041l5450K2429Q756l8313J8402L1311l1017k976
1268h778K7075k8381j1928M1719p655k8333K5330j824l1571K7303K1035l3713
1280i721M178K0574l0297P95L9100j9525k2065K7708j0438k4468L5988Q766l6771
1293a6176J4041J4455l2082J4492L3363l2112j1389K9542k0719j2895M1643q439
1305A3724l4170K5230L360l0320K9000J9304l9801M415K3551k9150N494L7020
1317B7657k7350j9791K9872j3252j5902L7902l958l5528K0745P186k6497K4639
$$ plain form
1232 -31344 -18046 35324 -10600 -16922 33956 -8064 -35419 25521 13939 -26078 17146 16093
1244 16093 -33839 618 26937 -16009 -2324 23454 -21166 -18446 27014 9 -16433 20811
1256 20811 -449 -29845 12039 18080 -17370 5059 13815 -24498 -6096 25215 -5802 -8778
1268 -8778 18297 -10084 -22012 19707 12052 -16281 9049 7225 -24346 2957 23992 -9721
1280 -9721 -5543 15031 -15266 -14471 24629 5104 -16961 10747 309 -24159 11829 20595 -16176
1293 -16176 -2135 12320 -19762 -5270 28093 -4019 -15408 14134 -6585 -19480 22163 13724
1305 13724 -20446 4784 8144 -22176 6824 26128 -13673 -9258 14293 -14857 -9363 27657
1317 27657 307 -19484 10388 -2864 -18766 19136 15178 -20350 395 7581 -18916 5723
1329E723J8136l6114J852K0781k1979O641K9014k4714j4317K2040j1819n846K9667
1342A9065j0670k3501J6816k079j2373K5089J962k6058Q744M382j3623J8603R805
1355A6162k3582K841O179j5608J7187J5453k4253L86J1142k0873J0878K7669k4766
1368a185r736K0830k0421l561L7398j5598k3262K4810j2552j8493M0436j737l5525
1381a8596K4601M61l4865L6699K0499m7646J3999K4068m5704J6044M7949m3388
1393e879j4089M1968l3632j5073N8289j9540l7838M0816j1642l6301N2458O726
1405B6263n2110L0823J1822n1370L6707L7065n8158O033L9288m9736K326O1422
1417D0375l9093k8338M8127k4741k8652N8726o285m6899L4183K205m0812M0380
$$ plain form
1329 5723 23859 -12255 -10403 10378 -11601 -4960 24054 -660 -14977 7063 -4756 -10602 19065
1342 19065 8395 -15106 1710 -369 -12742 12347 14309 -11749 -3005 1377 -12246 6357 16162
1355 16162 -7420 -4579 1600 -14008 3179 18632 -5621 -5235 5907 -14966 -4088 23581 -1185
1368 -1185 -10921 9909 -10512 -14073 23325 7727 -15535 9275 -3277 -21770 18666 16929 -18596
1381 -18596 6005 6466 -28399 8300 28799 -18847 -4848 19220 -26484 -10440 37509 -5879
1393 -5879 -19968 22000 -11632 -26705 31584 12044 -25794 15022 3380 -32921 19537 26263
1405 26263 -25847 4976 16798 -34572 2135 39200 -18958 -12925 26363 -23373 -21047 40375
1417 40375 1282 -27056 21071 -3670 -32322 26404 20119 -26780 7403 9608 -31204 9176
1429I176K1137m8000J2931K0144l8290J6971L6978l4896q730K5375k5346j724
1441a4274L7424j6353j8337J8185j4347p427L0179m491j8134J1281r550r790K5151
1454I517K348j5135O060q277q406K0284K379q009P005j6130q562K7367m103j1678
1468e340K1957j8326k6741L8326N809l1240K9705Q89n0606L2866L1551m6900J8712
1481F62L1190o2844P153O1878m5956j1983O0394n2082l4733Q1025k0760n0926
1493c6982P0573j6585p6202P4726K4675q1614N2615L3712r8395L6792P4311q5161
1505b7535Q283P8713r1017j8629J09996n8982n0296J04916m6794q4689J11894
1516C5860N553j00967Q2998K4135j19721O6113P3662j10858K6303Q5596j10281
$$ plain form
1429 9176 30313 -17687 -4756 15388 -22902 -5931 31047 -3849 -12579 12796 -12550 -14274
1441 -14274 23150 6797 -11540 6645 -7702 -15129 15050 10559 -7575 3706 -5844 -15634 9517
1454 9517 11865 -3270 2790 -5487 -13893 6391 8770 761 7766 -8364 -16926 10441 6338 -5340
1468 -5340 16617 -1709 -28450 9876 15685 -15555 14150 15039 -35567 -2701 28850 -18050 662
1481 662 31852 -30992 -23839 38039 -7917 -19900 40494 -11588 -46321 34704 13944 -36982
1493 -36982 33591 17006 -59196 15530 40205 -41409 11206 44918 -53477 -16685 57626 -27535
1505 -27535 -19252 59461 -31556 -50185 59811 829 -49467 55449 8655 -76034 35860
1516 35860 41413 -59554 23444 47579 -72142 -6029 67633 -43225 -16922 68674 -41607
1527d1607r059J18822p0023m6435J03879n3530p0382J08798r804q3400Q4258J290
1539C2807j03733P8602N0313j02991L9995O1686j04654J3834R7939p7016k3401
1550c6619R1768o5338n3592J08042j3742q1632P2045J2863q7946M6967N5499o4805
1562a6490M181M1173n1061j555N6204k8095k1926L7652k1964l0604M4426J2427
1574B4368l4790P867R462k3508R633K5095j3651j0960J0751j1125j0527K8276
1586A0891J1656l1149m423K1490j4692o890L2902n424l0841J3420L788j4907L1455
1599A7276M054m6443K1749K5823n1346J7956O2827n9167l6366P0753k1194m5313
1611c9391P3751n681p9151N5711K7775p9596M9643O0632j00350m349Q9870n7558
$$ plain form
1527 -41607 -50666 68156 -1867 -48302 55577 2047 -68335 40463 30659 -52741 31517 32807
1539 32807 -70926 7676 57989 -45002 -5007 56679 -47975 -34141 63798 -13218 -36619
1550 -36619 55149 -10189 -63781 44261 30519 -51113 20932 33795 -54151 -7184 48315 -16490
1562 -16490 -12309 28864 -22197 -23752 32452 4357 -17569 20083 -1881 -32485 11941 24368
1574 24368 -10422 -2555 6907 -16601 -6968 18127 4476 -6484 4267 -6858 -17385 10891
1586 10891 22547 -8602 -13025 8465 -6227 -13117 19785 14361 -16480 -3060 728 -14179 17276
1599 17276 21330 -25113 -3364 22459 -28887 -10931 51896 -7271 -43637 27116 5922 -39391
1611 -39391 34360 28679 -50472 5239 33014 -46582 3061 63693 -36657 -41006 48864 -8694
1623h694k8483Q6804m1167n7974P3272j4245n0197Q1501r983r3855O8980L9633
1635D5592r2556M3266O6301r5166m715P9097n6554r218P8630o3884m4481R2345
1647C8657k7719o2687R0577n11r7799N5384M2818p0905L5940M1641q2467J5370
1659b1701O5116o7115n7Q3977o5163n3508Q6987o721n8503N9428L944o8574M0295
1672a595K6845n2190L5805L2213p6171N534O7719m1529k0523N6917k8033m2745
1684c7753M5875N548k8761L4974n691n0531L3473L0479m3174J1550L5800m4735
1696a2946j7938M7345n730j9770K4623j4486k8365L3045R755k9136K2027J1824
1708B0248m6808O355M5568k0073j7157K6432j7027k3040L3794O705k4617J9861
$$ plain form
1623 -8694 -37177 49627 8460 -49514 23758 9513 -40684 40817 30834 -63021 5959 45592
1635 45592 -46964 -3698 62603 -32563 -37278 41819 -14735 -23953 54677 -9207 -53688 38657
1647 38657 10938 -51749 38828 38317 -59482 -4098 38720 -32185 3755 45396 -37071 -21701
1659 -21701 43415 -23700 -23757 60220 -4943 -58451 28536 21815 -36688 22740 26684 -41890 -1595
1672 -1595 25250 -26940 8865 41078 -35093 -29559 38160 -3369 -23892 33025 4992 -37753
1684 -37753 8122 13670 -15091 19883 14192 -36339 -2866 27613 -15561 -4011 31789 -12946
1696 -12946 -30884 16461 10731 -9039 15584 1098 -27267 5778 15533 -13603 8424 20248
1708 20248 -26560 -20205 25363 5290 -11867 14565 -2462 -25502 8292 14997 -9620 10241
1720A0241j488l9464K5385L5924l5639o217L1997l0934j7781M7962l072l2176
1732a5262K4839n207l5826L7616K3770m5678J0157K7622m5441J657N5704k6002
1744G949k9985L6883j6631k8970N0024M260m5927K6746J0449m7440L0366M1461
1756C9185m9810o865L8840l5503q777N5281k1430l5683L7694j1061l3782M9762
1768A7851J1573n3756J9819K2136m3432J9419M2772m2536j3450L5583k6697r893
1780b0611M9941j7106l6864L2077k579l0312L8124J4791m4716R110J9970k8678
1792a6853J3981L1751l2291j3004K5386j6547n346L5670j2034k8818J8274J130
1804A299j5388K4800P966k9480K599J0854j2279J1446J7275k0093j0837J1453
$$ plain form
1720 10241 8753 -30711 -5326 30598 -5041 -11258 20739 -10195 -27976 19986 16914 -15262
1732 -15262 9577 4370 -31456 6160 29930 -15748 -5591 22031 -23410 -21753 33951 7949
1744 7949 -22036 14847 -1784 -30754 19270 23530 -22397 4349 14798 -32642 -2276 39185
1756 39185 -10625 -17490 21350 -14153 -22930 32351 10921 -24762 12932 1871 -31911 17851
1768 17851 29424 -24332 -4513 17623 -25809 -6390 36382 -6154 -19604 15979 -10718 -20611
1780 -20611 29330 12224 -24640 7437 4858 -25454 12670 27461 -17255 -8145 11825 -16853
1792 -16853 -2872 28879 -3412 -16416 8970 -7577 -12923 22747 10713 -18105 169 1299
1804 1299 -14089 10711 18677 -10803 -8204 2650 -9629 1817 19092 -1001 -11838 -385
1816c85m611K667J7175q011j6147M380J570L26J2638Q25j4055m712L721L411O723
1831E515L474o292r987k638Q686P308q11n64n924j1734O984J4883m147k323K053
1846D483j4979j832K0997j141q140Q200j2193j3389K3130P679j6360Q919m99k4324
1860a9449J4438K2952j8108j476J1729k3112k307K9853p289j2431J3981j4311
1872e530j3790K7775L351j7334J3203o614k2870K3191J6240k2291O710P609k7685
1885a8035P486K9196j5014p934J3751j8522o791K6734j876j1044Q686j3231r370
1898a5964K2882J239j0310J1617j1601j8293K3764Q903j6435J0360n99k4240J3436
1911e241J7767j2303M132K414k1695P662J7325j1633P346P019k9576M268K7803
$$ plain form
1816 -385 -4996 -2329 14846 6835 -9312 -4932 -3362 -3036 9602 10427 -3628 -8340 -4619 -1208 5515
1831 5515 8989 2697 -7290 -9928 -1242 6066 5255 4691 -1233 -12967 -5983 8900 4753 2430 4483
1846 4483 -10496 -12328 8669 7528 -612 7588 -4605 -17994 5136 12815 -3545 5374 4875 -19449
1860 -19449 -5011 17941 -167 -1643 10086 -13026 -15333 14520 7231 -5200 8781 -5530
1872 -5530 -19320 8455 11806 -5528 7675 1061 -21809 1382 17622 -4669 2041 9650 -18035
1885 -18035 -10549 18647 3633 -4301 9450 -9072 -15863 10871 8995 -2049 6637 -6594 -15964
1898 -15964 6918 8157 -2153 9464 -2137 -20430 3334 12237 -4198 6162 5563 -18677 -5241
1911 -5241 12526 223 4355 6769 -14926 -7264 10061 -1572 5774 12793 -16783 -12515 15288
1924A5288j7519q40K4261k9525j6597L8337n779j9255K8997j2628l3149L1878
1936C469J1145k6837K3442L493m2716K2274K6735l3787J4773K4845m9132J058
1948b1238M7590k9625j0343M3888l4638l0636N3293n823l3886M2611p745n0782
1960c7334M0949K0083m4920K9622J8936o0416J9001M6227m5959L483M7098n2381
1972a5611j9464O3857k1851l2153N2883j8331n0635N0695J4664m6451L2325J4380
1984B4308n7055K2367L9597m1086O783L4162m6875p558M9918k2310j7662L9440
1996B4029k4052l2722M4266M697l2712K7947L101m2250K1028K7874k7765N038
2008a521J9012l1068m145L1920q000j1855J6407j1435j7635J9428J1412j1800
$$ plain form
1924 15288 -2231 -3071 21190 -8335 -24932 13405 7626 -11629 17368 4740 -28409 3469
1936 3469 14614 -12223 11219 14712 -28004 -5730 21005 -12782 1991 26836 -22296 -21238
1948 -21238 26352 -3273 -13616 30272 -4366 -35002 18291 12468 -21418 21193 13448 -37334
1960 -37334 3615 23698 -21222 8400 27336 -33080 -14079 32148 -13811 -10328 36770 -15611
1972 -15611 -35075 28782 6931 -25222 27661 9330 -41305 9390 24054 -22397 9928 24308
1984 24308 -32747 -10380 29217 -11869 -5086 29076 -17799 -25357 24561 2251 -15411 24029
1996 24029 -23 -32745 11521 16218 -16494 11453 14554 -27696 -6668 21206 -6559 -1521
2008 -1521 17491 -13577 -17722 14198 6198 -5657 10750 -685 -18320 1108 12520 720
2020G20L55J621j1882R7J6172L820j1024l379K659p117L235J8309n962j7185Q599
2035i62K71j1589K0295R418k7352K982J4351k0068Q970K8407k6831j5113K8154
2048A0933j5840j1930M1086j2493l7655L2399L132l6286L8917J9073n6756J3851
2060a1569L6040m4935Q842N1018m6576k3188N3290k4593k7380O1165j4983n5931
2072c8800M6890J0973n1031M2206K5592o4486J6116L9348m8432J2925N0139n4732
2084a3292j5879N8070l4047k3709O5010k3072n2723N1265M087m6862M7536J3354
2096B9738o4118K8373L3526n4144K1228M8433o0030j3108N8036l1695k0144N6974
2108C3069k5353m3316M9097r69m2093M7711J1822o3759K3481L8602m4474O676
$$ plain form
2020 720 1075 2696 -9186 -9089 7083 10903 -121 -3500 -841 -7958 -4723 13586 7624 -9561 -962
2035 -962 -691 -12280 8015 17433 -9919 -6937 7414 -12654 -3684 24723 -2108 -17221 10933
2048 10933 -4907 -16837 24249 11756 -25899 6500 9632 -26654 12263 31336 -25420 -11569
2060 -11569 24471 -20464 -11622 39396 -7180 -30368 22922 -1671 -29051 32114 17131 -38800
2072 -38800 8090 19063 -31968 10238 35830 -28656 -12540 26808 -21624 -8699 41440 -13292
2084 -13292 -29171 28899 -5148 -28857 36153 13081 -39642 11623 15710 -31152 16384 29738
2096 29738 -34380 -6007 27519 -26625 -5397 43036 -16994 -30102 27934 -3761 -23905 33069
2108 33069 7716 -35600 13497 12528 -29565 18146 29968 -33791 -10310 28292 -16182 -9506
2120i506M1536l9655j7298M0356j5816j3503L7701j8208l4380L4788P419l1047
2132a7613K4034J5457l9057L323K6770j5739J047J8950k4247j0321K8332p857
2144C079j4227K6121l965l2583J4826K1991j7936J556J3738k0799n220K2554p349
2157A786p579K0943j3574k6323K7007J6176k7974P148J9137k9176m466L2641j1365
2170D381j2847K2657j6329k3483L7715O102l7013K2364J7318m4888R583M3513
2182B9073k9330j5116L2866k2717j8755M3810p466l3346L3530o57m4038L4380
2194B234K8665m5989N197L0584l7103N24M2813k7614j5582L6226k6139k2377N2190
2207B3629n983m4066L4252R137m5874K8646L0357m3885N221K8800l9336M156M7014
$$ plain form
2120 -9506 32030 -7625 -24923 15433 -383 -13886 23815 5607 -28773 6015 13434 -17613
2132 -17613 6421 21878 -17179 -13856 12914 -2825 -1778 17172 -7075 -17396 10936 3079
2144 3079 -11148 14973 11008 -21575 -6749 15242 -2694 -1138 12600 -8199 -13419 9135 1786
2157 1786 -5793 15150 1576 -24747 2260 18436 -9538 -2390 16747 -12429 -16895 15746 4381
2170 4381 -8466 14191 -2138 -25621 12094 18196 -18817 3547 20865 -24023 -14440 29073
2182 29073 -257 -15373 17493 -5224 -23979 19831 12365 -20981 12549 11892 -32146 2234
2194 2234 30899 -15090 -9893 20691 -16412 -15888 26925 -689 -16271 19955 -6184 -28561 23629
2207 23629 17646 -26420 7832 16969 -28905 -259 30098 -13787 -8566 20234 -19102 -14946 32068
2220C2068l3356k2049M3890j9609l1463M7912M513m4716K3899J2967l7435K3296
2232h3K7738m0532J661L0738l2883m268M4989k0116k9022L0624l837k4822L0226
2245A0413P573l2840J2946J2041k6389J4361K5124k8508q742K4332j3571r371
2257a2631K7513o221k1729J3203K299j3402J7606P520k3462K916J3201j3648K838
2270c997J9348j3054j4462J3243P97p519J3839J012j8574M162R774r179M427J3432
2284A3249j4690j1502J4951J392q509J2661K82j9705O269J2360r920L510J1713
2297A2061j7867p177K0023m330r195J7279o183k0902J6488R878j6495J0306Q310
2310A2196k5150L840K1743j4733k801J9064j7785j3430K6042k886j5029J8696
$$ plain form
2220 32068 -1288 -23337 20553 944 -30519 17393 21906 -22810 1089 14056 -23379 -83
2232 -83 27655 -12877 -11216 19522 -13361 -17629 27360 7244 -21778 8846 5009 -19813 10413
2245 10413 17986 -14854 -1908 10133 -16256 -1895 23229 -5279 -14021 10311 -3260 -12631
2257 -12631 14882 8661 -13068 135 2434 -10968 6638 14158 -9304 -6388 6813 -6835 -3997
2270 -3997 15351 2297 -12165 1078 1875 -5644 8195 9207 -9367 -5205 4569 -4610 -183 13249
2284 13249 -1441 -12943 2008 3400 -5109 7552 7834 -11871 -5602 6758 -3162 348 12061
2297 12061 -5806 -12983 7040 2710 -6485 10794 4611 -16291 197 10075 -6420 3886 12196
2310 12196 -12954 -9114 12629 -2104 -4905 14159 -3626 -17056 8986 6100 -8929 9767
2322I767m290k4264J9276J1409k0136J1238R472k7036N692K3643j7356k589K0004
2335A4830k0287j1424K7896m929j5036J9202o267k1449J9846Q705j8315J1231
2347D003M807k2992R347J6958j5922K969J1972k0623j393K1473r506o281J5527
2360A0339j2470j1825J9559L11j0837J1861m645j5070J4245N166j0912R898k06
2373E414j7738J0286J0697j2653O057P346j8439Q40J6408q368j972J0721j2504
2386c905n415J3887l500k155R392j0925p619J4903l777n987J5817q558j6975J7141
2400B324N112j5340J3322N006k2783P019J4460j2899M143J0497j8316p93J5914
2413G666j1050J150J5791j8611q014K2925r043j1209K3708p668k4298K0734Q600
$$ plain form
2322 9767 5477 -18787 489 11898 -8238 3000 12472 -14564 -8872 14771 -2585 -5174 14830
2335 14830 -5457 -16881 11015 6086 -8950 10252 3985 -17464 2382 11087 -7228 4003
2347 4003 8810 -14182 -4835 12123 -3799 -830 11142 -9481 -10874 10599 1093 -5188 10339
2360 10339 -2131 -13956 5603 5914 -4923 6938 2293 -12777 1468 6634 -4278 5620 5414
2373 5414 -12324 -2038 8659 -3994 2063 9409 -9030 -8190 8218 -150 -2122 8599 -3905
2386 -3905 -9320 4567 1067 -1088 8304 -2621 -10240 4663 886 -5101 10716 2158 -14817 2324
2400 2324 7436 -7904 5418 10424 -12359 -5340 9120 -3779 364 10861 -7455 -8248 7666
2413 7666 -3384 -2234 13557 -5054 -13068 9857 814 -10395 13313 5645 -18653 2081 10681
2426A0681k1310J3655J0251k5147M270J7595j3347J732J2958j6922l709J7036
2438G743r681k241J6796j4221j1830J9886k316j3282J7312R4k1869J0626J2034
2451I051j3467M255Q874j3786k480J1198l140Q7M387p691k151O143j979J939N484
2466F724q710l587O243n53L01M412m967k685J473j860N764M073j0317J111O660
2481D082j0732L617J5590j3490r102J6643p354j0507K1468k034k0710J3921M339
2494E731j7630J5402R719k3343P059J2798k0673Q150K0681k4285l906K4009j9363
2507e651p397L1769j5179k2088K9094n004k4853K9641N270l4620J8879J5236l2557
2520a7460J5474K4830l4443j97K9944k6673n493L6947k2682k0623L4915j0432
$$ plain form
2426 10681 -10629 3026 13277 -11870 -7600 9995 -3352 -1620 11338 -5584 -9293 7743
2438 7743 -1938 -4179 12617 -1604 -13434 6452 4136 -9146 8166 8260 -13609 -2983 9051
2451 9051 -4416 -161 8713 -5073 -7553 3645 505 592 4979 -2712 -4863 1280 -699 1240 6724
2466 6724 -1986 -5573 670 117 418 4830 -137 -2822 -1349 -3209 2555 6628 -3689 -2578 4082
2481 4082 -6650 -3033 12557 -933 -10035 6608 -746 -11253 10215 8181 -12529 1392 5731
2494 5731 -11899 3503 13222 -10121 -3062 9736 -10937 -2787 17894 -6391 -10297 13712 -5651
2507 -5651 -13048 18721 3542 -18546 10548 5544 -19309 10332 15602 -19018 -139 15097 -17460
2520 -17460 -1986 22844 -11599 -11796 18148 -8525 -14018 22929 247 -20376 14539 4107
2532D107k5064L5515j88l6245K5111J1808l4146K0070K1424l7366N823K7995k9717
2545a0873n38L4251k5702j5977L3937j3564k0177L3946m899l1089K5319P406k9583
2558a7543K0691J6052l3624O812K4011k5282J92K7882k1278j3563K6750q538j5988
2571a3426K4341k350k3709J6240P898j9472J1216J2298k0988L88J6859j2545k552
2584e802J6403r395j1985J4426L89j1182J0880L737j5683M003J1959j0174j434
2597c858J3006q909j0864J4569K044j3205R942O182j8194M094J5774j3186m140
2610f745J7928j2254j2861K1936l95k0135J7104O588k6389J1960J9635k4187M72
2623g343K3532k2387r013L1284j2313j9715K7750m210k8230K6238J0855l1962
$$ plain form
2532 4107 -20957 14558 14370 -21875 3236 15044 -19102 968 22392 -14974 -9151 18844 -10873
2545 -10873 -11411 22840 -2862 -18839 15098 1534 -18643 15303 10404 -20685 4634 12040 -17543
2558 -17543 3148 19200 -14424 -7612 16399 -8883 -8691 19191 -2087 -15650 11100 2562 -13426
2571 -13426 10915 8565 -15144 1096 8994 -10478 738 13036 -7952 -7564 9295 -3250 -5802
2584 -5802 10601 1206 -10779 3647 4036 -7146 3734 7471 -8212 -4209 7750 -2424 -3858
2597 -3858 9148 239 -10625 3944 5988 -7217 2725 8907 -9287 -5193 10581 -2605 -6745
2610 -6745 11183 -1071 -13932 8004 7609 -12526 4578 11166 -15223 -3263 16372 -7815 -7343
2623 -7343 16189 -6198 -15211 16073 3760 -15955 11795 7585 -20645 5593 16448 -15514
2635a5514J4855J7634l2309P584K8087k7560m399L0542k3871j3559L6598j2802
2647E286k5234L2417l071l2253K9795J0583l6668J9570J9227l8329J0970L2492
2659B4785l4277n189L7043k6420j7846M1538j2281k9694L4123k09l5027K8663
2671E209J4540l8154J5176K3687l5440L740L3979k6941j2205L2813j5191k0007
2683a8794L1261l351k6208K2794M948k6527J6214J5698k6442M555J9428k0501
2695f925j935K2358j3635j0212J8802p311j2535J9143m92j8614J3356O149j8390
2708a0241Q401J3493j6595j969J5446j0671o226J7233n538j3557J3938J939j5245
2721i592J0482R783j7036J14J5047j0580n205J5568o005j2483J4195J058j4133
$$ plain form
2635 -15514 -659 16975 -15334 -7750 20337 -7223 -11622 18920 -4951 -18510 18088 5286
2647 5286 -19948 12469 9398 -22855 6940 17523 -19145 425 19652 -18677 -7707 24785
2659 24785 -9492 -14681 22362 -4058 -21904 19634 7353 -22341 11782 11573 -23454 5209
2671 5209 19749 -18405 -3229 20458 -14982 -11242 22737 -4204 -16409 16404 1213 -18794
2683 -18794 12467 9116 -17092 5702 10650 -15877 337 16035 -10407 -5852 13576 -6925
2695 -6925 -8860 13498 -137 -10349 8453 1142 -11393 7750 7258 -11356 2000 8149 -10241
2708 -10241 -1840 11653 -4942 -6911 8535 -2136 -8362 8871 3333 -10224 3714 5653 -9592
2721 -9592 890 10673 -6363 -6249 8798 -1782 -6987 8581 2576 -9907 4288 5346 -8787
2734h787J0849P305j7837M254J4397j4381k424J7108j0997j0372J7923l952j3690
2747a0604J6801J268j9978J2771J0720k0734P098J6155k0463k029K1305j3840
2759a530q513K1788r699j5287K0958j450j8886J8462L762k3023J3291J2435k2470
2772a0162O836J7178k1984o97K2429j7155p335K4110j2361j5771K4619l569k0645
2785a4507K0517M084k4106J4125J2524k3078P437J7081k1770l20K1251j6019o989
2798i770K1448j0986j3011K0608l118j6864J6902K373j9341J2557Q683j7816O272
2811b063J2021j6189P82J5121j2109l994J4233p864p534J3065k916r244J0332
2824C641K00j0662Q105L772r849M356N729q904J064P211n618j872N595k230l836
$$ plain form
2734 -8787 2062 9367 -8470 -4216 10181 -4200 -6624 10484 -513 -10885 7038 3086 -10604
2747 -10604 6197 7465 -12513 258 10978 -9756 -2658 13497 -6966 -8995 12310 -1530
2759 -1530 -10043 11745 2046 -13241 7717 6267 -12619 5843 9605 -13418 -127 12308 -10162
2772 -10162 -3326 13852 -8132 -8829 13600 -3555 -10890 13220 859 -14912 9707 6138 -14507
2785 -14507 6010 10094 -14012 113 12637 -10441 -3004 14077 -7693 -8013 13238 -2781 -9770
2798 -9770 11678 692 -12319 8289 5171 -11693 5209 7582 -11759 798 9481 -8335 -2063
2811 -2063 9958 -6231 -5449 9672 -2437 -6431 7802 -62 -7596 5469 2553 -6691 3641
2824 3641 3841 -6821 1284 5056 -4793 -437 5292 -3612 -2548 4663 -955 -2827 2768 538 -3298
2839c298M254M06k962J579O30q33m81L52J323j108j231K187M9k485K423Q88l526
2856a833K243J458l979K624K151n333K288M606p221P59P996p662k971J0656n310
2871D72p219J1170j489j0278R541K823j1734P036N789j1565M309P829j1171J922
2885b565R868j0953j043J2717r441n486J4194n640j0360J3836l7j3201R665M626
2899F180j2359N449O800j0110K187O408p973K078O719r095J385Q330r133q25J1603
2914G644q768n554J2453m134q661J1177O4j0178O919K843p587M532K229o384M686
2929A281Q50o713O838K102j0498O572O003j2581L664J0812j1916j982J2412q003
2943a159m466J1324m594o232Q886l655n032R783l826p341J1347k772j1044J3882
$$ plain form
2839 -3298 956 1362 -1600 -21 609 -224 -705 -353 970 -138 -1369 818 867 -1618 805 1693 -1833
2856 -1833 410 1868 -2111 513 2664 -2669 -381 4225 -2996 -2237 5759 -1903 -4874 5782 472
2871 472 -6747 4423 2934 -7344 2197 5020 -6714 322 6111 -5454 -1145 6684 -4487 -2565
2885 -2565 7303 -3650 -4693 8024 -1417 -6903 7291 1651 -8709 5127 5090 -8111 1554 6180
2899 6180 -6179 -730 6070 -4040 -1853 4555 -3418 -1340 5379 -3716 -2331 5999 -3134 -3959 7644
2914 7644 -1124 -6678 5775 1641 -7020 4157 4221 -5957 962 3805 -3782 750 2979 -3405 1281
2929 1281 2131 -4582 2256 4358 -6140 432 6435 -6146 -2482 8330 -3586 -5568 6844 -1159
2943 -1159 -5625 5699 1105 -5127 3759 104 -4928 4855 1029 -6312 5035 2263 -8781 5101
2957E101J536j6443J0881P764j7839O303J3887j6263j573J6221j2116m795J6077
2970H741q211q486J4580n661r985J6295l301j4335J5237J714j7794J3162Q867
2983A0823k0349O826J4091j7777M55J7628j3596o594J6930q091r195J6365m301
2996C215j2031J3398j063j2767J3279L097j6292R832P456j6445O158J2840j5525
3009d848j401J4697r956o238J5473n037j0728J1249P35j0655Q336M468j0942L162
3023a685O128p615J336P242o093l015O386k581l086N359K5n324J680L208l009
3038a044j4M000k147m283L367K435m112J696L874o083j519P822l322m229Q045
3053D486k748q673R389K572j0837P055N359j3695L880J1805j2153j226J3826j1633
$$ plain form
2957 5101 6637 -9806 1075 8839 -9000 -2697 11190 -5073 -6646 9575 -2541 -7336 8741
2970 8741 530 -7956 6624 963 -9022 7273 3972 -10363 4874 6588 -11206 1956 10823
2983 10823 -9526 -2700 11391 -6386 -5931 11697 -1899 -8493 8437 346 -8849 7516 3215
2996 3215 -8816 4582 3519 -9248 4031 7128 -9164 668 8124 -8321 -2163 10677 -4848
3009 -4848 -6249 8448 -1508 -7746 7727 2690 -8038 3211 3946 -6709 1627 6095 -4847 -1685
3023 -1685 4443 -3172 -1836 5406 -687 -3702 2684 103 -2983 2376 2401 -2923 -1243 1965 -1044
3038 -1044 -1058 2942 795 -3488 -121 2314 -1798 -102 3772 -2311 -3830 3992 670 -3559 4486
3053 4486 1738 -6935 2454 5026 -5811 1244 6603 -7092 -3212 8593 -3560 -4786 9040 -2593
3067b593o852J7613n956j1804J6611k041j7641J5980O443j9932J0362J1252k1882
3080a0440N073J9119j9009l016K1511j5672j0877K5142p794j7504K1805j439k2712
3093a5813J9438Q373k4503J2307J3629k5519N930K2262k2045l305K3692j7610
3105c164j1007K6885q539j8394K2834j441k3334K0125R246k5469J1334J4167k3778
3118a0535L808K1581j8476n483K0675j2908j0963K1901m595j5842J5940O83j7503
3131a1717J3324Q465j7576N613J0063j4782J458J5064j1341m216J2212p488o848
3144g769J3997j864j1183R149J752j1664P746P824j1908N09R377r128k240J2352
3158F950m433r089R053M19r922P893O668j1705L4R558p705k977J2061l973j0127
$$ plain form
3067 -2593 -9445 8168 2212 -9592 7019 4978 -12663 3317 9760 -10172 190 11442 -10440
3080 -10440 -5367 13752 -5257 -8273 13238 -2434 -13311 11831 4037 -13467 8338 6899 -15813
3093 -15813 3625 11998 -12505 -198 13431 -12088 -6158 16104 -5941 -9246 14446 -3164
3105 -3164 -14171 12714 4175 -14219 8615 7174 -16160 3965 13211 -12258 -924 13243 -10535
3118 -10535 -6727 14854 -3622 -9105 11570 -1338 -12301 9600 5005 -10837 5103 5786 -11717
3131 -11717 1607 10072 -7504 -1891 8172 -6610 -5152 9912 -1429 -5645 6567 -921 -7769
3144 -7769 6228 4364 -6819 2330 4082 -7582 164 7988 -3920 -3411 5966 -3162 -5402 6950
3158 6950 2517 -6572 2481 2900 -7022 871 7539 -4166 -4132 5426 -2279 -5256 6805 2832 -7295
3173g295R001K366j0148P227O515j2837J290J0528r426j956J3044p874q794J2417
3187D058j635r344J1697J220j4602Q424O413j3172O683J0075j5832j83J4576j1138
3201b760l588J6283r324j1000J6487l138j2534J6488N52j9468J2614R045j9016
3214i359Q003J4559k0631q96J9559j3917n802K0683j1438j3954K0759k777j6856
3227a2067J8168L412k2567J1714J2177j8972N502J5151j9080j748J8529j2142
3239a923n940J8859r945j3210J8162m14j4883J3799L172j8436R538R987j4813
3252f047M206J1855j5680j881J6143q902o411J4134n617j1042J1980J902r883
3265e243P889K198j2065N611P620r165J890Q012r999k567J1101l566n685Q087
$$ plain form
3173 -7295 1706 4072 -6076 1151 7666 -5171 -3881 6647 -2779 -4735 8309 435 -8359 4058
3187 4058 2423 -6921 4776 5996 -8606 -182 6231 -6941 -258 9817 -6015 -6198 8378 -2760
3201 -2760 -6348 9935 611 -10389 6098 2960 -9574 6914 7466 -12002 612 9657 -9359
3214 -9359 -1356 13203 -7428 -8324 11235 -2682 -8484 12199 761 -13193 7566 4789 -12067
3227 -12067 6101 9513 -13054 -1340 10837 -8135 -2633 12518 -6562 -8310 10219 -1923
3239 -1923 -7863 10996 1051 -12159 6003 5589 -9294 4505 7677 -10759 -1221 8766 -6047
3252 -6047 -1841 10014 -5666 -7547 8596 -306 -6717 7417 1800 -9242 2738 4640 -5243
3265 -5243 2646 4844 -7221 -1610 6010 -3155 -1265 6747 -3252 -5819 5282 1716 -3969 4118
3279D118k206q580P046M870p942K261N041q159r64R233k341n827N498m43p244
3294e639N454N319o287p94M937n818j133Q820k404o520O257o07p766P625M962
3309F406r548J217O318q439N87J0651o637n803R370m080o872J1760J53j1427O892
3324E48L156j0441P108P590j2297J129Q899j0148P9J3322q916p111J2143m905
3338A56p617J3611q80j3079Q772L640j1981Q326P784j3517J121R199r441L03J1865
3353H262q500o046J0222m750m609J1321k463r932Q323L61q627R234L703j1735
3367e236L227O288q764K811R010q411l515P564m045k163Q320l229n833N182j483
3382b77k883O811q36o026L431L01m416O013K572p175J208K719m097K576M302m797
$$ plain form
3279 4118 1912 -6668 378 5248 -2694 -433 4608 -3551 -4515 4718 2377 -3450 2048 1605 -5639
3294 -5639 -185 5134 -1153 -1947 2990 -2828 -3961 4859 2455 -4065 2192 1585 -6181 1444 6406
3309 6406 -3142 -1925 4393 -4046 -3459 7192 555 -5248 4122 42 -6830 4930 5083 -6344 548
3324 548 3704 -6737 371 7961 -4336 -3207 5692 -4456 -4377 8945 29 -7082 5061 156
3338 156 -7461 6150 5270 -7809 963 4603 -7378 948 8732 -4785 -3664 5535 -3906 -3603 8262
3353 8262 -238 -6284 3938 -812 -5421 5900 3437 -6495 1828 2189 -6438 2796 6499 -5236
3367 -5236 -2009 4279 -4485 -1674 7336 -1075 -4590 2974 -1071 -3234 5086 1857 -3976 1206 -277
3382 -277 -3160 3651 2815 -3211 220 521 -3895 2118 4690 -2485 -1277 1442 -2655 -79 4223 -574
3398e74q96J877k712K317L648m108l01K034m107J425O184l974l478M115k339k989
3414c878O943J25n220K265m61k223L861O07l085K172j759l872O582K196o808K901
3430C46K508q077L073Q334o260l265O689m736l561Q784m15o015L166m30l632N488
3446A997J062n019K884j12n718N759L705o878J508M026p177Q29Q523m218m502
3461c331M884k199l070N610J336m071R15j068j138L304P47j905R78j646k757M185
3477G74K013l397N67O29l342J504L722j223q52o05k026J762J429p89J999j621
3493E44m471L363L065l321J694K397o735L36O460k932j425M797n343k898P066
3508B597j431l065N671l261o564P801J374o836O642J270j1159N204P627r005J887
$$ plain form
3398 -574 -1470 407 -2305 12 3660 -448 -749 1285 -2822 -1397 4787 813 -2665 1450 -889 -3878
3414 -3878 3065 3190 -2030 235 -226 -2449 1412 2019 -1066 1106 -653 -4525 2057 4253 -2555 346
3430 346 2854 -5223 -2150 6184 -76 -3341 3348 -1388 -4949 3835 3420 -2595 571 141 -3491 1997
3446 1997 3059 -1960 924 812 -4906 853 4558 -2320 -812 3214 -3963 -3134 5389 1171 -3331
3461 -3331 1553 -646 -3716 1894 3230 -841 74 -994 -2132 1172 1919 14 992 -654 -3411 774
3477 774 2787 -610 -43 586 -2756 -1252 2470 1247 395 -210 -2236 -474 955 166 2165 544
3493 544 -3927 -564 2501 -820 874 3271 -3464 -3128 3332 400 -1025 3772 -1571 -4469 2597
3508 2597 1166 -1899 3772 511 -6053 1748 3122 -3714 2928 4198 -6961 -1757 5870 -3135 -1248
3523a248Q224j1080k555J3177n805n653J1226m764j0624J2155K115j0345Q000
3536B823K523j3206O240Q561j0330K514P706j1775p48J2745p406l959J1045p443
3550g10p921J3289r27j0031J0029M44j3217Q647P348j1108L548P277j2000M64
3564d868J1979p556l392R980o714p004J1434k77p815P150O8r636O263O255q517
3579b650J972N017q323k35R295l691l949N020k567m816O289K158n157J957Q34
3594A154m912K633N146l590j809K553k696j309M696R76l903O10R23l385K683M146
3610C916l835k389L686k129k409N879J050o968J782L514n424K467O494o575k927
3625c868O573l732k953R162k244q312O169J436o875O310L797r542J881O143p675
$$ plain form
3523 -1248 6976 -4104 -6659 6518 713 -4940 6286 1522 -9102 3053 5168 -5177 2823
3536 2823 5346 -7860 -1620 6941 -3389 -875 6831 -4944 -5692 7053 -353 -4312 6733 -710
3550 -710 -8631 4658 3731 -6300 3729 4173 -9044 -397 6951 -4157 -609 6668 -5332 -4868
3564 -4868 7111 -445 -3837 6143 -571 -7575 3859 3582 -4233 2917 2985 -6651 -388 5867 -2650
3579 -2650 -678 4339 -3984 -4219 5076 1385 -2564 2456 -111 -4927 1362 3520 -1637 320 1154
3594 1154 -3758 -1125 4021 431 -1378 1175 -1521 -2830 1866 2842 -1061 -451 472 -2913 -230 3916
3610 3916 81 -2308 1378 -751 -3160 2719 3769 -3199 -1417 2097 -3327 -860 5634 -941 -3868
3625 -3868 2705 -1027 -3980 5182 2938 -5374 795 2231 -4644 1666 5463 -4079 -2198 3945 -3730
3640c730K223Q932r446l443R901n375m804J2367l662j0835J0056J359j0197R521
3654B867M655j4474M387R430j1893K213J2832j2255n497J4263o488p035J4406
3667G411l663j2984J1159K781j2006R679N906j5112L132J0499j1127J198J1739
3680H612j0510n533J2638m720o305J2122l365j1123R776K479r654P645M629j2827
3694f136L137Q730q864R99R598r074m836J0658l158n737R868j975j0127O912M539
3709D534q294M527M847r436l95Q535m549k375O971l923o325P376J736n944M421
3724A706J636p846J769O961m324j757N564l991m926O899J596n518L501J523p388
3739d595K431O706m881j719N387m285m137Q074K39o192M129N46o873M911N618
$$ plain form
3640 -3730 -1507 7425 -2021 -5464 4437 -938 -5742 6625 2963 -7872 2184 3543 -6654 2867
3654 2867 7522 -6952 -2565 6865 -5028 -2815 10017 -2238 -7735 6528 40 -6995 7411
3667 7411 3748 -9236 1923 4704 -7302 2377 8283 -6829 -3697 6802 -4325 -3127 8612
3680 8612 -1898 -7431 5207 487 -5818 6304 2939 -8184 1592 4071 -5583 2062 6691 -6136
3694 -6136 -2999 5731 -3133 -2134 7464 -1610 -6446 4212 1054 -4683 5185 3210 -6917 -5 4534
3709 4534 -3760 767 5614 -3822 -4217 4318 -231 -2606 4365 442 -5883 1493 3229 -2715 1706
3724 1706 3342 -4504 -2735 4226 -98 -1855 3709 -282 -5208 1691 3287 -2231 1270 2793 -4595
3739 -4595 -2164 4542 -339 -2058 3329 -956 -5093 2981 3220 -2972 1157 1703 -5170 -259 5359
3754E359p336N46N241p230m81R348m013n390P091k901o090Q832J563q344M487
3769F82K165r027N589P121r092j75P419q079j300J1219n120o529R195l392p928
3784g252J1154J615j1511N835M748j0703M567R311r441k262Q569o928k300J0462
3798E864l914o855P610j715o530Q280J819q636L812K908p331M421N643p517n05
3813b646N694n754j88P641m039m318N554k025l695P031K09o649L194J811n453
3828c633L891M465o021r50M431l779m15N823k601l871K865m59j863L623R89m089
3844a594L51J168j187J386K139k117j601P27L88M09J361k79j703n90N73J074N09
3861A014L69j451j473R32J175k73R33J71l074l21L069q29l22J978k144l081L648
$$ plain form
3754 5359 -1977 -1431 3810 -3420 -3901 5447 1434 -3956 3135 234 -5856 2976 4539 -3805 682
3769 682 2847 -6180 -591 6530 -2562 -2737 4682 -3397 -4697 6522 1402 -5127 4068 676 -7252
3784 -7252 3902 5517 -5994 -159 4589 -6114 -1547 7764 -1677 -3939 4630 -2298 -4598 5864
3798 5864 1950 -4905 2705 990 -5540 2740 4559 -4077 -265 2643 -4688 -267 5376 -2141 -2646
3813 -2646 3048 -2706 -2894 4747 708 -3610 1944 -81 -3776 3255 3464 -3185 9 1820 -3633
3828 -3633 258 4723 -1298 -2248 2183 -1596 -2011 3812 1211 -2660 205 -254 -2117 1506 2495 -1594
3844 -1594 -1243 -75 -1262 124 2263 146 -1455 -728 -340 69 1430 1151 -552 -1142 -569 505 1014
3861 1014 1383 -68 -1541 -609 566 293 1226 1397 -1677 -1998 1071 242 -80 1898 -246 -3327 321
3878C21J518k778J899R91m845J079M022k020k00K246l560j380M645j136j725K950
3894B027k521k902M645L34l254L346o0n631L247M096m330O78L257n374n36N458
3910B480j856j802L497k793k917M617N05l131L087r09m445L711K695m256K286
3925G69J710n687R84N296k615j375L058l094j973L919M7j285J408j675j446K744
3941G85n37m52K276k445k625L897K22k332K606K04m554J795L540k595M78J433
3957A696l198m82L042p03O2J352l155k99L079j860N7L298l634k315M600o83k744
3974a887L973n60n367L366K813l873K158J794m929P82L603k394N74K978m874p95
3990b638N072k449j571M987l242m292N704L45m337M028R39o225K221M185l874
$$ plain form
3878 321 1839 -939 960 1951 -2894 -1815 2207 187 -13 2233 -1327 -2707 1938 802 -923 2027
3894 2027 -494 -3396 1249 1583 -1671 1675 1615 -4016 -769 3327 -1003 -325 2932 -2442 -2978 2480
3910 2480 624 -1178 2319 -474 -3391 1226 1731 -1400 1687 778 -3667 44 2739 -1517 769
3925 769 2479 -3208 -2224 3072 457 -918 2140 -954 -2927 992 1039 -246 1162 -513 -1959 785
3941 785 248 -204 2072 -373 -2998 899 1121 -1211 1395 1599 -2955 -1160 2380 -215 263 1696
3957 1696 -1502 -1984 1058 355 417 1769 -1386 -1685 1394 -466 -409 2889 -745 -3060 1540 857 -1887
3974 -1887 2086 1526 -3841 -475 2338 -1535 623 2417 -2512 -1730 1873 -521 53 3031 -1843 -2638
3990 -2638 2434 -15 -1586 3401 159 -4133 1571 1916 -2421 1607 2546 -3679 -1458 2727 -1147
4005a147R50K943m498p87M345j421j037K954l116j938L982p20j676L447j438l725
4021b882K916J616k603J745J377m174O9L638j076q86J586j539j843J673J187j93
4037F11L8o74j174M79J017M86J62r35j175O89Q60J76L88o31o71p23O70J501j41
4056I53j251L69l05j439K099K093l264j63J928k535j60M494j974l100K984o00
4072A29k583M079P18m871K268J663m192K815L532n078m12M661m397n10O362l462
4088G22m330N164q70m560O226R24p287L939K529o130L240N059p164K15N787n382
4104a918p3O444m523l824O822k798m649Q031j53p912M855K778p198M319M641p802
4120b960P69O039n705r84P850m938m536O902j421n011O631N43o994L757K492n484
$$ plain form
4005 -1147 -197 2746 -1752 -2539 1806 385 -652 2302 -814 -2752 1230 510 -1166 2281 843 -2882
4021 -2882 34 1650 -953 792 2169 -2005 -1936 1702 626 -260 1326 -213 -2056 -383 804 611
4037 611 649 -25 -1199 -720 297 783 945 10 -1165 -476 384 560 948 317 -354 -1077 -407 1094 953
4056 953 -298 71 -234 -1673 426 2519 -745 -908 1020 -1515 -1675 2819 845 -2255 729 129
4072 129 -2454 1625 2343 -2528 -260 1403 -2789 26 3558 -1520 -1932 2729 -1668 -2178 4184 722
4088 722 -3608 1556 686 -3874 2352 3276 -4011 -72 2457 -3673 -433 4626 -2538 -2323 3464 -1918
4104 -1918 -1991 4453 -70 -3894 2928 130 -4519 3512 3359 -4553 302 3080 -4118 201 4842 -2960
4120 -2960 -2191 3848 -1857 -2841 5009 71 -4465 2437 1016 -3995 2636 3179 -3815 -58 2434 -3050
4136c050L122M151o646K79N002m020q28N674l474l741N053o67l538M295Q12n429
4152c005K321L042m073J286L900m228j970M443j306k210L568n24l696K008K147
4167A703k764R63K684l868r43M009j283j788K680l45l906K479K274l261J094K510
4183B238m291J1M168k124j578L892j846l752M443J090m399K442J905n204K039
4198i66M256m259o08M852m690k361O585j535m063M854o22n410M713K471n686K790
4214C21K676o269J466N874m930j624O062m259l247P316j713n364N553M7o186N046
4230G69L052o598K202L846o301R93O280n011j849N597l276l629O634p53n103M193
4246A046Q68n598M409K445n493J643K887m484J100M519l839r83L756l020k022
$$ plain form
4136 -3050 72 4223 -2423 -2144 2858 -1162 -1990 3684 210 -3531 1522 855 -2683 1612 2424 -3005
4152 -3005 -684 2358 -1715 -429 3471 -757 -2727 1716 410 -1800 1768 1244 -2452 -444 1703
4167 1703 -1061 -98 2586 -1282 -2225 1784 501 -1287 1393 1048 -2858 -379 1895 -1366 -272 2238
4183 2238 -2053 -2042 2126 2 -1576 2316 470 -3282 1161 2251 -2148 294 2199 -3005 -966
4198 -966 3290 -969 -1577 3275 -1415 -3776 2809 1274 -2789 2065 1443 -3967 746 3217 -2469 321
4214 321 2997 -3272 -1806 4068 -862 -2486 3576 -683 -3930 3386 1673 -3691 1862 1909 -4277 769
4230 769 3821 -2777 -575 3271 -3030 -2037 4243 -768 -2617 2980 -296 -3925 2709 1956 -3147 1046
4246 1046 1914 -3684 725 3170 -2323 -680 2207 -2277 -1177 3342 -497 -1480 2276 -744 -2766
4261b766N096j410l536L935m49l811L871J723m555J343K836m317Q25M019k745
4276E9j704L416k006k156M233M25m437J995J502l109J432K734k572j228K351r75
4292d0j266K306J35k632J372J149j671N10J644j915n75J607o38l30J304l22j944
4309a306J471K13j447J827O58k798O40J779k012O38K490k813j054K627m87j894
4325a468K720K16l797K029K012l199J537K430m020k94M067k428j676M236k057
4340C08k977L642M13l400K925J113m333J681K916l334L06L157l371q88L602j657
4356A03j884L613k017k308L531K63l194K879P19m310K367K340l702J161K819l654
4372a274m11L824k096j367L201j392k957L357L05k588K251L80k733R19J733j864
$$ plain form
4261 -2766 2330 920 -2616 1319 870 -2941 930 2653 -1902 -559 2277 -2040 -1215 2804 59
4276 59 -1645 1771 -235 -2391 1842 2267 -2170 -175 1327 -1782 -350 2384 -188 -1416 935 -40
4292 -40 -1306 1000 1135 -1497 -125 1024 -647 -137 1507 -408 -983 624 -14 -344 960 638 -1306
4309 -1306 165 378 -1069 758 1416 -1382 -742 1037 -975 -337 2153 -660 -1714 913 426 -1468
4325 -1468 1252 1468 -2329 -300 1712 -1487 50 2480 -1540 -1834 2233 -195 -1871 2365 308
4340 308 -2669 973 1386 -2014 911 2024 -2309 -628 2288 -1046 -740 2417 -954 -1842 1760 103
4356 103 -1781 1832 -185 -2493 1038 1301 -1893 986 1705 -2605 -238 2102 -1600 -439 2380 -1274
4372 -1274 -1685 2139 43 -1324 1877 485 -2472 885 1190 -1398 853 1233 -1500 -581 1152 -712
4388g12P14J382k435M8K408j415n46J722j769o33K081l62j139J152k32j356J158
4405F6P30j202O07L46j058J58N92N2k8j35m82K65L53m08N71K9p81q0Q24r43O46
4426A22O63j622Q05J54m94N89N39j259P4R59r48K99J152r76r18J484n22r33J746
4445I14k17j707R17O85r49M54L75j164K86N11m63P02N97j681N72P84j225K49J717
4464A357j397j213K044p55j010J871L3k081R22P09r16N11P08j392K28O91p67O55
4482A98M52j000J83P70j055L95J119j318l39R52o74k56J254k45r24M56J81n39
4500c90P00j80k42K17l99j09Q44R3j319J344k12j246J254Q60k021M65J118j346
4518e69K91J160j124j76Q28q56k10J704j342l01J465q59j339K628m66k067J889
$$ plain form
4388 -712 2 1384 -1051 -1003 1405 -10 -556 1166 -603 -1236 845 483 -656 496 264 -1092 66
4405 66 796 -406 201 547 -511 -353 239 291 263 128 -354 -89 264 -144 427 456 -325 -405 419 -524 122
4426 122 785 -837 -32 122 -372 217 756 -503 -429 530 -418 -119 1033 57 -861 623 101 -832 914
4445 914 697 -1010 -93 592 -357 97 472 -692 -406 105 -358 344 941 -740 -168 616 -609 -360 1357
4464 1357 -40 -1253 791 36 -974 897 930 -1151 -229 480 -436 75 783 -609 -381 310 -457 198
4482 198 650 -350 -167 603 -452 -57 1062 -256 -595 357 -317 -573 681 436 -488 -32 149 -390
4500 -390 310 130 -112 105 -294 -403 441 534 -785 559 347 -899 355 1215 -806 -341 777 -569
4518 -569 -278 882 -242 -418 410 -446 -656 1048 -294 -595 870 11 -1328 1300 834 -1233 656
4535F56k2k577K144J173k647Q43J962k510K90K434k066m98J761j232p26K330r64
4552C51j800K255m59k105K722K52k871J822J547l267J488J990k949m02K892j650
4568a84j281K641o60k231K454j71j993J843R14k459R11J139k003J183J183k042
4584g56J15J823j541o49J994o83j059J067%r10Q19M81r97L6J026j251k7J439p36
4603A91j006J205l59n37P61L01j050M15P01j011J83J051j077l20R93l49q72J012
4621B32M23j580O48J163j514pJ934j312j136J923j89j834J804L66k069J155J131
4638A138k053Q48J381k098J86J588j276r04K565j094j480K056p0k073J818M14
4654I46k600J865J051k259N66K129k676Q0K564k103r02K841j317k153L049l6k603
$$ plain form
4535 656 634 -1943 201 1374 -1273 -430 1532 -978 -688 1746 -320 -818 943 -289 -1015 1315 351
4552 351 -1449 806 347 -1758 964 1216 -1655 167 1714 -1553 -65 1925 -1024 -1426 1466 -184
4568 -184 -1465 1176 516 -1715 739 568 -1425 418 1332 -1127 -216 923 -1080 103 1286 -756
4584 -756 -641 1182 -359 -1008 986 303 -756 311 311 -599 220 701 -296 -260 766 -485 -512 927 191
4603 191 -815 390 31 -506 255 556 -494 -79 622 -389 -206 845 -232 -552 441 92 -780 232
4621 232 655 -925 -277 886 -628 -635 1299 -13 -1149 774 585 -1249 555 921 -1148 7 1138
4638 1138 -915 -67 1314 -784 -598 990 -286 -1190 1375 281 -1199 857 787 -1286 532 946
4654 946 -1654 211 1262 -997 -431 1698 -978 -898 1666 -437 -1339 1502 185 -1968 1081 1045 -1558
4671a558K020P72k613J403J488k587N93J968k502J27K749j900j159K388r46j761
4687a518K650l04k439K273L5k070J233J559k334L06J998k020k54J936j278q42
4703a069K058q16j257J580M15k067J434N37j919J085J191k042M23J592j527m14
4719g96J603m80j589K026r7j849J339O93j595M07J157j244m36J836r07q27J202
4736D43m82o90J112J66j202O22O48j285K97J415j062m83J302o30p04J041j51j172
4754h15R14O47j266M76P09j381J60J800j718o7J348j000p19J791n68j332J783
4771G62jj820J080J005k126P44J780k068k61K217j296j522K497m31k117K011O06
4788A060k436J576R67k225O69J770j872k16J622j108r98K337q89j208J866m71
$$ plain form
4671 -1558 462 1234 -1379 24 1512 -1075 -482 1486 -1016 -889 1860 -40 -1199 1189 243 -1518
4687 -1518 1132 828 -1611 662 697 -1373 -140 1419 -915 -609 1389 -631 -885 1051 -227 -1069
4703 -1069 989 173 -1084 496 911 -1156 278 815 -1104 -19 1172 -870 -447 1145 -382 -796
4719 -796 807 327 -1262 764 667 -1182 157 850 -745 -338 819 -425 -861 975 68 -759 443
4736 443 -39 -729 383 549 -653 -31 617 -668 -371 1044 -18 -501 801 171 -533 508 357 -815
4754 -815 99 746 -520 -44 665 -716 -556 1244 -474 -541 807 -193 -912 879 311 -1021 762
4771 762 761 -1059 21 1026 -1100 -356 1424 -644 -905 1312 16 -1506 991 560 -1557 454 1060
4788 1060 -1376 200 1167 -1058 -389 1381 -491 -707 915 -193 -1191 1146 257 -951 915 444
4804D44j666J853K30j861J172O62j671Q30J143k068K95J906j467l56J565j229
4820b18o44J679l02j509J332O08j867P46J060j609O02J126j319l97J465o97n73
4837e17J074j69j193R78J75p37O31J62p65J41N00n80N5M48l15k93P01j16k92L06
4857A94j38k84K88k6k84K37J19n20O4N83k77l13P92o9p87K80M35k31l60M86m31
4878b42k2N02l87m40Q59L6p96L01O22o00k44J052r20o6P67m2q36Q45k98o78Q38
4899B51L1n77J60L79p91L87P72p61n1L83n23j54R64l28o48J132p97l87J038k03
4919B77p19P07l1n81K19N82o92j55P76p77J99O42o74n9Q00o96k28P88l24l35O40
4940C59k19o66P74J84r34M88Ol19K99M12p11K51N36o23J76N28p02k60P38l84M0
$$ plain form
4804 444 -1222 631 861 -1000 172 834 -837 -7 1136 -932 -637 1269 -198 -554 1011 -218
4820 -218 -862 817 515 -994 338 946 -921 -175 885 -724 -122 1004 -315 -712 753 56 -517
4837 -517 557 388 -805 173 348 -389 242 404 -361 -220 280 -300 -245 203 -112 -405 296 180 -112 194
4857 194 56 -228 60 34 -250 -13 106 -414 -350 233 -44 -357 435 366 -421 -141 294 63 -297 189 -242
4878 -242 -264 238 -149 -589 270 306 -490 -189 433 -167 -411 641 -279 -345 422 380 -456 389 91 -587 251
4899 251 282 -295 -135 244 -547 -160 612 -149 -200 183 -340 -494 470 142 -506 626 -171 -558 480 277
4919 277 -442 265 234 -347 -128 454 -238 -393 383 -394 -195 447 -227 -286 514 -182 -410 378 54 -281 359
4940 359 140 -526 248 432 -502 -14 -8 -327 -28 384 -327 -76 460 -163 13 541 -161 -421 317 -67 -27
4961b7M69K2p08M92j55j74K72m4k20m1L52m44K04K64k06j42K45p47R07p3p87M85
4983e6M20p82K22P02o14l48P73l55j76Q00l18k81J24k60j79M29N4l9J50m7o72
5004d53Q01j50n92N21k26j76m2P54m33l28M24k07l14N73p5l47M10j39l78M80P8
5025A81m01L30m3k01Q6M30o45j00P23o12j49N83K54m95M5m4j88N22K4l23K95l22
5047e0J13M09n75k1K90j14k2m9N5r6K04o6j16k68K04J70J41l23M8N38r58J28R03
5070E45n22l33P04l99R6J71J41j094O62K15k44J10K70l25R3m6l38L33M07m88k69
5091c11O61l54m21R08l93n95O82K77p06L52K53j060P79N62q95R3N20k79l39L47
5111H1k62k48Q86l06n79N73J89n16M38P0p57O1R01o89k38J117p47m25R18l69k68
$$ plain form
4961 -27 442 464 -244 248 93 -81 191 147 -73 -114 238 -206 -2 262 56 -86 159 -588 319 246 -541 -56
4983 -56 364 -418 -196 506 -108 -456 317 -38 -214 586 268 -13 111 -149 -328 101 155 116 266 219 -453
5004 -453 348 198 -394 127 -99 -275 -317 437 4 -324 100 -107 -421 152 77 -270 140 1 -377 103 181
5025 181 -220 110 67 -134 -48 382 -263 -363 360 -252 -401 182 436 -59 -14 -58 -246 276 300 -23 272 -50
5047 -50 63 472 -103 -124 166 52 30 -19 36 -60 144 78 -38 -306 -102 68 209 -114 -66 472 -486 -358 545
5070 545 23 -310 394 -5 91 262 403 -691 -29 186 -58 52 322 -3 90 44 -294 39 446 -42 -311
5091 -311 350 -4 -425 483 90 -505 177 454 -252 100 353 -707 72 634 -261 -168 352 73 -266 81
5111 81 -181 -429 457 151 -428 145 334 -182 256 326 -431 -370 531 -158 -396 721 -26 -451 467 98 -170
5132a70L55j21n23N70R0m74L84K35o34J68N31o02J11M48m29m08O90p8l00P05l03
5153B45p35K95L14k19J42M02o45PN96m69J66J33j55m81P57j92m61M73k76k60J46
5174b17M10l96kM68l61m50M39M90o78O50J59q25R3N75n29J8O10m94k48O26q4l08
5196e4M23j82p75P93K09p02L15K39l55L0M13n17k63P32m19l60N54r0k10K33qn62
5218e56Q96J95o82l4K54m29J35O41j45m12M17l48n87J042q4o66P23m8p00L58O21
5239E91o31l64M29j40j52N48l32k81N09lo42O99k39k22O63p9o05J07M17m09k24
5260c60O64j88k88M60j71o58P85m70k60P25R0n93P3Q1k29K59M55m58k70N05p3
5281G9l44O06l26m86L90K59l06j05M88m44J86j36O3J36q9L25k20r4j09l3L66l34
$$ plain form
5132 -170 185 64 -459 111 201 -273 111 346 -288 -120 411 -191 -80 368 -61 -469 221 143 -157 548 245
5153 245 -490 -195 119 -100 42 444 -201 -194 402 -67 99 232 77 -404 353 161 -300 173 -103 -363 -217
5174 -217 193 -203 -205 263 -98 -548 -109 381 -297 353 512 -313 -220 355 -174 -156 454 -40 -288 338 254 -54
5196 -54 369 187 -588 205 414 -288 27 266 -89 -59 354 -163 -426 306 -113 -473 81 -9 -219 14 6 -556
5218 -556 340 535 -147 -181 73 -356 -221 420 275 -137 280 -68 -655 387 303 -363 360 312 -388 -30 591
5239 591 -40 -404 25 -115 -267 281 -51 -332 177 174 -468 231 -8 -230 433 354 -251 -144 273 -136 -360
5260 -360 304 116 -172 288 117 -541 244 -226 -486 239 329 -264 -191 -110 -339 -80 375 -83 -353 152 79
5281 79 -265 341 15 -471 -81 178 -128 -233 255 -189 -3 -139 -76 60 -29 296 76 -18 -127 -160 206 -128
5303a28l79N51m8m3J84J14k81l10K32K9j43M95k75ON3N4j25k14M83m03K88nL0
5326A65l9K4j26m33J98J99O4J07j3l76L0M14l18K52P8k05j40K33j47p6J42L02
5348C35o15L29J40k95K78J4l72O6J43p9Q5K27l80p5N52j67l60J03M44m54J73q9
5370Cj09R2L34o73K94J73k30K18kk96KK47k3q6K52j41l32L18Q5k85N6K01r7J68
5394A69r0j83j3J39j18lM08p3k53n0L68m47K28J54n10K47M9k45L71J50q4q3m53
5417c22j75N09J65l80L24q3k28L1K92j52R3O2n00M11j32J2K80l4j0j52P6n1l8
5440bj73J49N2L2o1q2J34j46K17k54M8l6J44K9oP1n7R5j58N6o9J30J33o06N05
5465A45N8k65r1J92J03j33R4j09l1K05q2q4J89j18k47K26j32Q6O2J77k45J03j48
$$ plain form
5303 -128 -507 44 -4 -47 137 251 -30 -340 -108 -79 -222 273 -2 4 57 111 -14 -228 255 -148 140 135 165
5326 165 126 150 24 -409 -211 -12 52 159 146 -230 -200 214 -104 148 226 21 -119 114 -33 -109 33 335
5348 335 -280 49 189 -106 172 186 -186 -120 23 -56 29 256 -124 -199 353 186 -174 -71 373 -81 92 3
5370 3 -106 -14 320 -353 -59 114 -116 102 100 -196 -194 53 30 -56 196 55 -277 41 126 -159 -103 98 1 169
5394 169 79 -104 -117 22 -96 -99 309 236 -17 -67 301 -146 82 236 -274 -27 22 -223 148 298 214 131 -322
5417 -322 -497 12 177 -203 121 38 -190 -159 133 -19 74 136 -364 47 -85 -73 207 173 163 11 87 36 -2
5440 -2 -175 -26 26 58 -3 -85 49 -97 120 -134 -86 -122 22 51 45 116 59 154 -4 52 -17 113 246 -360 145
5465 145 203 -62 -153 39 142 9 103 -6 -37 168 86 2 191 73 -174 52 -80 6 68 245 0 103 -45
5488d5q1J17K19j65p7j22r3N34j32p6k00J03N5J72j41j26n4K20k77L02k43K04
5510I4j92j3L97m73J77K63j12j45j67RJ34n1J27j34K97k66nJ23p3l7O8o6p6J05
5534a6M9O3k05J03J55j12J27k81K18O2j92K38l33K60J08j66j31J75l1m1j60L1
5556g9J86j80J52N8M2j01k20P3J14n4O0j19r2j1L42l73K16K94n07J61J97k02j49
5579a92M72j83k01J99M1k17j39L95k93J5L28j96J18k6m1k44m3K55Rk9J65j54Q4
5602A23N0n7o0k36j8R7N6J38J5J43j83j60Q3r1M3j8J92o5j83K%J39o6K56j69J82
5628B13k21l8J24J67k49j73M30m12J66K75l66M7J88j96l1J27J94l54J75K9k04
5649a09j72K37R2%J15k57l7K32P7l06K92J41p78K79M74o35N89p4k65j3Q8k70L68
$$ plain form
5488 -45 -126 -9 210 45 -32 -154 -247 287 155 79 -121 -18 37 209 68 -58 -112 108 -169 133 -110 94
5510 94 -98 -111 286 -187 -10 253 141 -4 -171 -162 -28 -79 48 -86 211 -55 -60 63 -10 -47 21 -45 -121 -16
5534 -16 33 96 -109 -6 149 37 164 -117 101 163 -29 209 -124 136 244 78 -53 122 91 50 -110 -79
5556 -79 107 -73 79 137 179 78 -142 -69 45 -9 51 -68 -160 -171 171 -202 14 308 -199 -38 159 -43 -192
5579 -192 280 97 -104 95 136 -81 -220 175 -118 -103 225 29 147 121 80 -164 -207 48 57 28 193 39 123
5602 123 173 116 56 -180 -198 -101 -45 93 108 251 68 -92 -9 -100 -57 -75 117 52 -131 -129 -129 10 -56 200 31 213
5628 213 -8 -46 78 245 -4 -177 253 -159 7 282 -84 -37 151 -45 -76 51 245 -109 66 95 -109
5649 -109 -281 -44 48 48 163 -94 -131 101 178 -128 164 305 -473 -194 280 -355 234 160 -105 -118 -30 -300 68
5672F8L1N9o5j08R4n30K05L75k29J78K03n19K8K40J0m0l6J0j48L56l9m70O22L8
5696C33m34K97m2l83K95K03n21K12L86k89J82J51l59O5J2R6l87L45lk77q1M60
5718B61n72L24K81m86K61L48n22K26K35n37M6L47l2l19J70K61o52L36J73k34j88
5739b73K82J65m14L43R2l63K05k41K6K12K00n24K71L04n69J27L69k78q0K92r6
5760E0J1RM83m61j94M15o18M79M69j031L88j47L3jK44q7j79L48k87J8L13K31j029
5783e43L97N59l69l06M57j62m97N66J52m01K34j20l42K68J50l65K23M49m96j96
5803c42O27k48l30O39l20m84P87n24k00M96K79n72K04L89o62P1N32o08J58K56
5823A48l13J07O35l84n08N17on25M67J79n47j7N33m16J10K18m66L03L83k98l95
$$ plain form
5672 68 99 158 93 -15 79 -451 -246 129 -100 78 281 -238 -210 30 40 0 -36 -26 -174 182 143 -327 295 333
5696 333 -101 196 154 -229 66 269 -252 -40 346 57 239 390 31 96 108 204 -183 162 159 -118 -199 261
5718 261 -311 13 294 -192 69 417 -105 121 356 -181 -135 212 180 -139 31 292 -360 -24 149 -85 -273
5739 -273 9 174 -240 103 195 -168 37 -204 -178 34 234 -290 -19 285 -284 -157 212 -66 -146 146 50
5760 50 61 70 553 92 -102 313 -305 174 643 -388 0 -147 -114 -115 129 42 -137 211 -76 -58 255 486 -543
5783 -543 -146 413 44 -262 195 33 -464 102 254 -147 87 -33 -375 -107 43 -322 -99 350 -146 -342
5803 -342 285 37 -293 346 26 -458 329 -195 -395 101 380 -192 12 401 -261 -190 342 -266 -108 148
5823 148 -165 -58 577 193 -315 202 196 -329 138 317 -230 -247 286 -130 -20 198 -268 35 418 120 -275
5844b75Q54l24m18J61K78o45N27jk28J1J04j25P9K52m94QL19l09NM67j83l53K82
5867hK57j38nk20J13k64N34k6n77L68m4r1P5M38l71j52K03j91J0M43k87l30L53
5890I0r9l54J85O59p51K24K59l38l7L27N5l71L28k2o78N56Mr7L74k90k38L05K18
5913C09m93L31O4k91l4N57m82j07K32o7l60P91k59m73L24L3j19j78K06k42L41
5934H3J09l26M7M85l80k62M14m34m2N37k22k66L86l87M2L09j66r5L7J00kj44L82
5957B05j86j80M48m70m0K75K01m46K13j25O1J29q1j73K38j67j98K28K74oo4j43
5979gL3K47l2l37K35mm9j95L78m29P3q9nK75J3n8k07J34Rj04K07k5k1Mj00j68
6005b22K44o6L57j12k39K3J11j80j53L85j44j91J10K13J01m65J44O9j49L38k46
$$ plain form
5844 -275 579 255 -163 -2 276 -369 158 157 -71 -60 44 -81 -2 250 -244 -236 83 -226 -221 246 63 -290 -8
5867 -8 249 111 106 -114 -1 -265 269 243 -334 34 -10 -101 -26 412 41 -111 92 -99 -89 354 67 -263 90
5890 90 -9 -363 -178 481 -270 -46 213 -125 -162 165 220 -151 177 155 -523 33 37 -60 314 24 -214 91 309
5913 309 -184 147 211 -80 -114 443 -39 -146 86 19 -341 450 191 -282 42 75 -44 -222 -16 -258 83
5934 83 192 -134 -87 398 18 -244 170 -264 -306 231 9 -257 129 -258 -216 93 -73 -168 -131 -31 -33 -177 205
5957 205 19 -161 287 -183 -223 52 253 -193 20 -105 -44 85 4 -169 69 -98 -296 -68 206 200 136 -7
5979 -7 26 273 241 -96 139 135 86 -109 269 -160 -87 -176 -181 94 107 49 -158 -24 -15 -119 88 63 42 46 -54 -222
6005 -222 22 -44 313 201 -38 -15 96 -84 -237 148 4 -187 -77 136 237 -228 -84 -15 -164 174 -72
6026g2o3J68L61m23Q0o7q3Q6k2j0K1P9N9m49M80k28J38L16l10j64k02K87r6R5
6050a9K8p0J24k56k7K05k40M52k29J95j33k72K02R1P5rP9k42n9L41j46p1j05L11
6074B25j6J06j34k79J09Q5k98J30K63p8l69J36P9K2K70J1k78M4M37o92R7M13l10
6097b7j31L51k09J38l1l22p9N22J22n81N01j24l80M69j31j54j53N28m50k53P06
6118C12l04j97M81L4l19o5K03r9N1J78n46J17L50j45k28O17m09l41N63j07n37
6139c91O62j41m61M65K60p81L25L92p76O0L68L04n60O98n51r3L97O3k21P8M57
6160E54q21J07M48n40M43J58l39k13N91m64m8L17q2m66O10J31n44nM57m31j92
6181c29O16j70m49N62k54j69N41j24n82L52Qj22K32L04m51l73Q51j86n17N95j78
$$ plain form
6026 -72 -135 33 394 -29 51 -16 -99 -13 -35 -45 -24 55 114 -335 145 -83 55 371 61 -103 -305 -18 -114 -19
6050 -19 9 -61 63 -193 -220 -15 -255 197 -32 163 30 -242 -40 51 126 117 196 -46 -105 236 90 19 -86 225
6074 225 209 315 181 -98 11 96 -202 -72 191 113 -256 -120 -41 -19 251 262 -16 28 465 -227 -130 283 -27
6097 -27 -158 193 -16 122 91 -231 -310 212 334 -247 254 130 -250 219 88 -66 -219 309 -141 -394 312
6118 312 8 -189 292 326 7 -58 145 46 97 275 -271 -154 196 51 -177 440 31 -310 253 146 -391
6139 -391 271 130 -331 134 394 -387 -62 330 -446 -386 -18 286 -274 424 -127 -220 177 240 19 97 554
6160 554 -267 -160 288 -252 191 349 10 -203 388 -76 -124 193 111 -355 255 386 -158 -163 294 -137 -329
6181 -329 287 117 -332 230 -24 -193 348 224 -358 -6 2 -120 112 416 -35 -408 443 257 -260 335 157
6202A57p20O84J76n26K31L75o58R6M88p79J76R48p57k33N60k36l52L52m4k82L45
6223AK67q26O95M43p69j92Q40m53n06J168p60k61P55k45p99R02M37j120K67L15
6243A59n87L81N91n55k43N40l02k43N72j14p37Q53L0q35P57L31j285P94L52q55
6263c96L65O93q12j33P49p04m82R15J75q99O90J45o22K99M26p66K70P23q58R0
6283a32N82n82m09R46l48n06P59n6o88N88L93q60L78k0j74q0N52n23j9O34n36
6304a01m21N51J7m13N71J2m19L09K64n71Q6N28k25q20P55J34p50M87J14l20R9
6325a13K67j30l2N04m50m20P97l96l63O17k78m14N52J92m40K34K95n05j95P77
6345D99o51k14R74m35p91R53j35n28L62L20o04K58M60r55M30N09p65J12Q09n86
$$ plain form
6202 157 -563 121 297 -229 2 377 -281 -185 303 -476 -300 648 -109 -342 218 -18 -370 -18 -62 -344 1
6223 1 268 -558 137 580 -189 -381 459 6 -500 668 -92 -353 402 157 -642 260 697 -423 -156 159
6243 159 -428 -47 544 -11 -254 286 -16 -259 313 199 -538 315 345 -490 267 598 -687 107 459 -396
6263 -396 -31 662 -150 -283 466 -238 -720 195 370 -529 161 306 -316 -17 409 -357 -87 636 -222 -132
6283 -132 450 -132 -541 405 57 -449 310 254 -434 154 547 -313 65 45 -129 -209 343 -180 -199 435 -101
6304 -101 -522 29 46 -367 204 216 -203 106 370 -201 -115 413 188 -632 123 257 -493 -6 108 -212 -113
6325 -113 154 24 -8 496 46 -374 423 27 -336 281 3 -411 141 333 -107 127 422 -83 -278 499
6345 499 -152 -366 608 173 -618 335 200 -328 34 354 -250 8 468 -487 -57 452 -313 -201 608 22
6365B2n90R28k19o11R00r6p04K25O91j062L63O22j009J32J048q38r1O79l86n52
6385e48J022l94n94R93l78o33Q04N7o75N18J78q08K79O21q71L15O58o32l15P68
6405C65p2p05P13k2m90K46K0r3M2J51j56j14L89m11j9M97o11L3M04j32j90L45
6427A90j65k41K28k11J43o1O17o32J26K62n55L01Q3J68k87J22l34L05l1JL3K4
6449H6J20l79j05K73p5k8J83N4r7o1J16j14o8M12k01j35J35l4k64o3K76l19K82
6472fM4j42j42M99k16j79J20P2k77K28q1j67J61J73k97M06K4l10K52P5n13L08
6494C2K51l08MK02k91q4L10P9j70K4oj22J5J10l89Q17l67j11j13L23k89J05K91
6517C13n86N66k66O8l4J61k08j36L59m93M75q2j78J16P7k12P1J68j97M9j14L49
$$ plain form
6365 22 -568 360 141 -470 430 334 -370 -145 546 -516 -153 469 -540 -408 640 -198 -289 390 4 -548
6385 -548 474 80 -514 479 101 -532 272 329 -346 172 350 -458 -179 442 -429 -114 544 -88 -403 365
6405 365 293 -412 301 279 -211 35 55 -38 4 155 -1 -115 274 -137 -156 341 -270 -237 167 35 -155 190
6427 190 25 -216 12 -199 -56 -117 500 -132 -6 256 -299 2 85 253 -34 88 -246 59 28 29 62 86
6449 86 206 -173 -278 -5 -80 -108 75 129 32 -29 87 -27 -95 317 116 -19 116 82 -182 -245 31 -288 -6
6472 -6 38 -104 -246 253 37 -142 -22 50 -227 1 -80 -247 -86 87 -210 196 220 -90 162 237 -276 32
6494 32 283 -25 -21 181 -110 -194 116 195 25 49 43 -79 -64 46 -343 474 107 -4 -117 206 -83 22 313
6517 313 -273 293 27 95 61 222 14 -122 237 -256 219 137 -41 75 152 -60 11 179 -18 31 -83 266
6539B66k94M3Q2k8n1l47K49k07K38N3j54R8L1j58N1l8P9J16O3k98J34l9p7K21
6563C3q8NJ66jj52K17J54m31L03k35lQ2J22m40K40M70n95q3O8K61n22N32j19O8
6587E2j36K63l18Q9K80j92q6jJ96j58o3O9P2j11M9j4o1J24o2m01P30l10K34k80
6611c5M3j11J64k6j23K16J21l69j5M32m50N8N36n21j14M20k23k38L12p5j02Q1
6633a9L38m00k6M27m18p7K31j80k19N27k5l01N84m15o39Q16j47l60L99J98o53
6654c59K65L05l28l16Q29n80j35O42k79k00M60O9p52M89J80o59J43R40r69J32
6674a23N91n09k62N73r6o15Q07l08l69L15L01p85M45L54o71L84P23q45k25O75
6694C60k73l28M12L9n17P16k21o32N23M35q20J31O69o94j82R93n64o63R22l26
$$ plain form
6539 266 -28 15 97 69 18 -329 -80 -287 -49 4 -150 -52 -21 -179 -128 -166 -87 29 92 -206 -72 -111 -188 33
6563 33 -55 -50 116 115 -37 180 334 -97 206 -29 -32 50 172 -268 -28 442 -153 -236 -168 93 -429 103 -16 52
6587 52 -84 179 -139 -50 230 38 -48 -49 147 -11 -74 -5 67 -44 5 -9 -70 54 -8 -409 321 11 245 -35
6611 -35 8 -103 61 35 -88 128 249 -120 -135 297 -153 -95 441 -80 -194 226 3 -235 77 2 -100 -19
6633 -19 319 -81 -107 320 -98 -175 56 -124 -343 184 159 -142 442 27 -612 204 57 -303 96 294 -359
6654 -359 -94 211 -117 -433 396 -184 -319 323 44 -156 304 373 -379 110 290 -369 -226 714 -255 -123
6674 -123 468 -41 -303 270 174 -441 366 58 -311 4 305 -480 -35 319 -352 32 755 -90 -315 360
6694 360 87 -241 171 210 -307 409 188 -444 79 514 -306 -175 494 -200 -382 611 47 -616 306 -20
6714b0m93Q70j35q00Q77j57n57K46N90p81j68J147q45J7O55l70l98O26j86n32
6734d14N29J28p31K43M25o42O10K83o90k7P02m73j05M47k09m48M20K84o35K95
6754hM29n55l6L81o20L01O15o38l21O01K31q15M13J85l36j2M48k27o27J038n05
6775e8m81R37k89m08L81K65o06K35L92q78J07R41o07k37P34n77m70J032r5q24
6795e06P03k8p20P05K96q53L45M01p15j64J029p76k2Q55n28m16R97l20n36N74
6815C21kr07N93O67j083Q5J037j150J58J118m60r21J079n31p50R64L67j029O09
6834A65J37o80J90M72n46K50J44o13L83O11r39o4Q77n71m72R60l8o34O39L2q26
6855e23M67M76q81M93M75q13K04N8l67L08M86n32o2M15j31l37M00rm53M86rl15
$$ plain form
6714 -20 -513 357 222 -578 299 142 -415 -169 421 -360 -528 619 -226 -209 446 76 -322 304 118 -414
6734 -414 115 243 -488 -245 180 -462 148 431 -259 -286 416 -57 -162 285 76 -372 48 332 -303 -8
6754 -8 421 -134 -170 211 -409 -108 507 -131 -452 149 380 -435 -22 163 -173 -185 263 36 -591 447 -58
6775 -58 -539 398 109 -299 82 347 -259 -24 368 -510 -403 538 -69 -306 428 -149 -619 413 318 -506
6795 -506 197 169 -551 154 450 -403 -58 343 -372 -536 493 -283 -305 550 22 -394 603 283 -253 321
6815 321 319 -588 5 672 -411 -326 711 -439 -281 837 377 -544 535 4 -746 218 585 -444 165
6834 165 302 -378 -188 284 -262 -12 132 -481 -98 513 -426 -490 387 -184 -656 304 266 -368 271 303 -523
6855 -523 -56 420 -461 32 507 -306 -102 -44 -411 -103 383 -149 -211 204 73 -264 136 127 -326 160 151 -164
6877a64j17O44k71m61M64K31l67k1n7K3P4J1j8m28N51l59J62L73j42l14L59j5
6899A58l34K65J95l74j60M42p1l89O96l82l62L12L79o17M03K86o12J04L77n17
6919b01L15J92k88j29L94l74p7O71m98m91P60K4o10L81m7n15L88O24q62K62N47
6940D66o79j90P79j93m06L67k03k61L86J17m84N98j31m09J08O33m43j41L58k54
6960A8j50N92n82k67O88q3n16M66O5m74M36k00k93N9K58k02j4M95m62N5K50j19
6982B0k11L40j60J99o2r4l15L33P4m36L70j62J87k19J08m5l56L25M20n4k39J74
7004A97k34l9K14j24nJ58j54k44M66l13J10lJ02l71OM27j16l13J74j62q7K81J91
7027A61r0j16Or1K31k60Lj79N53l14j32rM06k50K7K09l30N06j62k22k70N71Ll01
$$ plain form
6877 -164 -281 363 92 -369 95 326 -41 -62 -119 -96 -22 -11 -29 -457 94 -265 -103 270 128 -186 173 158
6899 158 -176 89 284 -90 -250 192 121 -268 428 46 -316 -4 375 -242 161 447 -165 -61 316 -201
6919 -201 114 306 18 -111 283 -91 -168 503 5 -486 274 298 -312 69 22 -493 -105 519 -343 -81 466
6940 466 -213 -403 376 183 -223 144 -59 -320 66 183 -301 297 166 -243 -135 498 55 -86 272 18
6960 18 -132 460 -122 -389 299 216 -300 166 231 -243 193 -7 -300 -241 17 -185 -199 296 -166 -111 139 20
6982 20 -191 149 -11 188 126 32 -283 50 124 -312 58 -104 83 -136 -28 -73 -429 -104 316 262 23 197
7004 197 -37 -76 138 14 9 167 13 -231 235 -78 32 29 131 -240 -234 193 77 -236 -62 -224 -311 -30 161
7027 161 71 -45 -39 -130 101 -159 -156 -335 218 -96 -228 -237 169 -81 -54 155 -175 331 169 -53 -323 248 251 -50
7051e0K04j90M4o1k7M2NP1Qo9pJ3PJ15j73nJ95n7k3q8l1J13m17N41K8m42M77q7
7079A36n7l11R3J94j19L70k46j79M73p8n29L20o9j70M51j58m9j76M45m76K7N36
7101D28n01m0K53K7n03L92N0k9l3qj08L04m0j08j97K78m28J75J18Q8m44M14Q6
7124A74l14L03k60j75L86n5j94n3N33l71j28M53k58r0O3K09n37O11k85k23K48
7145C7K89p29L98M73j012N33L48j12m96L59M7m88L72J63o11O4M84k84K22k5j11
7166g9K95n5l78Q8P97n80k48M81k94k53L11K44m72M8M92n79J55K09P3o03N49l39
7188a38l09N34J47m35L12J71p04M21N5L5k21J50j85M2K75L9o51M43K52n20L90
7209A03K16o72P2O62k48j15K51k54l33N68j43m18O02j27l28J00K78n07L65J56
$$ plain form
7051 -50 154 -36 8 -53 -80 -38 -33 38 46 -23 -30 -17 -10 105 -68 -73 122 65 42 -46 -77 36 -381 160 188 -254 223 136
7079 136 79 -232 -139 55 -64 306 60 -119 354 276 -253 67 -2 -172 279 121 72 -104 341 -135 -108 428
7101 428 -73 -113 140 167 -336 56 106 77 44 36 -72 232 192 84 -113 165 -263 -88 30 118 -326 88 174
7124 174 -140 163 -97 -272 114 59 -135 -188 345 -26 -154 299 41 -49 14 223 -314 297 12 -211 37
7145 37 326 -403 -5 468 -544 -11 337 225 -271 88 135 -353 19 182 -429 -365 119 -165 57 32 -79
7166 -79 216 161 -217 -129 668 88 -160 321 27 -226 85 329 -143 -95 397 -182 -27 182 255 -348 201 -138
7188 -138 -447 87 234 -201 111 282 -422 -1 54 89 -132 18 -167 -125 150 189 -462 -19 233 -287 103
7209 103 319 -353 -281 381 133 18 269 15 -318 250 107 -311 291 164 -164 -64 214 -293 72 228
7229B28m06o8N04k67j66L69k48n63O67J39o13N32L18p12L47M88o21J97L14n46
7249a07r8O59j67p18O88j30o96Q16J01l82J49K95j015M52R05j019n6O37l37j86
7269b09Q50l77q54P93k2o87N95L13r31N47O03j167L32L44j92j02O37o30l73J029
7289D99n34q7K79k03l37N92J53q56O44J34p20M46M21n82R8K58k87k50P89l0l30
7310I7K12k73k96O07R4o62K18L13m79J02L35l27k97M54L7n72P74r5l67j20L84
7331A39m90j20J125l91o67L57J72l07N56k51J6k03K43j79j08J69l96Q7M28k24
7351d4l98Q78j98p30M15N35j063O43M57q15j9N98m75j86R21p71j58M84j13l00
7371c39Q36m02o39N57K50r03O30N96r31j98J072q45k44J081p31k77N71k9m01P92
$$ plain form
7229 228 -178 -246 258 -9 -175 194 -54 -617 50 189 -424 108 426 -286 61 549 -72 125 439 -107
7249 -107 -205 454 287 -431 257 127 -569 247 348 -34 115 410 -605 -153 752 -267 -323 314 -23 -209
7269 -209 641 264 -590 203 181 -506 89 402 -529 18 621 -546 -214 130 -62 -164 473 -157 -530 499
7289 499 -35 -122 157 -46 -383 209 362 -494 150 284 -436 10 431 -151 -53 205 -82 -332 457 427 97
7310 97 309 36 -260 347 441 -221 -3 310 -169 -67 268 -59 -356 98 135 -437 337 242 -125 -245 139
7331 139 -351 -471 654 263 -404 -47 125 -182 374 123 139 -64 179 0 -108 61 -335 -248 180 -44
7351 -44 -442 436 238 -492 -77 458 -605 38 495 -320 -339 259 -216 -402 519 -252 -410 74 -39 -339
7371 -339 497 95 -544 13 263 -640 -10 586 -345 -543 529 -316 -560 521 -210 -487 84 55 -346 446
7391D46k10p35P10K81o89K15M24q01K68M89o90N8P12n50m13P96k70o59P33J49
7411B64p29M94L58o76J75N42o32J47L7J99n33P60l60m4ok08q2N00r9j55JM59n52
7434a40q4M25m36m9M76k0n13L48K94l59j18J49m2j63L53j51j50K55J17k61K91
7455B22m44L7JK44q2J8L66o20K12K93k14k72M48l75M6P0L31k93j49L17o01L93
7477e2L35o14O23r2j75k49M48k04r0L58km50L61M2k16j21J59l54J32L45j20j16
7499e2P6p9n2N05o67O0M62k45j44J07J56j65q9R6l35K39K49j30J23j84j57L51
7521A25k80L39L7j16l9j47P2L5J36l75L85l67K55J3j60L43m4k76l5J70q4p1j2
7544i6j7P7J52J2N8k23m6J92Jj40J63k62q1J35M6K45p9q6j68J05k17J06J74K06
$$ plain form
7391 446 236 -499 211 492 -197 18 442 -359 -91 398 -292 -234 478 -72 -485 311 41 -618 115 264
7411 264 -465 29 387 -289 -114 428 -204 -57 -20 179 -354 406 46 2 -4 -212 -294 206 107 -48 -47 412 -140
7434 -140 -224 201 -235 -284 192 172 -341 7 301 -58 -176 -27 -69 -232 121 -30 -180 75 192 -69 222
7455 222 -222 -185 -184 60 -22 -4 362 -258 -46 247 33 -239 209 -166 -120 -50 281 -12 -161 156 -445 -52
7477 -52 283 -331 292 200 25 -224 224 20 -70 288 286 -164 197 239 23 -98 61 -293 -161 184 64 -52
7499 -52 24 -55 -107 398 -269 -209 253 8 -136 -29 127 -38 -127 -31 -366 -127 122 -8 115 -69 -226 125
7521 125 -155 184 221 105 66 -81 -9 26 162 -213 172 -195 60 73 -87 256 212 -64 -99 71 -13 -84 -96
7544 -96 -113 -36 116 128 186 -37 -83 109 110 -30 133 -129 -210 -75 -29 216 137 51 -117 -12 -229 -123 51 257
7568B57j62j75K12j47o0J31m47L35l53L74p8K97J36l82m8K52j96J27J7K8k52R2
7590d2K81l48K89j20l80N18l14J13lL01m59J18L23j35l6M4j21P4j46M36k11j02
7612H0j2k06Q1K1q3o8J77J16n0K5J19k9m92J94M6J22J44N4l39M7K60l17J80J17
7636A87k64l45N08j71l54M63K9m14M09j81J63J87k21q0J54L72o15J83n4j66k7
7657b37M83m95J31L47j77p5K80j57l88L50N4k65K00J43n68L95J20m4k80K48K3
7678H8j87K86O2k00q8K44m43k1N87m98K03M19m89o3N07m66j50N32j50m74M39j66
7700b8m05M25K90n46L80K1l92J37N66m60j71L88k81l36P60j94o21Q82j01o22L53
7721D5J40j92j60N00o04O8P49n16l33N99k96r3K38M1n23P93N5r21M61L1j12J70
$$ plain form
7568 257 95 -80 132 -15 -75 56 -391 -56 -409 -35 -113 184 320 -62 -110 142 -54 73 90 118 -134 -42
7590 -42 239 -109 180 60 -320 198 -116 -3 -6 295 -164 -46 277 142 106 150 29 103 -43 393 182 80
7612 80 68 -138 -57 -36 -119 -187 -10 106 56 81 200 171 -321 -127 -81 41 185 239 -100 -53 207 -110 70 187
7636 187 -77 -422 86 -85 -439 24 53 -361 48 -133 30 217 -4 -84 70 442 -173 10 -44 -210 -237
7657 -237 246 -249 -118 229 52 -23 257 100 -288 62 116 -149 51 194 -374 21 141 97 -183 65 88
7678 88 -99 187 249 49 -39 205 -238 -259 328 -170 33 452 -37 -100 407 -59 -209 323 173 -301 138 -28
7700 -28 -433 -8 282 -264 116 137 -255 -118 448 -12 -183 205 -76 -412 348 154 -467 415 314 -308 45
7721 45 185 -7 -167 333 -271 -203 546 30 -303 296 0 -93 145 186 -337 456 511 -410 51 82 -30 140
7743A40J84n95q0P35m51m11M33j08rM93n86j19P09k12l91L22L87o63N3J92j19
7764i6RQ4J26j12J02M6k98L9M37l96N6R2k7l52M10j06j77R6J40l9r7M85p38L04
7788a2J4j92k85J058n83k60M81J32n52K59R4n04L99O3k62J7M35l84o0J05k39p7
7810c53P92j88n91Q10j40o74O64j59l12Q9M42r38L72N33m91p4M86l86m32O75M5
7831A70n83N48j08l79L88L71p85J66L54l00l00P35m18j15M31m41J20N26j98n78
7851c96M19K99o94M60K59r06L33N61n09r9Q70p40j65M80j57l84N80p5l87M17k3
7872A43m50K55K56n34K20L65j95k70L15k93J42J77p9l24M11L86o91l0K89J37q8
7893A42k55K33l77K66K15l37l7Q4k14N8K47k16R3L50l61J7K14j31l01N83j27m21
$$ plain form
7743 140 324 -271 -351 384 -67 -478 -45 -153 -162 331 -255 -374 335 123 -268 54 441 -222 -169 23 -96
7764 -96 -87 -3 123 11 113 159 -139 -100 337 -59 -3 89 62 -290 120 14 -163 -67 73 34 -63 422 -316 -12
7788 -12 2 -190 -475 583 0 -260 221 353 -199 60 154 -350 49 112 -150 -133 302 -82 -142 -37 -276 -353
7810 -353 439 251 -340 470 330 -344 320 161 -151 -62 380 -558 -186 347 -144 -218 268 -118 -550 125 170
7831 170 -413 135 27 -352 36 407 -378 -212 142 -158 -458 277 -141 -256 175 -266 -146 380 182 -396
7851 -396 23 322 -372 88 347 -559 -226 335 -174 -273 597 -143 -308 172 15 -369 211 136 -251 166 143
7872 143 -307 -52 204 -330 -110 255 60 -210 105 -188 -46 131 52 -272 139 525 -166 -196 93 230 142
7893 142 -113 120 -257 9 224 -113 -150 -66 -280 -222 25 -191 -98 252 -109 -92 122 -9 -310 273 146 -275
7915b75K59J01k98O6R4k4j67M92k96j90L80l05K6M66p2l60L34k45J91l61L05j25
7937dN6m2Jm3L62l16m5j51K31j40M08j53k61K97l70k07J61L02k83J4M49l30lK14
7961A47k00PQ8k83r2N09j60k12K5M98n58J14M86l17j31R2q3r4L17j34j10oO5J55
7985A23n4J79o31K16K04N1j29jn7K18j17j39P5P1%p3M9K98n03K25k1q0o0K13J03
8010A60ok2j02l2rL17k87oK24k88n3K69L6n87M54O6k49J09M74p71M06r8L1l80
8034c44N13k82o5L00k01k5N2j43Q9N82o19O6J36j48j63J47O6j0k63J61K48p6O
8057B7k0k0j80Q4J82m7k91K51J78n38K74K20k48Q1j33N2k68O53j26q7k15J6J29
8080b6R0j14J4l5J32j18M57n89J29R5Mj21J05n6%q0J75r0j67M23k52R0L6J5Rj02
$$ plain form
7915 -275 -16 85 -213 -147 -53 -77 -244 248 -48 -238 142 -163 -137 329 257 -103 231 -14 177 -184 121 -4
7937 -4 52 10 11 -32 330 14 -31 -182 49 -91 317 164 -97 200 -170 -377 -216 86 -197 -183 266 -64 -67 147
7961 147 -53 -46 42 -241 -333 176 16 -196 -171 327 -231 -117 369 52 -79 13 -70 -164 153 19 -91 -97 -32 123
7985 123 69 248 -383 -167 37 88 -41 -42 -99 119 2 -137 -62 9 9 -64 -15 283 -220 5 -16 -96 -156 57 160
8010 160 154 132 30 -2 -11 306 19 13 237 -51 -104 165 201 -386 68 134 -115 -6 468 -303 103 5 36 -344
8034 -344 169 -113 -178 122 -79 -104 -52 -195 -106 476 -143 -77 59 -89 -252 -105 -39 -49 -312 -151 97 21 27
8057 27 7 -13 -193 -109 73 26 -265 -14 164 -374 -100 120 -128 -47 -180 -128 -396 257 131 44 -171 -155 -26
8080 -26 64 -50 -36 -71 61 -57 400 -189 -60 35 39 -82 23 -33 -33 -113 62 -28 -195 228 -24 66 102 117 126 24
8106B4r7J41Q5Q3k95P5K06m27K31J12j48q4K95j32Q2Kk65j14M84k13k43J29j2
8129h1m1r4M94l79O9O1j3L7K06l49k23L28K07o60P44mm32K47J48j27M1N3m23J39
8153e2K57k74p1K91Pl79L85Kl39M0K42m09K27K74l95K40K8Jk04K48L7l99K93L45
8177C95m91J39j43k12J35K55m06J68M68l04j93L36l93K06
$$ plain form
8106 24 -73 68 153 236 -59 16 222 -205 26 138 -10 -94 201 69 151 153 -112 -226 258 45 -198 -69 -81
8129 -81 -122 -216 278 -101 -32 29 16 53 259 -90 -313 15 222 -438 306 302 -130 117 265 138 179 232 -191 -52
8153 -52 205 -69 -140 151 158 -221 164 166 -173 -133 109 -300 -73 201 -194 46 74 75 -129 119 156 -243 50 395
8177 395 -96 43 -100 -312 -177 78 -328 -160 308 4 -189 147 -246 -40
8191d0
$$ Imaginary data points
##PAGE= N=2
##DATA TABLE= (X++(I..I)), XYDATA
0@%%%%%%JrJ6j6K4l5M7o4Q0j00J23j52J91k33K78l31L95m70N54o46P51q71J007
29E40j162J332j517J725j958K215k499K811l151L526l939M390m885N424o009O650
45C493p352Q116q952R867j0870J1977j3195J4537j6031J7698j9569K1692k4115
58a2704K6909l0178L4065l8773M4613n2078O1998p5901R6903j32582K08492o24458
70d93694O72315O76511j689732Q09711P79661j262713Q6400J063270q52571l2243
80b43085Q06065p88511l08974J047512m40221m79009P90822k72129o28398P35350
90B19422l1524n27254O46289o5846q44532O62826M26202q47664K49425O04691
100D92035p32805j18731O66545k67431j67735L76095l64922j56611N28896k23684
$$ plain form
0 0 0 0 0 0 0 0 1 -8 8 -8 16 -19 28 -36 44 -56 67 -85 106 -127 151 -180 215 -255 299 -347 404 -467 540
29 540 -622 710 -807 918 -1040 1175 -1324 1487 -1664 1862 -2077 2313 -2572 2852 -3157 3493
45 3493 -3859 4257 -4695 5172 -5698 6279 -6916 7621 -8410 9288 -10281 11411 -12704
58 -12704 14205 -15973 18092 -20681 23932 -28146 33852 -42049 54854 -77728 130764 -493694
70 -493694 178621 855132 -834600 -24889 754772 -507941 -421541 641729 -210842 -243085
80 -243085 562980 -225531 -534505 513007 72786 -406223 384599 112470 -515928 219422
90 219422 187898 -339356 306933 241087 -603445 59381 485583 -362081 -112656 492035
100 492035 -240770 -359501 307044 39613 -128122 247973 -116949 -273560 255336 31652
110C1652k81937N21662j41271n37253M15628K76333l99099R5969J93328l25433
120a50421R446K85228j14965p0414J38933j11049j48653J32274J67406n1063j71973
131h5251K4586J34657j30853n6709K80486l2214l08281R6262J44931j15296Q7629
142C9947O9198j84406L9392O6001j42063J65706J49845l03061k0587K17210j77261
153h0079K5469K71260k41463j33789K81958j71368j23039M17019j32040l90918
163b76990L24886P7546l44750K92767J69043m34821J15568K37845l39004J49700
173b8210L43092m37748q7881M32912k75021j61612M88156j81471l78704L75707
183H9220N946l17877L68157O8273m64701K20130K18963l83571J70373L19850m17361
$$ plain form
110 31652 -250285 271377 130106 -407147 8481 284814 -114285 -18316 175012 -150421
120 -150421 -140975 144253 29288 -41126 97807 -13242 -161895 -29621 137785 86722 -85251
131 -85251 -60665 73992 -56861 -113570 166916 134702 -173579 -77317 67614 -47682 39947
142 39947 109145 -75261 -35869 30132 -111931 53775 203620 -99441 -120028 97182 -80079
153 -80079 -54610 216650 -24813 -158602 123356 -48012 -171051 245968 113928 -276990
163 -276990 47896 125442 -219308 73459 242502 -192319 -76751 161094 -177910 -28210
173 -28210 314882 -122866 -210747 222165 -52856 -214468 273688 92217 -286487 89220
183 89220 95166 -222711 145446 213719 -250982 -30852 188111 -195460 -25087 294763 -122598
194a22598o4645L59445k30558p1311L70596k21096k45933L32994o5913k27819
204a86838L41302L731l80987J97423J60480k74545J50324K00498l20208j5479
214a24299K50161j77749k2380K66344j84337j88554K39259j7085j48936K07945
224A00369M832k46357J04678J10506j40797R2287J06512k08598k4173J63604p9663
235a6800j8853J51533j03717j37804J32732L3644p9265J00357J0668j64400L3602
246e8303J09986o0490J4699P8309j12152p1594J18671J8993n0237O4766k2691
257B9957j19376N2060Q9853m8990P940L8611j01440k9750J16684M285m7009M8704
269D1529m1046r0672Q0989P3082o1453R909J7096r6918J1657J13394k3203m0121
$$ plain form
194 -122598 -187243 172202 -58356 -129667 240929 19833 -226100 106894 40981 -186838
204 -186838 154464 158195 -222792 -25369 135111 -139434 10890 211388 -108820 -124299
214 -124299 125862 -51887 -74267 192077 7740 -180814 58445 41360 -107576 100369
224 100369 105201 -141156 -36478 74028 -66769 25518 132030 -76568 -100741 62863 -16800
235 -16800 -35653 115880 12163 -125641 7091 40735 -38530 61827 72495 -91905 -58303
246 -58303 51683 -8807 5892 84201 -27951 -99545 19126 38119 -12118 52648 29957
257 29957 -89419 -37359 52494 3504 11444 50055 -51385 -81135 35549 39834 -7175 41529
269 41529 483 -90189 -9200 63882 2429 12338 29434 -67484 -55827 57567 34364 -5757
281e757L8026n7819n1461J01333L7110o4771J4336r484p4738N2287Q5479m4970
293A9571k5777J7731n7305l262R3373K929n2822O823k4285l2608O6215M6235m4669
306A2149j9667m231l1154K9722O3691j4266m1232j0236j7560O248N4197J7903
318D5564l6836k7978j1845M149L8037L2407j6829l8411k2963N669K9836K9223
330C0023K455l0288l8240l38L6047K4553P068j0309m2904k3658L9234L1166k909
343B1900L521k7862m9683K8073N3241r671n53K388o2043p923P5704J741k6388
356B445K5411m4740n3960P6556M0412n0811K4495k538q8298M4369Q8694n5931
368F104q823M3884r0438j8882J24156k2303o0063O9356m8895q6026J18810M2107
$$ plain form
281 -5757 32269 -25550 -77011 24322 61432 -3339 10997 1513 -73225 -20938 64541 19571
293 19571 -6206 11525 -45780 -49042 44331 47260 -5562 1261 -23024 -55632 10583 56818 12149
306 12149 -7518 -11749 -42903 -13181 50510 36244 -4988 -15224 -32784 -26536 27661 45564
318 45564 8728 -19250 -31095 -26946 11091 43498 26669 -11742 -34705 -29036 800 30023
330 30023 32478 2190 -36050 -36388 -341 24212 31280 20971 -21933 -45591 -6357 24809 21900
343 21900 25421 -2441 -52124 -24051 29190 19519 18966 21354 -40689 -48612 27092 28833 2445
356 2445 27856 -16884 -70844 5712 46124 -4687 19808 17270 -71028 -26659 62035 6104
368 6104 -2719 41165 -49273 -68155 56001 33698 -26365 42991 -5904 -91930 26880 68987
380F8987j00529N0560J7270j28149O6769J14332j03616n765Q0492j19320j7227
391g6196J61211n6103p8882J06086o3703j01372J54569K8601j30446P8084J8917
402D0766j45224R3580J12777j29069J1197Q1111j36633Q456J61210q5717o2019
413d9565J12563q6758p8752J67205r92j21921Q7901j871j27879J04117Q6428j20155
425b9679J4615N8468j07250J7627J21256n6710m7398N4365m8823k8559R0075K589
437D0576n0847J7533k1956l1020N6954K9848l1865j0663j0884j5146K0182K8803
449B1515J2464k3129m4304J0877K5296j0156L6207J1753q3287P839O2516n1900
461b4309K3473Q6727j12160n9243J35996m1068p2090J46491m1994j61039J37208
$$ plain form
380 68987 -31542 19018 36288 -91861 -25092 89240 -14376 -20141 60351 -58969 -76196
391 -76196 85015 28912 -49970 56116 -7587 -108959 45610 74211 -56235 21849 40766
402 40766 -104458 -10878 101899 -27170 -15973 65138 -71495 -63039 98171 12454 -49565
413 -49565 62998 -23760 -102512 64693 63701 -58220 29681 27810 -100069 4048 90476 -29679
425 -29679 -15064 43404 -63846 -46219 75037 18327 -29071 25294 -23529 -52088 37987 40576
437 40576 -10271 7262 -14694 -45714 11240 41088 9223 -1440 -12324 -27470 -7288 21515
449 21515 33979 10850 -33454 -22577 2719 -7437 28770 40523 -42764 -34925 27591 -24309
461 -24309 -836 85891 -26269 -85512 50484 9416 -62674 83817 41823 -119216 17992
472A7992M5548j50477J33445O5921k36622P8316J70550k00360K8683K10793k21107
483e7318q1410K62246j24262j16353K68423j17456k30362K82725J0555k71051
493a74263K47965Q8179l55286J48511K19982k88985P1115K39520l06098j8184
503a27544L13195k38852q1907L56702k24392k38440L91276n8759l08683L39476
513A22072L2165m02879K62207J91091l91048J58036K83599m09994j5221L97554
523B27582k47583j50166L44219j41190k21961K75777k6283j78937K25430n1076
533E5812k34348K37342M9688k55960J87495J11299k99932R0720K03469k17900
543g2315K5721K00310k19377n7299K48442j16455j18875K11538n6494j77576J48369
$$ plain form
472 17992 63540 -86937 46508 112429 -124193 -45877 124673 -75687 -47004 163789 -57318
483 -57318 -138728 123518 -744 -117097 151326 33870 -196492 86233 96788 -174263
493 -174263 73702 161881 -193405 -44894 175088 -113897 -42782 196738 -109360 -127544
503 -127544 185651 -53201 -135108 221594 -2798 -241238 150038 91279 -217404 122072
513 122072 154237 -248642 13565 204656 -186392 -28356 255243 -154751 -169972 227582
523 227582 -20001 -170167 174052 32862 -189099 86678 60395 -118542 106888 55812
533 55812 -178536 58806 108494 -147466 40029 151328 -148604 -57884 145585 -72315
543 -72315 -46594 153716 -65661 -122960 125482 9027 -109848 101690 45196 -132380 15989
554A5989M6984j11671Q4701J675j22684R4778M7586j23062P4104Q7419j52493
565e6674k8335J44133j6910q0955M1532L4009n3960l6500O6287N5077q1182l0962
577d4440Q4497n1986n8129J40718j0154j58689J00955P5876j65501N6759J57515
588A27421j46428p1084J33752l8380m2040Q3673m9959k2199O8421r6614Q387J68851
600A23801j25490j12405J95463n2851j59923K06577K2971k23964J40535P8166
610I2880k22726J33968J56305k64019K9842K18039k16749k7885K66992j76390
620i743j28683K56544j16301j59953K99723n5212k84016K58701P6275l23458J82464
631c659K08255l18615J4797K47581k04628l4019K39842j65227r7712K22249j18345
$$ plain form
554 15989 62973 -48698 36003 37678 -85006 9772 57358 -65704 8400 95819 -56674
565 -56674 -85009 59124 42214 -38741 2791 36800 -17160 -53660 12627 67704 -13478 -44440
577 -44440 40057 -11929 -70058 70660 60506 -98183 2772 78648 -86853 -30094 127421
588 127421 -19007 -90091 43661 5281 -36759 46914 -3045 -25244 43177 -53437 -45050 123801
600 123801 -1689 -114094 81369 28518 -131405 75172 98143 -125821 14714 92880
610 92880 -129846 4122 160427 -103592 -73750 144289 -72460 -100345 166647 -9743
620 -9743 -138426 118118 1817 -158136 141587 86375 -197641 61060 137335 -186123 -3659
631 -3659 204596 -114019 -99222 148359 -56269 -90288 149554 -15673 -113385 108864 -9481
642i481j14261K48587p2990k00318K06468R016k01001J86806O2030k44859J21436
653h567J27653k36268P7103K11999k29904o1757K40168j19410j19136K15586m2727
664E4740j69248J46634J9532j42359J29841N1776j80022O3216J08809j39323J7997
675c8407J35710j11606n9243J20398m1448n6184J07033k7774j00095Q1255K7911
686C7550q7578N6145N8007r8489r923Q0066l5594k3719O1977k8694n5302N3328
698G774J4925m8086M0484K5562p8775L294P3977l7184k8618O5352k7448o6395
710e5138O4213K6656o5308L7052L2220q7619J7823Q3668o2613k1642Q2073n6509
722e124n9691R9686p40p9648O7677J2017r8461O0339O4575r3100J7844P2071r4522
$$ plain form
642 -9481 -123742 124845 51855 -148463 58005 67021 -133980 52826 114856 -130003 -8567
653 -8567 119086 -117182 -40079 171920 -57984 -119741 120427 1017 -118119 97467 54740
664 54740 -114508 32126 51658 -90701 39140 90916 -89106 -25890 82919 -56404 -38407
675 -38407 97303 -14303 -73546 46852 5404 -50780 56253 28479 -71616 9639 37550
686 37550 -50028 6117 64124 -34365 -44288 35778 184 -23535 38442 9748 -45554 7774
698 7774 22699 -25387 15097 40659 -38116 -34822 39155 1971 -26647 38705 11257 -55138
710 -55138 9075 35731 -29577 7475 39695 -47924 -30101 53567 -9046 -30688 51385 -5124
722 -5124 -64815 34871 34131 -45517 22160 34177 -64284 -3945 60630 -32470 -14626 57445 -37077
735c7077j1159J10799n5211n3576R1586l7351p7143R8673J4179r3301O0818L0190
747D1427j00940M5890P8290q7799l652P6580p3753k5970J00167l4685n9400P3160
759B9315j5476o9961P4485K7044p9523L2839L6128p2984K0158O7659n6561j9578
771b6455N6239l9805k7211O9588j1692n0981M1188J744m8834M2187K9100n2870
783a7802P308K9346m0121O016M7369k9229k2081L2895j6803j9515M1699l91l6232
796a7541J7838O720k6241K1877K1708k9757m026J7291j7298J698K7066j3661j7724
809a2050J3092l696q286J9779L520j9521J282O129o736Q055J0992j0673r703M479
823c337J399M48Q699P52j2323l861Q025K145m8P042m928j5023N839J0533o329
$$ plain form
735 -37077 -48236 62563 7352 -46224 45362 8011 -69132 29541 43720 -49581 11237 41427
747 41427 -59513 -13623 64667 -23132 -26784 49796 -23957 -49927 50240 15555 -43845 29315
759 29315 13839 -56122 18363 45407 -34116 -1277 34851 -38133 -17975 49684 -6877 -26455
771 -26455 29784 -10021 -37232 32356 20664 -30317 10871 12615 -36219 5968 35068 -17802
783 -17802 -10494 18852 -21269 -15253 32116 2887 -19194 13701 -3102 -22617 19082 18691 -17541
796 -17541 297 7017 -19224 2653 24361 -5396 -9422 7869 -9429 -7731 19335 5674 -12050
809 -12050 1042 -2654 -10940 8839 12359 -7162 -5880 249 -6487 1568 12560 1887 -7816 -3337
823 -3337 -1938 -1490 7209 7961 -4362 -8223 -198 1947 1899 8941 4013 -11010 -5171 5362 -967
838i67L146P887j8027n203J9990l741p440J5609r699k0202K0856Q495j9169J3079
852D614P522k9557Q440K5296j9377j321K1278k3739j0198L0513p634j5812K2804
865A2829r705k3946K5693P660k2994J5648O143k8280J1571J9807j9023K107J4022
878A1532k0595k752K0500p244m628J0045j0273m793J1325j565R48M030j2006J190
$$ plain form
838 -967 2179 10066 -7961 -13164 6826 3085 -4355 11254 1555 -18647 2209 10704 -8465 4614
852 4614 12136 -17421 -8981 16315 -3062 -4383 16895 -6844 -17042 13471 5837 -9975 12829
865 12829 3124 -20822 4871 12531 -10463 5185 11328 -16952 -5381 14426 -4597 -2490 11532
878 11532 -9063 -11815 8685 1441 -3187 6858 -3415 -8208 3117 1552 2500 6530 -5476 -4286
$$ [...]
8191A20
##END NTUPLES=NMR FID
##END=
