##TITLE=1H_2Mal-1
 CDCl3
 8 sc, 
 6.6.2023
##JCAMPDX= 6.0         $$ Bruker NMR JCAMP-DX V2.0
##DATA TYPE= NMR FID
##DATA CLASS= NTUPLES
##ORIGIN= UXNMR, Bruker Analytische Messtechnik GmbH
##OWNER= root
$$ XWIN-NMR		Version 3.5
$$ Tue Jun  6 15:32:51 2023 Russian Standard Time (UT+4h)  she@DPX200
##.OBSERVE FREQUENCY= 200.13135
##.OBSERVE NUCLEUS= ^1H
##.DELAY= (6, 6)
##.ACQUISITION MODE= SIMULTANEOUS
##.ACQUISITION SCHEME= undefined
##.AVERAGES= 8
##.DIGITISER RES= 18
##SPECTROMETER/DATA SYSTEM= spect
##.PULSE SEQUENCE= zg30
##.SOLVENT NAME= D2O
##.SHIFT REFERENCE= (INTERNAL, D2O, 0, 15.7039)
##AUDIT TRAIL= $$ (NUMBER, WHEN, WHO, WHERE, WHAT)
$$ ##TITLE= Audit trail, XWIN-NMR		Version 3.5
$$ ##JCAMPDX= 5.01
$$ ##ORIGIN= Bruker BioSpin GmbH
$$ ##OWNER= she
$$ F:/spectra/data/she/nmr/H-F/1/audita.txt
$$ ##AUDIT TRAIL=  $$ (NUMBER, WHEN, WHO, WHERE, WHAT)
(   1,<2023-06-06 15:32:00.17 +0400>,<she>,<DPX200>,
      <created by zg, POWCHK disabled, PULCHK disabled
       configuration hash MD5:
       00 E9 B6 7A A2 85 ED C7 34 08 36 98 17 FE 4E 26
       data hash MD5: 16K
       9E 64 4B DA A6 B4 70 E2 32 F7 69 FA 0B AA DE CF>)
$$ ##END=
$$ 
$$ hash MD5
$$ 12 4E 5F 2B 46 52 52 F4 5A 4E 08 C5 2C DB A3 E7
##$RELAX= 
##$RELAX= 
##$RELAX= 
##$RELAX= 
##$RELAX= 
##$RELAX= 
$$ Bruker specific parameters
$$ --------------------------
##$DU= <F:/spectra>
##$EXPNO= 1
##$NAME= <H-F>
##$PROCNO= 1
##$TYPE= <nmr>
##$USER= <she>
##$AMP= (0..31)
100 100 100 100 100 100 100 100 100 100 100 100 100 100 100 100 100 100 
100 100 100 100 100 100 100 100 100 100 100 100 100 100 
##$AQSEQ= 0
##$AQ_mod= 1
##$AUNM= <au_zg>
##$AUTOPOS= <>
##$BF1= 200.13
##$BF2= 200.13
##$BF3= 200.13
##$BF4= 200.13
##$BF5= 200.13
##$BF6= 200.13
##$BF7= 200.13
##$BF8= 200.13
##$BYTORDA= 1
##$CFDGTYP= 0
##$CFRGTYP= 5
##$CHEMSTR= <none>
##$CNST= (0..31)
1 1 145 1 1 1 1 1 1 1 1 1 1 1 1 1 1 1 1 1 1 1 1 1 1 1 1 1 1 1 1 1 
##$CPDPRG= <>
##$CPDPRG1= <>
##$CPDPRG2= <>
##$CPDPRG3= <>
##$CPDPRG4= <mlev>
##$CPDPRG5= <mlev>
##$CPDPRG6= <mlev>
##$CPDPRG7= <mlev>
##$CPDPRG8= <mlev>
##$CPDPRGB= <>
##$CPDPRGT= <>
##$D= (0..31)
0 1.2 0 0 0 0 0 0 0 0.06 0 0.03 0 0 0 0 0.0002 0 0 0 0 0 0 0 0 0 0 0 0 
0 0 0 
##$DATE= 1686051119
##$DBL= (0..7)
120 120 120 120 120 120 120 120 
##$DBP= (0..7)
150 150 150 150 150 150 150 150 
##$DBP07= 0
##$DBPNAM0= <>
##$DBPNAM1= <>
##$DBPNAM2= <>
##$DBPNAM3= <>
##$DBPNAM4= <>
##$DBPNAM5= <>
##$DBPNAM6= <>
##$DBPNAM7= <>
##$DBPOAL= (0..7)
0.5 0.5 0.5 0.5 0.5 0.5 0.5 0.5 
##$DBPOFFS= (0..7)
0 0 0 0 0 0 0 0 
##$DE= 6
##$DECBNUC= <off>
##$DECIM= 32
##$DECNUC= <off>
##$DECSTAT= 4
##$DIGMOD= 1
##$DIGTYP= 9
##$DL= (0..7)
0 120 120 120 120 120 120 120 
##$DP= (0..7)
150 150 150 150 150 150 150 150 
##$DP07= 0
##$DPNAME0= <>
##$DPNAME1= <>
##$DPNAME2= <>
##$DPNAME3= <>
##$DPNAME4= <>
##$DPNAME5= <>
##$DPNAME6= <>
##$DPNAME7= <>
##$DPOAL= (0..7)
0.5 0.5 0.5 0.5 0.5 0.5 0.5 0.5 
##$DPOFFS= (0..7)
0 0 0 0 0 0 0 0 
##$DQDMODE= 0
##$DR= 18
##$DS= 0
##$DSLIST= <SSSSSSSSSSSSSSS>
##$DSPFIRM= 0
$$ [...]
##$SUBNAM2= <"">
##$SUBNAM3= <"">
##$SUBNAM4= <"">
##$SUBNAM5= <"">
##$SUBNAM6= <"">
##$SUBNAM7= <"">
##$SUBNAM8= <"">
##$SUBNAM9= <"">
##$SW= 18.05172834244
##$SWIBOX= (0..15)
0 0 2 0 0 0 0 0 0 0 0 0 0 0 0 0 
##$SW_h= 3612.71676300578
##$TD= 16384
##$TD0= 1
##$TE= 0
##$TE2= 300
##$TE3= 300
##$TEG= 300
##$TL= (0..7)
0 120 120 120 120 120 120 120 
##$TP= (0..7)
150 150 150 150 150 150 150 150 
##$TP07= 0
##$TPNAME0= <>
##$TPNAME1= <>
##$TPNAME2= <>
##$TPNAME3= <>
##$TPNAME4= <>
##$TPNAME5= <>
##$TPNAME6= <>
##$TPNAME7= <>
##$TPOAL= (0..7)
0.5 0.5 0.5 0.5 0.5 0.5 0.5 0.5 
##$TPOFFS= (0..7)
0 0 0 0 0 0 0 0 
##$TUNHIN= 0
##$TUNHOUT= 0
##$TUNXOUT= 0
##$USERA1= <user>
##$USERA2= <user>
##$USERA3= <user>
##$USERA4= <user>
##$USERA5= <user>
##$V9= 5
##$VALIST= <valist>
##$VCLIST= <CCCCCCCCCCCCCCC>
##$VD= 0
##$VDLIST= <DDDDDDDDDDDDDDD>
##$VPLIST= <PPPPPPPPPPPPPPP>
##$VTLIST= <TTTTTTTTTTTTTTT>
##$WBST= 1024
##$WBSW= 4
##$XGAIN= (0..3)
0 0 0 0 
##$XL= 0
##$YL= 0
##$YMAX_a= 252767
##$YMIN_a= -300239
##$ZGOPTNS= <>
##$ZL1= 120
##$ZL2= 120
##$ZL3= 120
##$ZL4= 120
##$ABSF1= 10
##$ABSF2= 0
##$ABSG= 5
##$ABSL= 3
##$ALPHA= 0
##$AQORDER= 0
##$ASSFAC= 0
##$ASSFACI= 0
##$ASSFACX= 0
##$ASSWID= 0
##$AUNMP= <proc_1d>
##$AZFE= 0.1
##$AZFW= 0.1
##$BCFW= 1
##$BC_mod= 2
##$BYTORDP= 1
##$COROFFS= 0
##$CY= 11.3945322036743
##$DATMOD= 1
##$DC= 2
##$DFILT= <>
##$DTYPP= 0
##$F1P= 15.7292609196834
##$F2P= 12.9074282941183
##$FCOR= 0.5
##$FTSIZE= 0
##$FT_mod= 4
##$GAMMA= 1
##$GB= 0.15
##$INTBC= 1
##$INTSCL= 1
##$ISEN= 128
##$LB= 0.24
##$LEV0= 0
##$LPBIN= 0
##$MAXI= 10000
##$MC2= 0
##$MEAN= 0
##$ME_mod= 0
##$MI= 1.114404
##$NCOEF= 0
##$NC_proc= 0
##$NLEV= 6
##$NOISF1= 3.799351
##$NOISF2= 2.8
##$NSP= 1
##$NTH_PI= 0
##$NZP= 0
##$OFFSET= 15.70392
##$PC= 1
##$PHC0= -20063.69
##$PHC1= 10.45272
##$PH_mod= 1
##$PKNL= yes
##$PPARMOD= 0
##$PSCAL= 0
##$PSIGN= 0
##$REVERSE= no
##$SF= 200.130013532006
##$SI= 16384
##$SIGF1= 3
##$SIGF2= 2
##$SINO= 400
##$SIOLD= 16384
##$SREGLST= <1H.CDCl3>
##$SSB= 0
##$STSI= 0
##$STSR= 0
##$SW_p= 3612.71676300578
##$SYMM= 0
##$S_DEV= 0
##$TDeff= 0
##$TDoff= 0
##$TI= <>
##$TILT= no
##$TM1= 0
##$TM2= 0
##$TOPLEV= 0
##$USERP1= <user>
##$USERP2= <user>
##$USERP3= <user>
##$USERP4= <user>
##$USERP5= <user>
##$WDW= 1
##$XDIM= 8192
##$YMAX_p= 0
##$YMIN_p= 0
$$ End of Bruker specific parameters
$$ ---------------------------------
##NTUPLES= NMR FID
##VAR_NAME=  TIME,          FID/REAL,        FID/IMAG
##SYMBOL=    X,             R,               I
##VAR_TYPE=  INDEPENDENT,   DEPENDENT,       DEPENDENT
##VAR_FORM=  AFFN,          ASDF,            ASDF
##VAR_DIM=   8192,          8192,            8192
##UNITS=     SECONDS,       ARBITRARY UNITS, ARBITRARY UNITS
##FACTOR=    0.0002768,     1,               1
##FIRST=     0,             0,               0
##LAST=      2.2672688,     0,               0
##MIN=       0,             -300239,         0
##MAX=       2.2672688,     252767,          0
$$ Real data points
##PAGE= N=1
##DATA TABLE= (X++(R..R)), XYDATA
0@%%%%%%%%%%%%%%%%JrJ6j6J6j8K6l2L8m6N3o2P1q3R5j08J25j44J64j84K09k37
$$ 0 0 0 0 0 0 0 0 0 0 0 0 0 0 0 0 0 1 -8 8 -8 8 -10 16 -16 22 -24 29 -33 38 -45 50 -58 67 -77 87 -97 112 -125
38a25K65k97L32l70M12m57N07n63O24o91P61q37R24j018J122j236J360j497J650
$$ -125 140 -157 175 -195 217 -240 267 -296 328 -363 398 -439 485 -533 589 -647 713 -784 866
57H66j823K018k236K484k774L110l504L966m498N064n444M301J2446K38791l57223
$$ 866 -957 1061 -1175 1309 -1465 1645 -1859 2107 -2391 2673 -2771 1530 13976 252767 -104456
72a04456j08082M62737k09549k35964L07203p2215k11979K88129k4853k43775
$$ -104456 -212538 250199 40650 -195314 111889 39674 -172305 115824 90971 -152804
82a52804K11551K5911k50919J95714J11398k40717Q6029J03265k05879J08345
$$ -152804 58747 84658 -166261 29453 140851 -99866 -13837 89428 -116451 -8106
92h106J50960k28262L4976J91953k22314l9153K69750j14379j54453J77196l1823
$$ -8106 142854 -85408 -50432 141521 -80793 -119946 149804 35425 -119028 58168 26345
103B6345j21825J44426M43j10933J06905k5983j32431J49101O3438j72969N3321
$$ 26345 -95480 48946 49389 -61544 45361 19378 -113053 36048 99486 -73483 -20162
114b0162R9489j37705J611J35067o3896n5156O8957l6934m0500Q0686J0377o4260
$$ -20162 79327 -58378 -56767 78300 14404 -40752 28205 -8729 -49229 31457 41834 -22426
126b2426R414K6799k6395j4780M4851L2265n9284m2416O2660J4609n1975L7085
$$ -22426 -13012 13787 -12608 -27388 17463 49728 -9556 -51972 10688 25297 -26678 10407
138A0407K9622o5615l570L8784j4829K2907J1938o3494J6929M4018n3776K1279
$$ 10407 40029 -25586 -29156 9628 -5201 17706 29644 -33850 -16921 27097 -26679 -5400
150e400O5035p6034k7367P2851m1985j1497Q8683o4357o4551J01908k5483p6668
$$ -5400 59635 -16399 -43766 29085 -12900 -24397 64286 -71 -64622 37286 11803 -64865
162f4865J16244N223j31345O9509N1972j01269O2597O4389j25089K3848Q8359
$$ -64865 51379 56602 -74743 -5234 46738 -54531 8066 72455 -52634 -28786 59573
173E9573j07734J8235J25921j14681n6666J34584n7694o9533J34825l1327j14121
$$ 59573 -48161 -29926 95995 -18686 -75352 59232 1538 -67995 66830 35503 -78618
184g8618J01785P733j01494J04709L5269j38406N4725P2530j11891L8079R8268
$$ -78618 23167 30900 -70594 34115 69384 -69022 -14297 58233 -53658 -15579 82689
195H2689j09920k0544R6735p0997j9008J11088o3259o9043R7162k4684o9529J01111
$$ 82689 -27231 -47775 48960 -22037 -41045 70043 6784 -62259 34903 10219 -59310 41801
207D1801N012j03879N5461L4664p9557N0590N5193q9560L894O1967o1361J925
$$ 41801 46813 -57066 -1605 33059 -46498 4092 59285 -30275 -26381 35586 -25775 -23850
219b3850P9675n2692m4663O2361j9581l5689O5706l868o1192L3574J2803m2435
$$ -23850 55825 3133 -41530 20831 1250 -34439 31267 27399 -33793 -219 12584 -29851
231b9851L9732K8856n7381J382L3458l3551O161M7200l1541l0199L1718q185j7014
$$ -29851 9881 38737 -18644 -17262 16196 -17355 -11194 36006 4465 -25734 5984 -2201 -19215
244a9215M0444J145m2167J2294J4470k2589J8574K5840l3217j4549K3492r391
$$ -19215 21229 22374 -19793 -7499 6971 -15618 2956 28796 -4421 -18970 4522 -4869
256d869l839L0795j0072l1235J4397Q045j4085K1008J2037l3166m500J9963j0932
$$ -4869 -8708 22087 12015 -19220 -4823 3222 -10863 10145 22182 -10984 -15484 4479 -6453
269f453M383K4998k0045k2990J9135J823q698K3782p00l1684O501J4513j1499
$$ -6453 -2070 22928 2883 -20107 -972 851 -7847 15935 15235 -16449 -9948 4565 -6934
282f934J2755J4804k7162j0294J9181m352P08K0394j3933k2779J3229O079n822
$$ -6934 5821 20625 -6537 -16831 2350 -2002 -1294 19100 5167 -17612 -4383 1696 -4126
295d126J6214R70k5040N44J2734l800Q004R653j8231j0765J1209K402K230J0731
$$ -4126 12088 13058 -11982 -11438 1296 -2504 5500 15153 -3078 -13843 -2634 -232 1998 12729
309A2729q414j6302L884P805K189P645r05j4682m697P221N653N630J483r913r348
$$ 12729 4315 -11987 -8103 -298 1891 9536 8631 -6051 -10748 -3527 2126 7756 9239 -674 -10022
324a0022K077P945O888J737o009q755l781O092J0424K343n737n701o112k75J2574
$$ -10022 -7945 0 6888 8625 2616 -6139 -9920 -3828 6596 8939 3202 -2499 -8611 -8886 3688
339C688P123p385m478l366o689R383J4546o959p718J872r530J7K0877p14j4545
$$ 3688 10811 3426 -1052 -4418 -11107 -1724 12822 5863 -1855 17 -9513 -9496 11381 10667 -3878
354c878M956m782j1491K0364J1658j9786J180N040j9369J1049K5343j8413r490
$$ -3878 1078 -3704 -15195 5169 16827 -2959 -1779 3261 -16108 -5059 20284 1871 -7619
367g619J5317j8627n593L5099p033k3659J9105p180k3433L2862J2456l3515J1813
$$ -7619 7698 -10929 -16522 18577 11544 -12115 6990 -190 -23623 9239 21695 -11820 -7
380gJ0208l3630J8412L2954l2796m745K6223l1477m695M6295j9230k5301L2557
$$ -7 10201 -23429 -5017 27937 -4859 -9604 16619 -14858 -19553 26742 7512 -17789 14768
393A4768j6537k7875M5975M675m0360K5398N761m1905L0309K9552m1887O807K4293
$$ 14768 -1769 -29644 16331 21006 -19354 6044 11805 -30100 209 29761 -12126 -5319 18974
406A8974m1192O864M5188l0713j3157L4290l0070j7250N0395j0041l2206L2523
$$ 18974 -22218 -15354 29834 -879 -14036 20254 -9816 -27066 23329 13288 -18918 13605
418A3605q115l6268L8169J6599l8074J5080J3159l7021J4115L2691k5440n615
$$ 13605 5490 -30778 7391 23990 -14084 996 14155 -22866 -8751 23940 -1500 -7115
430g115J9386k2512n740K9651n800j2871J0755j0147r967J9305M699r762L140
$$ -7115 12271 -10241 -15981 13670 7870 -5001 5754 -4393 -14360 4945 9644 -118 3022
443C022m250r306P761R996K70n755o612O69N51J339J2859k103j7711O230M420
$$ 3022 -1228 -10534 -2773 7223 7493 1738 -4874 -4205 -3654 -2315 10544 8441 -9270 -3040 1380
458A380j2518J9064J1727l3240L910K3496k8172N385M0078l4124k1766M2207j9862
$$ 1380 -11138 7926 19653 -13587 -9677 13819 -14353 -8968 31110 -3014 -24780 17427 -2435
471b435k1978N3990j5936m8738M8630J495n3468N4643K2309p5608K9394M2260
$$ -2435 -24413 29577 13641 -35097 13533 15028 -38440 16203 38512 -37096 -7702 34558
483C4558o7488K3284O0915p3435o330P1188o2069j7673R3226n1279n8767Q8536
$$ 34558 -32930 -9646 51269 -22166 -28496 42692 -19377 -37050 56176 4897 -53870 34666
495C4666k0637o8822Q6988M126q8198O3458K0872q6866O5879M5469j07295L6850
$$ 34666 14029 -54793 32195 36321 -51877 11581 32453 -54413 11466 56935 -50360 -13510
507a3510P2015j03908J5509J04897r4084l2385J10396o6731n4008J22884l7392
$$ -13510 58505 -45403 -29894 75003 -19081 -51466 58930 -7801 -61809 61075 23683
518B3683r5578J05281M196j08532Q4991M8375j10635L2840O1233p9904K0002O2234
$$ 23683 -71895 33386 37582 -70950 14041 62416 -48219 -15379 45854 -34050 -14048 48186
530D8186p1105M673N8304o9863K352Q3558o3416l4817Q2288l9285m8296Q3126
$$ 48186 -22919 -18246 40058 -29805 -27453 56105 -7311 -42128 40160 875 -47421 35705
542C5705j2806o5614O0928K753o7311N7250L1072p3580K1350M2194n4599O658
$$ 35705 22899 -42715 18213 20966 -46345 10905 41977 -31603 -10253 31941 -22658 -16000
554a6000M7716l6425q401L1135l2830j704M6629k8832k6931M3218p927l9460L1917
$$ -16000 31716 -4709 -13110 18025 -14805 -16509 30120 1288 -25643 17575 9648 -29812 2105
567B105K6194l3362j1972K2498J289j6611O857K0540j5073k2528K3215Q686k6769
$$ 2105 28299 -5063 -17035 5463 6752 -9859 -3002 17538 2465 -20063 3152 11838 -14931
580a4931J9721J9257m3809J533M3870k7661j8238M2571j3585l4617K7368Q357
$$ -14931 4790 24047 -19762 -18229 25641 -2020 -20258 22313 8728 -25889 1479 9836
592I836j4200J3784j2665j0467K9304j9474j8693N1846j4940n4525M8967J6943
$$ 9836 -4364 9420 -3245 -13712 15592 -3882 -22575 29271 14331 -40194 8773 25716
604B5716n8189L7248L1410o7068J8870M7459o0394J0097O2832o4656k0013P6005
$$ 25716 -32473 4775 36185 -30883 -12013 35446 -24948 -14851 47981 -16675 -36688 39317
616C9317m1680l5270P7786k9423n8191P3587q423o6857P6251J2694r5999N4902
$$ 39317 -2363 -37633 40153 10730 -47461 26126 17703 -49154 27097 39791 -56208 -1306
628a306N2541r2946K3678P6713p9095j7387P7283m5323k4340O9025l8045l7701
$$ -1306 51235 -41711 -18033 58680 -20415 -37802 39481 -5842 -30182 38843 798 -36903
640c6903O5925k4117m3165O9730j1119o4303N7012J1510o3028M9437K5821p3975
$$ -36903 29022 4905 -38260 31470 20351 -43952 13060 24570 -38458 10979 36800 -37175
652c7175L0277M5122o9184J4611O5818o3036k2503O9939l2044l6175O1654j2247
$$ -37175 -6898 38224 -30960 -16349 49469 -13567 -36070 33869 1825 -34350 27304 15057
664A5057m8085M4078L406m2468L9992J3779n2953K2105K9718m3597R295L9041
$$ 15057 -33028 11050 14456 -28012 11980 25759 -27194 -5089 24629 -18968 -9673 29368
676B9368l5967j2826L5715j8085j3735L4354j2366k6863K7051K142k5834K2038
$$ 29368 -6599 -19425 16290 -1795 -15530 18824 6458 -20405 6646 8788 -17046 4992
688D992J2997l0240L412J9815j6009q67J9470j3708j1739J7495l617j1661J8265
$$ 4992 17989 -12251 -8839 10976 -5033 -5900 13570 -138 -11877 5618 2001 -9660 8605
701H605J687k3397Q419J5144j6399J411J9163j5780j2404K0169l131j3441J9156
$$ 8605 10292 -13105 -4686 10458 -5941 -4530 14633 -1147 -13551 6618 3487 -9954 9202
714I202l79k4361J4152J3201k1766Q264J8588k5278m740K5947j3505r930K5192
$$ 9202 8823 -15538 -1386 11815 -9951 -1687 16901 -8377 -13117 12830 -675 -10605 14587
727A4587j1774k0994K5132J216k2378K1540O301l0930J3312J9392k5110N685K2362
$$ 14587 2813 -18181 6951 8167 -14211 7329 13630 -17300 -3988 15404 -9706 -4021 18341
740A8341k6241n941K8032j5035j1123K7345j2036k2198K5988J898k3005K0276
$$ 18341 -7900 -13841 14191 -844 -11967 15378 3342 -18856 7132 9030 -13975 6301
752F301O836k8948J1759J7586k2146N155J9317k2942n250K3974j1972r387K2072
$$ 6301 13137 -15811 -4052 13534 -8612 -3457 15860 -7082 -12332 11642 -330 -9717 12355
765A2355r073j8273J9656K580j7041J4310N291k1246P866J3330j5079K968J3559
$$ 12355 3282 -14991 4665 7245 -9796 4514 9805 -11441 -3575 9755 -5324 -2356 11203
778A1203j5672m811J6794o751o869J4131n648j2825J2355K942j0590Q776L461
$$ 11203 -4469 -9280 7514 763 -6106 8025 2377 -10448 1907 4849 -5741 3035 6496
791F496j3992M203R247q585J416Q454r862l860J0331k760m123P897l268q001O677
$$ 6496 -7496 -3293 5954 -2631 -1215 7239 -2623 -6483 3848 1088 -3035 4862 1594 -6407 270
806B70K907n239M077J550p689J279N454k896K18L340m489k732M400Q91j412J777
$$ 270 3177 -2062 2015 3565 -4124 -2845 2609 -287 -69 3271 -1218 -3950 450 1341 -71 1706
822A706r03l590R61L145k14p64O24j612k229K587K902k016n88J177l300n07N332
$$ 1706 803 -2787 -1826 1319 1105 341 965 -647 -2876 -289 2613 597 9 1186 -2114 -2621 2711
839B711o58l518K871j377m388N318K936n816J923K563o797K218P156n730j906
$$ 2711 2053 -1465 1406 29 -4359 959 3895 -1921 2 2565 -4232 -2014 5142 -588 -2494
854b494O069n486k911R101k064n998O282j521o685P683K464p722M053K370q250
$$ -2494 3575 -1911 -4822 4279 2215 -3783 2499 978 -5707 1976 4440 -3282 771 3141 -5109
869e109M110O334p065L33N250o714m28P567l648k855M748l248k815N467m04k645
$$ -5109 -999 5335 -1730 -1397 3853 -2861 -3289 4278 630 -2225 2523 -725 -3540 1927 1523 -1122
885a122K361j847j837L335m35l38J835l393n40L684k620O06M063n473j348O344
$$ -1122 1239 -608 -2445 890 455 117 1952 -1441 -1981 1703 -917 -311 3752 -1721 -3069 3275
901C275m588j247Q285o394m991J0545m422o873J2938l477j2534J3542R45j5055
$$ 3275 -1313 -2560 5725 -669 -5660 4885 463 -6410 6528 3051 -9483 4059 5004 -10051
915a0051J3941N186k0486J1189J1354k2143Q461J7985k4880R45K4927k2826o367
$$ -10051 3890 9076 -11410 -221 11133 -11010 -2549 15436 -9444 -8499 16428 -6398 -12765
928a2765L1164j9153j7438L3673j0561k5519L3411r43l4005K8414R969l7116K2210
$$ -12765 18399 -754 -18192 15481 4920 -20599 12812 11869 -22136 6278 16247 -20869 1341
941A341J9688l9446J2697K8380l7377L730L6063l4480q023M1270k7333j8721M4708
$$ 1341 21029 -18417 -5720 22660 -14717 -10987 25076 -9404 -17427 23843 -3490 -22211 22497
954B2497j8109l0636M3494n812l8982L9095P428m5500K9750K0200m6490J9087
$$ 22497 4388 -26248 17246 11434 -27548 11547 18975 -26525 3225 23425 -23065 -3978
966c978L0857m4521N959L8579l8324n979M3371k9684j8388M3892j8530k7526M0922
$$ -3978 26879 -17642 -11683 26896 -11428 -17407 25964 -3720 -22108 21784 3254 -24272 16650
979A6650o602l4064L3900M443l6205K5877J3556l5696J6309K0223l2036P431K4250
$$ 16650 10048 -24016 9884 14327 -21878 3999 17555 -18141 -1832 18391 -13645 -6214 18036
992A8036k6626r00K5257k0190o616K4319j3719j1166K1641p491j3713J7894j856
$$ 18036 -8590 -9490 15767 -4423 -11039 13280 -439 -11605 10036 2545 -11168 6726 4870
1005D870j4447J2922K469j3054P607N077r598K584N173m271r91J570J479l82m776
$$ 4870 -9577 3345 5814 -7240 367 5444 -4154 -1570 3603 -668 -1659 -89 1390 1008 -3768
1020c768M565M625j0987K465J2337j3051l947J8472j0565j1965K1010m196j7871
$$ -3768 797 5422 -5565 -3100 9237 -3814 -7761 10711 146 -11819 9191 4995 -12876
1033a2876J8820J931k0161J5267N645j9698J3978O362k2399J5631J0217k8536
$$ -12876 5944 7875 -12286 2981 8626 -11072 2906 9268 -13131 2500 12717 -15819
1045a5819J5804J9309l6116Q929L2566l7100l899M3502l1875k0185M9403j9436
$$ -15819 -15 19294 -16822 -7893 24673 -12427 -16326 27176 -4699 -24884 24519 5083
1057E083l4157M8392m993m5239M1590J0534m9716L2227K2716n2796K1587L5401
$$ 5083 -29074 19318 14325 -30914 10676 21210 -28506 3721 26437 -26359 -4772 30629
1069C0629n2550Q718M8081m9119j0371N7665l5207k8606N7343j7502m1427M8609
$$ 30629 -21921 -13203 34878 -14241 -24612 33053 -2154 -30760 26583 9081 -32346 16263
1081A6263m34m4324L8433R383m5284K9632J7430m4350K3646K4253m6586J5844
$$ 16263 15829 -28495 9938 19321 -25963 3669 21099 -23251 395 24648 -21938 -6094
1093f094L3873m6828N947M5987m5060j2652N6339l1248l2507N6757r929m7978
$$ -6094 27779 -19049 -13102 32885 -12175 -24827 31512 264 -32243 24514 14585 -33393
1105c3393M3299J2205m7950K5781K4142m2103J0015K9327l2411M86L0844k5575
$$ -33393 9906 22111 -25839 -58 24084 -18019 -8004 21323 -11088 -10602 20242 -5333
1117e333r406L0286j5549j4837K7588p559k0750K2280J455k1669J6661R075k2920
$$ -5333 -14739 15547 -2 -14839 12749 5190 -15560 6720 8175 -13494 3167 12242 -10678
1130a0678O440J5597j5888j999J5847q605q629J1276r81o983P640M0q379N658
$$ -10678 -4238 11359 -4529 -6528 9319 714 -7915 3361 2380 -4603 3037 3077 -5302 356
1144C56L645q755M150Q253j0950l824J3696m562j0418J3657J701j7404R451J1519
$$ 356 4001 -4754 -604 7649 -3301 -7125 6571 2009 -8409 5248 6949 -10455 -1004 10515
1158A0515j7824K910J7866j8237p403K4651r714j6869K3646j218k4597J8681J0033
$$ 10515 -7309 -4399 13467 -4770 -12173 12478 2764 -14105 9541 8323 -16274 2407 12440
1171A2440k4449J1727J4338k5956N775K1968k3424j646K6795k1375j2752L1225
$$ 12440 -12009 -282 14056 -11900 -6125 15843 -7581 -9227 17568 -3807 -16559 14666
1183A4666j0600k0587K7914l054k7097K4077P454k8516J8026J4146l2163R775
$$ 14666 4066 -16521 11393 8339 -18758 5319 12773 -15743 2283 16429 -15734 -5959
1195e959K4598k7541o81K7875k2878j0716K9938j2903j6422K7742p736k3918K5911
$$ -5959 18639 -8902 -9583 18292 -4586 -15302 14636 1733 -14689 13053 5317 -18601 7310
1208G310L721k6841J9123J1344k9256R870K0084k3242J626K1372k0756o120K4575
$$ 7310 11031 -15810 3313 14657 -14599 -4729 15355 -7887 -6261 15111 -5645 -11765 12810
1221A2810j2609j1840K3215p419j9332K0486L424j9727J3741P551k1174P658J4029
$$ 12810 201 -11639 11576 4157 -15175 5311 8735 -10992 2749 10300 -10874 -3216 10813
1234A0813j6815K138J5321j6021n072J8711p895r456J5935m294j4167J3468L599
$$ 10813 -6002 -3864 11457 -4564 -9636 9075 1180 -8276 7659 3365 -10802 2666 6265
1247F265j3369R162N320j5463M852J1476j1473j21J1771j0681n763J3665l278
$$ 6265 -7104 2058 7378 -8085 -3233 8243 -3230 -3351 8420 -2261 -8024 5641 2363
1260B363p927J0487j729j1518R016N049j0180M857N992j1826O48J0949o506l298
$$ 2363 -5564 4923 3194 -8324 692 5741 -4439 418 6410 -5416 -4768 6181 -325 -3623
1274c623R274n800p207J0186R09q018O724J479j0559M943P750q172O12P151q647
$$ -3623 5651 -149 -7356 2830 3739 -4279 2445 3924 -6635 -1692 6058 -2114 -1502 5649 -2998
1289b998k871J0803l042n771Q033k730q718Q606L836q771M403L973j0492K422
$$ -2998 -5869 4934 1892 -3879 4154 1424 -7294 1312 5148 -3623 780 4753 -5739 -3317
1303c317R551p063j829P965p185m840J1082j505o932P570j361r502Q023M877q821
$$ -3317 6234 -829 -2658 5307 -1878 -6718 4364 2859 -4073 3497 2136 -7366 657 5534 -3287
1318c287L839M220j0386K277R490o828j665P596p477l958J0521j991n788P158
$$ -3287 552 4772 -5614 -3337 6153 -675 -2340 5256 -2221 -6179 4342 2351 -3437 3721
1332C721k745p767Q153K781p041M631J280q811M264O117o052J561L857p894L87
$$ 3721 976 -6791 1362 4143 -2898 1733 3013 -5798 -1534 4583 -1469 92 3949 -3945 -3558
1347c558P427l886o79M734n986k520O935j763j433M762m920l839O494j118k238
$$ -3558 3869 -17 -696 4038 -1948 -4468 2467 704 -729 4033 -887 -4726 1768 650 -1588
1362a588O157m058o213O905L21m560P088j009r090N664L058o364O430K348j0770
$$ -1588 4569 511 -5702 1203 1524 -3036 4052 3043 -6047 -383 2675 -3689 2741 5089 -5681
1377e681L906N619q265N197P087j2663K39J0434r368J27J3124j0746p362J3790
$$ -5681 -1775 3844 -4421 776 7863 -4800 -4561 5873 -3495 -3368 9756 -990 -8352 5438
1391E438n177p297J4960l673j3793J1838J352j1754J2493L653j6732P616P347
$$ 5438 261 -7036 7924 4251 -9542 2296 3648 -8106 4387 8040 -8692 -1076 6271
1404F271j4332Q155J1320j7706O15J4183j3641p60J8290j2714r749J6944o361
$$ 6271 -8061 94 11414 -6292 -5677 8506 -5135 -5895 12395 -319 -10068 6876 515
1417E15j0001J8030k636j6184J2587K325j3835J2689O041j7313N723Q486j3659
$$ 515 -9486 8544 5908 -10276 2311 4636 -9199 3490 9531 -7782 -2059 6427 -7232
1430g232N709J2153j4213j951J1451r473j570J3952p599p599R706l988n048J1137
$$ -7232 -1523 10630 -3583 -5534 5917 -3556 -5126 8826 1227 -6372 3334 -654 -5702 5435
1444E435j678q531N962r40n447Q350J506p587L005N25m978N401L299m940K65j02
$$ 5435 3757 -4774 1188 248 -5199 3151 4657 -2930 75 600 -4378 1023 4322 -618 -353 -455
1460d55k846M013J525j973J840l694l174P028m66m015O569l613q600R698K618
$$ -455 -3301 712 2237 264 2104 -1590 -4764 2264 1798 -2217 4352 739 -7861 1837 4455
1475D455r215Q346J849j4780P858R420j3253N101J0377j7850N52J7481j3135l057
$$ 4455 -4760 3586 5435 -9345 -1487 7933 -5320 -219 10158 -7692 -7140 10341 -2794 -5851
1489e851J8148j4764j0303K2313p014j3399K1694n819k1523K1519M265k2460J8408
$$ -5851 12297 -2467 -12770 9543 2529 -10870 10824 5005 -16518 5001 9266 -13194 5214
1502E214P569k8847J3403J7485k6167Q419K1563k9629j292K9855k1925q345L1824
$$ 5214 12783 -16064 -2661 14824 -11343 -2924 18639 -10990 -12282 17573 -4352 -12697 19127
1515A9127j9121k0058L2960o801k3703L0127j420l2616K4895J1500l1569J8173
$$ 19127 6 -20052 12908 6107 -17596 12531 11111 -21505 3390 14890 -16679 1494
1527A494J7706l4709P207K5819k6480J183K7308k6009q513L0616j7227j2829L1953
$$ 1494 19200 -15509 -8302 17517 -8963 -7780 19528 -6481 -14994 15622 -1605 -14434 17519
1540A7519j3582k4522L0048o13k6283K5890N896l2839J7266J6585k8775J0573
$$ 17519 3937 -20585 9463 8850 -17433 8457 14353 -18486 -1220 15365 -13410 -2837
1552b837K2671k9442l422K7978j6636j0024K5211j0018j7640J8947j75j3658J5585
$$ -2837 19834 -9608 -13030 14948 -1688 -11712 13499 3481 -14159 4788 4613 -9045 6540
1565F540O16j8242J0517P835j4300O842J0477j4749k530J1610m931k282Q624n408
$$ 6540 7156 -11086 -569 7266 -7034 -192 10285 -4464 -6994 4616 -315 -2597 6027 619
1579F19o599P024M50m596O299J704r223j53P111j334k315L903j914n392L480K624
$$ 619 -5980 1044 1494 -3102 3197 4901 -4322 -4475 2636 1302 -1013 2890 976 -4416 -936 1688
1595A688k827M481N52j1158L635J1516r830l584J5368q524j4993J7494N034j7132
$$ 1688 -1139 3342 3894 -7264 -3629 7887 -1943 -5527 9841 1317 -13676 3818 8852 -8280
1609h280J0284P429k0636O807J7000j8088r0K0008j9012j0367K6574o229j7193
$$ -8280 2004 9433 -11203 -4396 12604 -5484 -5574 14434 -4578 -14945 11629 5400 -11793
1622a1793J9633k189k0103J7757N454j8951J5041N707k6633J2991J9613k5145
$$ -11793 7840 5651 -14452 3305 8759 -10192 4849 10556 -16077 -3086 16527 -8618
1634h618J982K3104k2413q142K6705j0928j1573K2000j1486j6980K5880j729k2323
$$ -8618 -6636 16468 -5945 -14087 12618 1690 -9883 12117 631 -16349 9531 7802 -14521
1647a4521K1965M589k9223J4627J7349k3119N764J6096k3323J240K2756j8503
$$ -14521 7444 12033 -17190 -2563 14786 -8333 -2569 13527 -9796 -8556 14200 -4303
1659d303m666K5062j7230j6921K7795j371k1019J8208L325k2240J2672J0494j7645
$$ -4303 -8969 16093 -1137 -18058 9737 8366 -12653 5555 8880 -13360 -688 9806 -7839
1672g839R009J0415k2360L234K0589j5145n853J8987j0464j2857J6970K21j0802
$$ -7839 1170 11585 -10775 -7541 13048 -2097 -7950 11037 573 -12284 4686 4907 -5895
1685e895J1323j775j4561J1987O796j4362O464R703j6133j525J5328n863n368
$$ -5895 5428 3653 -10908 1079 7875 -6487 -23 9680 -6453 -7978 7350 1487 -3881
1698c881R319n947p124J0928l67p416R155k93j3588O930J0048r563m88Q138q280
$$ -3881 5438 -509 -7633 3295 2928 -4488 4667 4374 -9214 -2284 7764 -1799 -2287 5851 -2429
1713b429l998J0287j772m456P040m463q635J0349M131j0269M608N833j2226L23
$$ -2429 -6427 3860 2088 -2368 4672 209 -8426 1923 6054 -4215 393 6226 -6000 -5677
1727e677J2340n425m370P899o203o244J1916q6r145Q460P99j3556P609J0322j1011
$$ -5677 6663 1238 -3132 4767 -1436 -7680 4236 4150 -4995 3465 4264 -9292 -1683 8639 -2372
1742b372rQ646j0485k255J3303n382n786J0142o074r463J3835K289j2323P812
$$ -2372 -2381 6265 -4220 -6475 6828 1446 -4340 5802 -272 -9735 4100 6389 -5934 1878
1756A878L407j3883O251J0769j0843L36Q585j1710j486J4680o566o829J1551n765
$$ 1878 5285 -8598 -2347 8422 -2421 -2085 6500 -5210 -6696 7984 1418 -5411 6140 375
1770C75j0178J3486K727j1603P185K437j2775O920R365j0747J303P848j1448j061
$$ 375 -9803 3683 6410 -5193 1992 4429 -8346 -1426 7939 -2808 -1505 6343 -5105 -6166
1784f166J3325n791n529R114n412p534J1404J157q506O456J06j0116O896O852
$$ -6166 7159 1368 -4161 4953 -459 -7993 3411 4568 -3938 2518 2624 -7492 -596 6256
1798F256q373J749M586q967N95R394m335k677N423n378l769Q271J90m544L770
$$ 6256 -2117 -368 4218 -4749 -4154 5240 905 -1772 3651 -1727 -5496 2775 2965 -1579 2191
1813B191j798n634N215L524l916J483L39n253J789M720j693m82R30l590q64L863
$$ 2191 393 -5241 -26 3498 -418 1065 1404 -3849 -2060 2660 967 485 1415 -2175 -3039 824
1829H24J029p16l65j963j124J532J987J206j357k441l1K38Q64L063n89l836M91
$$ 824 1853 1137 772 -1191 -2315 -783 1204 2410 1053 -1388 -1419 -1181 -317 2746 2157 -1679 -1188
1846a188M73j082L882J511n228m9K053l101K939M890n544k645M334l052o11P271
$$ -1188 -715 -1797 2085 3596 -1632 -1681 372 -2729 210 5100 -444 -3089 1245 -1807 -2418 4853
1862D853k596n993M036l68l444O589J009p034K304J393m690N299M016p511M05
$$ 4853 2257 -3736 300 -68 -3512 3077 4086 -2948 -644 749 -3941 1358 5374 -2137 -1732
1877a732L779n926K472P754o323l671N813l888k161Q496j617o362L764p83l409
$$ -1732 2047 -3879 -1407 6347 24 -3647 2166 -1722 -3883 4613 2996 -3366 398 -385 -3794
1892c794O353R99n454K174n71m008O113K462o068J954J097n984M169N718n592
$$ -3794 2559 3558 -1896 278 -293 -4301 1812 4274 -1794 160 1257 -4727 -558 5160 -432
1907d32o90K907m945R02N996k793j131J523m683J201N589l477j67L696o959j125
$$ -432 -1122 1785 -3160 -2258 3738 945 -186 1337 -3346 -2145 3444 -33 -200 3496 -3463 -4588
1923d588R041l343l650O965m898o353R343Q89o403O169j241q746P314L772p455
$$ -4588 4453 1110 -2540 4425 -473 -6826 2517 3406 -2997 3172 1931 -6815 499 4271 -3184
1938c184N620J877j1570N529P974r805L221Q064j3282p32J3494q036l484J2396
$$ -3184 2436 4313 -7257 -1728 6246 -3559 -338 7726 -5556 -6288 7206 -830 -4314 8082
1952H082q918q382J4099k238q722J2311k893j3442J2061L534j2428J0475M169
$$ 8082 -836 -9218 4881 2643 -6079 6232 3339 -10103 1958 5492 -6936 3539 7708
1965G708j7496P277J1278j4537L926J2964j6599l036J7249r424n913J6200q484
$$ 7708 -9788 -2511 8767 -5770 -1844 11120 -5479 -8515 8734 -690 -6603 9597 1113
1978A113j2022J5528q35j1228J3249j98j5717J0231O236j2934Q137P158j6098
$$ 1113 -10909 4619 3784 -7444 5805 5607 -10110 121 6357 -6577 1560 8718 -7380
1991g380L004J1735j1258J063J2460j2278n388J3868n515o021J2964m487j1479
$$ -7380 -4376 7359 -3899 -2836 9624 -2654 -8042 5826 311 -5710 7254 2767 -8712
2004h712J0351K027q973Q380K777j1955L640O716p071K459O391q140k641O952
$$ -8712 1639 3666 -5307 3073 5850 -6105 -2465 4251 -2820 -361 6030 -2110 -4751 2201
2018B201k146j636N379k603n099K947J940j230J722N79l374j302K324J587n22
$$ 2201 55 -1581 3798 1195 -3904 -957 983 -247 1475 2054 -1320 -2622 -298 1289 767
2033G67K80l3l503p5M684p43k093L025k735m511O171K236n605L679J139q551M348
$$ 767 1047 1014 -2489 -2564 2120 1377 -716 2309 -426 -4937 1234 3470 -2135 1544 2683 -5868 -1520
2050a520P337p997P72P456j0319k104J3392n647o967J1631m801j1045J3490K575
$$ -1520 5817 -2180 -1408 6048 -4271 -6375 7017 1370 -5597 6034 1233 -9812 3678 6253
2064F253j2921R159L738j5879P978J1350j4411K036J1880j4737k001J6797r313
$$ 6253 -6668 2491 6229 -9650 -1672 9678 -4733 -2697 9183 -5554 -7555 9242 -71
2077g1o271J4645q960j0103J7635k375j3332J4504n0j7715J2926Q692j6731O930
$$ -71 -6342 8303 -657 -10760 6875 4500 -8832 5672 5622 -12093 833 9525 -7206 -276
2091b76R463j7629L547J5285j4086j002J5397j4378o871J9806o505j1672J6241
$$ -276 9187 -8442 -4895 10390 -3696 -4698 10699 -3679 -10550 9256 2751 -8921 7320
2104G320l450j5696J4805M539j5390J0153N911j8201O673J3720j4504k47J3853
$$ 7320 3870 -11826 2979 7518 -7872 2281 8192 -10009 -3336 10384 -4120 -4367 9486
2117I486j2451n770J5288m450p471J0921m292r688J1513J577j0387Q311L162j3082
$$ 9486 -2965 -8735 6553 2103 -5368 5553 1261 -8427 3086 4663 -5724 2587 5749 -7333
2131g333M605R285q239j37O812p652j958Q764l764l186P654m484p392Q518L139
$$ -7333 -2728 6557 -1682 -1819 4993 -2659 -4617 4147 383 -2803 4851 367 -7025 1493 4632
2146D632p680L389L343p446Q75O294l316p36M107n693k524Q216r96o004N739J077
$$ 4632 -3048 341 3684 -3762 -2887 3407 91 -645 3462 -2231 -4755 3461 2465 -3539 2200 3277
2162C277q809L493P250n593j316M970n465k037Q455k754n302P498j783r457Q226
$$ 3277 -5532 -2039 5211 -382 -1698 3272 -2193 -4230 4225 1471 -3831 3667 1884 -7573 653
2177F53O298j0283J199P242q452j121R975m845m084P805n413n851J1636l84j0214
$$ 653 6951 -3332 -2133 5109 -3343 -4464 5511 666 -3418 4387 -1026 -6877 4759 4375 -5839
2192e839P749K380j1256N958P880r502J189O250r700J335J0997q536l625J1194
$$ -5839 1910 4290 -6966 -1008 6872 -2630 -1441 4809 -4891 -3556 7441 -1095 -4720 6474
2206F474p233p667J3596m48j0859Q444J201j1028Q312N827j1542M437P006j2882
$$ 6474 -759 -8426 5170 4722 -6137 2307 3508 -7520 792 6619 -4923 -486 6520 -6362
2220f362J990J3059r471m628J1428o456p097J2430j241r132Q714m43j0684R205
$$ -6362 -4372 8687 -784 -5412 6016 -440 -7537 4893 3652 -5480 3234 2791 -7893 1312
2234A312N649j1655L610P021j0808P02J0788o623l716Q009n489m468J0023j635
$$ 1312 6961 -4694 -1084 5937 -4871 -4169 6619 -4 -3720 4289 -1200 -5668 4355 2720
2248B720p049O838k77q443O590M951p712J517M213o719R52O810m420j955N050
$$ 2720 -4329 2509 2232 -6211 379 5330 -2382 -865 3348 -3371 -2419 4391 -29 -1984 3066
2263C066m363l117P398k75n381L720M12n358L588L950m294p7K432l917q6N393
$$ 3066 -1297 -4414 2984 2709 -2672 1048 1460 -3898 -310 3640 -654 -731 1701 -2216 -2302 3091
2279C091j774l160K907r52l321L862K512l927l5J900l055M15M570k007k855K850
$$ 3091 1317 -1843 1064 112 -3209 653 3165 -762 -797 1103 -1952 -1537 3033 1026 -1829 1021
2295A021j250k793M695J490n090J227K314m371J765N022m225k132M206k991j968
$$ 1021 -229 -3022 1673 3163 -1927 -700 1614 -2757 -992 4030 -195 -2327 1879 -1112 -3080
2310c080O482j281n361M160J12m888N116K801o544J589L302n587K111N898n633
$$ -3080 3402 2121 -3240 920 1032 -3856 1260 4061 -2483 -894 2408 -3179 -1068 4830 -803
2325h03j773N347m291j891P688k482n544N518r06n253O335J930o955K791K590
$$ -803 -2576 2771 -1520 -3411 4277 1795 -3749 1769 863 -4390 1945 3875 -3080 -289 2301
2340B301n966L171M982n931k43M185m984K59O463m004k828M957l213k716O721
$$ 2301 -3665 -494 4488 -1443 -1686 2499 -2485 -2226 4237 233 -2595 2362 -851 -3567 3154
2355C154j076m922M180n93m451M939J864n009K161J075m487L161L206m422R51
$$ 3154 2078 -2844 1336 743 -3708 1231 3095 -1914 247 1322 -3165 -4 3202 -1220 -269
2370b69K217m895J568M817l863q03L473l806j225N380j496k494L002k089k192
$$ -269 1948 -2947 -1379 3438 -425 -1228 2245 -1561 -2786 2594 1098 -1396 1606 -483 -2675
2385b675M050k75k023K675k158k595M528k28l145L929q67n234M222K602m725K429
$$ -2675 1375 1100 -923 1752 -406 -3001 1527 1299 -1846 2083 1216 -4018 204 2806 -1919 510
2401E10K216n677J300M267l433O07K882m801N0M544l468J70M651n307k235O847
$$ 510 2726 -2951 -1651 2616 -817 -210 2672 -2129 -2079 2465 -1003 -833 3818 -1489 -3724 3123
2417C123k758l467O848k276o576O133J808n922M305K142o874K188M084m473J820
$$ 3123 365 -3102 3746 1470 -5106 1027 2835 -3087 1218 3360 -3514 -1326 2758 -1715 105
2432A05L202n687M79M587m347O14N331n599k428O737k766l377O514j508o323M929
$$ 105 3307 -2380 -1901 2686 -1661 -1047 4284 -1315 -3743 2994 228 -3149 3365 1857 -4466 463
2448D63J852m718L229K083n209R61K930k682J367K105l793J40K489k269O94L045
$$ 463 2315 -2403 826 2909 -2300 -1339 1591 -1091 276 2381 -1412 -1272 1217 -1052 -358 2687
2464B687l154j574K927j005q61K492o29k158O36M53M79N46q87K78j95j944K003
$$ 2687 -467 -2041 886 -119 -980 1512 883 -1275 -639 -186 293 839 -48 230 35 -1909 94
2481I4K142k960R8K261l282o2M453k375j942L235k244j941M685j037l135L890
$$ 94 2236 -724 -626 1635 -1647 -1709 2744 369 -1573 1662 -582 -2523 2162 1125 -2010 1880
2497A880j637l863N522M16n393M471R57o925M515M572p420J836N503p788K72Q341
$$ 1880 243 -3620 1902 2318 -3075 1396 2353 -4572 -57 4515 -2905 -1069 4434 -3354 -3082 5259
2513E259o019k768Q193n268m844R650k014p186Q233o30r016Q047L206r764N367
$$ 5259 -760 -3528 4665 -603 -5447 4203 2189 -4997 3236 2606 -6410 1637 4843 -4921 446
2528D46M730j0565L405Q371r213M3Q767q393k646J0759n326n377R848l818p655
$$ 446 5176 -5389 -1984 6387 -2826 -2783 5984 -2409 -5055 5704 378 -4999 4849 1031 -6624
2543f624R999J80r070P705J950j0367O068N849r672K823O841r386J95R292o899
$$ -6624 3375 3555 -5515 2190 4140 -6227 -159 5690 -3982 -1159 5682 -3704 -3509 5783 -1116
2558a116k672Q851n348n211R277j690o713P291j4p941N897L351p345L255M049
$$ -1116 -3788 5063 -285 -5496 3781 2091 -4622 2669 2655 -5286 611 3962 -3383 -128 3921
2573C921p202J153O198n163j018N632m251k761O079j389l827M568n16m751L621
$$ 3921 -3281 -2128 4070 -1093 -2111 3521 -730 -3491 2588 1199 -2628 1940 1424 -3327 294
2588B94K259m338J590K562m239J6M219k180j885L419j257l240L362J489l534J253
$$ 294 2553 -1785 -195 2367 -1872 -1856 2363 183 -1702 1717 460 -2780 582 2071 -1463 -210
2604b10K177l684o1M356k302k367L969j286l963M570J572n257K275L105n487R31
$$ -210 1967 -1717 -1778 2578 276 -2091 1878 592 -3371 1199 2771 -2486 -211 2894 -2593 -1662
2620a662N508m564j847N768l576l489O907j107n896N615Q08o951M957L694p394
$$ -1662 3846 -718 -2565 3203 -373 -3862 3045 1938 -3958 1657 2465 -4486 471 4165 -3229
2635c229K349M831p144J087P076o482j702P718n437l812R200k863o634Q096o34
$$ -3229 -880 3951 -3193 -2106 4970 -1512 -3214 4504 -933 -4745 4455 1592 -5042 3054 2420
2650B420q269P723K673r633N292N017j0274L082Q616r416j006R731p375m033J0864
$$ 2420 -5849 1874 4547 -5086 206 5223 -5051 -1969 6647 -2769 -3775 5956 -1419 -5452 5412
2665E412m142o979R525j422q899Q781K485j0229N567N161j0010K737P992q290
$$ 5412 1270 -5709 3816 2394 -6505 2276 4761 -5468 99 5260 -4750 -2013 5979 -2311
2679b311r49Q268o260l022Q750l625n258P531j466o500O656J568p208M174K967
$$ -2311 -3260 5008 -1252 -4274 4476 851 -4407 3124 1658 -4842 1814 3382 -3826 348 3315
2694C315o900K817M746o156N00N382n343j316O676l390l743N901j230n073N105
$$ 3315 -3585 -768 3978 -2178 -1678 3704 -1639 -2955 3721 331 -3412 2489 1259 -3814 1291
2709A291J420n496K778K739n240J347M556m298j246M724k619k873M811k25m178
$$ 1291 2711 -2785 -7 2732 -2508 -1161 3395 -903 -2149 2575 -44 -2917 1894 1669 -2509
2724b509L033J296m107J901L034l887j58L630k886j539M460j351l470L637L98
$$ -2509 524 1820 -2287 -386 2648 -1239 -1397 2233 -653 -2192 2268 917 -2553 1084 1482
2739A482m111K924K369m656J150L447m196j50M848l369k422N140j853l854N119
$$ 1482 -2629 295 2664 -1992 -842 2605 -1591 -1741 3107 -262 -2684 2456 603 -3251 1868
2754A868K21n243L703J875n392K841L391n577J027M546n002m57N862m151k586
$$ 1868 2089 -3154 549 2424 -2968 -127 3264 -2313 -1286 3260 -1742 -2199 3663 -488 -3074
2769c074O061k672l913O206q32n594N305J086o373M245L261o764K108M700o067
$$ -3074 2987 315 -3598 2608 1776 -3818 1487 2573 -3800 445 3706 -3058 -950 3750 -2317
2784b317L12N986n012j791O183l549l232O417j832m807N566q7n503M695J877o054
$$ -2317 -2005 3981 -1031 -2822 3361 -188 -3420 2997 1165 -3642 1924 1837 -3666 1029 2906 -3148
2800c148K970L260n642J486M479m898m35M879l789j567N112k443k818M481j177
$$ -3148 -178 3082 -2560 -1074 3405 -1493 -1928 2951 -838 -2405 2707 264 -2554 1927 750
2815G50l317L929P6l702K865J074l766K140K005l573R55K451k982Q0K847k134
$$ 750 -2567 1362 1438 -2264 601 1675 -2091 49 2054 -1519 -564 1887 -1095 -1015 1832 -302
2831c02r84K538j245j286K132m06j368J300Nj084R54R1p45O19r6n42O01M2m71
$$ -302 -1286 1252 7 -1279 853 447 -921 379 384 -700 254 345 -400 219 123 -419 182 224 -247
2850b47M42r9l91M44j74n4L36n09K1P78q53j03J344j262n97J901p87j425K114
$$ -247 195 96 -295 149 -25 -79 257 -252 -231 547 -306 -409 935 -327 -924 977 190 -1235 879
2869H79j40k244K002N86k505J570J177k586J108J633k682P76K191k813J22L016
$$ 879 739 -1505 497 1083 -1422 148 1325 -1261 -153 1480 -1202 -426 1765 -1048 -926 2090
2885B090k786r35L726k043k266L810p14l109L063N76l334K090J312k819J208J431
$$ 2090 -696 -1631 2095 52 -2214 1596 882 -2227 836 1412 -1922 168 1480 -1339 -131 1300
2901A300k515J097J508k577R22J881k855M63K908k911p00L491k023j949L505q25
$$ 1300 -1215 -118 1390 -1187 -265 1616 -1239 -776 2132 -779 -1479 2012 -11 -1960 1545 720
2917G20k578K519L27k357J695M87j770J330l7j413J825q9k173K193M55k995K122
$$ 720 -1858 661 988 -1369 326 813 -957 373 336 -1077 748 659 -1514 679 1134 -1861 261
2934B61J571l351R46K422k849lK625j984n30K022j619k26K104k018j83K517k507
$$ 261 1832 -1519 -573 1849 -1000 -1003 1622 -362 -892 1130 -489 -715 1389 -629 -812 1705 -802
2951h02p39L696k166k247M255j223l601M132N41m312K882J637m226J966K485l899
$$ -802 -1541 2155 -11 -2258 1997 774 -2827 1305 1846 -2466 416 2053 -2173 -207 2278 -1621
2967a621J156K624l881Q14L527l929j04M339l913j463N421k680l296N349j164
$$ -1621 -465 2159 -1722 -908 2619 -1310 -1414 2925 -988 -2451 2970 290 -3006 2343 1179
2982A179m584M743Q85n045L269J966m868K125K909m421J222L174m282L75M145
$$ 1179 -3405 1338 2223 -2822 447 2413 -2455 -330 2579 -1842 -620 2554 -1728 -1353 2792
2997B792l883p15M647l374k154N254j909l549M780m27m536L852J514m572K272
$$ 2792 -1091 -1806 2841 -533 -2687 2567 658 -2891 1889 1462 -3074 778 2292 -2280 -8
3012hK364m231R20L282l205k96L171k572j122L293j351j725K644p16k242K382
$$ -8 2356 -1875 -955 2327 -878 -1174 1997 -575 -1697 1596 245 -1480 1164 448 -1794 588
3028E88M15k157J388P55k080P13J448j298j47J133q88o15J101J43q30L01M59q57
$$ 588 1003 -1154 234 989 -1091 -378 1070 -228 -375 758 -130 -745 356 499 -331 -30 429 -428
3046d28l9J152l89r70J028nj371J096J157j962K16J763k121j53K756j722j548
$$ -428 -467 685 296 -674 354 349 -1022 74 1231 -731 -515 1248 -873 -1026 1730 8 -1540
3063a540K923j179k313L452N6l644K820J130m081K407K703m532Q92L655m375k43
$$ -1540 1383 204 -2109 1343 1399 -2245 575 1705 -2376 31 2734 -1798 -906 2749 -1626 -1869
3079a869N081l608k237N369k508l577N739p37n054M802P64n794M210K825o379
$$ -1869 3212 -396 -2633 2736 228 -3349 2390 1653 -3401 1401 2165 -3629 581 3406 -2973
3094b973K305M277o275R08N990n491j579O607m260l327P298k258n295O372k49
$$ -2973 -668 3609 -2666 -1758 4232 -1259 -2838 3769 -491 -3818 3480 1222 -4073 2299 2050
3109B050o410N557K303p094L398L858o770J659N629n699q64N928m456k274O416
$$ 2050 -4360 1197 3500 -3594 -196 3662 -3108 -1449 4180 -1519 -2383 3545 -911 -3185 3231
3124C231k473m046N482r60m789M966J076n348L192K165n306K267L696m696J97
$$ 3231 758 -3288 2194 1234 -3555 1411 2487 -2861 331 2496 -2810 -543 3153 -1543 -1346
3139a346M080l955r17M948k568k638M268j199l562M116P34m230K370J901m038
$$ -1346 2734 -1221 -2138 2810 242 -2396 1872 673 -2889 1227 1961 -2269 101 2002 -2036
3154b036J222L323l180q36L363k086j827L600k75l106K161J056l034J249K519
$$ -2036 -814 2509 -671 -1507 1856 -230 -2057 1543 1268 -1838 323 1379 -1655 -406 2113
3169B113k722o15K651j699j322L056n51k588K143M73k706J850J938l153K95K407
$$ 2113 -609 -1224 1427 -272 -1594 1462 911 -1677 466 939 -1767 83 2021 -1132 -837 1570
3185A570k420l29L188j958j810L062j170k177L570o6l722K749J105l870K358K580
$$ 1570 -850 -1179 2009 51 -1759 1303 133 -2044 1526 1460 -2262 487 1592 -2278 80 2660
3201B660m393O70L442l863r0M707l417k329M979j991l553N351j93n258L995J462
$$ 2660 -1733 -1063 2379 -1484 -1574 3133 -284 -2613 2366 375 -3178 2173 1980 -3278 717 2179
3217B179n189L173L163n674J151M281m977q7N632l992k512N342k303l283N397
$$ 2179 -3010 163 3326 -2348 -1197 3084 -1893 -1980 3652 -340 -2852 2490 187 -3096 2301
3232B301o90m653M150N41m707L776K176n360J841L345m803P59M512l972j293M389
$$ 2301 1611 -3042 1108 1649 -3058 718 2894 -2466 -625 2720 -2083 -1324 3188 -784 -2077 2312
3248B312k782j904M834j576l480L897k22l713L479J373m146J714J871l460J379
$$ 2312 -470 -2374 2460 884 -2596 1301 1079 -2634 845 2218 -1928 -214 1657 -1803 -424
3263d24K762l317j11K855k695o78L796j769k342K964m85k534K722Q90k996J064
$$ -424 2338 -979 -1090 1765 -930 -1608 2188 419 -1923 1041 556 -1978 744 1634 -1362 -298
3279b98J403k386P55K351j990j033K001q39j154K018J70j836O33P08j258P06J314
$$ -298 1105 -1281 -526 1825 -165 -1198 803 -36 -1190 828 998 -838 -205 503 -755 -49 1265
3296A265j431o08J306o70o15J661p8j888Q66Q49j425O81J477j840n90J767r58
$$ 1265 -166 -774 532 -138 -753 908 830 -1058 -192 657 -768 -87 1390 -450 -1040 727 -231
3313b31o84K229q85j975J972J16j876J974P65k827R72J674k383Q06K430k845o14
$$ -231 -915 1314 429 -1546 426 542 -1334 640 1405 -1422 -450 1224 -1159 -353 2077 -768 -1382
3330a382K920j882j034L397j484k721K970Q4k826K934Q19l718J605J901l028J157
$$ -1382 1538 -344 -1378 2019 535 -2186 784 868 -1958 976 1795 -1923 -318 1583 -1445 -288
3346b88K522l218l02K819k216l84L108j999j903L043r72j953L296l50l234K314
$$ -288 2234 -984 -1286 1533 -683 -1067 2041 42 -1861 1182 210 -1743 1553 1203 -2031 283
3362B83Q21k826K081J690l319M53K186k238K59K419k061j006K136j219n59K265
$$ 283 1104 -1722 359 2049 -1270 -817 1369 -869 -610 1809 -252 -1258 878 -341 -900 1365
3378A365j017j593J823n12j230K234j23k079J235M54j628J338R73j774J67P41
$$ 1365 348 -1245 578 66 -1164 1070 947 -1132 103 557 -1071 267 1240 -534 -367 374
3394C74j096P12J036j278O6M89j166P61J272j406j92J080j300k30J912o07j068
$$ 374 -722 -10 1026 -252 -186 303 -863 -102 1170 -236 -428 652 -648 -878 1034 427 -641
3411f41R81m88n78J129J24o19M20p51l19J431m12p05J278r05j461K063N16j964
$$ -641 340 -148 -726 403 527 -92 328 -423 -742 689 277 -428 850 -55 -1516 547 1063 -901
3429i01J141P76k357P52J942j502j90J175j420l61J712o29l89J103j438n09J946
$$ -901 240 1016 -1341 -589 1353 -149 -339 836 -584 -945 767 138 -251 852 -586 -1095 851
3446H51o68q90J810r47j919K220N77j909J193O90k217N52J766j124j44R40j342
$$ 851 183 -707 1103 156 -1763 457 1034 -875 318 1008 -1209 -657 1109 -15 -159 781 -561
3463e61j71J292n09j5P23j269l39J454m88m93J295q08j314J260N10q35N91K32
$$ -561 -732 560 51 36 759 -510 -849 605 117 -376 919 111 -1203 57 567 -268 323 555
3481E55j151Q5P40j4P8j51n04J64o9K19P99m52q97N79P2n73J097J34j234L02K86
$$ 555 -596 -511 229 215 293 142 -362 -198 -267 -48 751 299 -598 -19 53 -520 577 711 -523 -221 65
3502F5o55J034L22j274M34K80j167J198J032j927K43J286j923L54K497j856j178
$$ 65 -590 444 766 -508 -74 206 -961 237 1269 -658 -415 871 -1052 -698 1799 -57 -1235
3519a235K307j327j309L006m74k595K140J93k554K334J313l094R20J664k843R76
$$ -1235 1072 -255 -1564 1442 968 -1627 513 706 -1848 486 1799 -1295 -375 1289 -1554 -578
3535e78K723k807l91K564k375p00L643j719k073L058j154k428L670Q1l455K390
$$ -578 2145 -662 -1053 1511 -864 -1564 2079 360 -1713 1345 191 -2237 1433 1514 -1941 449
3551D49R47l636K202K402l635N31K647l279J04L686k568j411L213j849k003L824
$$ 449 1396 -2240 -38 2364 -1271 -740 1907 -1372 -1268 2418 -150 -1561 1652 -197 -2200 1624
3567A624m09l015K500K31l158K528J721l326R17J846k898M70K969k112j089K338
$$ 1624 1215 -1800 700 931 -2227 301 2022 -1304 -387 1459 -1439 -969 2000 -112 -1201 1137
3583A137j405j241K686l04j955J579r0j843J780J037k003L76J000j672K53J963
$$ 1137 -268 -1509 1177 873 -1082 497 407 -1436 344 1381 -622 -246 754 -918 -665 1298
3599A298j133q20J105o07q24J677J65j437M21N74j281M84J593r89j027J062j95
$$ 1298 165 -655 450 -157 -981 696 861 -576 -155 419 -862 -378 1215 226 -801 261 66
3616F6j005J537M23j700M06Q48j422O26J681j639q63J766r12q07K123l03k047
$$ 66 -939 598 1021 -679 -273 575 -847 -221 1460 -179 -1042 724 -188 -995 1128 825 -1222
3633a222J429K58j776J907R13k648O99J594k417P16K646k486j085K829j684j363
$$ -1222 207 465 -1311 596 1509 -1139 -440 1154 -1263 -547 2099 -387 -1472 1357 -327 -1690
3649a690L538r96k864K826Jk970K940J297l921J323K346l482R41L309l327r32
$$ -1690 1848 852 -2012 814 815 -2155 785 2082 -1839 -516 1830 -1652 -711 2598 -729 -1661
3665a661L400k246j387M063j424l009L259j49l082L223R67l826J681J709l274
$$ -1661 1739 -507 -1894 2169 745 -2264 995 846 -2236 987 1954 -1872 -191 1518 -1756
3680a756J516K626l399j47K874k680l95L630k057k055L118j020k249L401j0l292
$$ -1756 -240 2386 -1013 -1160 1714 -966 -1361 2269 212 -1843 1275 255 -1994 1407 1397 -1895
3696a895K175Q49k954J948K031l330K82K356k457j59L185j861j763K587q40j754
$$ -1895 280 1129 -1825 123 2154 -1176 -894 1462 -995 -1154 2031 170 -1593 994 154 -1600
3712a600K671J91k603J304R40k154J189J811k303l56J855j414m75K244p11j741
$$ -1600 1071 1262 -1341 -37 903 -1251 -62 1749 -554 -910 945 -469 -944 1300 589 -1152
3728a152J320J61j307J338Q67j957J44J196j166Q9J689j042j226J267L9j068J364
$$ -1152 168 329 -978 360 1227 -730 -586 610 -556 -467 1222 180 -1046 221 260 -808 556
3745E56M06j895N21J053j315N23J507j671p63J735o65q70J995m09k058J425N19
$$ 556 962 -933 -412 641 -674 -151 1356 -315 -1078 657 -8 -878 1117 708 -1350 75 594
3762E94j610J495Q60k479O58J615k066M83K363k317j108K617j076j498K981o55
$$ 594 -1016 479 1339 -1140 -482 1133 -933 -450 1913 -404 -1512 1105 29 -1469 1512 857
3778H57k803K356O97k746K057J588l513N78K601k545p5K949k248j389K698r37
$$ 857 -1946 410 1107 -1639 418 2006 -1507 -929 1672 -873 -948 2001 -247 -1636 1062 125
3794A25j476K772o06k546K111M53k259K027R17k887Q65J621k034O37K015k346
$$ 125 -1351 1421 815 -1731 380 833 -1426 601 1518 -1369 -504 1117 -917 -280 1735 -611
3810f11m51K113j417n85K508j232j824K052j23j633K100K15k342J056R87j858
$$ -611 -1062 1051 -366 -951 1557 325 -1499 553 430 -1203 897 1112 -1230 -174 813 -1045
3826a045J046J524k159k79J669j156k65J891r46j301J211M9q96J246J54j393M17
$$ -1045 1 1525 -634 -913 756 -400 -665 1226 280 -1021 190 239 -657 589 743 -650 -233
3843b33M52n59N05N82r56k08N01l30K54N54m96m95L23k7k5N50j8o10j38L67l4
$$ -233 219 -340 165 747 -209 -417 84 -246 8 562 66 -429 -106 -133 -158 392 374 -236 -374 -7 -41
3864d1J21L20j98p46K57N16j83N2M08o81n09P82J95l77M40j18r19M04P02m76K90
$$ -41 80 400 202 -544 -287 229 46 98 506 -175 -684 98 293 -84 356 238 -681 -277 425 -51 239
3885B39K66j030M5R03n21J02P80j091n12J303l21o08J201m90j336J080N39r43
$$ 239 505 -525 -480 423 -98 4 784 -307 -819 484 163 -445 756 266 -1070 10 549 -394
3903c94P04L53j447M22R03p64K78P75j366j80J332p30j65J273j114r10J437q7
$$ -394 310 663 -784 -362 541 -223 55 830 -536 -716 616 -114 -279 994 -120 -1030 407 320
3921C20r19J237j3j586P51P22p89L89N14j065J6O92m15L74L80j029J02O07o21
$$ 320 -599 638 625 -961 -210 512 -277 112 626 -439 -423 269 -146 228 608 -421 -319 288 -333
3940c33K56R89j096m95J062m80l20J128m12j030O01K54l76O34K0p40J89P6l41
$$ -333 -77 912 -184 -679 383 -97 -417 711 299 -731 -130 124 -252 382 402 -338 -149 -73 -414
3959d14R33j46q16M59N3p81R71N65j308J79P20r51K73J197r48m19P71o73m2J227
$$ -414 519 373 -443 16 69 -712 259 824 -484 -305 415 -536 -263 934 -14 -433 338 -335 -377 850
3979H50p17n99R15p00m75J594m18j222J147p4j403J471O95j712M55Q89j514M68
$$ 850 133 -466 449 -251 -726 868 450 -772 375 301 -1102 369 1064 -648 -193 696 -818 -350
3997c50J453j203m97J141q76l18J495n95q76J096n25q45J555J0j334R43J55j461
$$ -350 1103 -100 -597 544 -332 -650 845 250 -626 470 -55 -900 655 665 -669 274 429 -1032
4015a032J105R80j511J80R96j368P8J535q16p04R43n34n62J155K0p72M50j53o16
$$ -1032 73 1053 -458 -278 718 -650 -572 963 147 -557 386 -148 -710 445 465 -307 143 -10 -626
4034f26Q03L13o46L07n9p01M72O92n30j44L87n44j42P37J46o44Q1J33l35Q5O88
$$ -626 177 490 -156 151 92 -609 -137 555 25 -119 268 -276 -418 319 465 -179 -98 35 -300 -215 473
4055D73j83o05K21J55l28L25N22o70l01N29l01q0Q60l20q30O57K5p43R95K98j351
$$ 473 290 -315 -94 61 -267 58 580 -90 -391 138 -163 -243 617 297 -533 124 149 -594 401 699 -652
4076f52M32P82j211M99J235j412m51J468q45n82J692o52j373J445j02j259J634
$$ -652 -220 562 -649 -150 1085 -327 -778 690 -155 -737 955 303 -1070 375 273 -986 648
4093F48K42j904R41P99j671R81J237j963J15J627j656o7K152j510j177K097p54
$$ 648 890 -1014 -73 726 -945 36 1273 -690 -575 1052 -604 -671 1481 -29 -1206 891 137
4110A37j480K340q5k288J612O14k171J483J308k486M50J643j919J67K246j791
$$ 137 -1343 997 912 -1376 236 850 -1321 162 1470 -1016 -566 1077 -842 -675 1571 -220
4126b20q92K043j045j014K207n64j785J741M4j788J674Q09k242P75J301j955N60
$$ -220 -1112 931 -114 -1128 1079 515 -1270 471 515 -1273 401 1210 -1032 -257 1044 -911 -351
4143c51J728j636n51J676j080o94J940o11j504J453K6j453J358O77j678L56R32
$$ -351 1377 -259 -810 866 -214 -908 1032 421 -1083 370 396 -1057 301 978 -700 -344 588
4160E88j123J98J280r93n94J083m91n90J213k1j229N88M78r22N40P65j022k06
$$ 588 -535 -337 943 -50 -644 439 -52 -642 571 550 -679 -91 387 -535 5 770 -252 -458
4178d58Q47o14k11J140m43r74Q45K01r47P21P57j407J05J030q98j11J318r06q41
$$ -458 389 -225 -436 704 261 -713 132 333 -614 107 864 -543 -438 592 -306 -417 901 -5 -846
4197h46J310k47j011J398J56j743Q98Q09j463O38J253j732k16J708j150n88K000
$$ -846 464 217 -794 604 760 -983 -85 724 -739 -101 1152 -580 -796 912 -238 -826 1174
4214A174r75j469J871m8j642J633M19k103R59J147j833O35J567j958k20J945j436
$$ 1174 199 -1270 601 553 -1089 544 963 -1140 -181 966 -867 -232 1335 -623 -843 1102 -334
4231c34o24K242j058j559K044k16j595J775L01k221J189J035j846P62J385j964
$$ -334 -958 1284 226 -1333 711 495 -1100 675 976 -1245 -56 979 -867 -105 1280 -684
4247f84rJ687j388k37J794j194j007J767n64j137J769k25j723J364M23j617J164
$$ -684 -693 994 -394 -631 1163 -31 -1038 729 165 -972 797 572 -1151 213 636 -981 183
4264A83R53j943L42J418j401j19J707j179r24J578l83j066J446J9j554Q54O31
$$ 183 1136 -807 -465 953 -448 -567 1140 -39 -963 615 232 -834 612 631 -923 -69 562
4281E62j116M81R36j204k43J021m91l39R44m37o59O30K4l88N52O2o74J80L45l95
$$ 562 -554 -73 863 -341 -584 437 -54 -393 551 114 -545 85 109 -279 273 335 -339 -159 186 -209
4301b09K40L90n54j99N89k16k25N77k39o71N80K44o53M93L91r38M4P84n00j88
$$ -209 31 421 -133 -332 257 41 -184 393 154 -517 63 307 -346 147 538 -400 -356 428 -72 -260
4321b60Q15m77p40Q99O6q41Q08L71j275L74R00r79M5J073r95m84J216l43p56J089
$$ -260 555 78 -662 237 303 -538 270 641 -634 -260 640 -339 -294 779 -216 -700 516 173 -583 506
4341E06j68j162Q81M20j009O91M41j172L50Q10r56K39Q98j116j76J153p34l71
$$ 506 338 -824 57 477 -532 159 600 -572 -222 588 -368 -129 769 -347 -523 630 -104 -475
4359d75J200o65r18J241j2j011R90K65j427P48P90j248L99R21j279p8J139o79
$$ -475 725 60 -858 383 371 -640 350 615 -812 -64 726 -522 -123 798 -481 -559 580 -99
4377i9l08J037o02o83J008j45p20R04n1r22O33L10q57N97M40j027J77P61o39N6
$$ -99 -407 630 28 -655 353 208 -512 392 341 -581 52 362 -495 102 542 -485 -308 453 -186 -130
4397a30P36p11l10P14k17k78O56l74m58M32M6l45M66n8m76L07R9k67K77J90m57
$$ -130 606 -105 -415 299 82 -196 460 86 -372 60 106 -239 227 169 -307 0 99 -168 109 299 -158
4418a58L6J99j82J39J99k75n0J8j3J81N2k62J41Ql30L70K54m83O8L19m26Q1M35
$$ -158 -122 77 -105 34 233 -42 -92 -74 -87 94 146 -116 25 33 -297 73 327 -156 -88 231 -195 -114 321
4441C21l04j81K82k22n3L57p7j61K03l20m6M57k54k44N41l47m18O91R6p12M60
$$ 321 17 -164 118 -104 -157 200 123 -38 165 -155 -201 256 2 -242 299 -48 -466 225 321 -391 69
4462F9K73p93K59O43n36q5M59l87j79N02j37k38L00k55j32L93o1k75L70j82l79
$$ 69 342 -451 -192 451 -85 -170 289 -98 -277 225 88 -150 150 -105 -237 156 95 -180 190 8 -371
4483c71N34Q7n30L90J38n85K98L24l06K0J81l31J07J33o4R7J0l44K11J28k38J01
$$ -371 163 250 -280 110 248 -337 -39 285 -21 -1 180 -151 -44 89 25 122 132 -212 -1 127 -111 -10
4505a0K62m55k4M31k33m4L15k68k33L66j61LK87l34OK64l01oN75m09m57P34j56
$$ -10 252 -203 -227 204 -29 -73 242 -26 -259 107 -54 -51 236 -98 -92 172 -129 -135 440 31 -426 308 152
4528A52n75O56J97r22M52M60p65K79N81p85M7N88n31k2O53o37j88Q15n47l78J037
$$ 152 -423 233 430 -492 -40 420 -345 -66 515 -270 -223 365 -166 -188 465 -172 -360 455 -92 -470 567
4549E67m49q19J114j31j014J018L31j336N61Q10j126J77J046r88k33J056o91l58
$$ 567 118 -701 413 282 -732 286 617 -719 -158 652 -474 -297 749 -239 -472 584 -107 -465
4567d65J080n86n98R71k74p64J003L2j009P37L20j017N48P05j141K04Q18q94p4
$$ -465 615 29 -569 402 128 -636 367 399 -610 127 447 -570 -22 683 -458 -254 564 -330 -404
4586d04R77n91m49Q70l79m65P91q3p47O02J36o82N23L66p62R6O37p10PP30m61
$$ -404 573 -18 -467 403 24 -441 350 267 -480 122 258 -424 99 465 -297 -201 436 -274 -267 463 2
4607Bm10P11j25n30N48J21o17K02M39n30J7N82l90l26M97p4m39M57J65o17K75
$$ 2 -408 303 178 -352 196 317 -300 -98 341 -189 -172 410 20 -306 191 117 -322 135 300 -317 -42
4628d2L53n44J22M57n35j27O14l05l70Q36k29p78P58J19q37N85M42r93K57P59
$$ -42 311 -233 -111 346 -189 -316 298 -7 -377 459 230 -548 210 329 -508 77 519 -474 -217 542
4648E42q75OJ028q52m29J167n06p89J133n9j080R22L25j182O98O71j293L88R35
$$ 542 -333 -327 701 -151 -580 587 81 -708 425 366 -714 208 533 -649 49 720 -573 -185 750
4667G50j129r3J257r23n19J295n89p84J294k87j095J148J89j285Q78N58j314M32
$$ 750 -379 -472 785 -138 -657 638 49 -735 559 272 -823 325 514 -771 107 665 -649 -217
4685b17R55j255J51J165j043l64J309p13o94J294l24j007J066J19j096Q32L60
$$ -217 738 -517 -366 799 -244 -608 701 -12 -706 588 264 -743 323 442 -654 178 538
4702E38j181N85O90j098K09R66r85j97J101p08n19J150l83q63J069%r67O49M56
$$ 538 -643 -58 632 -466 -257 709 -276 -473 628 -80 -599 551 168 -695 374 374 -593 56 512
4721E12r78L00O57p36l9P53n56k94P98l82m82P42q1o51N94J14o40L73M09p09J02
$$ 512 -466 -166 491 -245 -284 469 -87 -381 417 35 -447 295 214 -437 157 271 -369 4 413 -296 -194
4742a94N89m91j87O22l09l57N78r5m69M88Q3o17M16K67o42K14N08o47n2P36n06
$$ -194 395 -96 -283 339 30 -327 251 156 -313 175 258 -359 57 324 -318 -104 404 -243 -295 441 -65
4763f5l65Q06k26p67Q65J83r98O06N29r86J49R64r25j89J025o15n76J035k04q52
$$ -65 -430 376 150 -617 248 431 -567 39 568 -418 -269 695 -230 -419 606 -9 -585 450 246 -606
4783f06Q55J47r53O22M01q92L62O73r24P3Q09p40j85Q77n77m08Q97l52o55R31
$$ -606 249 396 -557 65 466 -426 -64 609 -315 -242 567 -173 -358 519 -58 -466 431 79 -576 355
4803C55k21p28Q25J59j056P38M95j164M72Q11j090k8J124q40m09J143m69q15J131
$$ 355 134 -594 231 390 -666 72 567 -597 -125 686 -404 -432 692 -148 -557 586 117 -698 433
4822D33j24j011R56K10j009N07N62q87J87P43q21l0P84o29j94P04l76m25P60k13
$$ 433 309 -702 254 464 -545 -38 524 -363 -176 567 -254 -284 500 -129 -323 381 5 -420 340 127
4842A27n05N75j7o15M84K31n97L14L08o01K16M50n78L6N69m54k45N50j22m20M07
$$ 127 -378 197 180 -435 49 280 -317 -3 305 -296 -80 370 -208 -172 397 -57 -302 248 126 -294 113
4863A13J12m51J94L15m46L9L65k33k18L54m6l12K52R0k68O2K22k09o5J99o3j27
$$ 113 225 -226 -32 283 -163 -124 241 8 -210 144 98 -214 38 128 -140 -78 144 -65 -130 69 6 -121
4885a21K28j4k37K36J5k92J12K94l40O0K71l84k1M64l08k12M60k16l31N12K9m76
$$ -121 107 93 -144 92 107 -185 -73 221 -119 -59 212 -172 -193 271 -37 -249 211 -5 -336 176 205 -271
4907b71L72J22n42K59M23n80J11M41n05l5N66m06j88N23k55m14O22j30m83N80
$$ -271 101 223 -319 -60 363 -217 -106 335 -170 -205 361 -45 -233 290 35 -379 243 113 -370 210
4927B10m8n63M74K32o23L02L04n91K08L98m45N9M01m29p0M95l96j10L99j94k85
$$ 210 162 -401 73 305 -318 -16 288 -303 -95 303 -142 -83 318 -111 -181 314 -82 -192 207 13 -272
4948b72N09j29l81N07l6n14L59J94m35K21K30m01P2K66k30M2J59k47j1J61j62
$$ -272 237 108 -273 234 198 -316 43 237 -198 23 253 -148 -76 190 -40 2 161 -86 -97 64 -98
4969i8J08J35k52L2K21k95L9M06l46j87L94k15j51M00j08k52K98o2j54K00lk62
$$ -98 10 145 -107 -75 146 -149 -110 296 -50 -237 157 -58 -209 191 83 -169 129 67 -87 113 110 -152
4991a52J89N6k42K62M9l91K49K24m30J40L99m52j03M60l21j23M51j99k76L08n7
$$ -152 37 93 -149 113 162 -229 20 244 -186 -46 353 -99 -202 258 -63 -186 265 66 -210 98 41
5012D1k55L95j29k80L26o0k79M16Q0n73L80K08n63J73N10n15j71N53k78k51M58
$$ 41 -214 181 52 -228 98 38 -241 175 255 -318 62 270 -293 -120 390 -125 -296 257 -21 -272 186
5033A86l9l47K90o1j88K45O2k74K06k4k02K38J29l63J74J41l36K7L41j38k74K54
$$ 186 147 -200 90 29 -159 86 148 -126 80 56 -146 92 221 -142 32 173 -163 -136 205 67 -207 47
5055D7O9k94J54K41j98j86K13J3j77J64J18k59j1J36p0l8K34j64j05J63m9j12
$$ 47 116 -178 -24 217 19 -167 46 59 -118 46 164 -95 -106 30 -40 -78 156 -8 -113 50 1 -111
5077a11L26j53l39L89kk92K71K44n45Q0M74m16j02N33l88k68N11j48m33N50N9
$$ -111 215 62 -277 112 110 -182 89 333 -212 -132 342 -74 -176 357 -31 -299 212 64 -369 181 240
5098B40o03M50J19n14L83K86p01J62N50n83j2P18o14l22P96l00m67P63j49p12
$$ 240 -363 87 206 -308 75 361 -340 -178 372 -211 -223 495 -119 -441 355 55 -412 351 202 -510
5118e10O15K32p59N36L77q36J56N93p10J27O51n87k95P79m19l22P96k72n94N85
$$ -510 105 337 -422 114 491 -345 -189 404 -306 -179 472 -115 -410 369 -50 -372 424 152 -442 143
5138A43O3o05O13J18p85L32M84p49K59O25o63j55O66l79k60O19j80n97O29P2n99
$$ 143 206 -399 214 332 -453 -121 363 -386 -127 498 -165 -320 346 -33 -293 326 146 -451 178 250 -349
5159c49M82K46p33K53M02m73J08M38m40k39N87k38l05N57j58m21L21J35m46L30
$$ -349 133 379 -354 -101 301 -172 -64 374 -66 -305 282 44 -261 296 138 -283 38 173 -273 57
5179E7K87o01L7M28l18q0N01l15l54N46n8m54N65M4o11K12M51n49Q7N31n66j12
$$ 57 344 -257 -220 208 -110 -190 311 -4 -358 188 130 -324 241 285 -326 -114 337 -212 -125 406 -160 -272
5201b72N69l51k18O49k98m81N47M9m79L83K67q06L47N01o73J28O94o72l67Q30
$$ -272 297 -54 -272 377 79 -402 145 194 -285 98 365 -441 -94 407 -266 -138 556 -116 -483 347
5221C47k25n50P05k0p22M98L03o37K99M32p52P4O98o31k7O90o00l56Q58k82n05
$$ 347 122 -428 277 257 -465 33 336 -301 -2 430 -322 -248 450 -181 -208 482 -118 -474 384 102 -403
5242d03P65j08q04P23K44q75M93M65q67R4Q24p65j02Q41o42l56Q52l44m63Q31
$$ -403 362 254 -550 173 417 -458 35 500 -367 -273 551 -214 -316 525 -117 -473 379 35 -428 403
5262D03j97q57Q56J88r07N84M78j025K09Q25p27j54Q14n10m87Q24j46n41N96p
$$ 403 206 -651 205 393 -514 70 548 -477 -268 557 -170 -324 490 -20 -507 317 171 -370 226 219
5282B19o61M70K64n34K99K29n86K07L48m17J06M89n51j89N96k93k84N44n7o02
$$ 219 -442 28 292 -242 57 286 -300 -93 255 -162 -56 433 -118 -307 289 -4 -288 256 199 -403
5302d03M81J80n36L36K74n86J2N07l25j48M79l04l66N28M4m21L32J79n57J29M60
$$ -403 78 258 -278 58 332 -254 -242 265 -60 -208 271 -33 -399 129 173 -248 84 263 -294 -165 295
5323B95l60j52M71k16l91N15O0m10L15Q3m84J73M07m09R0K35l66p9M67j96k15
$$ 295 -65 -217 254 38 -353 162 222 -188 127 210 -274 -101 306 -103 -13 222 -144 -223 244 48 -167
5344a67M10k63k98M57O7m28M10Ln69K88L73m99J13M52o09r7P30l41l41O83k81
$$ -167 243 -20 -318 139 206 -222 188 191 -378 -90 283 -216 -103 349 -260 -357 373 32 -309 374 93
5365I3o40P10Q2o09M85K37p39L57M40o38J64M37n78p9O71l57k55N30l00m17O33
$$ 93 -547 163 245 -364 121 358 -381 -24 416 -222 -58 379 -199 -278 393 36 -219 311 11 -406 227
5386B27k0m70M81n4n35M42J66n07L16L08o78J29N43m02j35N23m78k08O41k69k28
$$ 227 207 -263 218 164 -371 71 237 -270 46 354 -324 -195 348 -54 -189 334 -144 -352 289 20 -208
5407b08M30r8m34M30O9l93L00K0l66J51K79k41J12R6k53l3K75j27l0K36k81r9
$$ -208 222 124 -310 120 189 -204 96 116 -250 -99 180 -61 51 147 -106 -139 136 9 -21 215 -66 -165
5429a65J95J9p1J16o0j70J01K9L6K9k7j13o4N8P5N1k6k9J8o7L0J61j25k9L8p4
$$ -165 30 49 -22 94 34 -136 -35 -6 30 59 32 -81 -145 -87 -12 39 13 -16 2 -65 -35 126 1 -28 10 -64
5455f4l2K81j58j58J94p4j46K90Jk51J41k8j97K42K05l19M4J11k79J02L29k04
$$ -64 -96 185 27 -131 63 -11 -157 133 134 -117 24 -4 -201 41 246 -73 -29 82 -197 -95 234 30
5477C0j02J57j73mK68j21j20J61k09p6L50ql08K07k4k42K02K48l16M5J97l06L6
$$ 30 -72 85 -88 -92 176 55 -65 96 -113 -189 161 153 -155 52 28 -214 -12 236 -80 -35 162 -144 -108
5500a08K69r4j51J79j52N1R1l3m0M3j18p9K36kj02J20r7j38J57O8j47P9n8j55
$$ -108 161 67 -84 95 -57 -6 85 52 12 55 -63 -142 94 92 -10 110 13 -125 32 100 -47 32 -26 -181
5524a81J79k0L8R5j67j19J84J1p8J95l3l60K27J74l34J74K31l50p2L12j39L6J92
$$ -181 -2 -22 16 111 -56 -175 9 20 -58 137 104 -256 -29 145 -189 -15 216 -134 -206 106 -33 3 195
5547A95k85p6K52j25k3L24k53k63L61p5k19L77ql73J27K90m12J51L23m30o6L83
$$ 195 -90 -166 86 -39 -62 262 9 -254 107 32 -187 190 182 -191 -64 226 -186 -35 288 -142 -208 175
5569A75k07j40L92j97k59L02J0k59L26K8m14K11J76l00K66J74m54j3L75k47rL47
$$ 175 -32 -172 220 23 -236 66 76 -183 143 171 -243 -32 144 -156 110 284 -170 -183 192 -55 -64 283
5591B83k98k43L77o7j46K91m2m14K49J25k62K34J47l33p1K81j26m8K67j86k44
$$ 283 -15 -258 119 52 -94 197 155 -259 -10 115 -147 87 234 -99 -170 111 -15 -63 204 18 -226
5612b26L31p5j48K28N7l57J10K11k13J19K02l62p3L20l4k33K97r8k96K29J72k11
$$ -226 105 30 -118 110 167 -190 -80 131 -82 37 239 -123 -196 124 90 -143 154 56 -240 -11 161 -50
5634e0J16J73l90KL06k08l1L12k36k92M50j03k40L44J2m83K92K01m18K48L45n78
$$ -50 66 239 -151 -149 157 -51 -82 230 -6 -298 152 49 -191 153 165 -318 -26 175 -243 5 350 -228
5656b28o7N37k64j95M97k59l67M29Q4m00L85P2n47K67L25m49J55L63m64j03N02
$$ -228 -295 242 -22 -217 280 21 -346 83 167 -233 152 224 -323 -56 269 -180 -25 338 -126 -229 273
5677B73k76j85N84l48m39O25nn19M45J58o69K71M06n49K10L56m65j90O39k80l14
$$ 273 -3 -188 396 48 -391 234 229 -290 155 313 -356 -85 321 -228 -18 338 -127 -317 322 42 -272
5698b72N82k68m65N68L2m35M18O2n73K50L96m80R8M47n33p3N99l24l45O77k45
$$ -272 310 42 -423 145 177 -258 160 222 -351 -101 295 -185 -87 360 -173 -246 353 29 -316 361 116
5719A16n96O03K12n95L52J71n46J74M32m64KM53m56o9L83j17k49M35k22l23L57
$$ 116 -480 123 335 -260 92 263 -283 -109 323 -141 -139 314 -142 -211 172 55 -194 241 19 -304 53
5740E3J84m46K62J19n17J94M75m64M4M01l98k25M84j06j91L07k5m04K42K45l49
$$ 53 237 -209 53 172 -345 -151 324 -140 -96 305 -93 -318 166 60 -131 176 151 -253 -11 234 -115
5761a15P9K56l62j13N41k92j42M21k25l62M07J29m45K29K06m31N0M40k81j41M24
$$ -115 -36 220 -142 -255 286 -6 -148 273 48 -314 93 222 -223 6 212 -219 -169 271 -10 -151 273
5782B73k60k03K67L4k51J92K5l26K99J12l25K24J12m20J40L95m06J7M42m32k48
$$ 273 13 -190 77 111 -140 52 77 -249 50 162 -163 61 173 -247 -107 288 -118 -101 341 -91 -339
5803c39O69j52m80M49L6n58M71K77o37K72K92n80Q0N91m75j10M92m08k60O60j52
$$ -339 330 178 -302 147 183 -375 96 373 -264 8 300 -280 -200 391 -84 -194 298 -110 -370 290 138
5824A38m87N94j02n85M93K45o20L04K46n57J46M84m25L0M27m77j72O23k76k30
$$ 138 -349 245 143 -442 51 296 -324 -20 226 -331 -185 299 -126 -96 331 -146 -318 305 29 -201
5844b01N10l22l34N21J2m47L90J12o16L55L40m78J07L47m07j13M62k01k33L58
$$ -201 309 -13 -347 174 186 -261 129 241 -375 -20 320 -158 -51 296 -111 -224 238 37 -196 162
5864A62j20l12L39Rj80J68K1k19J44J40k44R7R4k27jK68pj75Q8m0j18J12J50j61
$$ 162 42 -270 69 78 -102 66 87 -132 12 152 -92 5 99 -128 -129 139 132 -43 45 5 -113 -1 149 -12
5888a2jQ8j59m0K18Kj73J31K0k24J29J40r8o3J16j73o2L60q5k29J68l0k63K99
$$ -12 -13 75 -84 -124 94 96 -77 54 74 -150 -21 119 21 -42 74 -99 -161 199 114 -115 53 23 -240 59
5912E9J06k79J14J26l47R6L38k72j13L41k58q9M17j87k29K82p2k45L51P4m10K47
$$ 59 165 -114 0 126 -221 -125 213 -59 -172 169 -89 -178 239 52 -177 105 33 -212 139 213 -197 50
5934E0O4l59K22L30m72J31J94k82m1M51k89q9K83k39k08M07Ql50K23M3l39L03
$$ 50 114 -245 -23 307 -165 -34 160 -122 -163 288 -1 -90 193 -46 -254 153 161 -189 34 77 -262 41
5956D1J46k82L9J78l45J38K73j68n4J97k64j6K59o8j43J12o2j41K78o9j03J70
$$ 41 187 -95 -56 122 -223 -85 188 20 -34 163 -101 -117 142 74 -69 43 -19 -160 118 49 -54 116
5978A16j17j45J79M3n6N1Rj78P9J38j39N6Lj39M2J44p0k9Q2r7o6R0k0J05jk09
$$ 116 -1 -146 33 76 20 71 80 -98 -19 119 -20 36 39 -100 -58 86 16 -13 69 -28 -94 -4 -24 81 80 -129
6004a29P9J23j63O0J36j92n3K36j01n3J95j14j66J49M1q8R8N6k51P7J27j61J44
$$ -129 -50 73 -90 -30 106 -86 -139 97 -4 -57 138 24 -142 7 48 -40 58 114 -137 -60 67 -94 50
6027E0M9k26O7J60j01j6J52j10j36J16n4J9J38o3j78J02M7l7J08jj43N3J4q3J03
$$ 50 99 -127 -60 100 -1 -17 135 25 -111 5 -49 -30 108 45 -133 -31 16 -21 87 86 -57 -4 10 -73 30
6052C0R5j10j02P2L4q9J58Mj48l5Q8K3o6L4P1j20M0K7k1K1O2j98oJ69m3m4J41
$$ 30 125 15 -87 -15 19 -70 88 92 -56 -91 -3 20 -46 -12 59 -61 -21 6 -15 6 68 -130 -136 33 -10 -54 87
6079H7p7j31J45N0j54J46l9j93J81O0j89J68N8k43O5K40j97k5J71j54j33K72m0
$$ 87 10 -121 24 74 -80 66 27 -166 15 75 -114 54 112 -131 -66 174 -23 -48 123 -31 -164 108 68
6102F8k04K90m0l34K21J05k29J51J04k81P5K70k20p7L35l01r9K84q9j89K72j13
$$ 68 -136 154 114 -220 1 106 -123 28 132 -149 -74 196 -24 -101 234 -67 -166 118 29 -160 112 -1
6124ak41K92L0k29J97J66m03JM36k56j37L45k05k65L87Ol27L27Kk84K13J24l01
$$ -1 -242 50 80 -149 48 214 -189 -188 248 -8 -145 200 -5 -270 117 123 -204 123 125 -159 54 178 -123
6147a23J58R9l07O7K76j97p7L63k78k31M14k2l71L18R3n02K24L15l39M5K62l54
$$ -123 35 134 -173 -106 170 -27 -104 259 -19 -250 164 142 -229 89 182 -320 -96 219 -120 -75 187 -167
6169a67J3K71j16r4K91j47k51L61k3l60L49N3l95J82K41l08O5K31k87q5L30j13
$$ -167 -154 117 1 -93 198 51 -200 161 138 -222 127 180 -215 -33 208 -100 -35 196 -91 -176 154 41
6191D1k30L20ml68K38K10k86O7J43l12J09K41k04n4K57j76j89L43m6k97L08rl24
$$ 41 -189 131 127 -241 -3 207 -79 -12 131 -181 -72 169 -35 -89 168 -8 -197 146 100 -197 111 102 -222
6214b22K85K07m03J11K45l31p8M15k39j41L80j58l18L48M8l07K57O7l40J45K74
$$ -222 63 270 -133 -22 223 -108 -186 229 -10 -151 229 71 -247 101 149 -158 99 166 -174 -29 245
6235B45l72M2L35l81m4M22k24k03L78j15m02M40J17n03L24J74n28J90L91m87L0
$$ 245 -127 -85 250 -131 -175 247 23 -180 198 83 -319 121 238 -265 59 233 -295 -105 286 -201 -171
6256a71N04l95j91N06k49k99N06j12m22M51O3m51K78K19m77K34L04m93J01M05
$$ -171 333 -62 -253 253 4 -295 211 99 -323 128 191 -260 18 237 -240 -6 298 -195 -94 311
6276C11m16j57N83k59l61M68n2m44M35K6l52L42k5m17L53J54l56J79J73l67M2
$$ 311 -105 -262 321 62 -299 169 117 -327 108 134 -218 124 99 -318 35 189 -167 12 185 -182 -140
6297a40M83l78j43M29k77l43N55J5m69K93J87m66J53L49k92l8K00k06jK54j31
$$ -140 343 -35 -178 251 -26 -369 186 201 -268 25 212 -254 -101 248 -44 -82 118 -88 -89 165 34
6318C4j14J88q7j55J97P9k55J48J16k81O6K33j57j52K45p2j62J90O4k41R5J27
$$ 34 -80 108 21 -134 63 142 -113 35 151 -130 -64 169 12 -140 105 33 -129 61 125 -116 -21 106
6340A06j93j0K48j26j40K01j09j22K95j03k10K60Pk76K17K31m69J10L56m56J3
$$ 106 -87 -97 151 25 -115 86 -23 -145 150 47 -163 97 104 -172 45 276 -193 -83 273 -183 -170
6361a70M52k54k91N04j62l90M58L2m33K81K08m78K14K72l81O5L29m07k2M70l56
$$ -170 282 28 -263 241 79 -311 147 179 -254 27 235 -243 -29 243 -138 -73 256 -151 -173 297 -59
6382e9q1M23l36k18N93j88m52M57N3m90L53K45n15J47K90m04J02L25l11m8L53
$$ -59 -140 283 -53 -271 322 134 -318 139 192 -298 55 300 -215 -68 222 -182 -80 245 -66 -114 239
6403B39l38q0L87j75j89L09n9l28L72Q2m25K27J39l75J55K11k95P6J96k08J8K63
$$ 239 -99 -179 208 33 -156 153 94 -234 138 220 -205 22 161 -214 -59 152 -143 -67 129 -79 -61 202
6425B02j50j71J97q9j51K74l0j22J01K5j88J34Q4j41k5J41j03n6J70m7r2M5J5
$$ 202 52 -119 78 -11 -162 112 82 -40 61 86 -102 32 116 -25 -50 91 -12 -68 102 55 -37 8 23
6448B3j4j1N3j1n5K3m7k2O5N3q7l8J56j00n7J04j1p9Q7Rq6J0P4j52Q0O6n6O3M3
$$ 23 9 -2 51 40 -15 8 -39 -61 4 57 -30 -68 88 -12 -69 35 24 -55 32 41 -45 -35 39 -113 -33 33 -23 40 83
6477H3j18OQ8j17Q4J07j23o5J09j13m2K41o8j98J88n6q6J44K1j70J08Q0j72K4
$$ 83 -35 -29 59 -58 26 133 10 -55 54 -59 -101 140 72 -126 62 6 -80 64 85 -85 23 103 -69 -45
6501d5J53j46j3J33j30jR4m4j3K6o4J9O8l3o2N2L1l5M8K7q3P7m9k6J06j8p9mM4
$$ -45 108 -38 -51 82 -48 -49 45 1 -12 14 -50 -31 37 4 -58 -6 25 -10 38 65 -18 59 10 -16 90 72 -7 -11 33
6530C3p7Q1n1qJ2Q7p0pM4m8K4k2RLK2r2M5M6j01L5R7j05N2K1j18K3J75r5m8J18
$$ 33 -44 37 -14 -22 -10 77 7 0 44 -4 20 -2 7 10 32 -60 -15 31 -70 -35 62 -43 9 30 -88 -65 110 15 -33 85
6560H5j24k8P0M4j13Q1O1j11L9J66k68Q7O2r8K5J58j07o2K0N2j22J22nj45J99
$$ 85 -39 -67 3 47 -66 15 76 -35 4 170 -98 -11 51 -47 -22 136 29 -33 -13 39 -83 39 34 -111 88
6585H8oj88P1J63j76MP9l9j35J74k6j30J64k9j19K02j6k37J74J39j78m0J62j22
$$ 88 82 -106 -35 128 -48 -44 35 -4 -139 35 9 -121 43 14 -105 97 81 -156 18 157 -21 -61 101 -21
6609b1o6J76p3j09J55lj69P8R6j15N3Q4j79K4J30j27qJ85j24p1J71o5j97K36L1
$$ -21 -87 89 16 -93 62 59 -110 -32 64 -51 2 86 -93 -69 61 -66 -74 111 -13 -84 87 22 -175 61 92
6634I2j96J16J31k24m3K58j23j15J86q4r0K02q7q0J06N3j94J67M6k15J11J58k74
$$ 92 -104 12 143 -81 -124 134 11 -104 82 -2 -92 110 23 -57 49 102 -92 75 121 -94 17 175 -99
6657i9K0K89k61m4L19k05j61K64k0k86K42R5l17J27J82k62J9K26j89k8K31k29
$$ -99 -79 210 -51 -95 224 19 -142 122 102 -184 58 153 -164 -37 145 -117 -98 128 -61 -89 142 -87
6679h7m6K69j10k91L77j7k81K67Q9l49J54K25l40P6L83l46j40L83k06j94L80j06
$$ -87 -133 136 26 -265 112 95 -186 81 170 -179 -25 200 -140 -64 319 -27 -167 216 10 -184 196 90
6701I0k78K75J7l24K60J18l58J71K44l72P8L53l96o9L91k28k17L91ll52L46l4
$$ 90 -188 87 104 -220 40 158 -200 -29 215 -157 -79 274 -122 -191 200 -28 -245 146 143 -209 137 103
6723A03l32K26J52l34J49K75l98P4L47l57m2L52l14q4M14k11k46L83p1k55K17
$$ 103 -229 -3 149 -185 -36 239 -159 -85 262 -95 -137 215 -99 -183 231 20 -226 157 86 -169 48
6744D8J33l39K09J47l77P0L52l17j13L77j90k03L29m0k73K42J12l27J37J93l24
$$ 48 181 -158 51 198 -179 -109 243 -74 -187 190 0 -203 126 86 -187 55 167 -160 -23 170 -154
6765a54J02J36j75l7K79j32j40K04k2k14K03Q8k61J81J20k73M5K46k13j61L57
$$ -154 -52 84 -91 -128 151 19 -121 83 61 -153 50 138 -123 58 178 -95 -50 196 -17 -178 179
6786A79r7k29K47N6l03K39L1k80J59J41k89Q4K51l22l0M25k64k38M89j76l70M01
$$ 179 82 -147 100 156 -147 92 123 -157 2 143 -146 -62 189 -133 -163 262 -2 -240 249 73 -297 104
6808A04J23n43K89L76n92J47M55m77j16M90k36k59M65j87k48M31j32l65M77j20
$$ 104 227 -316 -27 349 -243 -96 359 -118 -234 256 20 -239 226 39 -209 222 90 -275 202 82
6828H2l14L63M1m54K52L61n46L1N75n25j57O11l07k42M47j03m12M09pl92M45n3
$$ 82 -232 131 172 -282 -30 331 -215 -184 391 -134 -291 320 13 -229 218 115 -297 112 105 -287 158 105
6850A05l91L43K00n22K31L02m31N1M10l49k38N76l06k36M37o9l02K51Q3l40K11
$$ 105 -286 57 257 -265 -34 268 -163 -112 298 -51 -289 287 -19 -255 182 113 -189 62 145 -195 16
6871A6J85k93N3J29j74N8K11k52J8J08q6p3K36o0j96J40qj22J26O9j30m4J56l5
$$ 16 201 -92 -39 90 -84 -26 185 -67 -49 59 -27 -100 136 76 -120 20 12 -110 16 85 -45 -89 67 32
6895C2j48J63K3j26N1O9j11P5Mj06L7O7j9l5J00l7j31K07p5j50J66J14k91L4K47
$$ 32 -116 47 70 -56 -5 64 -47 28 32 -74 -37 30 11 -24 76 39 -92 115 40 -110 56 170 -121 -87 160
6920A60k51O3K47k41k15L47n7k21K95j7k71J69M8j77J49J09k42Q8J38k24J9L02
$$ 160 -91 -28 219 -22 -237 110 53 -168 127 110 -161 8 56 -121 28 137 -105 -17 121 -103 -84 218
6942B18k47p4K26j21j37K64n7k95L05O2k67K04J16l63J34J82k59L8K21k04o1K58
$$ 218 -29 -103 123 2 -135 129 72 -223 82 144 -123 81 197 -166 -32 150 -109 -71 150 -54 -115 143
6964A43j79n2K98k34j24K76j02j66K15m7j22J08L7j75J14O2j39j4K05j59mJ01
$$ 143 -36 -88 210 -24 -148 128 26 -140 75 28 -94 14 51 -124 -10 52 -87 -101 104 -55 -59 42
6986D2p3q2J37K8r8J27l6j08Q3N1q0L2L6n8k7N3J4p8R9l9q7%L6K4L9j1j1j7lK3
$$ 42 -31 -113 24 52 -46 81 45 -63 20 71 -9 23 59 1 -26 27 41 -37 62 23 -64 -64 -28 -4 35 24 13 -4 -7 16
7016A6p3M6km7JP5o7K6L4k4m4Q2j4l5R0m6q8O0KrN2m1n2M7L7kLkk7m9N2P9q3K2
$$ 16 -57 -11 -13 -60 -59 16 -51 -25 9 -15 -59 23 9 -26 64 18 -70 -10 -8 -17 35 -6 -58 -11 26 24 27 25 -2 -51 1 80 -3 19
7050A9J9p2mP0m9nl2oL1n1O9J8o3pM1l6R0j2o7k0J18j06O9M6l9n8O7j5o3J79j23
$$ 19 38 -34 -38 32 -17 -22 -54 -60 -29 -80 -11 7 -56 -63 -22 -58 32 20 -47 -67 51 -55 14 60 21 -37 30 15 -48 131 8
7081Hm4J01k8r5N9O7j36L2P6r1M6R1j05q1J94j41O1P1j07l7J08p1p5J55M1j96
$$ 8 -36 65 37 -58 1 68 -68 -36 40 -51 -5 86 -19 -100 94 -47 14 85 -22 -59 49 -22 -97 58 99 -97
7107i7J20oj30Q2J17r7k4J52j66m9K23j03j62K27p4j33J58M7j56J47K2k39J40
$$ -97 23 17 -113 -31 86 -11 -35 117 -49 -98 125 22 -140 87 13 -120 38 85 -71 76 98 -141 -1
7130aJ41k55Q7Q1j41j7K71j25j85J93k5j82J93R5k11O3Q2j91J29J04j23m0J85
$$ -1 140 -115 -28 53 -88 -105 166 41 -144 49 24 -158 35 130 -81 -18 64 -127 2 106 -17 -57 128
7153A28k01J1J65q7q0J63m6k02L02K5l04J36J25k44P2K11k28m4K69j77j25K79
$$ 128 -73 -62 103 16 -64 99 53 -149 153 178 -126 10 135 -109 -37 174 -54 -98 171 -6 -131 148
7175A48n9k21K24j07j45K18N1k40R4J85k58P6K04k54r2K94j53j23K84p0k12J97
$$ 148 89 -132 92 -15 -160 58 109 -131 -37 148 -110 -34 170 -84 -176 118 -35 -158 126 56 -156 41
7197D1L8j56O5J67j51r7K32j86o1K46j11j24K14j07j58L28k9k57R0R8j73L2K80
$$ 41 79 -77 -12 155 4 -93 139 -47 -108 138 27 -97 117 10 -148 180 151 -106 -16 82 -91 -59 221
7220B21k61j23K49r7j23K67n2k83J73J11k57K11J37l48P3K07k03K6K48j67j85
$$ 221 -40 -163 86 -11 -134 133 81 -202 -29 82 -175 36 173 -175 -102 105 -98 -72 176 9 -176
7241a76L03p2j93K91J9m23K99O4l21K57K16l62k8L19k44n8L66k95j95M19j32l49
$$ -176 127 55 -138 153 172 -251 48 112 -209 48 264 -98 -126 193 -51 -109 257 -38 -233 186 54 -295
7263b95M38K9m37K88J56l58J78K50m55O8M14l82p7M19k91j79M24j20l40M55n8
$$ -295 143 172 -265 23 179 -179 -1 249 -206 -138 276 -106 -183 236 -55 -234 190 70 -270 185 127
7284A27m12L17R6l48K28K45m52J22L47m25P6M01m26r0M08j88k52M29j02l79L83
$$ 127 -285 32 128 -220 8 253 -199 -77 270 -155 -79 322 -104 -194 214 26 -226 203 101 -278 105
7305A05L2m23L37J66l83J16K66l39J5K89k29n3K03r0j59K24l4j64J62j8j07J25
$$ 105 137 -286 51 217 -166 -50 216 -123 -108 181 -48 -101 102 12 -147 77 43 -121 41 23 -84 41
7327D1L3j90J25O3j45P7J82j76o0J09j5j43K21Jj88J1J49j53JJ93j26j18J43m5
$$ 41 74 -116 9 72 -73 4 186 10 -50 59 44 -99 122 123 -65 -54 95 -58 -57 136 10 -108 35 -10
7351a0r5J87K1k04O0J09j56L6J91k18l8K34j14j70L91k18k07K84P5l11K14J13
$$ -10 -105 82 103 -101 -41 68 -88 -52 139 -79 -117 117 3 -167 224 6 -201 83 158 -153 61 174
7373A74l11M5K81k09l1K61k63r9L03j16j51K10n3k15L06o3k66L26l8l75K58K15
$$ 174 -137 -92 189 -20 -51 210 -53 -152 151 35 -116 94 41 -174 132 69 -197 129 91 -284 -26 189
7395A89l99J74L00m23qL44k35o0L77j94l04L50nk73L14J4l25J98J65l04J70J70
$$ 189 -210 -36 264 -159 -167 177 -58 -118 259 65 -239 111 106 -167 147 161 -164 34 199 -105 65 235
7417B35l30k1L44k25j28L19j58k62L60l0k70K80oj81jK09k08K2J69j84p7K10j20
$$ 235 -95 -116 228 3 -125 194 36 -226 134 104 -166 114 108 -73 -74 135 -73 -51 118 -66 -143 67 -53
7440e3K1Q4r3j10J91Mj73K09Mk47Q2J85q5p6J59j42m0J21O2j36J02mj95J46Q8
$$ -53 -32 52 -41 -151 40 44 -129 80 84 -163 -81 104 19 -57 102 -40 -80 41 103 -33 69 65 -130 16 104
7465A04j60P6O8q4l2J14m8r6J42n7j47Q8J15j44M4Q4j81rK70j97N2R1r0j15J55
$$ 104 -56 20 88 4 -28 86 38 -58 84 27 -120 -32 83 -61 -17 67 -114 -123 147 -50 2 93 3 -112 43
7490D3pJ0N2q8r9J16K3j41J04np9K8J41j01J8M0r7j1J35j15K2P4j04n9N3J06r1
$$ 43 36 46 98 10 -89 27 50 -91 13 8 -71 -43 98 -3 15 55 -42 -53 82 -33 -11 63 -41 -100 -47 59 -32
7517c2L7N0j34J7P8j6P0j8o8o0J02Jk5l4QNn5R5J3l9k4J0J9L1k0K5l6L8l6j6P1
$$ -32 5 55 -79 -62 16 0 70 52 -16 -76 26 27 2 -32 -24 -19 -74 21 34 -5 -29 -19 0 31 11 36 0 38 2 -14 57
7548E7Lj31O3J7n7J00M2j08m6L0O8n2Q7q6n0J02r5k3Q0j3n5R8Oj05N4R3j77J20
$$ 57 60 -71 -8 9 -48 52 94 -14 -60 -30 38 -14 73 -13 -63 39 -56 -79 1 -12 -67 31 37 -68 -14 79 -98 22
7576B2j8m4j8J13o3oK7q4N1N7Or0R0Nj07O7R9r0j20J57j25oJ19Pq6O5p2J2J14
$$ 22 4 -40 -58 55 -8 -14 13 -71 -20 37 43 -47 43 48 -59 8 107 17 -103 54 -71 -77 42 49 -37 28 -44 -32 82
7605H2k9j13M6M2j43R1J05j05m5J03K6r9M2N3o3k0Q8j05k7J33j05k0O3NpR2p8
$$ 82 53 -60 -14 28 -115 -24 81 -24 -69 34 60 -39 3 56 -7 -27 61 -44 -71 62 -43 -63 0 5 -2 90 12
7632A2j17Q4Q3j31Q0Q3j18m9J53j09m5J19p7r3K73j57p8J32J1j87R1R5j42J25
$$ 12 -105 -21 62 -69 11 94 -24 -73 80 -29 -74 45 -32 -125 148 -9 -87 45 56 -131 -40 55 -87 38
7656C8R8k35L5J14j35L5J86j08j43J90j02o6J58N4k72J43K04k61M3J86k14r1K35
$$ 38 136 -99 -64 50 -85 -50 136 28 -115 75 -27 -93 65 119 -153 -10 194 -67 -24 162 -52 -143 92
7679I2j22J0J61n5j97J86k3j39J10P3k81R4K80k71L9J78j60j15K37p0j92L08p0
$$ 92 -30 -20 141 86 -111 75 52 -87 23 96 -185 -91 189 -82 -43 135 -25 -140 97 27 -165 143 73
7702G3k64J95N6k24K15J09l28R4K29k25m0L14k56j10L34j38k14L49p4l46K96J03
$$ 73 -191 4 60 -164 51 160 -168 -74 155 -70 -110 204 -52 -162 172 34 -180 169 95 -251 45 148
7724A48k85J50J84l53R9K55k34l4K54l03p3L51j89j40L73j12k76K48J8k20J97
$$ 148 -137 13 197 -156 -57 198 -36 -70 184 -119 -192 159 -30 -170 203 91 -185 63 81 -139 58
7745E8R3l45J25K21k66O0K58l09o1K80j06j30K89p2k28J52P0j43J39J7l08J52
$$ 58 151 -194 -69 152 -114 -54 204 -105 -166 114 8 -122 167 95 -133 19 89 -54 85 102 -206 -54
7767e4J89j90nJ50j17j01K15k3j35P8R7k00Q9R8j12L0P3j56k0J49n4p2J78k5j77
$$ -54 135 -55 -60 90 -27 -128 87 64 -71 7 104 -96 -7 91 -21 9 82 -74 -94 55 1 -71 107 82 -95
7792i5Q7J26j85J16J01k27lK16j10o7J95j44j55K95n2k06K43m7l09K28J71k41
$$ -95 -8 118 -67 49 150 -77 -80 136 26 -41 154 10 -145 150 98 -108 135 88 -221 7 178 -63
7814f3MK20k39r5L40j76j93L93j62k64L12J8l37L51nl00J36K04k29O4K65l93L8
$$ -63 -59 161 -78 -173 167 -9 -202 191 29 -235 77 95 -242 109 104 -196 -60 144 -85 -21 244 -149 -111
7837a11L93l62o5M15k70k28M32o7l62L66Nl87K08K77l81J45K52l98L7L17k45o9
$$ -111 282 -80 -145 270 0 -228 204 137 -225 141 146 -241 -33 244 -137 8 260 -138 -101 216 -29 -98
7859i8K83j88j90L42p3l20K90R3l99K78J68l18P2K73l40nL09j55r6K26j44j13
$$ -98 185 -3 -193 149 76 -244 46 139 -260 18 186 -132 -60 213 -127 -132 177 22 -74 152 8 -105
7881a05K23q4r3R6K8j80J08P1k01J56J29k64J12J23j52l7K60j79j46J86R7k41
$$ -105 118 34 -59 37 65 -115 -7 64 -137 19 148 -116 -4 119 -33 -70 190 11 -135 51 148 -93
7903i3Q7J69k18j5K02j12j63K39j25p6K04o7j48J41N9k53J80J35j91L4K02j97
$$ -93 -6 163 -55 -70 132 20 -143 96 -29 -105 99 32 -116 25 84 -169 11 146 -45 -11 191 -6
7925fj04K57o3j53J53kk00J59R5k21J15L6j65J04J05j15lR4k04M1J82j21j24K23
$$ -6 -110 147 84 -69 84 82 -118 41 136 -85 30 66 -99 5 110 -5 -8 86 -118 -77 105 -16 -140 83
7949H3r0j61K41J1k22J22Q8j98O2K12k09j4J78j65j0J33j1q7J11J0j67J20P6j37
$$ 83 -7 -168 73 84 -138 -16 72 -126 -64 148 -61 -75 103 -62 -72 61 50 -37 74 84 -83 37 113 -24
7973b4J03K0j59K7J66j38kQ8r9l3R8l4l7L5J2n9J10O8j96M3M1o9J6J74j86j5J37
$$ -24 79 99 -60 -33 133 -5 -7 81 -18 -51 47 13 -24 11 23 -36 74 142 -54 -11 30 -39 -23 151 -35 -50 87
8000H7p0r1Q8O1q2J2M5j16P4Q4r1q0J58n1m6J04M7j74O9j0m8L4N1q3N5pm2j6J24
$$ 87 17 -74 14 75 -7 5 50 -66 8 92 1 -79 79 28 -18 86 133 -41 28 18 -30 4 55 -28 27 20 -22 -38 86
8029H6m1j16J50r1o5J09j2j01R4l6k4M2J01p9l4l7J4J1J16j02PJ04r1MJ1L1q9
$$ 86 45 -71 79 -12 -77 32 20 -81 13 -23 -47 -5 96 17 -17 -54 -40 -29 87 -15 -8 96 5 9 20 51 -38
8056c8O9m5o1M3O5l2K7l4l3P9j0k7m3M3oqk3K1nL6l1qK7J5l4j2j0mN4Ll7pl0N7
$$ -38 31 -14 -75 -32 33 1 28 -6 -39 40 30 3 -40 3 -3 -11 -34 -13 -18 18 -13 -21 6 21 -13 -25 -35 -39 15 18 -19 -26 -56 1
8090Ajj2K3j2j5k5P8J1q4R4m9n7Q5m8QP8j8q2pP0m2RQ1q4p4Q7p7K2N0N3j51J03
$$ 1 0 -12 11 -1 -16 -41 37 48 -36 58 9 -48 37 -11 -3 75 57 -25 -32 38 -4 5 86 2 -72 15 -62 -40 10 63 -88 15
8122A5j9m6O2Qo9N1N2p7N9K2p5m5J54j02o7J70o8l4Q2j8j49J66m7j46J13J07j21
$$ 15 -4 -50 12 20 -49 2 54 -23 36 58 -17 -62 92 -10 -77 93 25 -9 73 55 -94 72 25 -121 -8 99 -22
8149b2M6J29k43M4J66j21p5J74j14q8J47L5j57J04K8j97J14J29k12J07J46k45
$$ -22 24 153 -90 -46 120 -1 -76 98 -16 -104 43 78 -79 25 53 -144 -30 99 -113 -6 140 -105
8171a05L0J78q3j17J90l9j17J34k2j11J29L8j42K6J04j35K5J13j43j3
$$ -105 -75 103 20 -97 93 54 -63 71 49 -62 67 105 -37 -11 93 -42 -17 96 -47 -60
8191f0
$$ Imaginary data points
##PAGE= N=2
##DATA TABLE= (X++(I..I)), XYDATA
0@%%%%%%%%%%kJ0j6J6k2L0l4M2n6O7p7R2j09J30j55J83k11K43k81L23l70M20m75
$$ 0 0 0 0 0 0 0 0 0 0 0 -2 8 -8 8 -14 16 -18 24 -32 35 -42 50 -59 71 -84 99 -112 131 -150 173 -197 223 -252
33b52N40o13O92p77Q70r74J086j209J345j492J652j829K022k232K461k712K987
$$ -252 288 -325 367 -410 460 -514 572 -637 708 -784 868 -961 1061 -1171 1290 -1422 1565
50A565l291L627l995M407m870N388n974O644p421Q336r422J0745j2398J4521j7371
$$ 1565 -1726 1901 -2094 2313 -2557 2831 -3143 3501 -3920 4416 -5006 5739 -6659 7862 -9509
65i509K1408k7598L8350o2018J98277j14796l44353M70324p0745l11090K92621
$$ -9509 11899 -15699 22651 -39367 158910 44114 -300239 170085 99340 -211750 80871
76H0871P8814l39054J88255J00433k48487J58258J50284k97903O7253J90265k07606
$$ 80871 159685 -179369 8886 109319 -139168 19090 169374 -128529 -61276 128989 -78617
87g8617K2982K03146j95579l1839J82869j61329l0105K52423j57434j60278K41522
$$ -78617 -55635 147511 -48068 -79907 102962 -58367 -88472 163951 6517 -153761 87761
98H7761l2410j93539J91159N4792j96033P1034O3797j15667R5860N5615j58307
$$ 87761 55351 -138188 52971 107763 -88270 -17236 46561 -69106 26754 82369 -75938
109g5938N9786R5402j54018L0649J62504j20821q3739J25685k9138o7077R9227
$$ -75938 -16152 79250 -74768 -44119 118385 -2436 -86175 39510 10372 -56705 42522
120D2522J116q8270L8051K3986m9777L1783N0523m2326m8563K4489M1510k0425
$$ 42522 43638 -44632 -6581 17405 -32372 -589 49934 7608 -40955 -16466 25044 4619
132D619k5308M7429J634p8829K1442P2912l3869k1725L0150l4121r346M2839k0824
$$ 4619 -20689 26740 28374 -50455 -29013 43899 10030 -11695 18455 -15666 -25012 17827 -2997
145b997M813L8757o6258k3784Q3917k2903l7837O8373l6651o5929Q2063R68o5161
$$ -2997 1816 40573 -25685 -49469 34448 11545 -26292 42081 5430 -60499 21564 22532 -42629
158d2629Q5046k745j21365P6933O9271j09828L9211P9771j20766j906J09289p7243
$$ -42629 42417 39672 -81693 -4760 64511 -45317 -6106 73665 -47101 -49007 60282 -16961
170a6961j1491J04957r8294n5613J37493m6331q1628J31190k4623j32322J06930
$$ -16961 -28452 76505 -21789 -77402 60091 13760 -67868 63322 38699 -93623 13307
181A3307M2027j14068P7215M7448j36758M6242R1487j08598K2099J02810j16515
$$ 13307 55334 -58734 18481 65929 -70829 -24587 66900 -41698 -19599 83211 -33304
192c3304l2470J24218n7794m6691J08752n1940q3509J01688l805p7206R1145N408
$$ -33304 -65774 58444 650 -46041 62711 10771 -72738 28950 25145 -52061 39084 44492
204D4492j14011O2759N5593q8618L8644O2874r7646l540Q1993n5133j1522P7917
$$ 44492 -69519 -6760 48833 -39785 -1141 61733 -35913 -39453 42540 -12593 -24115 53802
216E3802n7447n0233P8537j1194m7313O5833m333p4296M1273L0943m7763L0582
$$ 53802 -3645 -53878 24659 13465 -33848 31985 27652 -46644 -5371 25572 -22191 8391
228H391K8466o3631K769M6743l1901R46M4697l9618l1699M4977k542k2580L6840
$$ 8391 36857 -26774 -24005 22738 -9163 -8217 36480 -3138 -34837 10140 7598 -14982 21858
241B1858n200m6663K0928K3210k3756J5398J9440l9641r098L3862p846p270K5772
$$ 21858 16658 -30005 -9077 14133 -9623 5775 25215 -14426 -23524 10338 2492 -4778 20994
254B0994j6508l0820K2991J3844j5713J5333N861l4084K073K7215r952p28J8073
$$ 20994 4486 -26334 -3343 10501 -5212 10121 15982 -18102 -16029 11186 1234 506 18579
267A8579k3036j9355K6958N770j2716J6612m855l0593J3553K1465j3036N701R833
$$ 18579 -4457 -23812 3146 8916 -3800 12812 7957 -22636 -9083 12382 -654 5047 14880
280A4880k8191n689K7285k878n903J4712j6029k0236K1412J0677j0634J0141k176
$$ 14880 -13311 -19000 8285 5407 -496 14216 -1813 -22049 -637 10040 -594 9547 7371
293G371k4959P553J9755o505J160N649j9671o503J9842L340m032N929j0826j4167
$$ 7371 -17588 -10035 9720 3215 4375 10024 -9647 -16150 3692 7032 3000 8929 -1897 -16064
307a6064J2166J1491k963J994m008j4784K057J3889L048o72k181j0876m537J0063
$$ -16064 -3898 7593 4630 6624 2616 -12168 -10111 3778 6826 6154 3973 -6903 -11440 -1377
321a377Q564Q69l280q408o570M112R989N734l297q599n562K46O458J0266P55j0839
$$ -1377 7187 8056 4776 -3632 -10202 -6090 3899 9633 6336 -2263 -7825 -7579 -1121 9145 9900 -939
337i39n850N35R81R653Q291j0729r768L379j303L954J5239n402j6673M139J927
$$ -939 -6789 -6254 -5273 4380 12671 1942 -7826 -4447 -5750 -1796 13443 8041 -8632 -4493 -2566
352b566m916J6643O093k2090j528R730j0370R788J9561k0421j3099J6467q784
$$ -2566 -7482 9161 15254 -6836 -8364 1366 -9004 784 20345 -76 -13175 3292 -5492
365e492l567K8642r453k7113J7047J716j7850K7560R838l6340P266J7058k5016
$$ -5492 -9059 19583 10130 -16983 64 1780 -16070 11490 21328 -15012 -7746 9312 -15704
378a5704J4379K9424l4111j1225K9238k0778n921M1908j9208l1539L1657n265
$$ -15704 -1325 28099 -6012 -17237 12001 -8777 -14698 27210 8002 -23537 8120 2855
390B855k5882M0835N034m5674K0622J5412l6694K5547L0177m5970j092L2372l2741
$$ 2855 -23027 17808 22842 -22832 -2210 13202 -23492 2055 32232 -13738 -14830 17542 -15199
403a5199J983M5625l1294k3755L6858j8510j8936M7975r215m0457L1064J574l4649
$$ -15199 -13216 32409 1115 -22640 14218 -4292 -23228 24747 15532 -24925 6139 7713 -26936
416b6936L7466J7727m6534J1564K2015l4987J3446L6209l3632j2459K8143j9636
$$ -26936 10530 28257 -18277 -6713 15302 -19685 -6239 29970 -3662 -16121 12022 -7614
428g614p773L5986j0363k4686J6721k691j2924K2412M659j9997L567J525r216
$$ -7614 -15387 20599 10236 -14450 2271 -420 -13344 9068 13727 -6270 -2703 -1178 -10394
441a0394J2852J0282j1445n598P66j742M464O585K364o392j1674M334Q872m268
$$ -10394 2458 12740 1295 -4303 -3537 -5279 -815 5770 8134 1742 -9932 -5598 3274 -994
455i94P475M543k2824J389K0691j5150J809K6536k9178j9802L9999r039k4542
$$ -994 6481 11024 -11800 -10411 10280 -4870 -3061 23475 -5703 -25505 14494 5455 -19087
468a9087M0769q846m6699L8994J3927m5212L7798K0593o7974K3193M8711n9237
$$ -19087 21682 12836 -33863 5131 19058 -26154 11644 32237 -35737 -12544 36167 -23070
480b3070R646O0457o4716j9106P3979m1651k8343P8917m0109n9967Q3840q453
$$ -23070 -13424 47033 -17683 -36789 37190 -4461 -32804 46113 6004 -53963 29877 21424
492B1424p2546P9134J3243r7968N4493M6570q5307L9151N6202r4651J6353P6749
$$ 21424 -51122 28012 41255 -56713 -2220 44350 -40957 -1806 54396 -40255 -23902 52847
504E2847q4158K800R7790q6452m1488J13686n0806o5150J14548k6081j00796R9794
$$ 52847 -31311 -28511 69279 -17173 -58661 55025 4219 -60931 53617 27536 -73260 26534
516B6534J5440j08695Q3395M9489j26981L7964Q7433r7442J624R2255p3201k9843
$$ 26534 41974 -66721 16674 66163 -60818 -22854 64579 -32863 -31239 61016 -12185 -42028
528d2028P8821m3728k2069P4998m8763m1965Q1027k9933n4931Q5212p226q1571
$$ -42028 36793 -6935 -29004 45994 -2769 -44734 36293 6360 -48571 36641 29415 -52156
540e2156O1062K1867p1958M8942L5892p9575K1868N2983o3684M877O4432m9619
$$ -52156 8906 30773 -41185 7757 43649 -35926 -14058 38925 -24759 -19882 44550 -5069
552e069k7315N2861j9453k0418M2945j8735k7931L8056j1718l0970M5706Q058
$$ -5069 -32384 20477 1024 -19394 23551 4816 -23115 14941 3223 -27747 17959 26017
564B6017n2126J4438L3362k7125j0079K9878o89k7448j00K3625j410j8316J4839
$$ 26017 -26109 -11671 21691 -5434 -15513 14365 13676 -13772 -13872 9753 8343 -9973 4866
577D866Q522l1907P647L3869k6861j1640L9024k2657l3343M5195J0012m0197J6890
$$ 4866 13388 -18519 -10872 22997 -3864 -15504 23520 863 -32480 12715 22727 -17470 -580
590e80J3796k6737J0377R922j1844J9339j1101l2919M0651J2148n2004L1908L1952
$$ -580 13216 -13521 -3144 6778 -5066 14273 3172 -29747 10904 23052 -28952 2956 34908
603C4908o4891J0852N6418m9905o469N7296n0970k3651P3099l2315m2334P3101
$$ 34908 -29983 -19131 37287 -12618 -19087 38209 -12761 -36412 36687 4372 -37962 35139
615C5139j9541o6110O8539J1176o9514N4925K0711q3994M6010N1120q6746K3373
$$ 35139 15598 -50512 18027 29203 -40311 14614 35325 -48669 -2659 48461 -38285 -14912
627a4912P4966q7731j7567R6999m9159m6881Q1766k4523n9664O6943j016n4094
$$ -14912 60054 -27677 -45244 51755 2596 -44285 37481 12958 -46706 20237 19221 -34873
639c4873N6451O35o6534N2462K4220o7442L8211L6085p3174J9134N3867o0958
$$ -34873 21578 22213 -44321 8141 32361 -35081 3130 39215 -33959 -14825 39042 -21916
651b1916N198O1579o1297k0566P6329l5517m2863P0580j2640o2697N2237J7933
$$ -21916 -16718 44861 -16436 -37002 39327 3810 -39053 31527 18887 -43810 8427 26360
663B6360n3953L2515K2218n4302J8973L5291m4414P662M1255m2689j4234M7463
$$ 26360 -27593 4922 27140 -27162 -8189 27102 -17312 -9650 31605 -11084 -25318 22145
675B2145j8692k3238L7635r839l1704K9636O049k7638K2127J0288l4458R795K4836
$$ 22145 3453 -19785 17850 8011 -23693 5943 11992 -15646 6481 16769 -17689 -7894 16942
688A6942k2268k478K3141j6942j3877K1966j417j2716J5242j421k0142J2409J2394
$$ 16942 -5326 -7804 15337 -1605 -15482 6484 5067 -7649 7593 6172 -13970 -1561 10833
701A0833j7153L829J5712j8620q517K3085l444j4935J6012n47k1062J4413J2961
$$ 10833 -6320 -2491 13221 -5399 -13916 9169 5725 -9210 6802 6255 -14807 -394 12567
714A2567j9842N891J5089k3675k114K6825j3415j2501K3307r722k0614K5159M124
$$ 12567 -7275 -1384 13705 -9970 -12084 14741 1326 -11175 12132 2410 -18204 6955 11079
727A1079k3454J6824O927k8404J3364K0862k5425K178K2448k4629o552L0554j3230
$$ 11079 -12375 4449 11376 -17028 -3664 17198 -8227 -6049 16399 -8230 -14782 15772 2542
740B542j5527K5602r489k2305K6915M195k5490J7729Q300k9026J2350K1001k3935
$$ 2542 -12985 12617 3128 -19177 7738 11933 -13557 4172 12472 -16554 -4204 16797 -7138
753g138J306K0778k2064n985K6831j1504j3377K1710q005j8894K1979M459k0477
$$ -7138 -5832 14946 -7118 -13103 13728 2224 -11153 10557 2552 -16342 5637 10096 -10381
766a0381J3062O807k1962Q692J6268j6789M5J4686j5639m740J9434o912r933J4367
$$ -10381 2681 9488 -12474 -3782 12486 -4303 -4258 10428 -5211 -9951 9483 2571 -7362 7005
780G005m965j3265J4464M341j3560P494M535j4373N186J1373j0186q20Q964r782
$$ 7005 2040 -11225 3239 7580 -5980 1514 6049 -8324 -3138 8235 -1951 -2771 6193 -3589
794c589l365J2652l084o653P880k979q256Q632L798p644L294K328q004K639P068
$$ -3589 -6954 5698 2614 -4039 3841 862 -7394 1238 5036 -2608 686 3014 -4990 -2351 4717
809D717m424j280L835m805j977O468l6l401J915j106l398L063L332k116r37L92
$$ 4717 293 -987 2848 -1957 -3934 2534 2498 -903 1012 -94 -3492 -429 2903 787 -150 242
825B42j981l71L412J165k531p44N45j713Q69M102j461l502K094k38k683M586J975
$$ 242 -1739 -2110 1302 2467 -64 -808 -263 -1976 -1107 2995 1534 -1968 126 -112 -2795 1791 3766
842C766n782P51K947m611K085O103n645k932N825l717k489Q412k103p240N819
$$ 3766 -2016 -1265 1682 -2929 -844 5259 -386 -3318 2507 -1210 -3699 4713 2610 -4630 1189
857A189K69o476O898L000q812K898M085p214L272O829p695j253O484n650j097
$$ 1189 1458 -5018 1880 4880 -3932 -1034 3051 -4163 -891 5938 -1757 -3010 3474 -2176 -3273
872c273Q476m129m972O018j968m045O787R4n594K993K82l493L781J365l266J112
$$ -3273 5203 1074 -3898 2120 152 -3893 2894 2988 -2606 387 669 -2824 957 2322 -944 168
888A68n89j743L295j70j693K367k596k042N299j561k838N356l326n063Q134r77
$$ 168 -421 -2164 1131 961 -732 1635 -961 -3003 2296 735 -2103 3253 -73 -5136 2998 2021
904B021o672Q628r56j0817R943L685j2990Q856O422j7054O680J2640j7565L193
$$ 2021 -4651 3977 3021 -7796 2147 5832 -7158 1698 8120 -8934 -2254 10386 -7179 -3986
918c986J6819j9466k559K3020j6676r103K6841j4015j8378K9866n441k5830K8557
$$ -3986 12833 -6633 -9192 13828 -2848 -11951 14890 875 -17503 12363 6922 -18908 9649
931I649L082l3595K3964J4671l5926J6181K3553l7075O240L1917l2866l539L7030
$$ 9649 12731 -20864 3100 17771 -18155 -1974 21579 -15496 -9256 22661 -10205 -13744 23286
944B3286k8517j4347M0767j9932k3786M1580j1269l3959L9606J178m0780L3834
$$ 23286 -5231 -19578 21189 1257 -22529 19051 7782 -26177 13429 14607 -26173 7661
956G661J3216m6083K4281K6043m5726J2582L5910m2643r11M2747l4399j3303M5715
$$ 7661 20877 -25206 -925 25118 -20608 -8026 27884 -14759 -15670 27077 -7322 -20625 25090
969B5090k4957k4989M5005j2686l3475M0638n09l9745L2772J1545m0868K2819
$$ 25090 133 -24856 20149 7463 -26012 14626 14117 -25628 7144 18689 -22179 640
981F40K0648l9113J1880K7347l3817K178L0593k7252o874L1041j8941j3201K8747
$$ 640 21288 -17825 -5945 21402 -12415 -10237 20356 -6896 -13770 17271 -1670 -14871 13876
994A3876j1318j7470K4677m214j9236J9805J571j9510J4332O146j7724Q683Q827
$$ 13876 2558 -14912 9765 5551 -13685 6120 7691 -11819 2513 8659 -9065 -382 8445
1007H445j4396L390R497r625q58P754m166k620L222N10n49l233J926N679p832
$$ 8445 -5951 -2561 6936 -2689 -3547 4207 41 -2579 643 1153 604 -2629 -703 4976 -2856
1022b856j959J2534p946r302J7149k941j6732J6706M329k1280J2720J1361k1544
$$ -2856 -4815 7719 -227 -9529 7620 4679 -12053 4653 8982 -12298 422 11783 -9761
1035i761P272J4125j9880M687J5445k0242M442J8365k4717K270K7446k7655o614
$$ -9761 -2489 11636 -8244 -3557 11888 -8354 -3912 14453 -10264 -7994 19452 -8203 -14817
1048a4817L7401k5043k0779M4487j4159l5053M3850J15m6089L7326J6874n0950
$$ -14817 22584 -2459 -23238 21249 7090 -27963 15887 16002 -30087 7239 24113 -26837
1060b6837K5253L0063n0884J2145M0845m6220r52M8002m1342j5138N5985l0674
$$ -26837 -1584 28479 -22405 -10260 30585 -15635 -16587 31415 -9927 -25065 30920 246
1072B46l1871N7799j4516m7435N1286O584n3491L6290K1022n1841K2253L0201
$$ 246 -31625 26174 11658 -35777 15509 22093 -31398 4892 25914 -25927 -3674 26527
1084B6527m5793J1607L3843m2282L374L9157l7914m658M4023l5491j6305N1673
$$ 26527 -19266 -7659 26184 -16098 -12724 26433 -11481 -16139 27884 -7607 -23912 27761
1096B7761k6392l1689N4658j0984m9095M8048J3141n5648K9200L1001n0883Q176
$$ 27761 1369 -30320 24338 13354 -35741 12307 25448 -30200 -1000 30001 -20882 -12706
1108a2706L9839l6456o533L8006k5260j5627L5463j3461k0983L0230n196k5439
$$ -12706 27133 -9323 -15856 22150 -3110 -18737 16726 3265 -17718 12512 7316 -18123
1120a8123K4229M932k5276J6490J0510k5259Q462J7673k0118o47J9495j3771r629
$$ -18123 6106 11038 -14238 2252 12762 -12497 -4035 13638 -6480 -7127 12368 -1403 -11032
1133a1032J8010k481j2015J0297K002j0830N372N170p402K868N017r136M9J0395
$$ -11032 6978 4497 -7518 2779 4781 -6049 -677 4493 -2909 -41 4976 -4160 -4111 6284
1147F284o233o200J1709j868j3389J0363Q443j5517K939J3879j5498m425K1050
$$ 6284 51 -6149 5560 3692 -9697 666 9109 -6408 -3469 10410 -5088 -9513 11537
1160A1537r661j4133K1338k553k2528J9399J0359k5850R395J7093k4236K101K3212
$$ 11537 1876 -12257 9081 6528 -16000 3399 13758 -12092 -2697 14396 -9840 -7739 15473
1173A5473j9656n773K4305j7079j2599K9461r064k2044K6706m38k8297K2764J1551
$$ 15473 -4183 -9956 14349 -2730 -15329 14132 5068 -16976 9730 9292 -19005 3759 15310
1186A5310k9781J3362J6892k9569P081K5645k6478l502K8888k1809j2928L2453
$$ 15310 -14471 -1109 15783 -13786 -6705 18940 -7538 -11040 17848 -3961 -16889 15564
1198A5564j0706k1416K7064l266k5341K4277O671k7884J6719J2859k9565R946
$$ 15564 4858 -16558 10506 7240 -18101 6176 12847 -15037 1682 14541 -15024 -5078
1210e078K3067k5491j694K4506j9639r084K6642j0618j5359K2632n617j9864K1621
$$ -5078 17989 -7502 -9196 15310 -4329 -13413 13229 2611 -12748 9884 4267 -15597 6024
1223F024M483k2673J3499R816k2633P403J7169j7909r99J6617j4945n529K0003
$$ 6024 10507 -12166 1333 11149 -11484 -4081 13088 -4821 -5820 10797 -4148 -9677 10326
1236A0326q190j1544J6558l708j5217J5315M941j6071P830P077j5440M854J2714
$$ 10326 2136 -9408 7150 3442 -11775 3540 8481 -7590 240 7317 -8123 -3269 9445
1249I445j2305j559J2027j0486n228J5272l934j0065J0784r03j1548R923N689
$$ 9445 -2860 -4419 7608 -2878 -8106 7166 3232 -6833 3951 3048 -8500 1423 7112
1262G112j1568L781O291j1243J690J1570p794m355R541n561o670J1361O07r619
$$ 7112 -4456 -675 5616 -5627 -3937 7633 -161 -4516 5025 -536 -7206 4155 4762 -4857
1276d857O015K110r755N706P629r048l40P129p825j867J1153l850o954P606j718
$$ -4857 1158 3268 -6487 -781 6848 -2200 -2540 4589 -3236 -5103 6050 2200 -4754 2852 1134
1291A134p784Q924L604r814L374M468r250L053R616p948l267Q101n918m191J1179
$$ 1134 -6650 2274 5878 -3936 -562 3906 -5344 -2291 7325 -623 -3890 4211 -1707 -5898 5281
1306E281j645q686O961N4q612P978N178j0007K171N277q923K132R967p413l644
$$ 5281 3636 -5050 1911 1965 -6647 1331 6509 -3498 -1327 3950 -4973 -2841 7126 -287 -3931
1321c931P912n745l906J1002j930q007O632p10p571Q279L740r104L005L263q126
$$ -3931 3981 -1764 -5670 5332 3402 -4605 2027 1317 -6254 2025 5765 -3339 -334 2929 -5197
1336e197L977P437p314r38N206o571j04Q769m070l862N271m179l124Q095p21m804
$$ -5197 -1220 6217 -1097 -2035 3171 -3400 -3504 5265 1195 -2667 2604 -1575 -4699 3396 2675 -2129
1352b129M025k361m385O793J142m673L669j665n782O433K537n693M108K93q263
$$ -2129 1896 -465 -4850 1943 3085 -1588 2081 416 -5366 1067 3604 -2089 2019 2312 -5951
1367e951N159N427o645K741L471r453K202Q097o561Q63O379r959j208J1096o352
$$ -5951 -792 4635 -2010 731 4202 -5251 -3049 5048 -1513 -650 5729 -4230 -5438 5658 -694
1382f94k602J0762q688p624J3892k315r046J2600k235j4421J1547N243j2762Q706
$$ -694 -3296 7466 -1222 -8846 5046 2731 -6315 6285 4050 -10371 1176 6419 -6343 2363
1396B363N499j6505N415J1106j2657L529J1232j5746j616J5782j0499l590J6546
$$ 2363 7862 -8643 -3228 7878 -4779 -1250 9982 -5764 -7380 8402 -2097 -5687 10859
1409A0859j1363j1101J8046l197j2267J6391j140j8237J2773O673j5248R751P910
$$ 10859 -504 -11605 6441 3244 -9023 7368 6228 -12009 764 7437 -7811 1940 9850
1422I850j8372M090J2679j2886K222J3000j4368m267J4853p655m597J4249p382
$$ 9850 -8522 -4432 8247 -4639 -2417 10583 -3785 -8052 6801 -854 -5451 8798 1416
1435A416j0613J2305p95q018J0881m98j1930O824L380p210O873K915j0155K475
$$ 1416 -9197 3108 2313 -5705 5176 4678 -7252 -428 2952 -4258 2615 5530 -4625 -2150
1449b150M435n480M284M425p813n35L935l149K371L860m441j304P77j746M190
$$ -2150 2285 -3195 1089 5514 -2299 -2834 1101 -2048 323 4183 -258 -1562 -785 -2531 1659
1464A659J545m379K057r67n480P225L697q601L858K979j1046N818J0053j1372
$$ 1659 3204 -1175 882 -85 -5565 1660 5357 -3244 614 3593 -7453 -1635 8418 -2954
1478b954M63R696j3282q20J7091j0129o944J5713j0221j0759K0882l057j5953
$$ -2954 -2491 7205 -6077 -6897 10194 65 -6879 8834 -1387 -12146 8736 5679 -10274
1491a0274J7076j524k0344J8668Q191k2778J2421J0398k5876R688K0566k3790
$$ -10274 6802 5278 -15066 3602 11793 -10985 1436 11834 -14042 -4354 16212 -7578
1503g578J560K1736k4488m315L0135j7623j2995K9203j4683k1404L2455j971k7463
$$ -7578 -6018 15718 -8770 -13085 17050 -573 -13568 15635 952 -20452 12003 10032 -17431
1516a7431K5920L366l2830K2420J6392l2330J2906K0384l3828M652L0769k6023
$$ -17431 8489 11855 -20975 1445 17837 -14493 -1587 18797 -15031 -10379 20390 -5633
1528e633n896K9882k2282j3867L2817j1314j8768K8642q717k5703K9262L691k8880
$$ -5633 -11529 18353 -3929 -17796 15021 3707 -15061 13581 4864 -20839 8423 12114 -16766
1541a6766K2356R145l3647J5588K1462k9100N941K3480k8679l509L1301j8192
$$ -16766 5590 14735 -18912 -3324 18138 -10962 -5021 18459 -10220 -13729 17572 -620
1553f20j3041K8454j1490k1926K5298L418k1020J4557N090k0611J0127J1431j5602
$$ -620 -13661 14793 3303 -18623 6675 10093 -10927 3630 8720 -11891 -1764 9667 -5935
1566e935N305J0508j7120n64J6527q167n727J1417n569q853R873K030o160N290
$$ -5935 -630 9878 -7242 -7806 8721 554 -5173 6244 675 -8178 1695 3725 -2435 2855
1580B855l18q873M302P006n068j329M916m120m945O015L890m194J3M54m957L218
$$ 2855 2537 -6336 -2034 4972 -96 -1425 3491 -629 -5574 441 4331 137 150 604 -4353 -1135
1596a135O165o092q18Q144r233p240J7201Q41j6863R976P389j8660N949J7265
$$ -1135 5030 -1062 -1880 6264 -2969 -10209 6992 7833 -9030 946 8335 -10325 -4376 12889
1610A2889j5883l470J6589j4821p256K4856p878j8385K0548l81k2555J8115J1248
$$ 12889 -2994 -6464 10125 -4696 -11952 12904 5026 -13359 7189 6808 -15747 2368 13616
1623A3616k2462P414J0634k0576Q560J7726k2005O01K1234k1904p177L0305j1387
$$ 13616 -8846 -1432 9202 -11374 -2814 14912 -7093 -6492 14742 -7162 -14339 15966 4579
1636D579j8810K2789m415j9621K2309L163k2271J6704N059k6415J6261J8547k7170
$$ 4579 -14231 8558 4143 -15478 6831 9994 -12277 4427 9486 -16929 -668 17879 -9291
$$ [...]
8191G8
##END NTUPLES=NMR FID
##END=
