##TITLE=1H_2MTBDP2212
 CDCl3
 8 sc, 
 23.12.2022
##JCAMPDX= 6.0         $$ Bruker NMR JCAMP-DX V2.0
##DATA TYPE= NMR FID
##DATA CLASS= NTUPLES
##ORIGIN= UXNMR, Bruker Analytische Messtechnik GmbH
##OWNER= root
$$ XWIN-NMR		Version 3.5
$$ Fri Dec 23 14:28:21 2022 Russian Standard Time (UT+4h)  she@DPX200
##.OBSERVE FREQUENCY= 200.13135
##.OBSERVE NUCLEUS= ^1H
##.DELAY= (6, 6)
##.ACQUISITION MODE= SIMULTANEOUS
##.ACQUISITION SCHEME= undefined
##.AVERAGES= 8
##.DIGITISER RES= 18
##SPECTROMETER/DATA SYSTEM= spect
##.PULSE SEQUENCE= zg30
##.SOLVENT NAME= CDCl3
##.SHIFT REFERENCE= (INTERNAL, CDCl3, 0, 15.7039)
##AUDIT TRAIL= $$ (NUMBER, WHEN, WHO, WHERE, WHAT)
$$ ##TITLE= Audit trail, XWIN-NMR		Version 3.5
$$ ##JCAMPDX= 5.01
$$ ##ORIGIN= Bruker BioSpin GmbH
$$ ##OWNER= she
$$ F:/spectra/data/she/nmr/H-F/1/audita.txt
$$ ##AUDIT TRAIL=  $$ (NUMBER, WHEN, WHO, WHERE, WHAT)
(   1,<2022-12-23 14:27:05.35 +0400>,<she>,<DPX200>,
      <created by zg, POWCHK disabled, PULCHK disabled
       configuration hash MD5:
       00 E9 B6 7A A2 85 ED C7 34 08 36 98 17 FE 4E 26
       data hash MD5: 16K
       78 5E F9 1F C5 05 9B 1E 5A AB 24 D5 D8 53 E5 73>)
$$ ##END=
$$ 
$$ hash MD5
$$ 08 BB DA 24 40 67 72 53 2B 05 AB 64 4B 0A 4E F4
##$RELAX= 
##$RELAX= 
##$RELAX= 
##$RELAX= 
##$RELAX= 
##$RELAX= 
$$ Bruker specific parameters
$$ --------------------------
##$DU= <F:/spectra>
##$EXPNO= 1
##$NAME= <H-F>
##$PROCNO= 1
##$TYPE= <nmr>
##$USER= <she>
##$AMP= (0..31)
100 100 100 100 100 100 100 100 100 100 100 100 100 100 100 100 100 100 
100 100 100 100 100 100 100 100 100 100 100 100 100 100 
##$AQSEQ= 0
##$AQ_mod= 1
##$AUNM= <au_zg>
##$AUTOPOS= <>
##$BF1= 200.13
##$BF2= 200.13
##$BF3= 200.13
##$BF4= 200.13
##$BF5= 200.13
##$BF6= 200.13
##$BF7= 200.13
##$BF8= 200.13
##$BYTORDA= 1
##$CFDGTYP= 0
##$CFRGTYP= 5
##$CHEMSTR= <none>
##$CNST= (0..31)
1 1 145 1 1 1 1 1 1 1 1 1 1 1 1 1 1 1 1 1 1 1 1 1 1 1 1 1 1 1 1 1 
##$CPDPRG= <>
##$CPDPRG1= <>
##$CPDPRG2= <>
##$CPDPRG3= <>
##$CPDPRG4= <mlev>
##$CPDPRG5= <mlev>
##$CPDPRG6= <mlev>
##$CPDPRG7= <mlev>
##$CPDPRG8= <mlev>
##$CPDPRGB= <>
##$CPDPRGT= <>
##$D= (0..31)
0 1.2 0 0 0 0 0 0 0 0.06 0 0.03 0 0 0 0 0.0002 0 0 0 0 0 0 0 0 0 0 0 0 
0 0 0 
##$DATE= 1671791224
##$DBL= (0..7)
120 120 120 120 120 120 120 120 
##$DBP= (0..7)
150 150 150 150 150 150 150 150 
##$DBP07= 0
##$DBPNAM0= <>
##$DBPNAM1= <>
##$DBPNAM2= <>
##$DBPNAM3= <>
##$DBPNAM4= <>
##$DBPNAM5= <>
##$DBPNAM6= <>
##$DBPNAM7= <>
##$DBPOAL= (0..7)
0.5 0.5 0.5 0.5 0.5 0.5 0.5 0.5 
##$DBPOFFS= (0..7)
0 0 0 0 0 0 0 0 
##$DE= 6
##$DECBNUC= <off>
##$DECIM= 32
##$DECNUC= <off>
##$DECSTAT= 4
##$DIGMOD= 1
##$DIGTYP= 9
##$DL= (0..7)
0 120 120 120 120 120 120 120 
##$DP= (0..7)
150 150 150 150 150 150 150 150 
##$DP07= 0
##$DPNAME0= <>
##$DPNAME1= <>
##$DPNAME2= <>
##$DPNAME3= <>
##$DPNAME4= <>
##$DPNAME5= <>
##$DPNAME6= <>
##$DPNAME7= <>
##$DPOAL= (0..7)
0.5 0.5 0.5 0.5 0.5 0.5 0.5 0.5 
##$DPOFFS= (0..7)
0 0 0 0 0 0 0 0 
##$DQDMODE= 0
##$DR= 18
##$DS= 0
##$DSLIST= <SSSSSSSSSSSSSSS>
$$ [...]
##$SUBNAM2= <"">
##$SUBNAM3= <"">
##$SUBNAM4= <"">
##$SUBNAM5= <"">
##$SUBNAM6= <"">
##$SUBNAM7= <"">
##$SUBNAM8= <"">
##$SUBNAM9= <"">
##$SW= 18.05172834244
##$SWIBOX= (0..15)
0 0 2 0 0 0 0 0 0 0 0 0 0 0 0 0 
##$SW_h= 3612.71676300578
##$TD= 16384
##$TD0= 1
##$TE= 0
##$TE2= 300
##$TE3= 300
##$TEG= 300
##$TL= (0..7)
0 120 120 120 120 120 120 120 
##$TP= (0..7)
150 150 150 150 150 150 150 150 
##$TP07= 0
##$TPNAME0= <>
##$TPNAME1= <>
##$TPNAME2= <>
##$TPNAME3= <>
##$TPNAME4= <>
##$TPNAME5= <>
##$TPNAME6= <>
##$TPNAME7= <>
##$TPOAL= (0..7)
0.5 0.5 0.5 0.5 0.5 0.5 0.5 0.5 
##$TPOFFS= (0..7)
0 0 0 0 0 0 0 0 
##$TUNHIN= 0
##$TUNHOUT= 0
##$TUNXOUT= 0
##$USERA1= <user>
##$USERA2= <user>
##$USERA3= <user>
##$USERA4= <user>
##$USERA5= <user>
##$V9= 5
##$VALIST= <valist>
##$VCLIST= <CCCCCCCCCCCCCCC>
##$VD= 0
##$VDLIST= <DDDDDDDDDDDDDDD>
##$VPLIST= <PPPPPPPPPPPPPPP>
##$VTLIST= <TTTTTTTTTTTTTTT>
##$WBST= 1024
##$WBSW= 4
##$XGAIN= (0..3)
0 0 0 0 
##$XL= 0
##$YL= 0
##$YMAX_a= 108450
##$YMIN_a= -143736
##$ZGOPTNS= <>
##$ZL1= 120
##$ZL2= 120
##$ZL3= 120
##$ZL4= 120
##$ABSF1= 10
##$ABSF2= 0
##$ABSG= 5
##$ABSL= 3
##$ALPHA= 0
##$AQORDER= 0
##$ASSFAC= 0
##$ASSFACI= 0
##$ASSFACX= 0
##$ASSWID= 0
##$AUNMP= <proc_1d>
##$AZFE= 0.1
##$AZFW= 0.1
##$BCFW= 1
##$BC_mod= 2
##$BYTORDP= 1
##$COROFFS= 0
##$CY= 11.3945322036743
##$DATMOD= 1
##$DC= 2
##$DFILT= <>
##$DTYPP= 0
##$F1P= 2.36226072786647
##$F2P= -0.459571619588291
##$FCOR= 0.5
##$FTSIZE= 0
##$FT_mod= 4
##$GAMMA= 1
##$GB= 0.15
##$INTBC= 1
##$INTSCL= 1
##$ISEN= 128
##$LB= 0.24
##$LEV0= 0
##$LPBIN= 0
##$MAXI= 10000
##$MC2= 0
##$MEAN= 0
##$ME_mod= 0
##$MI= 1.114404
##$NCOEF= 0
##$NC_proc= 0
##$NLEV= 6
##$NOISF1= 3.799351
##$NOISF2= 2.8
##$NSP= 1
##$NTH_PI= 0
##$NZP= 0
##$OFFSET= 15.70392
##$PC= 1
##$PHC0= -19266.19
##$PHC1= 9.200731
##$PH_mod= 1
##$PKNL= yes
##$PPARMOD= 0
##$PSCAL= 0
##$PSIGN= 0
##$REVERSE= no
##$SF= 200.130013532006
##$SI= 16384
##$SIGF1= 3
##$SIGF2= 2
##$SINO= 400
##$SIOLD= 16384
##$SREGLST= <1H.CDCl3>
##$SSB= 0
##$STSI= 0
##$STSR= 0
##$SW_p= 3612.71676300578
##$SYMM= 0
##$S_DEV= 0
##$TDeff= 0
##$TDoff= 0
##$TI= <>
##$TILT= no
##$TM1= 0
##$TM2= 0
##$TOPLEV= 0
##$USERP1= <user>
##$USERP2= <user>
##$USERP3= <user>
##$USERP4= <user>
##$USERP5= <user>
##$WDW= 1
##$XDIM= 8192
##$YMAX_p= 0
##$YMIN_p= 0
$$ End of Bruker specific parameters
$$ ---------------------------------
##NTUPLES= NMR FID
##VAR_NAME=  TIME,          FID/REAL,        FID/IMAG
##SYMBOL=    X,             R,               I
##VAR_TYPE=  INDEPENDENT,   DEPENDENT,       DEPENDENT
##VAR_FORM=  AFFN,          ASDF,            ASDF
##VAR_DIM=   8192,          8192,            8192
##UNITS=     SECONDS,       ARBITRARY UNITS, ARBITRARY UNITS
##FACTOR=    0.0002768,     1,               1
##FIRST=     0,             0,               0
##LAST=      2.2672688,     0,               0
##MIN=       0,             -143736,         0
##MAX=       2.2672688,     108450,          0
$$ Real data points
##PAGE= N=1
##DATA TABLE= (X++(R..R)), XYDATA
0 0 0 0 0 0 0 0 0 0 0 0 0 0 8 -8 8 -8 8 -16 16 -24 24 -32 32 -40 48 -56 64 -80 88 -104 112 -130 152 -168
34 -168 192 -216 240 -272 304 -336 376 -416 464 -512 568 -627 692 -764 840 -925 1020 -1124
52 -1124 1237 -1365 1509 -1672 1856 -2067 2313 -2604 2953 -3381 3920 -4623 5586 -6986 9214
67 9214 -13332 23467 -102368 -94120 62109 -113195 -82654 80691 46443 -28172 85225 81947
79 81947 9643 62973 82682 -11142 18668 56996 -23110 -32266 27305 -42719 -64448 29715
91 29715 -8797 -91506 20301 61483 -79026 -59040 69321 -19338 -102897 17600 42576
102 42576 -55269 2910 77270 8889 13445 86016 31958 -3492 59864 26914 -36921 13332
114 13332 5552 -72259 -29866 1587 -84661 -61855 31873 -29330 -65801 50747 55674 -34977
126 -34977 26177 84458 -6060 -16484 57946 8236 -41761 23926 20378 -40491 1855 28302
138 28302 -29310 -11575 30596 -22609 -27990 32106 -9484 -51875 17754 15464 -59225 -10290
150 -10290 42523 -28918 -26586 57328 20651 -25397 45827 50098 -22516 7798 41675 -23039
162 -23039 -29011 17490 -20595 -42803 6578 -9412 -41589 10807 17441 -33597 7289 47520
174 47520 -13831 -14012 51231 10718 -36466 23760 26502 -40926 -9398 33743 -21519 -27463 30063
187 30063 4589 -28452 16622 16688 -24110 3838 18268 -23207 -6266 24122 -18283 -19711 30309
200 30309 400 -31562 23597 26191 -30371 1211 38388 -16362 -23744 28637 292 -35621
212 -35621 9603 14103 -29315 -3818 22803 -12981 -7475 25597 -1159 -10244 25479 5345 -21494
225 -21494 17419 15734 -31194 -3466 25958 -23350 -25246 26019 -1267 -33232 15713 20693 -26515
238 -26515 -149 30481 -11863 -13595 26310 1518 -19388 16802 9435 -20567 8922 16057 -21620
251 -21620 -1573 24146 -17181 -18534 25904 -1777 -32031 14260 17133 -30005 -3407 28326
263 28326 -14699 -16919 28335 4765 -22334 17448 18334 -19669 2663 20642 -15018 -8794 18679
276 18679 -11264 -19206 17945 -894 -27974 11871 16397 -26541 -1937 29429 -12860 -16908 29387
289 29387 6149 -25152 16193 20593 -22897 -1903 24570 -13325 -15600 19508 -3293 -21739
301 -21739 12029 4789 -23682 5551 14846 -21719 -4060 25287 -11005 -16701 26422 6898 -23736
314 -23736 15182 22090 -21120 -2219 27201 -10893 -18097 20576 1555 -25018 7885 10330 -22261
327 -22261 -1990 15438 -15981 -8779 20043 -6749 -16156 20835 7485 -21168 12718 21457 -19021
340 -19021 -3031 27212 -9103 -18695 21432 4455 -26005 7805 15232 -22521 -6395 19078
352 19078 -12254 -15046 17594 -740 -17686 14444 10149 -18346 7641 20149 -15493 -5226
364 -5226 24277 -6208 -18000 19177 6279 -24280 6550 16617 -21207 -8602 20384 -9288
376 -9288 -18259 16354 4592 -18964 8817 13922 -14901 1161 18794 -9392 -7260 19862 -1566
389 -1566 -15810 14822 7692 -20823 3523 15493 -18206 -9654 18567 -7588 -18946 14847 6165
402 6165 -20263 5643 16348 -13580 -3580 19079 -4427 -9346 16690 2733 -14064 10953
414 10953 9219 -16809 1381 14555 -14008 -9451 16106 -5563 -17647 12329 5884 -19744 3455
427 3455 15867 -13289 -6330 18388 -2409 -12081 13864 6104 -13328 6975 11080 -12427 -558
440 -558 13930 -9330 -8951 13978 -2794 -15799 9755 6231 -17297 2045 14147 -12528 -6876
453 -6876 17130 -2851 -13711 12951 7424 -14469 4454 12971 -10595 -3354 13629 -5926 -9599
466 -9599 12130 74 -14152 7655 7336 -14533 550 12967 -10261 -7283 14809 -2287 -13360
479 -13360 11298 7371 -14419 3102 13510 -9833 -5361 13821 -2966 -10369 10216 3086 -12377
492 -12377 5119 8122 -11730 -1239 11532 -7964 -7775 11953 -1244 -12257 8725 6083 -13285
505 -13285 2372 12341 -9764 -5663 14064 -1950 -11089 10118 5641 -11699 3873 9890 -9512
518 -9512 -2335 11751 -5523 -8258 10532 86 -12191 6464 5851 -13056 346 10805 -9805
531 -9805 -6684 12979 -2140 -11858 10014 6709 -12150 3432 12337 -8000 -3476 12979 -2534
544 -2534 -8291 10177 2505 -11523 4928 6850 -11869 -1738 9862 -8659 -8131 10424 -2351
557 -2351 -12346 8139 6055 -12676 2091 12624 -7529 -4610 13753 -248 -8868 10133 5477
570 5477 -10460 4039 9198 -9710 -3295 10201 -6216 -9306 8729 -717 -12736 5305 5991
583 5991 -12189 -83 11642 -7225 -6052 13107 639 -9892 9368 7732 -10037 2506 10866
596 10866 -7545 -4407 10536 -3618 -9857 7547 1424 -12239 2757 6451 -10581 -2277 10130
609 10130 -5827 -6711 11169 1239 -9741 8072 8293 -9402 1412 11804 -6002 -5391 10718
622 10718 -1455 -10416 6559 3433 -12118 764 7443 -9635 -4534 9448 -4301 -8083 9330
635 9330 2415 -9493 6454 8672 -8613 800 12310 -4884 -5993 11136 596 -10525 5840
648 5840 5248 -11175 -710 7996 -8308 -6306 8498 -2779 -9374 6840 3511 -9286 3460
661 3460 8462 -6926 -858 11127 -2935 -6039 10176 2533 -9547 4917 6966 -9479 -1798
674 -1798 8739 -6069 -7300 7784 -849 -9916 4793 4516 -9078 904 8363 -5905 -3087 9638
688 9638 -1355 -6366 8101 3258 -8551 3917 7318 -8004 -2193 8946 -4284 -7292 7205
701 7205 779 -9111 3719 5131 -8029 -333 8096 -4606 -4301 8359 -15 -6699 6017 3921
715 3921 -7508 2128 6869 -6617 -2900 7980 -3204 -7110 6416 1532 -8700 2842 5676
728 5676 -7221 -1215 7971 -3619 -4734 7781 868 -6852 5170 4833 -6890 861 6904 -5131
742 -5131 -3401 7041 -2156 -6739 5509 1895 -8268 1977 5742 -6718 -2167 7530 -2927 -5257
756 -5257 6919 1464 -6886 4127 5486 -6314 -212 7205 -3740 -3987 6535 -612 -6424 4526
770 4526 2709 -7279 1176 5694 -5737 -2674 6996 -2207 -5626 5915 2018 -6816 2896 5370 -5806
785 -5806 -1098 6812 -3094 -4571 5980 396 -6312 3457 3439 -6134 405 5486 -4488 -2704 6530
800 6530 -1445 -5498 5321 2588 -6452 2225 5495 -5182 -1538 6566 -2652 -4893 5555 880
814 880 -6565 2746 3881 -6107 -515 5449 -3881 -3273 5936 -742 -5378 4729 2978 -5926 1786
829 1786 5788 -4596 -1848 6552 -1732 -4947 5199 1550 -6311 2292 4253 -5691 -1272 5771 -3322
844 -3322 -4314 5395 195 -5810 3446 3286 -5727 756 5789 -4130 -2697 6365 -934 -5225 4711 2418
860 2418 -6016 1802 4967 -5084 -1786 6173 -2319 -4814 5217 1185 -5993 2681 4068 -5391 -531
875 -531 5681 -3225 -3463 5557 -283 -5433 3738 2835 -5805 743 5130 -4220 -2530 5697 -1358 -4806
891 -4806 4570 2000 -5645 2037 4728 -4574 -1356 5737 -2039 -3890 4794 662 -5226 2743 3211
906 3211 -5334 -155 4994 -3632 -3196 5122 -836 -5055 3845 2390 -5513 1280 5007 -4156 -1859
921 -1859 5727 -1320 -4171 4552 1592 -5151 2132 3830 -4606 -751 5009 -2851 -3460 4731 -31
936 -31 -5241 3068 2874 -5156 230 4817 -3424 -2496 5158 -762 -4561 3828 2249 -5144 1188 4325
952 4325 -3770 -1660 4837 -1771 -3762 4258 892 -4998 2240 3537 -4451 -544 4934 -2467 -2951
967 -2951 4701 48 -4548 3096 2691 -4833 392 4299 -3456 -2369 4551 -1003 -4222 3369 1557
982 1557 -4677 1286 3606 -3782 -1062 4661 -1741 -3224 4163 952 -4208 2354 3017 -3885 15
997 15 4261 -2673 -2519 4249 -411 -4279 2740 1990 -4349 470 3538 -3247 -1681 4147 -1278 -3397
1013 -3397 3456 1202 -3995 1724 3126 -3452 -394 4125 -2043 -2443 3964 93 -3920 2529 2338
1028 2338 -4064 304 3731 -2815 -2091 3857 -732 -3548 2846 1351 -3993 1139 3118 -3311 -1071
1043 -1071 3911 -1492 -2870 3433 605 -3730 2075 2632 -3644 -98 3928 -2134 -2355 3813 44
1058 44 -3529 2431 1954 -3622 529 3221 -2775 -1585 3642 -1026 -3140 2873 952 -3742 1317 2710
1074 2710 -3250 -722 3646 -1725 -2458 3423 390 -3495 2034 2287 -3292 82 3423 -2170 -1749 3401
1090 3401 -486 -3109 2640 1428 -3590 879 2943 -2853 -1153 3459 -1292 -2612 2941 482 -3447
1105 -3447 1643 2273 -3338 -299 3226 -2020 -2050 3224 -171 -3144 2297 1688 -3287 614 3081 -2316
1121 -2316 -1211 3484 -778 -2668 2742 1048 -3292 1272 2478 -2871 -671 3268 -1743 -2461 2978
1136 2978 136 -3510 1692 1963 -3173 -74 3035 -2021 -1664 3337 -315 -2877 2464 1669 -3064 819
1152 819 2914 -2344 -954 3271 -1097 -2525 2807 744 -3417 1216 2314 -3025 -683 3065 -1634
1167 -1634 -2191 2867 121 -3079 1801 1865 -2991 190 2931 -1947 -1416 3140 -373 -2670 2327 1319
1183 1319 -3049 839 2531 -2512 -990 3037 -1051 -2460 2455 677 -2995 1330 1993 -2751 -240
1198 -240 2834 -1681 -1864 2833 -85 -2751 1783 1461 -2923 389 2516 -2152 -1132 2976 -660 -2402
1214 -2402 2319 974 -2745 999 2264 -2346 -505 2872 -1176 -1978 2570 306 -2807 1415 1749
1229 1749 -2714 -158 2604 -1779 -1707 2572 -317 -2598 1812 1202 -2759 542 2427 -2029 -969 2829
1245 2829 -698 -2085 2376 798 -2600 1232 2115 -2403 -386 2770 -1258 -1872 2371 144 -2584
1260 -2584 1414 1396 -2579 43 2357 -1802 -1396 2563 -423 -2285 1914 1096 -2546 691 2199 -2013
1276 -2013 -828 2568 -809 -1987 2160 599 -2466 1112 1785 -2154 -245 2392 -1264 -1425 2241
1291 2241 -89 -2306 1456 1226 -2399 267 2093 -1702 -1109 2228 -599 -1984 1758 717 -2352
1306 -2352 740 1760 -1890 -507 2268 -875 -1460 2134 309 -2083 1328 1451 -2071 94 2109
1321 2109 -1436 -1227 2134 -377 -2127 1491 819 -2312 423 1773 -1821 -780 2183 -821 -1774 1933
1337 1933 511 -2184 1022 1644 -1853 -136 2208 -1087 -1320 2128 105 -2035 1323 1184 -2106 170
1353 170 1872 -1523 -943 2011 -532 -1882 1523 736 -2213 546 1666 -1707 -550 2063 -782 -1594
1369 -1594 1816 373 -1960 1045 1359 -1832 -90 1979 -1146 -1127 1988 -85 -1800 1372 956 -1964
1385 -1964 376 1786 -1524 -813 1979 -522 -1638 1488 461 -1963 685 1328 -1694 -379 1876
1400 1876 -1011 -1296 1760 118 -1790 1110 1130 -1769 181 1830 -1246 -840 1988 -234 -1593 1432
1416 1432 718 -1874 515 1534 -1562 -523 1732 -806 -1501 1563 224 -1915 863 1252 -1785 -139
1432 -139 1765 -1056 -1091 1835 -11 -1688 1318 1040 -1772 279 1697 -1276 -779 1846 -428 -1505
1448 -1505 1476 487 -1881 587 1426 -1613 -519 1821 -782 -1339 1563 238 -1832 869 1200 -1715
1464 -1715 -102 1730 -1009 -1087 1732 -101 -1613 1209 903 -1697 350 1531 -1213 -657 1798 -458
1480 -458 -1408 1413 531 -1702 640 1251 -1546 -343 1616 -848 -1159 1417 -1 -1650 905 951 -1573
1497 -1573 9 1549 -1044 -793 1601 -199 -1350 1234 768 -1479 447 1375 -1169 -433 1573 -543
1513 -543 -1211 1399 260 -1608 679 1008 -1488 -212 1460 -896 -1037 1408 -32 -1491 949 781
1529 781 -1490 207 1367 -1055 -600 1580 -269 -1272 1247 540 -1518 566 1193 -1290 -344 1603
1545 1603 -648 -1162 1383 255 -1520 678 980 -1421 -107 1321 -951 -890 1382 -123 -1379 1023
1561 1023 670 -1520 252 1267 -1048 -561 1497 -368 -1083 1234 461 -1401 549 1113 -1212 -247
1577 -247 1345 -664 -933 1236 124 -1292 714 741 -1391 -33 1218 -902 -765 1285 -192 -1162
1593 -1162 892 479 -1225 364 1102 -939 -283 1320 -427 -881 1190 300 -1157 677 885 -1174
1609 -1174 -56 1237 -688 -745 1178 -69 -1214 759 536 -1244 151 1062 -936 -460 1221 -371
1625 -371 -974 968 344 -1212 492 1035 -1009 -213 1230 -450 -763 1186 129 -1126 706 772 -1165
1642 -1165 -3 1176 -727 -647 1108 -164 -1145 790 479 -1274 201 1030 -960 -460 1153 -370
1658 -370 -984 949 352 -1156 458 903 -985 -152 1175 -588 -718 1151 91 -1055 736 643 -1059
1675 -1059 64 1086 -776 -549 1082 -232 -1076 765 431 -1133 245 867 -891 -348 1052 -495
1691 -495 -775 949 193 -1051 530 737 -941 -53 1026 -566 -535 1055 -44 -927 704 536 -1001
1708 -1001 136 873 -798 -396 977 -344 -899 803 207 -1133 325 729 -980 -227 1061 -510
1724 -510 -749 941 107 -941 625 622 -929 87 984 -617 -480 1050 -63 -866 719 448 -1021
1741 -1021 192 855 -866 -366 1007 -357 -802 798 223 -1039 378 683 -983 -147 930 -503
1757 -503 -649 904 96 -907 668 572 -922 117 960 -654 -408 974 -136 -833 721 341 -909
1774 -909 248 761 -784 -318 859 -386 -735 718 88 -937 416 557 -871 -71 903 -446 -496
1791 -496 827 30 -752 575 438 -812 156 794 -519 -263 900 -232 -659 691 231 -869 259
1808 259 657 -775 -233 824 -452 -561 719 -14 -878 410 548 -773 43 771 -542 -388 858
1825 858 -98 -735 669 435 -827 173 806 -668 -243 772 -322 -642 679 169 -837 345 569
1842 569 -802 -138 696 -463 -491 714 -44 -775 497 442 -753 52 732 -513 -329 778 -76 -654
1860 -654 677 310 -699 206 630 -602 -175 798 -298 -599 623 136 -701 281 501 -708 -65 648
1878 648 -440 -502 670 -34 -741 431 358 -719 91 629 -490 -290 744 -147 -582 658 269 -668
1896 -668 269 558 -583 -117 742 -321 -451 611 58 -684 304 345 -673 2 581 -508 -363 596 -161
1915 -161 -643 493 223 -736 242 575 -521 -133 744 -234 -480 651 138 -571 374 453 -579 -27 642
1934 642 -402 -415 604 -14 -665 454 268 -723 80 564 -531 -358 641 -178 -598 446 210 -603 200
1953 200 472 -525 -154 659 -198 -469 575 130 -581 360 409 -574 -51 554 -369 -348 574 -18 -621 374
1973 374 255 -637 21 525 -459 -248 496 -201 -445 475 145 -509 280 487 -455 -48 643 -284 -307 474
1993 474 51 -507 339 348 -547 -12 508 -384 -233 539 -130 -488 445 171 -596 116 425 -492 -155 558 -227
2014 -227 -430 542 130 -566 280 415 -430 -14 512 -316 -333 565 -7 -512 351 293 -540 97 494 -383 -270
2035 -270 528 -161 -505 400 121 -562 170 360 -527 -134 484 -251 -410 441 32 -540 298 321 -478 53
2055 53 569 -325 -251 512 -38 -415 368 258 -521 46 436 -448 -199 485 -186 -444 352 98 -468 215 327
2076 327 -411 -79 494 -223 -300 432 97 -431 284 268 -414 44 475 -276 -174 494 -70 -402 363 231 -443
2097 -443 135 385 -396 -115 434 -218 -418 361 -4 -432 218 285 -426 -30 410 -216 -210 387 -20 -366 330
2118 330 207 -467 110 406 -330 -121 446 -91 -382 361 125 -433 156 303 -434 -138 437 -183 -296 372
2138 372 13 -447 227 301 -483 -53 438 -249 -261 407 -20 -398 359 260 -409 81 387 -313 -111 375 -137
2159 -137 -366 353 96 -458 154 306 -407 -117 325 -218 -273 390 13 -409 201 224 -392 34 299 -256 -169
2180 -169 417 -17 -345 343 170 -382 117 306 -325 -20 386 -156 -299 308 69 -368 127 284 -347 -40
2200 -40 331 -288 -201 355 -60 -319 189 141 -380 130 327 -240 -110 393 -82 -304 340 65 -322 205 264
2221 264 -307 -45 333 -179 -310 310 -32 -390 177 207 -369 32 272 -301 -205 322 -80 -379 262 138 -353
2242 -353 117 271 -294 -103 343 -163 -258 259 52 -316 169 300 -322 -35 352 -217 -198 331 -84 -295 126
2263 126 168 -396 -2 224 -255 -145 289 -84 -309 233 126 -320 120 270 -298 -51 342 -125 -223 275 111
2284 111 -306 179 177 -301 -1 253 -123 -232 214 38 -252 199 101 -293 28 234 -254 -71 301 -125 -233
2305 -233 264 52 -327 63 219 -259 -50 337 -130 -163 278 -4 -251 202 143 -256 70 282 -195 -155 316
2326 316 -58 -264 229 81 -317 20 223 -288 -134 277 -73 -211 235 75 -246 161 212 -263 -42 307
2346 307 -140 -185 252 38 -235 187 154 -246 25 255 -182 -117 247 -75 -242 219 91 -274 64 147 -286
2367 -286 -73 239 -76 -227 248 75 -206 134 210 -229 17 279 -112 -74 274 1 -224 169 133 -314 23
2388 23 205 -204 -155 208 -112 -230 219 36 -287 61 97 -224 -13 208 -137 -175 267 53 -186 153 122 -244
2410 -244 34 256 -163 -99 277 -53 -206 164 154 -256 47 160 -246 -91 198 -122 -231 198 -20 -238 51
2431 51 93 -242 1 216 -114 -140 206 -8 -208 119 140 -217 35 155 -107 -54 256 -83 -199 231 71 -236
2453 -236 57 133 -176 -76 175 -116 -163 168 -20 -218 110 86 -219 10 177 -124 -106 234 -15 -152 138
2474 138 63 -197 73 164 -167 -31 244 27 -153 173 33 -201 106 140 -193 -31 155 -118 -120 135 -10 -176
2496 -176 65 94 -153 19 206 -110 -85 206 -52 -179 128 44 -205 29 173 -155 -29 165 -142 -142 172 0
2518 0 -214 54 80 -214 -14 145 -109 -176 193 -18 -188 128 135 -194 27 159 -151 -38 179 -54 -180 177
2540 177 63 -167 48 176 -207 -17 230 -66 -157 182 4 -208 44 128 -189 4 167 -143 -106 134 -29
2561 -29 -162 155 45 -201 37 141 -110 -47 164 -45 -105 137 57 -171 48 112 -198 -60 149 -97 -151 161
2583 161 -9 -141 89 5 -140 37 121 -145 -79 113 -32 -145 98 71 -124 94 109 -140 -41 184 -45 -112
2605 -112 164 28 -133 98 78 -157 76 136 -81 -114 136 -62 -161 104 57 -201 -6 102 -187 -28 121 -78
2627 -78 -135 173 20 -117 98 113 -114 -33 136 -49 -107 161 8 -97 129 29 -176 52 115 -111 -66 100
2649 100 -54 -210 131 21 -203 27 177 -176 -102 148 -43 -90 112 63 -140 99 139 -147 38 110 -73 -53
2671 -53 174 -13 -103 104 105 -167 22 159 -94 -94 114 -32 -128 119 27 -164 58 62 -105 -44 129 -18 -182 153
2695 153 -17 -91 46 93 -152 35 134 -14 -27 185 -37 -82 63 82 -116 6 128 -81 -69 109 -84 -138 99
2718 99 12 -118 39 69 -93 -34 124 -72 -65 191 -4 -156 95 117 -103 32 144 -62 -34 117 -29 -140 116
2741 116 -7 -152 34 160 -88 -100 168 -71 -75 47 -30 -178 92 96 -101 32 127 -65 -22 164 -5 -111 80
2764 80 53 -74 53 85 -31 -39 111 -35 -102 45 38 -117 -8 38 -73 -50 95 -126 -85 136 40 -87 66 61 -146
2789 -146 11 138 -70 -63 171 -9 -123 127 90 -100 35 75 -81 -27 127 -61 -96 86 51 -123 51 103 -175
2812 -175 6 73 -87 -78 56 -2 -146 77 73 -135 -3 141 -104 -47 124 -77 -11 141 47 -110 54 84 -96
2835 -96 -33 145 -30 -97 85 37 -124 33 42 -126 0 93 -66 -80 104 -12 -112 102 66 -161 50 105 -108
2858 -108 -14 126 -21 -113 80 -24 -113 43 99 -101 -31 100 -26 -94 99 -26 -120 44 22 -91 18 39 -112
2881 -112 14 108 -75 -83 84 38 -69 52 124 -108 -30 96 -52 -38 100 -10 -74 62 32 -168 13 40 -86
2904 -86 -119 113 17 -76 18 -6 -94 34 58 -113 -44 90 -39 -108 53 43 -12 41 96 -64 37 122 -60 -46 146
2929 146 -11 -82 78 49 -55 -20 63 -56 -50 89 -36 -68 64 -25 -127 37 21 -94 -27 100 16 -48 81 46
2953 46 -71 27 123 -168 -2 126 -59 -52 109 80 -63 29 58 -29 -9 62 -74 -11 78 -72 -42 50 62 -98 17
2978 17 56 -91 12 63 -62 -42 85 -40 -89 71 38 -45 12 66 -29 -21 102 27 -108 76 3 -39 0 85 -45 -99
3004 -99 35 -39 -94 85 18 -40 24 13 -90 -7 83 -63 -55 62 31 -58 103 72 -71 -9 66 -90 -34 82 -28 -51
3030 -51 70 23 -113 -33 61 -103 -35 77 -9 -27 82 23 -125 -11 50 -111 39 49 -50 -66 54 -44 -76 77 32
3055 32 -85 -22 110 -17 -14 58 -44 -114 26 -12 -87 41 50 -71 -25 66 -66 -56 63 9 -75 17 20 -43 -4 44 -56
3082 -56 24 128 3 -54 66 79 -37 3 80 9 13 101 -25 -18 92 50 -41 43 -12 -119 -2 -81 -158 -42 72 -63
3108 -63 -60 83 45 -84 -11 49 -122 26 81 -17 -73 95 26 -62 21 53 11 -2 129 -64 -39 77 -53 -57 71 5
3134 5 -72 -25 64 -42 0 105 -86 -63 20 3 -72 48 97 -55 -27 68 -36 -57 -12 30 -40 -7 34 -67 -51 58 -14
3161 -14 -2 77 4 -40 7 48 -65 7 51 -37 -22 66 10 -78 -17 4 -88 20 -3 -69 11 91 -69 -43 71 18 -80 58
3189 58 34 -74 2 82 -59 -33 66 11 -49 47 50 -83 -17 61 -45 -72 100 -25 -63 60 0 -77 7 62 -61 43
3215 43 80 -38 8 78 -5 -97 30 42 -77 35 46 -27 16 81 -57 -90 -33 85 -58 20 128 -76 -16 30 -45 -80
3241 -80 65 -15 -44 57 33 -55 20 115 -37 19 51 2 -20 12 55 -23 35 67 -11 -71 55 -46 -44 26 12 -69 -9 51
3269 51 -21 -33 69 -47 -59 15 1 -21 49 -7 -53 -16 30 -27 1 63 -4 -7 22 41 -44 16 53 -42 -38 73 -9 -44 60
3298 60 -8 -64 35 26 -25 -19 60 -22 -61 93 -16 -55 41 75 2 21 74 -20 -14 133 19 -32 -41 49 -50 -11 14 -103 -30 6
3328 6 -14 -39 72 13 -60 -7 -7 -39 -38 94 22 -36 35 6 -21 88 27 -27 33 57 -45 -26 47 -55 -26 72 -12 -27 38
3357 38 54 -70 -42 31 -26 -25 4 15 -39 32 67 -88 4 -2 -25 -21 -3 -38 13 27 41 -26 -12 75 16 -31 90 -10 -49 51
3387 51 -3 -36 27 70 -74 -18 26 -61 -76 9 -11 -77 -5 6 -101 -20 20 -16 -33 88 -4 3 3 25 -61 87 57 -47 -25
3416 -25 37 -14 -54 11 20 -81 19 36 -14 13 82 8 -27 32 -13 -28 57 30 -75 38 13 -50 -23 30 -41 -40 87 40 -28
3445 -28 15 25 -29 -11 42 -3 -80 66 -40 -42 19 43 -34 -49 39 -75 -34 25 12 -114 -15 33 -29 -10 13 -56 -5 65 27
3474 27 2 86 7 -8 33 36 -62 36 8 -15 -18 41 19 -89 66 -31 -75 -28 -16 -54 -30 59 -40 -19 -2 -17 -25 58 65 -47 -11
3505 -11 37 42 -13 75 37 21 40 80 -85 -71 57 17 -57 68 -32 -27 25 10 -46 36 93 -32 -17 14 -10 -67 -15 8 -22
3534 -22 3 19 -23 -32 3 -24 -26 16 23 -48 -28 -24 -29 13 3 -12 -23 40 51 -22 6 1 -48 0 -13 -53 -67 39 -23 -40 12 52 16
3567 16 48 33 16 -34 61 -1 3 26 29 -39 40 13 -48 -17 55 -37 -5 -10 -26 -80 7 -18 -58 6 57 -33 8 80 7 -19 47 -7
3599 -7 -28 33 86 10 35 109 -17 -10 61 -23 -36 37 -25 -48 61 49 -22 17 -29 -11 -46 7 -31 13 -7 -7 -43 -23 13 -20 -50
3630 -50 1 -7 -54 7 20 -39 5 26 -25 29 42 26 -5 31 55 -4 26 57 -36 -8 68 -18 -51 37 -5 -39 42 26 0 25 -19
3661 -19 -32 -19 -6 -25 0 28 60 -20 4 53 -19 -38 27 -14 -30 31 -37 -54 -23 -2 -39 -20 63 -54 -26 -12 -13 -68 6 70
3691 70 -5 55 14 17 1 18 -29 -52 54 17 -23 -11 48 -69 -8 92 -1 -67 29 -3 3 -51 51 -38 -32 50 -15 -27 20 -18
3721 -18 -27 60 4 -56 -5 54 -17 -45 25 -21 13 47 60 -35 -7 66 -65 2 74 16 -31 35 -6 29 8 69 -18 4 15 -27
3751 -27 -36 27 -21 -38 -6 3 -61 -45 29 0 -34 78 -16 -42 11 53 -15 -28 -23 -30 13 16 -59 -10 86 -25 -45 -57 8 -51 5 -13
3783 -13 -63 -13 34 27 1 50 26 -38 -52 6 -83 -20 -8 24 -17 40 59 -22 0 15 -30 39 28 -15 50 60 -35 -55 25 -23 -66
3814 -66 -21 41 -40 -44 53 -4 -25 36 -20 -37 37 44 -30 -9 48 32 11 34 29 -58 6 -21 -14 19 10 -2 46 42 -25 -38 10 -3 -6 -4
3848 -4 50 18 -48 -20 21 -55 -11 3 -45 25 20 -13 65 0 12 5 7 10 -46 -29 55 -9 4 48 -11 -18 25 27 -18 -14 -54 7 -21 -14 -37
3883 -37 -19 -6 13 -35 -2 29 -34 19 20 0 61 57 -18 -52 -3 -31 -18 -3 25 9 -30 -1 -13 -5 26 6 10 -37 -14 -33 -27 20 -49
3916 -49 -20 12 -49 -33 25 32 8 -31 16 -41 9 2 -11 -42 30 -10 -7 15 14 20 -22 37 -61 -33 64 11 -28 85 -21 9 9 39
3948 39 -44 -1 -5 -16 14 12 12 -14 -5 -5 14 -3 -16 -8 -45 3 -24 60 3 -62 32 -15 60 -18 28 82 -28 -57 22 9 -17 33 -29
3981 -29 -96 -12 53 -41 -43 14 -37 -49 49 0 -22 9 28 -46 27 -2 -70 -22 8 34 31 18 -16 -35 -32 42 -73 -58 11 -3 3 -21
4013 -21 21 -38 37 14 62 -1 49 -3 -58 10 -42 -20 -11 70 12 30 62 -28 10 1 19 34 2 -10 16 -36 -25 -31 -30 16 -89 20
4045 20 19 5 -40 20 -6 -30 34 28 22 -14 33 14 -42 18 10 0 9 16 18 -13 -29 22 -26 11 21 0 61 44 -4 -21 61 3 19 24
4079 24 26 -39 1 1 -33 -42 24 21 -17 33 -5 0 37 -39 -9 -7 -20 28 -16 -12 4 18 -3 21 -40 5 15 -15 -29 13 -25 -58 26 7
4113 7 9 -26 33 22 -21 -6 -29 -20 -9 23 -43 -37 -3 -45 -26 6 -12 -15 -18 81 -85 -56 7 -62 -61 -16 -87 -49 42 -22 -33 -39 -9 -13
4147 -13 11 20 10 20 -30 -63 0 39 29 -37 29 22 -3 3 41 10 0 -4 9 -8 10 -30 18 11 21 -21 26 9 -25 -54 -41 -36 17
4180 17 -50 8 28 47 20 -11 -18 13 42 -7 65 -45 -1 -15 -23 15 -46 11 0 5 19 -30 -37 -20 53 16 -47 5 9 30 -26 35
4212 35 -72 1 -1 -2 35 -2 -37 16 23 54 1 22 23 -18 23 47 5 -20 -27 -5 7 -25 66 -46 -32 11 -27 -3 -19 -26 -40 3
4244 3 64 24 68 25 15 22 -16 45 11 11 -2 -47 -1 -16 -13 -1 -12 28 -30 29 33 -28 14 -67 -37 -8 -25 5 -6 34 -9 -5 20
4277 20 42 24 9 8 10 13 43 -17 -7 -21 3 18 -3 35 -37 -14 14 41 -19 39 40 -15 50 -19 -3 -45 -7 -69 -20 -59 -46 -11
4309 -11 23 -5 9 5 -14 -23 44 -41 15 41 38 31 -9 1 -21 -29 30 8 4 43 0 -5 10 -45 9 13 -1 -24 -64 4 -18 30 -38 -4
4343 -4 4 -13 -38 -30 -40 22 -8 -39 -30 9 27 32 -26 -64 -14 -23 -10 -29 -32 6 -23 -33 65 -36 -32 56 35 1 1 -40 -12 -32 8 -36
4377 -36 -15 4 12 1 34 9 1 -43 -42 -35 0 49 -6 -70 5 20 -12 21 -29 -45 -15 3 -48 -43 44 7 -21 11 -27 8 -14 -12 62
4410 62 -12 -25 17 -7 -11 57 13 1 58 -24 -77 34 8 11 2 4 -49 -43 -15 5 17 -38 -19 -20 12 -11 13 0 42 -31 -37 14 34
4443 34 -26 27 36 -4 -1 35 21 32 58 -25 28 45 10 39 -33 -20 -18 25 48 9 -8 15 18 -53 -13 -52 -38 1 -8 -18 -34 -11 -11
4476 -11 -19 -105 18 -17 -43 -16 0 23 -20 -21 -6 -27 -21 -3 -23 -22 -15 23 -37 -87 26 34 6 -3 6 -25 -89 -34 -62 28 -1 47 -21
4509 -21 9 21 0 -38 27 27 0 -16 2 -15 48 15 -54 -27 -38 -14 41 52 1 -1 -59 43 2 9 -20 42 -18 -17 -7 18 24 -1
4541 -1 -54 -3 -28 -9 -25 70 52 -25 -4 -27 -8 -19 -36 -4 9 -38 29 32 11 32 -22 13 -35 -72 6 5 1 48 2 -60 -28 -20 11
4574 11 -16 -1 -28 3 -13 30 -18 -14 2 17 1 -13 0 33 -42 -36 -4 9 3 36 -8 10 -13 1 -22 37 18 -15 -5 10 -5 -63
4606 -63 34 -19 -32 -34 29 -9 66 -24 4 -6 62 56 -32 28 -50 18 9 -11 -21 16 -5 4 -51 10 -9 -3 22 25 11 6 31 -14 -24 66
4640 66 -50 20 75 -26 -46 -35 10 -8 -40 38 15 -9 -71 -4 -30 24 51 -20 59 -41 -12 37 3 -13 6 34 11 -15 -29
4669 -29 -25 -19 -3 5 -20 -24 -19 -8 -53 27 -40 34 -10 -22 -24 57 -30 -44 -8 -7 -17 -52 3 -13 -42 12 -11 -64 -10 -30 -24 17 -45 -13
4703 -13 -31 22 24 4 18 -5 16 0 72 29 -52 -9 1 -25 -26 19 30 7 -14 -34 -34 -6 -18 4 -35 -41 57 -32 -25 9 -22 -38 -9
4736 -9 -15 12 -8 6 41 -22 2 -17 10 -62 -24 42 -37 -30 3 -21 7 -20 12 -1 -8 -9 28 -4 35 -10 -14 -7 -30 1 -38 -47 -7 32
4770 32 -32 37 5 37 -5 -44 -25 35 -6 -52 -28 7 -34 48 2 22 -45 25 -12 9 -8 -83 26 34 -18 42 18 44 26 -2
4800 -2 -15 -12 -9 24 44 1 11 -11 22 25 57 27 6 -16 -28 -15 46 16 28 31 29 10 25 36 40 -15 -20 45 -3 43 34 38 10 63 29
4835 29 -45 39 31 14 34 3 18 -28 -11 39 -38 43 7 3 35 15 -4 -72 49 -4 -18 25 -1 -4 -10 -18 34 17 2 22 108 32
4867 32 0 17 34 17 39 -22 4 19 47 -7 26 12 3 1 -1 70 -3 -20 53 14 -42 -43 13 83 -8 17 39 -40 -24 -14 11 -27
4899 -27 49 53 -54 28 -5 0 -33 -23 30 -22 20 10 3 -12 -23 -3 5 -54 -1 -1 7 31 11 -16 15 -41 44 5 40 3 -4 -50 2
4932 2 -16 57 -8 49 -33 -35 49 -30 -19 6 -26 -25 37 3 -2 -68 20 12 41 31 1 -13 2 -1 11 3 34 -13 13 9 6 -13 0 -27 34
4967 34 39 -16 14 2 26 -1 17 17 13 27 47 10 -13 -27 -22 17 -6 2 -10 -32 -26 41 -51 21 -22 -33 -5 2 1 -49 12 -8 38 35 80
5002 80 15 7 15 -21 4 16 9 -12 48 -64 -14 22 -4 29 -34 17 -7 -10 16 -33 -12 -5 36 19 -34 10 30 -8 11 13 -26 -40 -44
5035 -44 8 -34 18 6 -29 -25 -52 15 -27 -19 34 25 21 -17 -43 -9 33 27 27 38 29 48 23 -40 -40 -27 20 0 -30 -26 -23 5 10 13 15 9 9 4
5073 4 -54 22 20 28 -21 24 1 0 33 58 20 3 4 2 -15 27 2 10 -2 -11 39 43 13 -2 60 -59 1 -2 29 47 -30 -10 -32 77
5107 77 24 25 15 -7 -58 -6 -15 -13 -5 9 4 -4 25 27 26 48 6 24 -5 15 21 -28 41 27 -5 6 3 48 10 -52 9 31 2 46 -17
5142 -17 -12 -10 -2 37 34 -7 -6 80 -6 -62 -10 -7 -36 -31 -40 48 -14 -10 37 -13 31 -15 -28 28 14 9 -28 -21 1 -11 5 55 -3 29 -73
5177 -73 11 -66 10 17 2 -58 22 25 -7 33 -18 -43 6 -4 14 44 -10 -17 -21 -16 4 65 -21 -16 -53 -62 -20 -29 -27 -23 -31 12 21 -26 -20 64 -10
5214 -10 12 35 -17 3 32 27 5 14 49 -4 5 -22 15 -34 -40 14 -39 0 2 16 14 0 5 -4 -35 32 -12 -22 17 -10 -19 14 0 25 15
5249 15 -20 -25 8 19 4 20 9 -40 24 11 -18 -13 21 -4 16 83 25 13 -6 -5 -48 -5 -71 21 34 -7 -27 -12 1 11 0 -16
5281 -16 60 -23 -27 31 55 -14 -29 7 24 47 2 -13 -49 -26 -9 -65 24 -11 9 8 24 -16 40 -32 -4 -4 -58 15 -8 23 58 -27
5313 -27 17 51 18 -18 23 -10 36 3 -6 -17 11 -15 68 23 -19 -8 3 -16 5 28 21 -15 -5 34 -6 -4 -28 -23 -14 -14 -5 55 26 7
5347 7 -32 47 50 -22 -14 18 39 11 22 -16 29 18 13 -22 24 -29 -2 -31 -16 -69 -19 47 -17 -11 -8 -57 6 -13 28 9 37 24 -26
5380 -26 5 -10 26 -42 14 7 3 57 25 -21 16 8 8 -33 6 52 30 -26 7 -15 -51 -64 -3 -25 9 13 -10 -6 -15 9 58 14 -7 5
5414 5 7 7 -12 -22 20 -1 12 54 -1 49 7 -49 -2 31 5 -2 -32 -18 23 28 8 -3 24 24 33 15 -10 -32 -19 4 -23 -14 32 -26
5448 -26 48 -10 -55 -55 -22 32 -24 11 -6 -19 -50 25 4 -66 26 44 6 -8 -18 -35 -22 -37 37 -12 50 3 18 35 -31 47 -30
5479 -30 5 -15 -15 6 2 63 1 27 19 69 -14 -9 0 -26 -11 18 20 -20 -22 -55 -28 22 24 17 -1 42 -43 29 -25 -29 0 12 -63 -2 11
5514 11 -13 20 8 45 5 -19 -39 19 11 57 -21 26 13 -13 21 22 17 2 -11 -11 35 -15 32 -18 17 13 -46 -6 -20 1 43 36 45 32
5548 32 -3 -7 45 0 -16 17 10 -7 -48 38 66 20 -40 21 -14 20 58 13 24 -27 -38 -32 8 30 44 -10 14 -34 -7 -21 -42 40
5580 40 18 -3 -28 -11 25 -39 -37 -6 -23 -21 -24 -25 -57 26 49 0 -36 -25 12 23 31 -20 38 33 -4 36 -48 -10 8 34 30 -7 -43 -18
5614 -18 -24 -2 14 -3 -53 45 40 -1 17 5 -32 -8 7 19 20 -23 7 -25 -41 41 23 39 8 67 -36 -11 7 1 5 66 0 7 44
5647 44 14 58 45 -9 -19 -23 -10 65 9 -33 -5 -4 1 -21 -38 8 40 36 7 8 -19 -5 -14 2 24 23 42 64 -22 -14 -32 16 -4 -5 -37
5682 -37 7 -9 11 16 -5 11 -10 23 -12 -8 23 -41 -15 -54 -83 -24 1 7 -21 12 45 -17 -41 12 24 46 38 -80 10 -5 -57 11
5714 11 -29 17 -35 9 44 56 -3 18 18 -5 32 34 -48 -40 26 19 5 3 4 3 3 16 41 75 20 12 1 25 21 11 26 -28 -24 69 11 -5
5750 -5 14 -5 -12 54 -19 -6 -2 25 -36 -16 22 29 -2 -7 31 13 -12 7 -26 28 86 -40 -17 38 -1 -16 -1 -26 -38 -55 28 -16
5782 -16 6 -6 25 -36 13 -3 -18 -16 16 -42 -5 -14 -41 27 55 -60 -9 69 14 16 33 31 -46 40 -12 -26 25 -18 -11 -22 8 -24
5814 -24 13 -38 15 -8 31 -10 44 -25 28 -40 -27 -32 37 -5 1 15 7 -9 30 25 32 27 18 79 -34 -5 23 10 -63 31 46 -11 74
5847 74 -47 18 -15 -2 43 5 -65 -31 14 16 15 6 -29 -6 -4 30 34 28 27 15 -22 21 1 -37 -6 34 71 -13 -5 -8 10 -28 23 -23
5881 -23 4 -60 -23 10 15 -36 0 -12 27 -35 6 51 13 -11 -16 23 65 26 7 11 63 -18 4 57 20 5 -11 -14 -25 -10 34 -1
5913 -1 -1 -17 -5 38 5 -30 -14 17 10 9 33 2 34 -14 -4 30 -33 7 -47 -49 -69 -5 27 -8 -39 9 32 57 -31 23 13 -10 -30
5946 -30 31 51 39 -4 10 13 12 0 70 8 42 -10 23 9 93 -38 9 24 -14 -10 -21 43 3 1 1 -4 16 37 -8 -14 13 -64 -18
5979 -18 -52 -8 -18 -67 -3 58 9 -20 -20 2 39 -1 62 12 -43 -12 0 19 29 -11 18 12 -16 -31 -13 11 19 -7 51 -25 70 -24
6011 -24 0 -12 16 9 -8 -25 -3 -17 -16 22 19 41 14 -42 -43 -16 44 12 -1 21 10 -11 -15 -55 -19 31 -20 3 7 52 -20 61 2
6044 2 35 -44 -8 -3 14 16 -6 -33 15 29 -11 -5 -24 13 -12 21 31 -25 27 -18 -39 19 -20 -22 7 -26 29 14 70 10 35 0 -22
6077 -22 13 30 -4 -32 50 -79 -33 10 -18 7 15 1 15 -21 -12 -15 7 -30 -4 6 -17 -5 -28 2 -24 -9 -37 63 72 0 -25
6108 -25 0 9 23 20 -32 -23 -7 -51 -6 -2 -37 -2 42 25 51 -16 37 26 -12 35 -4 -35 24 50 -60 39 4 -17 21 14 -61 21
6140 21 6 7 -29 -47 15 -15 8 -5 -1 45 -37 38 13 -20 57 4 51 31 -38 7 -5 27 14 -22 42 51 -27 32 14 13 67 21
6172 21 5 29 48 22 39 -51 36 5 13 -42 -14 35 14 42 41 -21 -56 26 -14 10 19 14 46 -57 19 23 32 5 45 24 12 19 -15
6205 -15 -3 -16 25 -2 -11 23 1 10 -7 24 69 -21 35 89 4 -12 32 13 -4 -25 25 -16 5 -12 18 4 24 -23 14 11 -43 54
6237 54 12 55 3 51 -14 10 -23 86 -3 -46 22 12 33 4 14 16 -25 48 -19 -49 24 7 21 -37 -18 -33 -31 -63 -12 13 -12
6268 -12 -15 -11 31 4 51 19 -33 -12 -6 -15 17 23 27 34 56 14 29 -20 -5 -1 28 -13 -13 6 14 35 -3 71 28 -27 2 11 16 -33 -9 -4 20
6305 20 46 -44 -33 30 11 42 -65 -13 -4 -36 -14 13 -5 14 19 -62 -13 51 8 -47 13 24 -1 34 -13 -4 19 12 8 -1 5 -6 17
6338 17 13 53 -21 -45 33 17 78 6 21 13 -65 -7 -40 7 -7 -37 -34 -7 -15 41 3 -7 -35 -1 27 -5 -2 12 67 12 -20 7 -1
6371 -1 -37 62 30 -11 -18 7 27 -24 -20 -40 25 -29 24 52 -22 11 -30 33 -9 -13 -2 31 45 -11 40 25 -2 -36 -7 41 -8 -62
6403 -62 -8 -20 -7 5 59 -19 30 27 42 19 -3 -2 20 21 -18 48 -3 -11 13 -10 0 -12 11 18 15 -5 -3 -4 10 26 -6 -8 8 0 -18
6438 -18 -3 35 -4 0 -22 -17 -6 15 -22 -17 -15 24 37 14 38 -13 -75 51 11 17 31 15 -18 -12 1 -10 27 -75 22 52 -10 -1 25
6471 25 13 -22 -36 0 -6 -6 9 -15 -31 26 51 -6 -24 -24 43 -32 -6 2 43 41 48 3 48 -23 10 -45 -46 -15 42 -6 30 -34 -43 2
6505 2 28 -10 -16 39 30 -8 -23 -7 0 11 1 32 41 12 5 -26 14 -47 -2 25 -22 30 7 -34 34 55 -1 8 -18 -31 -21 38 -13 -5
6539 -5 2 7 -6 0 26 2 -49 2 7 0 -74 27 21 -8 59 -8 32 18 29 -40 -25 -11 -60 -38 -66 -13 -14 19 -7 10 31 38 34 43 40 -16
6575 -16 20 -32 -12 64 -54 -13 44 -23 41 2 -8 39 14 35 22 -17 7 18 29 -8 -34 47 53 -1 0 -18 -45 -34 -8 18 -19
6606 -19 12 -12 -23 15 37 -36 -10 38 -51 -29 16 12 6 -17 22 -29 -9 5 20 35 -13 -11 8 5 36 -10 12 -7 -6 33 -49 -28 17
6639 17 -23 -10 26 10 6 -28 -46 4 24 31 48 25 7 -15 26 72 -12 12 51 5 15 -16 -4 3 -1 -16 57 -4 30 22 -21 -5 44
6672 44 17 5 -18 19 -25 -27 -21 -19 6 64 -10 -7 -15 -24 7 0 -10 -11 28 -33 -60 -26 -24 8 3 61 -25 -4 5 -6 6 -26 3 11 11 1 -14
6709 -14 -9 6 -12 64 25 7 0 16 67 4 7 23 24 -3 -11 -15 37 -7 -36 4 -16 27 8 39 13 -2 -23 25 28 0 -21 27 -14 37
6743 37 44 8 10 28 4 -10 -46 -3 23 34 28 14 27 51 22 -42 -32 -4 4 25 4 -41 17 9 8 -7 -24 1 28 47 26 58 -29
6776 -29 -34 21 36 56 -4 51 -11 -12 34 -36 -42 11 5 16 39 -9 -13 7 -5 43 -5 20 5 0 23 -27 -17 -15 55 -5 -19 -37 -32 -6
6810 -6 -10 -28 38 -23 -8 -23 17 4 21 -2 42 14 -29 -49 13 26 -31 -8 -12 22 -36 -3 17 11 -15 43 20 -36 -8 -9 14 -10 30
6843 30 60 32 28 71 25 -44 47 36 14 41 10 26 4 28 20 -37 32 -13 72 8 19 -40 -12 0 5 -14 -40 -7 -31 8 32 -26
6875 -26 9 22 -5 -3 -38 26 8 -20 17 3 19 -42 -19 22 -24 -20 4 -4 19 -57 2 -16 -27 -39 -19 -6 -9 -18 -75 53 71 -25
6907 -25 28 9 43 -30 -19 0 10 36 26 43 42 -1 28 29 24 7 71 46 24 52 9 44 -17 42 -5 24 8 16 -47 -12 18 34
6939 34 -10 11 -8 -22 -4 -47 12 -20 -1 2 12 -20 -37 -9 4 20 -5 -29 32 7 -13 -6 5 13 26 -2 65 44 29 29 -14 -11 40
6972 40 57 36 16 -7 29 11 -19 26 -19 -5 -20 -9 -9 29 -6 -43 -12 7 37 32 26 24 37 10 5 5 32 26 21 47 30 23 -44 40 -23
7007 -23 4 107 0 -23 -13 27 11 52 17 42 -35 -1 -26 33 13 17 8 -60 25 -57 48 -9 -23 -11 18 -19 24 -26 -35 -34 35
7038 35 0 22 -3 6 4 6 -12 -16 34 4 19 18 -37 15 13 13 13 24 43 -74 7 12 -42 -27 -36 -9 -39 -14 -21 42 42 -17 24 -16 25 -38
7074 -38 6 -37 -5 29 40 -7 34 -26 8 28 6 64 5 -33 1 39 -6 53 1 1 1 12 -8 30 34 58 0 -18 -29 17 -43 -3
7106 -3 -7 -19 -20 13 -1 4 34 19 41 9 -9 -63 29 29 -25 -31 72 13 -33 -15 -8 46 23 -15 7 -38 -8 8 49 42 -15 -29 42 15
7140 15 -35 -2 -14 28 4 29 -7 19 -26 18 41 -4 -23 0 -5 -32 38 27 56 -30 20 -17 70 -9 15 -14 54 16 -17 37 -7
7171 -7 -10 17 61 -15 -2 43 -6 2 23 32 9 -61 49 -1 33 40 6 48 48 23 21 -24 0 2 -19 -3 22 -5 -10 -6 -15 2 -55 -1 3 22
7207 22 -26 -32 1 28 -32 7 30 44 26 45 -1 -41 56 37 5 16 40 -9 15 11 -20 84 50 2 -11 -8 34 -4 7 16 -35 -10
7239 -10 -15 -20 -20 -5 -24 -13 8 -23 16 17 1 2 -9 43 16 38 -43 -8 19 0 28 -29 -23 8 -21 -1 -21 3 -18 -28 7 -44 -25
7272 -25 -29 18 -51 18 26 -10 -56 18 -11 15 25 -33 -32 3 -26 22 -112 -21 37 18 13 27 10 -19 5 28 21 -28 26 24 4 -18 12
7305 12 -26 -14 47 -3 -2 11 -1 22 -30 -16 -38 -13 7 29 -12 -39 -24 34 12 -22 -10 -50 7 -20 14 21 10 29 -26 8 -21
7336 -21 23 16 -25 18 -29 -21 7 4 49 41 47 -9 13 7 4 -14 26 31 -10 12 -45 -16 -18 11 1 -13 -27 7 6 -37 6 51 21 10 -50
7371 -50 8 0 17 -2 -24 -7 40 -27 3 28 -28 40 -32 -3 -51 35 4 -32 -2 29 -20 -10 5 11 12 25 60 -17 33 -2 -11 33
7403 33 18 36 -22 -9 -6 49 11 -28 26 30 -4 -34 -2 32 37 29 2 -6 9 -8 29 6 -2 12 75 -11 50 34 -14 -21 46 4 -13 -41
7437 -41 -4 0 30 8 -5 -5 -34 -37 -5 -16 -2 20 -11 46 -3 53 7 12 13 12 -36 36 24 8 3 -7 10 37 -41 -18 17 12 -20 -4
7471 -4 47 -88 26 1 -51 -14 -15 -3 2 -69 -14 -11 -15 10 25 -5 -10 -13 9 -10 19 42 -58 -3 -2 51 9 5 -54 67 12 -9 -36
7504 -36 38 8 3 10 -58 -9 -26 -8 -17 23 -8 12 36 -14 4 -17 14 -42 50 -36 -11 3 17 18 -3 -30 2 -46 -65 3 -25 15
7536 15 -74 -60 16 -12 -18 4 16 34 -17 -29 -2 -8 37 6 16 -22 2 -4 18 16 25 40 -5 6 7 -17 -24 -34 1 10 35 6 25 -32
7570 -32 53 38 39 -14 -14 -15 34 -4 13 -24 29 32 21 -1 -32 34 -1 -15 52 -3 -33 21 -11 17 -35 -28 49 -19 -19 -26 -48 2 3 -12
7604 -12 -20 -24 15 64 -5 46 5 38 13 -10 21 34 41 14 -39 -63 -57 -13 -5 -17 2 -4 -19 -13 -20 -24 -22 16 -19 -18 12 3 -36 31 42 11
7640 11 -18 28 6 28 -11 3 -1 27 17 15 5 9 40 -15 -8 43 22 -20 -26 18 -43 -3 -25 -30 60 -22 -18 -19 34 2 -9 40 4 26
7674 26 -47 45 24 -25 29 4 40 7 38 -1 13 -20 10 -16 27 -9 -21 11 4 -22 -40 -19 8 38 9 -17 34 35 28 -46 21 13
7706 13 27 -41 7 -37 38 -62 26 41 10 -18 -28 -38 39 -34 -8 -16 17 24 -10 -11 4 -32 7 37 40 -11 -49 8 -7 -9 27 1
7738 1 -4 23 20 -12 -7 4 -27 -22 2 69 35 2 -27 4 -5 -24 -36 31 19 -30 15 -26 9 -35 6 43 -8 39 18 -12 -13 -69 44
7771 44 19 -55 21 6 -15 30 19 -10 2 28 -27 -33 34 -43 -10 35 -5 20 9 -18 -9 -31 54 16 -55 7 15 36 -33 -50 67
7802 67 12 -41 28 -12 25 56 11 26 -12 6 -33 14 -18 1 24 -31 32 -31 -2 12 -14 -23 7 -28 16 -14 -36 -23 -8 16 34
7833 34 -14 -15 41 -13 -29 -20 -18 16 -19 -85 -6 -34 14 -67 18 7 -64 7 29 23 58 -30 -12 6 -15 -22 -71 6 27 2 -22 -11 -57
7866 -57 -16 -23 -34 -4 11 40 0 45 -43 -45 -8 11 -11 1 30 31 20 -39 12 -34 -49 -15 -11 -2 1 28 -27 14 -30 -25 23 18 10 12 -25
7901 -25 12 -32 48 -2 7 -24 -44 15 -88 -25 22 -23 30 5 -16 -29 6 5 31 -7 -6 -19 36 -61 -6 -23 1 -39 -23 40 6
7932 6 26 -3 30 16 -16 13 1 -5 38 78 -14 32 32 -3 -6 -7 5 14 -16 -30 28 3 8 -18 -7 47 14 -3 64 -19 43 47 4 -45
7966 -45 -25 -32 -59 17 -36 5 13 -29 52 -10 -13 -5 26 21 1 -20 0 10 37 -54 19 5 54 10 -11 -6 -11 -4 21 11 -14 46 7 40
8000 40 46 8 26 -7 22 4 -13 -30 49 -4 13 -58 -64 31 8 -11 41 -10 43 5 -26 -9 17 -13 -17 40 2 -9 6 -36 41 61
8032 61 15 84 12 41 -38 9 5 2 2 8 -17 -14 26 -8 -43 -64 -18 -22 -33 28 12 -1 52 -12 -5 11 9 2 -3 2 -8 -28 -9 -11 -40 23
8068 23 -36 30 -11 -13 0 36 4 8 33 17 33 7 12 16 -53 -7 51 -38 19 3 -30 -11 39 6 -73 42 -6 -38 65 10 34
8099 34 -19 18 -9 38 -7 -8 50 5 -6 -25 -33 0 -41 -5 23 22 35 2 48 -14 -5 95 -17 35 -12 -45 -45 45 83 -5 45 6
8131 6 73 40 35 28 57 4 7 38 83 -24 -21 0 -43 18 -35 -15 13 19 3 -10 20 24 -16 9 16 3 -28 -7 -43 19 44 11 30 56
8165 56 7 -1 -26 11 5 -35 9 -12 32 -30 28 -17 64 -4 0 -30 -5 22 -6 7 26 -3 -30 21 10 2
8191B
$$ Imaginary data points
##PAGE= N=2
##DATA TABLE= (X++(I..I)), XYDATA
0 0 0 0 0 0 0 0 0 0 0 0 0 0 0 0 0 0 0 0 0 0 0 0 0 0 0 0 0 0 0 0 0 -2 2 -2 3 -4 4 -4 7 -8 8 -10 11 -14 14 -14 17 -20 22 -24 27
51 27 -29 31 -34 36 -39 43 -43 46 -46 45 -36 24 2 -51 152 -370 931 -2854 19333 108450 -67710 -143736
73 -143736 18112 -20889 -139444 -45622 8490 -67045 -10760 58852 -4699 11444 85587 23415
85 23415 -9343 56772 15612 -36315 45920 37249 -55997 22648 89555 -41431 -55168 80418
97 80418 17242 -101211 -1537 44025 -79062 -66424 20569 -45449 -73619 14254 -1296 -39086
109 -39086 44113 62795 7466 59072 89148 12759 25370 66522 -21107 -45940 32408 -23630
121 -23630 -99780 -8841 15811 -85461 -45328 44310 -23295 -47093 48816 33355 -28615 32969
133 32969 53767 -17923 2035 43388 -13858 -20076 33362 -3343 -27430 34573 16543 -39183
145 -39183 16433 33846 -47470 -26329 35935 -30636 -58803 23629 6310 -56324 7810 41825
157 41825 -25970 -4368 56951 9220 -10839 45759 22679 -20950 18061 13092 -37934 -6708
169 -6708 11625 -43699 -23917 28693 -19721 -35829 35792 18886 -37375 16673 42506 -25927
181 -25927 -12735 42478 -6050 -33567 24475 12914 -34328 4550 23044 -21104 -4239 26279
193 26279 -10900 -10306 27089 -6184 -25579 21614 5800 -38200 6870 26637 -30220 -12730
205 -12730 38763 -4642 -26505 30163 18338 -29155 8044 26441 -23021 -13501 21561 -12392
217 -12392 -23313 14394 -1427 -21893 14245 11168 -20230 12565 27266 -18113 -3873 35096
229 35096 -7167 -25961 24799 9693 -35445 3923 22888 -27454 -15182 26624 -8763 -24352
241 -24352 20226 8417 -23067 10001 17147 -18237 1702 21777 -14161 -7479 26430 -5895
253 -5895 -20630 24443 10394 -29724 8303 24847 -25294 -13619 27118 -10112 -27807 18983
265 18983 8098 -28829 6107 21830 -18093 -5095 25338 -5174 -11158 22316 2328 -17750
277 -17750 16813 10004 -25464 4226 20390 -23843 -13819 25487 -9242 -27304 20097 10863
289 10863 -28849 6187 25639 -18315 -8753 28333 -2742 -17786 20668 9022 -20007 9538
301 9538 14621 -19471 -951 18514 -17228 -13504 21129 -7324 -25845 16311 9913 -28156 3579
314 3579 24460 -17718 -10411 28618 -929 -19747 20855 14103 -20838 6147 20397 -15464 -6805
327 -6805 18692 -9891 -16047 15523 -2664 -23237 10789 9542 -24485 1092 21864 -16352 -11711
340 -11711 26474 -432 -20947 19617 15667 -21796 4688 23874 -14745 -10796 21630 -4479
352 -4479 -20022 13368 4623 -21908 5164 12207 -19727 -3149 19390 -12344 -12911 22243 1426
365 1426 -19901 16097 15520 -20215 2468 23314 -13453 -12664 21813 -1275 -21846 11692 9667
378 9667 -21400 -256 14894 -14894 -8557 16801 -6047 -13606 16516 4712 -16841 11183 15224
391 15224 -16140 260 21408 -9694 -12141 19829 769 -20769 10223 10946 -21271 -3014 16482
404 16482 -12920 -12726 15598 -1730 -15539 11535 7386 -14873 6363 14797 -12204 -1615 19112
417 19112 -5904 -10992 17132 2671 -17885 8822 11213 -18558 -3190 16615 -11106 -13715 14794
430 14794 305 -17280 8029 9278 -14228 1303 14158 -8889 -4481 15899 -2815 -10475 13804
443 13804 4405 -15044 6967 11571 -14767 -3054 15508 -8992 -12578 14136 790 -17459 7461
456 7461 10573 -14737 -1339 14907 -7375 -7725 13863 -413 -11311 10576 6025 -13322 4408
469 4408 11573 -11863 -3966 14066 -6370 -11417 12485 1876 -15575 6560 10313 -13926 -2415
482 -2415 14619 -6828 -9736 12919 1591 -12302 7747 7853 -11363 1647 11401 -8559 -4660
495 -4660 12566 -3481 -10332 10395 3260 -13218 4783 9179 -12221 -2668 12900 -7039 -10049
508 -10049 12093 1579 -13570 6318 8781 -11462 -522 11859 -6606 -5785 12207 -805 -9717
521 -9717 9494 5270 -11348 3978 9953 -10161 -3000 12270 -6012 -10137 10960 1126 -14447
534 -14447 4990 8439 -12897 -2653 12263 -6500 -8277 11580 1190 -10199 8194 7271 -9835
547 -9835 3102 11406 -7421 -3383 12388 -3144 -9519 9620 2245 -13271 3974 7956 -12948
560 -12948 -4038 11451 -6797 -10408 10301 1776 -11938 6019 8474 -9535 946 12400 -5226
573 -5226 -4589 12399 74 -9084 8742 4933 -11584 2487 8758 -10853 -5077 10650 -5824
586 -5824 -11312 9011 2104 -13107 4121 9241 -9806 -1732 12428 -3657 -6222 11615 2273
599 2273 -9151 7387 7019 -9913 773 9524 -7979 -5895 9393 -3737 -10846 7141 2495
612 2495 -12507 2517 8894 -9349 -3206 11945 -2770 -7466 10653 4053 -9273 6036 8803
625 8803 -8768 -746 10514 -5814 -7120 8902 -1483 -11147 5314 3625 -11820 578 8415
638 8415 -8745 -4498 11271 -2327 -8473 9989 5210 -9556 4812 10191 -7344 -1796 11023
651 11023 -3634 -7527 8522 887 -10795 3495 5041 -10365 -1784 7713 -6907 -6026 8914
664 8914 -1275 -8864 7521 5542 -9110 2711 10257 -5968 -3209 10923 -1230 -7766 7707
677 7707 3387 -9799 2273 6680 -8505 -3137 7982 -4856 -7132 7326 341 -8758 5002
690 5002 5425 -8238 1084 9217 -5317 -4036 9891 -351 -7899 6489 4390 -8690 1278 7013
704 7013 -6886 -3666 7820 -3009 -7214 6341 1874 -8068 3252 5824 -6855 -391 8276 -3912
718 -3912 -4519 8361 393 -7624 5269 4668 -8106 318 7100 -5977 -4327 7357 -2001 -7317
732 -7317 5606 2578 -7950 2303 6365 -5962 -1555 7956 -2453 -4703 7132 1232 -6813 4387
746 4387 4782 -7256 -131 7051 -5069 -4741 6855 -1026 -7368 4563 3073 -7739 1127 6433
760 6433 -5468 -2824 7505 -1505 -5443 6017 2386 -6451 3130 5163 -6049 -704 6851 -3788
774 -3788 -4659 6464 -97 -7035 3967 3698 -6933 338 6362 -4628 -3316 6812 -922 -5753
788 -5753 5050 2785 -6357 1693 5267 -5052 -1656 6037 -2771 -4605 5576 370 -6605 3437
802 3437 4150 -6277 -169 6455 -3732 -3417 6569 -162 -5683 4737 3386 -6165 1208 5637 -4687
817 -4687 -2406 5926 -2162 -5042 4836 929 -6459 2517 4045 -5976 -767 6125 -3361 -3917 6130
832 6130 377 -5675 4095 3797 -5612 805 5955 -3982 -2753 6180 -1096 -5422 4402 2123 -6209
847 -6209 1452 4452 -5241 -1669 5851 -2758 -4610 5486 898 -6106 3039 4237 -5481 -159 6049
862 6049 -3473 -3389 6070 -237 -5697 4037 3167 -5957 740 5323 -4274 -2469 5801 -1429 -4905 4735
878 4735 1719 -5770 2142 4398 -5038 -1172 5759 -2696 -4184 5131 430 -5749 2984 3446 -5591
893 -5591 -113 5525 -3542 -3230 5561 -246 -4953 3868 2660 -5086 1444 4702 -4148 -1656 5595
908 5595 -1811 -4346 4552 1101 -5573 2183 3704 -5262 -834 5339 -3152 -3786 5103 176 -5269
923 -5269 3235 3220 -5009 487 4989 -3350 -2192 5298 -875 -4315 4145 1804 -5346 1616 4241 -4438
939 -4438 -1568 5144 -2118 -4007 4407 826 -5260 2420 3554 -4728 -556 5086 -2564 -3090 4642
954 4642 -40 -4492 3205 2446 -4910 674 4476 -3652 -2272 4859 -1074 -4182 3807 1639 -4825
969 -4825 1743 3982 -4004 -985 5026 -1884 -3429 4329 786 -4660 2324 2959 -4390 -315 4214
984 4214 -2932 -2755 4300 -577 -4318 2966 2153 -4450 812 3904 -3192 -1485 4460 -1143 -3292 3874
1000 3874 1377 -4323 1782 3405 -3706 -798 4144 -2087 -2824 3746 -43 -4243 2282 2227 -4183 70
1016 70 3652 -2828 -1889 4000 -791 -3427 3280 1502 -4070 1407 3433 -3391 -913 4250 -1488 -2955
1032 -2955 3595 695 -3898 1916 2628 -3612 -194 3717 -2451 -2267 3788 -371 -3699 2551 1756 -3896
1048 -3896 679 3313 -3083 -1457 3981 -1113 -3269 3160 1305 -3757 1347 2954 -3074 -631 3754
1063 3754 -1623 -2387 3474 421 -3604 2126 2165 -3516 121 3403 -2474 -1909 3571 -610 -3369 2597
1079 2597 1434 -3715 829 3036 -2876 -1145 3601 -1162 -2758 3011 736 -3362 1716 2459 -3181
1094 -3181 -220 3501 -1968 -2053 3399 -51 -3194 2282 1702 -3348 636 3014 -2621 -1412 3434 -901
1110 -901 -2910 2729 874 -3495 1110 2433 -3043 -620 3293 -1641 -2313 3045 243 -3156 1990
1125 1990 2079 -3072 230 3202 -2085 -1469 3405 -481 -2920 2592 1353 -3414 769 2808 -2721 -1217
1141 -1217 3132 -1294 -2750 2627 606 -3370 1314 2315 -3020 -397 3238 -1608 -1918 3157 89
1156 89 -2904 2266 1940 -3082 478 3140 -2096 -1504 3207 -536 -2874 2338 1181 -3283 672 2460
1172 2460 -2649 -1014 3015 -1237 -2420 2623 560 -3069 1413 2182 -2794 -194 3057 -1735 -1809 3092
1188 3092 11 -2923 1995 1687 -2934 377 2696 -2091 -1281 2972 -774 -2499 2388 926 -2993
1203 -2993 990 2245 -2499 -610 2824 -1401 -2045 2633 187 -2910 1594 1774 -2744 -44 2611
1218 2611 -1795 -1508 2771 -288 -2412 2084 1264 -2757 777 2481 -2110 -857 2855 -865 -2166
1233 -2166 2305 650 -2796 1062 1855 -2561 -442 2618 -1495 -1961 2509 59 -2644 1562 1555 -2631
1249 -2631 298 2581 -1836 -1203 2815 -293 -2301 2029 1172 -2562 692 2177 -2099 -736 2569
1264 2569 -1005 -2009 2270 384 -2674 1155 1687 -2441 -251 2477 -1476 -1580 2417 -13 -2439
1279 -2439 1605 1298 -2397 295 2253 -1674 -1030 2429 -509 -1973 1949 787 -2318 929 1874 -2031
1295 -2031 -596 2406 -999 -1653 2080 191 -2294 1252 1344 -2283 -54 2053 -1509 -1305 2138 -297
1311 -297 -2069 1565 921 -2180 597 1945 -1700 -564 2374 -659 -1614 2064 561 -2156 1086 1577
1327 1577 -1965 -245 2119 -1240 -1351 1989 -179 -2221 1311 1045 -2303 93 1897 -1568 -988 2108
1343 2108 -522 -1821 1777 759 -2177 702 1834 -1687 -480 2159 -825 -1473 1918 288 -2034
1358 -2034 1117 1351 -1972 -111 1976 -1303 -1244 1950 -165 -1969 1312 996 -2081 311 1802 -1540
1374 -1540 -816 1981 -592 -1609 1663 579 -1997 811 1502 -1713 -262 2007 -987 -1304 1917 166
1390 166 -1835 1097 1189 -1777 114 1766 -1325 -880 1864 -401 -1755 1353 680 -1979 442 1412
1406 1412 -1590 -538 1917 -779 -1408 1718 366 -1820 926 1305 -1645 16 1925 -970 -1034 1848
1422 1848 -44 -1674 1237 877 -1950 301 1612 -1549 -813 1837 -558 -1626 1359 458 -1977 667
1438 667 1429 -1681 -401 1903 -791 -1269 1702 232 -1711 1013 1182 -1738 86 1820 -1153 -932
1454 -932 1823 -119 -1653 1237 823 -1785 319 1454 -1393 -718 1723 -634 -1515 1381 403 -1794
1470 -1794 623 1261 -1634 -283 1755 -827 -1147 1660 170 -1652 1030 1098 -1598 116 1625 -1053
1486 -1053 -762 1678 -228 -1417 1314 629 -1743 399 1343 -1352 -598 1528 -632 -1274 1304 254
1502 254 -1617 702 1062 -1485 -142 1579 -847 -885 1516 2 -1389 1053 848 -1479 273 1434
1518 1434 -1138 -612 1536 -384 -1345 1176 449 -1614 481 1147 -1381 -382 1437 -773 -1088 1380
1534 1380 135 -1446 815 993 -1433 18 1449 -934 -731 1525 -133 -1381 1128 803 -1463 262
1550 262 1382 -1071 -599 1494 -441 -1208 1216 381 -1507 508 1034 -1284 -300 1416 -771 -1080 1306
1567 1306 55 -1408 779 887 -1338 67 1318 -929 -674 1392 -116 -1172 1056 627 -1275 372
1583 372 1153 -1117 -313 1396 -510 -1053 1096 257 -1337 514 842 -1199 -121 1110 -827 -805 1196
1600 1196 -87 -1199 823 661 -1205 175 1127 -906 -476 1286 -282 -974 1067 427 -1096 462
1616 462 966 -1070 -276 1197 -583 -817 1064 8 -1210 694 645 -1249 -30 1044 -824 -677 1162
1633 1162 -141 -1057 879 523 -1210 298 1043 -883 -360 1264 -264 -909 1062 293 -1116 542
1649 542 822 -1094 -143 1150 -636 -795 1112 7 -1236 677 595 -1216 41 1074 -820 -592 1123
1666 1123 -261 -922 911 465 -1118 358 924 -926 -222 1194 -450 -804 1029 230 -1033 561
1682 561 737 -1024 -88 993 -631 -606 956 -173 -1018 714 491 -1075 117 868 -800 -468 1073
1699 1073 -318 -846 865 286 -1053 459 849 -864 -186 1095 -407 -593 951 89 -977 599
1715 599 663 -1009 38 894 -700 -552 1001 -215 -930 714 376 -1030 219 729 -880 -329 1024
1732 1024 -382 -734 855 242 -999 466 730 -860 -53 1004 -495 -617 1016 46 -934 621 610
1749 610 -963 1 896 -708 -488 947 -241 -893 699 347 -991 223 754 -824 -242 969 -387
1766 -387 -737 871 138 -888 486 656 -771 13 963 -481 -527 886 -4 -830 580 415 -885 108
1784 108 762 -723 -421 892 -215 -792 660 258 -882 297 683 -762 -143 889 -365 -576 797
1801 797 95 -850 513 545 -779 86 851 -559 -422 845 -118 -710 657 338 -872 179 655 -695
1819 -695 -302 753 -324 -719 652 163 -850 386 581 -807 -44 815 -433 -427 795 -14 -709 563
1837 563 512 -799 116 816 -553 -363 779 -189 -689 582 246 -836 269 615 -685 -206 761 -332
1855 -332 -616 684 98 -819 386 483 -773 -26 810 -389 -414 742 19 -689 558 387 -710 145
1873 145 651 -492 -278 741 -146 -598 610 169 -728 208 511 -625 -176 667 -350 -482 650 68
1891 68 -673 358 391 -645 73 662 -450 -286 715 -20 -577 520 295 -669 235 600 -523 -162 639
1910 639 -250 -524 547 92 -659 297 432 -642 -41 604 -471 -402 651 -44 -653 438 261 -582 216
1929 216 635 -417 -296 704 -144 -517 552 242 -661 264 535 -603 -172 669 -340 -504 577 49
1947 49 -700 321 370 -645 -58 557 -457 -381 645 -79 -487 491 283 -593 182 555 -426 -185 657 -125
1967 -125 -442 536 207 -561 254 473 -537 -67 578 -283 -419 553 -43 -586 278 278 -592 29 480 -427
1987 -427 -319 561 -68 -499 434 293 -575 159 456 -465 -126 564 -210 -381 487 101 -520 316 360 -470
2007 -470 -51 516 -344 -326 477 -78 -586 324 213 -537 64 459 -414 -205 501 -175 -417 467 151 -518
2027 -518 262 475 -497 -99 551 -262 -320 519 37 -489 299 392 -593 -49 499 -378 -227 458 -44 -478 380
2048 380 189 -601 104 422 -449 -150 497 -180 -393 471 135 -457 233 417 -414 -40 510 -202 -329 482
2068 482 53 -478 255 242 -508 -10 434 -338 -234 423 -135 -453 303 204 -436 115 412 -373 -164 469 -168
2089 -168 -332 396 131 -455 234 396 -391 7 423 -221 -241 430 -1 -442 281 189 -454 69 321 -414 -239
2110 -239 371 -203 -454 290 67 -471 140 282 -398 -54 460 -242 -289 454 82 -372 279 256 -368 29 430
2131 430 -291 -165 455 -72 -362 339 205 -417 105 302 -386 -196 385 -207 -365 306 50 -439 137 341
2151 341 -364 -72 368 -179 -241 416 79 -379 221 231 -374 85 433 -327 -172 383 -64 -342 337 178 -414
2172 -414 104 322 -324 -166 337 -159 -274 325 75 -352 213 232 -323 -88 388 -186 -148 318 5 -329 263
2193 263 234 -369 53 356 -248 -158 338 -156 -285 286 78 -388 163 213 -325 -63 342 -186 -300 322 -35
2214 -35 -350 199 267 -322 17 341 -249 -136 392 11 -239 293 125 -328 104 283 -260 -42 381 -170 -263
2235 -263 309 99 -384 122 218 -419 -109 284 -267 -258 273 -53 -361 211 219 -343 48 295 -209 -63 392 -33
2257 -33 -220 299 155 -327 134 281 -191 -95 287 -127 -236 249 -20 -346 92 129 -326 -26 247 -245 -208
2278 -208 283 19 -332 199 145 -284 83 277 -217 -78 325 -52 -242 308 60 -263 138 256 -270 -51
2298 -51 287 -180 -182 291 41 -335 163 146 -275 -8 283 -206 -158 290 -76 -283 205 100 -281 128 255 -214
2320 -214 -31 306 -108 -220 257 69 -277 165 214 -230 -8 275 -140 -263 225 -11 -275 143 108 -294 44
2341 44 285 -180 -106 271 -41 -184 242 133 -294 66 281 -198 -37 304 -91 -126 278 79 -260 173 186
2362 186 -242 2 231 -192 -174 224 -49 -264 195 106 -305 55 225 -186 -117 282 -114 -183 206 113 -243 135
2384 135 180 -163 -14 221 -128 -86 251 -4 -238 165 122 -245 43 190 -162 -114 231 -92 -193 105 121 -216
2406 -216 97 171 -226 -29 217 -31 -141 222 36 -219 136 152 -199 5 197 -63 -127 256 -42 -144 145
2427 145 112 -288 4 175 -156 -72 287 -24 -230 145 36 -270 79 162 -171 -33 236 -117 -99 245 47
2448 47 -197 97 131 -222 38 194 -101 -72 240 -46 -211 167 102 -257 16 198 -159 -88 184 -71 -187 130
2470 130 28 -253 76 82 -153 -31 260 -76 -102 252 55 -201 185 140 -132 45 157 -118 -87 177 -20 -138
2492 -138 130 6 -185 65 112 -147 -99 145 -93 -135 162 53 -152 99 71 -157 24 179 -66 -120 213 3
2514 3 -138 194 87 -140 90 153 -165 -75 242 -49 -201 187 4 -194 101 110 -175 -96 217 -105 -145 158 -57
2537 -57 -179 80 118 -203 -26 217 -46 -72 211 -22 -190 150 103 -109 39 184 -137 -39 173 -103 -135 172
2559 172 3 -155 73 147 -175 -65 152 -142 -143 160 9 -107 97 120 -153 29 158 -159 0 207 -4
2580 -4 -115 150 80 -98 23 94 -146 -40 123 -118 -161 201 -15 -208 143 44 -148 1 118 -140 -60 156
2602 156 -8 -146 165 88 -197 54 172 -126 -31 192 -86 -111 160 36 -162 105 107 -130 -22 108 -127 -135
2624 -135 139 -8 -196 69 99 -193 28 115 -58 -108 164 -69 -156 123 90 -104 -3 174 -73 -41 189 -41
2646 -41 -115 148 43 -136 123 105 -106 -9 143 -81 -100 135 29 -129 56 45 -162 48 95 -162 -85 153 16
2669 16 -122 132 43 -92 67 139 -156 -12 175 -36 -80 109 37 -129 86 96 -125 -18 104 -74 -52 132
2691 132 -18 -77 111 9 -151 36 123 -116 -40 83 -38 -113 117 9 -87 43 63 -161 30 121 -97 -71 127
2714 127 -22 -157 98 91 -155 -27 78 -106 -51 130 -72 -127 115 27 -106 82 91 -127 2 127 -88 -83 80
2737 80 5 -87 66 102 -112 11 162 -103 -34 116 14 -92 55 77 -116 44 68 -133 -79 75 -52 -90 47
2760 47 2 -156 42 56 -111 -3 107 -35 -78 178 57 -59 72 140 -63 37 100 -36 -39 105 -12 -102 83
2783 83 -20 -131 -26 60 -121 -39 93 -105 -144 122 -24 -148 67 44 -98 8 132 -40 -67 127 38 -122
2805 -122 113 69 -116 26 141 -82 -77 140 -17 -108 44 45 -139 55 25 -116 -13 96 -54 -74 85 17 -175
2828 -175 17 14 -113 5 145 -66 -87 99 -40 -105 72 -13 -80 27 87 -77 -59 98 -9 -54 110 20 -101
2851 -101 25 34 -110 -35 93 -74 -56 120 33 -49 129 32 -78 -17 168 -56 -37 115 -48 -91 65 43 -61 -13
2875 -13 98 -63 -24 68 -105 -85 69 11 -100 12 56 -80 2 101 -82 -56 92 1 -56 86 46 -58 39 119 -79
2900 -79 -37 93 3 -81 98 1 -93 66 158 -59 -59 145 -46 -23 92 -29 -110 82 43 -136 -5 95 -94 -49
2924 -49 49 -76 -146 87 13 -76 55 158 -67 -56 90 -7 11 114 58 -93 87 78 -67 25 51 -38 -66 108 -16
2949 -16 -95 54 12 -94 22 41 -114 -27 35 -14 -62 40 4 -78 68 46 -97 -8 103 13 -11 109 -12 -76 23
2974 23 59 -60 -4 54 -115 -54 32 -19 -34 85 35 -82 6 20 -60 -58 116 -33 -30 77 25 -90 -12 30 -50 41 119
3001 119 16 -62 77 -11 -48 82 60 -124 -7 72 -80 -32 68 7 -115 27 -9 -98 4 59 -65 -16 98 1
3025 1 -68 94 50 -55 76 131 -121 24 26 21 -37 41 5 -71 -15 -27 -81 17 68 -63 -22 98 -4 -107 27 48 -70
3052 -70 27 23 -40 -11 110 -8 -52 70 -50 -82 59 100 -30 60 49 -26 -52 99 -22 -44 2 51 -57 -12 60 -69
3078 -69 24 67 -67 -40 90 36 -83 97 102 -80 47 98 -51 -89 26 45 -59 76 58 -66 53 72 -20 -18 31
3103 31 -38 -53 36 25 -87 15 22 -55 8 51 -10 -72 32 -22 -91 -1 49 -102 38 114 -71 -29 94 -36 -106 27
3129 27 7 -116 40 106 -60 -15 65 47 -50 62 -15 3 28 21 -101 -4 44 -86 -115 88 14 -48 99 66 -51 6
3155 6 93 -9 15 90 6 -13 33 21 -57 0 58 -89 -34 66 -1 -42 34 -6 -85 5 15 -75 -47 78 -29 -27 8 16 -55
3184 -55 -26 -33 -57 26 84 -43 -10 108 3 -54 73 -8 -59 50 102 -83 19 82 -25 -11 92 4 -97 40 30
3209 30 -39 -39 33 -39 -29 46 -1 -112 53 -2 -75 15 58 -40 -16 85 34 -30 78 96 -68 27 31 -38 9 67 16 -40 64
3238 64 -22 -55 13 -14 -44 3 9 -20 -11 63 -6 -62 56 17 -68 47 49 -51 -44 82 -8 -57 77 -2 -44 45 55 -69 32
3267 32 4 -48 18 98 -62 -27 48 54 -85 -17 39 -28 -30 44 -2 -46 94 15 -39 19 11 -70 -15 107 27 -20 107 31 -37
3296 -37 53 56 -82 -31 32 -16 -17 32 8 -118 40 9 -50 42 36 -100 28 93 -24 -56 45 19 -34 27 42 -74 -51 69
3324 69 -50 -77 56 17 -54 87 10 -70 49 71 -35 12 54 16 -52 -31 -4 -104 21 28 -27 44 46 -23 -18 53 -28 -72
3352 -72 20 58 -47 -22 34 -66 -49 60 35 14 8 -65 -11 -14 52 -44 -9 29 18 -12 62 41 4 -2 34 17 -27 82 -15 3
3382 3 66 47 -19 9 61 -32 14 56 -3 -30 69 -8 -37 49 -12 -80 10 86 -5 -7 58 -69 -54 46 -43 -38 -18 20 -48 0 61
3413 61 27 14 38 34 19 38 53 -35 21 83 4 -43 111 -18 -144 36 33 -47 26 -2 -27 -21 14 -49 -82 43 4 -46 -28
3442 -28 -11 -80 11 35 18 -2 95 7 0 48 18 -18 30 36 -20 9 31 8 2 56 40 -42 17 15 -54 -23 28 -11 -26 40 -3 -18
3474 -18 42 27 -49 27 28 -28 -50 60 -18 -15 59 -7 -76 38 75 -42 -15 31 -27 -26 21 -19 -27 54 -62 -38 -15 22 -7 -8 28
3505 28 10 -71 99 48 -18 42 51 -19 -27 51 0 -24 87 11 -6 -22 66 -6 -28 -9 -23 -46 80 -31 -67 47 -53 -31
3533 -31 -32 48 10 -20 60 9 -45 32 16 -17 -6 61 -3 6 86 -4 -22 33 -20 -29 53 -23 -58 7 2 25 -67 25 8 -32 -1 -16
3565 -16 -37 -42 25 -9 -54 77 -40 -126 34 -11 -39 28 10 -27 49 52 -16 -69 64 -33 -54 20 21 -5 40 69 -55 -37 27
3594 27 -30 -36 67 -69 -32 -1 -2 -90 46 -4 -32 6 60 -28 -19 26 23 -39 14 19 -17 -58 17 14 -21 65 43 -81 9 65 -3
3625 -3 51 76 24 -94 27 -48 -67 -34 36 -56 -36 43 -9 11 51 15 -79 14 11 -27 60 45 2 -45 42 27 -95 24 43
3654 43 -75 14 -11 -69 2 36 -5 -115 1 22 -21 4 15 -24 -9 61 30 -29 34 -40 -22 1 33 -63 -24 44 31 -37 25
3683 25 -9 -28 -13 60 -14 -22 -2 -29 -21 22 -47 -6 30 -10 -4 19 5 -89 -23 -9 -54 -1 3 -37 -15 31 38 -42 39 -27 -77 23
3715 23 37 -25 -1 10 5 -48 -2 21 -75 -72 64 -49 -110 -12 4 -37 -52 11 -28 -23 16 11 -56 -15 -55 -15 83 63 -42 37 52
3746 52 -27 27 38 -32 -61 54 5 -72 -53 1 -8 -29 16 -13 -7 56 35 -48 56 2 -47 10 32 -37 -6 31 6 -68 16 12 -95
3777 -95 36 56 -12 -6 49 -12 -56 17 14 -10 9 69 -67 -18 -8 -29 -1 53 -39 15 60 30 -65 30 -23 -30 -34 103 -34 -23
3807 -23 26 -29 -45 -10 20 -11 47 -20 -31 -20 4 -38 -40 -20 17 -43 -36 14 21 -4 -8 34 -28 23 10 -5 -17 4 0 28 44 -10 -45
3840 -45 47 56 -83 -4 25 -18 -19 104 -35 -27 15 21 -28 -77 16 22 -22 -14 -44 -22 47 -22 -43 -11 -38 -46 44 82 10 -51 21 -42
3872 -42 17 10 -50 13 27 -6 23 30 26 25 -2 1 -4 -20 -26 31 -35 -27 33 -42 -4 20 25 -78 20 46 4 -42 -2 -46 15 93 -40 -1
3906 -1 22 11 -49 22 18 -23 11 11 7 -45 8 -15 -7 61 -10 -7 -1 49 10 -43 -7 36 39 19 -20 -25 -32 8 0 16 36 22 9 57 -12 -69
3942 -69 42 -13 -34 -32 -5 1 -56 10 -12 -26 -14 19 -66 -21 46 -51 4 16 -20 -46 22 64 -21 4 25 31 -8 20 2 30 7
3973 7 26 -16 28 34 -7 4 61 -12 -43 59 25 -27 -26 -6 -43 -14 -5 7 -38 23 21 -57 -14 -37 -32 51 -21 -18 -41 -40 -30 42 -9 -17
4007 -17 -18 -14 -25 16 -14 -10 -74 1 26 -32 -42 -19 -63 -113 1 27 -63 -63 55 2 -66 48 0 12 -41 7 42 -17 9 -31 5
4038 5 -6 -26 -61 23 31 -22 -20 1 -2 -18 9 -51 -8 -2 8 -4 -5 57 0 -19 1 -19 -11 -20 -56 -93 -15 -20 -24 19 -4 9 -34 0 14
4073 14 -12 16 40 -41 67 -29 -42 -17 -36 -54 -14 9 11 -23 16 30 -60 -25 34 18 -22 34 -3 -14 32 33 -20 45 14 37 -10
4104 -10 -13 -9 13 -34 -17 -20 24 29 -27 -13 14 16 17 -34 -15 17 -12 -9 -71 -29 10 7 6 31 -2 -34 -14 20 -23 17 -2 15 24 7 -39
4139 -39 27 -25 -8 -13 25 23 6 12 7 32 -32 9 4 -95 6 -34 -7 21 15 -3 21 23 -33 -37 -26 45 -20 -28 25 -11 28 9 11 -62 30
4174 30 42 -47 15 21 -50 -14 28 -13 41 -11 25 0 31 -6 -30 -10 11 -23 8 24 -9 -46 20 -15 17 -4 -32 -31 -15 -13 3 -54
4206 -54 23 -21 -35 18 30 3 1 4 -53 -23 -17 -77 -23 16 -7 -21 11 7 -5 -7 -1 -9 -36 1 -16 -53 7 37 1 5 37 26 43 -6
4240 -6 42 -53 -3 4 -48 -10 23 32 -15 -26 13 35 19 10 -9 34 -10 -2 -19 10 -29 -42 4 -8 25 -40 25 -17 33 7 0 -8 -28 -33
4274 -33 -34 5 -47 -69 -27 10 3 -23 17 -4 -18 0 -26 -8 16 7 -48 -32 9 -13 -4 10 9 34 -16 30 -94 12 5 -20 19 57
4306 57 -12 -60 23 16 13 21 23 -38 2 5 5 17 -24 -18 9 14 25 40 13 45 -51 -85 4 -30 -25 -11 -11 -44 -39 5 -32 -24 10 -17 -57 4
4342 4 -37 19 -6 4 -19 44 44 -50 28 61 25 14 3 32 17 33 -9 9 -9 26 17 -7 -13 -26 -21 -18 0 40 32 34 -12 -92 52 -56
4376 -56 -71 -30 35 25 -27 33 -48 5 50 -23 -15 56 39 -55 -4 10 -9 35 4 -4 15 28 45 -40 7 -15 -5 27 -7 5 -60
4407 -60 -7 9 -56 27 -64 1 7 -5 -38 42 15 -10 -40 -2 -4 -26 53 29 -78 -26 14 0 -27 1 46 -21 30 12 17 -5 15
4438 15 -7 -15 33 -3 -8 2 41 -51 -43 -10 23 -26 12 -2 -8 -40 -22 16 30 -63 -59 -28 -25 -12 -15 26 -29 -30 -26 -41 -7 28 -1 1 -55
4473 -55 -60 9 19 5 -9 -26 50 14 13 -5 48 22 13 78 44 2 5 11 40 -14 -13 1 -26 -9 -31 6 26 36 -17 12 -13 -48 -40 -7
4507 -7 -29 -13 -14 7 -36 19 22 -13 31 44 13 -28 16 66 -7 20 -27 -22 1 11 10 5 24 -2 -25 -9 1 -25 0 -6 -23 -26 -40 19
4541 19 -75 -35 -15 -32 13 -59 -51 6 -5 3 -18 -14 14 -21 49 16 5 -5 4 -28 -2 51 -36 11 7 -27 -6 5 -28 -20 -16 8 49 -25
4575 -25 89 -44 9 51 19 -5 -46 13 20 -28 31 12 11 -17 16 -12 -8 13 -60 15 32 9 -51 32 0 0 2 28 16 -41 -54 -11
4607 -11 12 -50 -5 -15 51 18 4 7 27 24 56 36 10 22 11 -18 -85 -38 -35 -65 2 26 -21 -42 -5 29 -47 -20 -20 -40 -12 -39
4639 -39 12 -35 -7 -20 19 18 -22 1 13 57 -8 17 38 31 -27 -30 -4 -44 -19 61 -39 -8 16 23 2 5 8 -13 -7 -35 -22 17 -16
4672 -16 24 -7 27 -8 2 13 12 -33 4 14 12 -83 -19 -16 -53 34 1 3 20 10 27 -37 -9 -17 -5 -14 11 1 -27 11 51 10 0
4705 0 -39 11 34 6 1 24 -1 18 -24 -19 32 -25 10 41 -25 -13 73 23 -8 17 37 47 21 -5 6 28 -24 -14 17 -37 60 3
4737 3 -26 33 -26 -41 63 26 35 16 -5 -28 -1 9 53 19 46 -18 11 7 -17 51 -42 -1 -7 -10 5 27 23 -50 5 -7 -1 -25 39
4770 39 9 11 -26 4 25 -3 53 14 30 23 -18 1 5 1 27 -10 43 -28 -39 26 -54 -10 41 45 23 -23 -43 43 4 -5 -38 -11 8
4803 8 -46 54 -16 34 -6 -42 34 -6 -3 40 -20 4 -21 41 24 38 -17 0 26 -17 28 -21 -5 -31 52 -25 31 -29 2 -5 11
4834 11 -12 16 10 3 5 48 -7 -43 -2 11 -28 -73 9 -15 -11 -3 33 -24 -23 -31 35 38 -35 -44 -42 -19 5 -16 -29 -34 -20 23 -9 -60 -21 -19
4870 -19 21 -30 -5 16 11 32 -59 -24 67 -10 6 16 -6 7 24 47 21 3 -55 -24 4 52 31 1 13 -9 20 4 -11 21 -22
4901 -22 -31 35 -30 1 10 36 -40 38 -2 2 24 -50 27 -45 -38 -27 33 3 -12 -21 -1 -9 -47 -17 -54 -58 -1 34 -31 26 59 -23 -40 -2
4935 -2 38 13 47 68 23 27 12 -18 1 16 -21 -24 -14 0 -17 -40 40 -23 27 58 -12 20 12 -4 -18 42 94 15 -9 -27 -3 -38
4967 -38 40 10 -8 30 -35 -9 -15 9 5 -44 4 -14 -12 -20 8 21 -21 -6 -15 10 6 26 -38 -2 -11 -25 13 -15 -35 -5 20 61 2 -44
5001 -44 -23 -20 -6 4 4 -5 0 36 -33 -25 -18 -6 -14 18 -8 -64 13 19 -14 39 -20 13 49 -2 23 1 38 -3 24 3 -9 -9 41 10 34
5036 34 -5 -26 22 1 5 2 21 83 -12 -32 -15 -32 23 14 -63 15 -33 -28 -17 26 30 -11 44 -41 -12 -46 -47 -30 8 9 -11 -43 -6 12
5070 12 -1 -20 -37 41 -23 -20 -14 33 -15 11 -15 -29 -30 -2 1 -35 19 -1 -27 -48 -5 -17 -9 17 -12 -13 3 2 2 38 15 -39 17 -23
5104 -23 -6 -48 11 -24 55 7 39 -16 -11 -69 14 -45 -31 70 -22 -36 44 -24 -7 -8 -7 39 19 63 -27 40 25 35 -35 13 2
5135 2 -45 -26 12 -4 8 17 -40 10 -6 -2 27 -16 31 -1 -3 12 -10 30 14 -41 -4 34 32 10 -33 -14 4 48 26 34 38 20 10 -49
5169 -49 1 -52 3 19 25 -6 11 -5 -8 -10 -9 49 -43 10 0 -18 10 13 -2 -42 6 -38 -5 11 -34 -16 46 -35 52 -10 -51 -3 -10
5202 -10 80 -20 -17 22 -44 -29 26 2 -12 7 -23 -17 -5 -15 -32 -7 -9 23 -48 -18 56 7 20 10 29 -5 16 -32 18 34 -54
5233 -54 -8 -35 -9 -47 22 36 22 32 -36 -24 4 -14 9 18 23 -46 25 -17 34 -12 21 -8 21 -35 -9 58 -31 -15 -3 21 -43
5264 -43 -27 0 6 27 25 12 8 -21 -22 -29 7 -10 10 1 3 -29 -67 25 13 -33 11 51 19 37 -53 -8 8 42 -20 -23 -25 -14 20 -74 -21
5299 -21 25 -6 24 27 5 18 -23 -20 5 36 -33 -16 5 -35 -35 55 55 -46 -14 -36 -15 16 -41 -11 -62 43 -10 46 61 10 -3
5330 -3 -24 14 -10 -3 7 -14 -4 54 -16 -31 -12 11 29 -34 9 -20 13 18 -28 0 9 -7 8 28 26 -7 -61 -10 -17 -68 42 18 -15
5363 -15 4 32 54 19 -52 61 45 -13 34 -37 45 -20 34 -39 7 -57 -6 36 6 -86 -22 -32 -14 -26 -23 -44 -2 -14 -9 4 -9
5394 -9 37 18 67 21 -12 10 -4 14 23 -20 54 22 11 11 15 -4 -35 -11 -18 40 -23 75 6 -22 -12 12 2 -22 16 -12 26 -4 87
5427 87 44 -1 67 -36 -21 4 22 2 -5 26 22 -49 0 -49 -21 38 -9 -44 31 -26 -15 31 6 0 -4 -2 33 4 -53 -1 7 -9 17
5460 17 -34 -31 35 1 17 21 39 0 15 -11 6 5 -16 25 -37 12 17 22 15 -14 34 14 -13 -34 -14 12 -27 -80 -25 -30 -40 -27 -47 32
5494 32 1 -10 -12 -43 9 -24 1 4 -39 -5 22 32 -20 1 33 -16 9 3 -25 -8 9 -49 -42 7 27 18 -36 1 -2 4 -19 26 -30 -35
5528 -35 3 22 27 -12 0 -5 -24 5 22 34 10 -40 16 -8 -2 -2 44 -62 -28 42 -16 -39 39 44 -11 -27 40 -16 -47 85 -17
5559 -17 17 -12 13 -76 16 26 -13 -13 7 -20 -39 18 -31 -30 11 -53 6 52 -35 -12 -13 -1 25 19 -4 18 -4 14 6 -7 13 12 27
5592 27 -69 59 6 31 72 17 46 20 -17 -19 -25 -64 -21 16 16 28 -31 -6 -17 6 -22 23 -22 53 -3 11 46 40 -3 -33 -23 35
5624 35 -9 16 24 52 31 -17 22 30 16 -33 0 9 2 -64 -23 34 -14 -41 19 -6 -6 -2 44 22 18 11 11 -3 54 44 21 -45 -2 -4 25
5659 25 54 -7 -4 -6 9 -49 -8 7 -38 -12 27 11 -27 -19 75 24 10 19 38 -22 -1 52 -17 -19 22 -12 -57 -28 2 5 -7 -58 -16
5692 -16 5 -32 39 3 -52 -67 -21 -7 -15 3 9 -4 17 -29 -14 -5 22 22 5 26 27 35 -45 12 14 19 49 13 36 13 25 -45 1 61
5726 61 4 27 -10 10 -84 -36 7 14 36 64 30 -17 29 6 -36 -57 -28 14 -36 -3 -50 10 -17 10 -29 39 -49 43 31 -26 17
5757 17 26 55 21 14 -28 -39 88 37 -26 0 34 15 32 13 28 -25 34 27 -9 -1 -1 -29 -81 10 19 -15 -45 -51 -8 12 6 32 38 -44
5791 -44 -59 -11 -28 -19 -2 15 -55 41 -3 -49 -2 -45 -19 10 -35 -29 14 11 2 -22 8 -12 24 27 0 7 -52 2 -1 10 -6 24 -58 -14
5825 -14 33 -10 -3 -29 11 35 -36 23 36 -23 -26 -35 -14 -71 17 -2 -8 -21 -9 23 -10 -10 -41 27 27 -28 17 -32 18 -31 9 -5 9
5858 9 -25 -6 -3 -4 17 -53 -37 -29 -27 43 7 -8 -79 0 -3 -1 -5 47 -11 19 -15 -4 47 -15 22 -15 52 7 -56 -14 -42 -30 -47 28
5892 28 37 26 54 -7 -35 50 18 42 -13 7 1 23 -28 -55 -31 -28 -2 -20 -5 -15 10 24 16 -23 -11 14 -31 -19 -34 19 43 -21
5924 -21 -31 -29 60 -26 -61 17 -39 8 5 -10 -18 2 24 15 25 -8 5 -6 18 65 -7 60 -5 -12 -8 -18 26 20 -13 -12 15 10 21 13 -31
5959 -31 -12 -43 10 -10 43 1 7 -3 26 -22 48 -3 2 -25 7 -14 20 32 -15 18 -60 0 -18 47 -15 -25 -20 -38 6 -54 -15 -45
5991 -45 -45 10 -20 -15 1 -16 -48 -9 17 -11 -11 -17 -9 35 -3 2 -31 2 36 -22 24 69 37 -23 -22 -51 -9 41 -70 21 -24 -58 -12
6024 -12 1 -7 -12 -8 -29 10 -7 7 36 13 3 1 -5 35 21 37 19 -31 27 7 5 50 -8 -42 8 -8 -5 -17 -2 -4 -31 16 37 7
6058 7 -36 61 26 -37 18 4 23 14 57 33 -11 -21 16 23 3 45 6 -7 -64 -22 -85 23 44 11 16 -20 -18 16 18 -12 6 -37 -34
6091 -34 -15 9 -3 20 3 -31 -22 59 3 -7 53 37 10 20 -27 51 -2 21 12 -34 12 -19 -6 -15 -4 45 -36 12 39 -28 20 39
6123 39 -26 -25 3 4 18 37 -18 -33 -38 -9 -7 -12 4 -11 2 -12 9 -25 -26 4 40 18 -2 44 -54 7 -58 -31 71 18 36 -6 -19
6156 -19 26 -42 -11 -25 26 59 4 33 -11 -40 -17 3 9 4 -6 -12 -28 -1 3 33 -18 17 27 -10 84 -8 -74 6 4 -26 -9 -14 -26
6189 -26 -10 5 11 8 -1 3 26 -26 19 73 1 19 -29 -55 15 9 -63 22 44 33 -11 -8 -14 -23 -26 -22 -22 -5 33 -34 -30 46 -8 -6 42 41 -6
6226 -6 -54 23 -2 10 27 11 38 12 -23 2 12 38 2 -3 -23 10 -18 -72 -37 -28 -7 -33 -22 -26 -28 0 40 13 17 -1 31 -48 27
6259 27 -15 -12 42 16 26 43 -39 28 -44 19 31 -53 8 24 37 -49 12 31 49 20 13 -17 -52 12 16 11 -5 2 53 0 -34 48 -22
6292 -22 20 -27 3 -42 36 31 14 8 -73 -11 -23 20 23 6 5 -2 -10 36 31 25 19 -22 85 -25 5 24 28 14 -44 -16 11 3 21 -39 16
6327 16 26 21 45 20 38 -31 28 -22 -31 56 49 19 0 1 -7 23 -90 -1 -17 30 -17 21 31 3 61 -18 6 11 24 34 -20 51 -11
6360 -11 24 -5 0 -5 14 7 7 31 -48 -2 -20 -3 47 25 -48 -17 10 -21 -9 32 4 -9 -49 28 80 10 -7 18 -7 59 43 43 -3
6393 -3 -16 24 1 -33 29 28 68 54 14 -2 21 35 49 24 -13 37 -1 29 21 1 16 -27 6 -17 6 0 3 -5 12 19 7 9 -39 -15
6427 -15 -45 -15 -47 -31 23 8 -31 60 59 8 -55 34 -2 -17 8 23 -15 -23 23 38 61 -55 -10 4 11 -8 -44 15 -4 -73 19
6458 19 -14 7 -13 -89 -56 0 -34 -12 -12 3 -26 10 3 -57 -35 -8 24 -14 -10 5 -7 -9 15 64 20 61 -3 39 -6 54 15 -15
6490 -15 1 29 -11 -18 21 31 30 -4 34 -36 14 42 -37 23 26 4 -46 -38 -19 13 -27 -20 36 -47 9 -1 -28 -6 -12 -47 59 -34 -31
6523 -31 14 44 -28 12 -10 27 13 5 -7 56 39 12 20 -8 -32 10 11 -28 8 8 -22 -19 27 5 45 -20 -22 33 -45 14 38 58 -1
6556 -1 26 -8 28 2 -36 24 3 -37 31 44 4 6 -28 -2 7 61 19 10 19 -18 -30 -53 -41 11 -6 11 1 10 -52 -8 1 35 -6 -15
6590 -15 -6 -41 -9 -44 -20 10 21 4 -6 34 -23 25 -8 -9 -28 -8 -3 -42 10 13 30 11 -9 -5 -16 0 -4 4 19 11 43 7 32 17
6624 17 3 27 -37 7 22 -15 11 -4 -31 -12 13 -45 -26 24 -21 -33 0 5 -5 -14 20 58 -36 0 20 20 48 29 55 17 2 26
6656 26 22 23 -15 -53 -21 24 18 15 11 -27 -2 25 -8 30 -76 -8 -10 7 -41 -29 13 56 -12 12 13 -45 -1 1 25 42 8 53 -4 21
6690 21 21 -27 43 -90 -29 20 -16 -4 27 -17 23 -2 -59 -47 -27 11 4 1 -44 11 -31 30 -15 -2 -29 7 -42 -4 -5 20 -39 -6
6722 -6 -61 8 33 34 1 23 18 -27 -16 33 19 39 -70 6 69 7 42 30 -2 -52 -59 10 17 -2 -5 25 13 3 74 63 48 -24 18
6755 18 16 4 -9 -11 -13 9 73 51 -15 -4 -37 -35 -22 -11 24 12 38 13 12 17 -28 -33 20 -8 14 -6 12 17 28 -1 13 67 -29 -9
6789 -9 33 10 -46 35 -3 47 1 -36 17 10 31 -7 4 -5 40 9 18 -23 54 15 5 -23 -29 -23 5 18 -48 41 10 37 -12 19 -9
6822 -9 10 -6 -16 1 18 -21 43 -36 -32 24 -15 45 -17 -42 46 -12 -21 43 -37 -22 19 -9 -3 -24 26 -44 16 -6 -27 27 -20 11
6854 11 -46 -3 2 -35 -17 25 -34 -9 -25 9 3 -24 37 -30 -11 6 -9 -10 -18 -22 31 1 -1 -19 50 -93 53 -11 -2 61 -1 -31 11
6887 11 -29 -39 5 -18 14 -2 5 7 -32 -9 38 -40 30 17 -11 -56 -11 67 -32 60 -28 -1 -15 15 10 -30 16 5 11 8 -17 29 -24
6920 -24 32 7 4 9 -62 -1 50 -8 23 -42 -18 16 -15 -17 -39 23 38 -1 52 29 -5 47 31 -7 -29 -5 -10 5 18 -2 39 30 -44
6953 -44 -45 30 0 12 7 4 8 -37 35 5 -61 -22 1 -60 10 17 26 13 31 -22 -17 -67 -21 -9 23 1 -12 -5 -16 0 -9 11 20 22 10 10
6989 10 32 28 -14 -8 -58 15 -22 18 23 -30 20 -74 -23 13 33 10 -9 -17 -56 -13 27 1 -36 10 33 32 -40 34 45 38 -3 8 -4
7022 -4 42 -81 4 -12 -24 27 -56 31 -12 8 17 -5 0 22 53 -35 19 38 6 7 42 42 13 10 9 12 25 28 27 8 -15 0 6 -12 -17 22
7058 22 -39 -49 22 -10 27 -20 6 -20 -35 5 -9 24 15 3 -21 3 1 2 32 -47 45 27 50 17 2 15 36 -13 2 22 54 9
7090 9 -1 15 -67 13 -7 -7 -44 9 22 -1 19 18 -20 29 -15 19 17 -8 17 7 26 -31 10 14 8 25 11 -21 -60 -13 -15 -36 35 65
7124 65 43 -30 -10 3 -37 15 -20 -14 59 38 20 7 -5 9 -34 -48 -2 -13 -55 -30 -9 -7 34 -18 19 -61 -62 1 19 13 -25 25
7156 25 29 -10 -29 57 -25 22 54 43 4 27 44 -23 51 -23 2 -24 31 8 -11 8 -37 23 -26 52 32 21 12 28 -2 27 -1
7187 -1 7 -19 17 13 -36 -24 32 0 -55 32 17 -31 -4 26 14 -5 38 36 -48 7 56 64 -13 29 69 43 -22 24 41 -14 -26 31 13
7220 13 -24 20 2 7 -4 -30 3 45 -8 -22 12 28 -13 -5 -64 -13 13 -9 24 -45 26 1 9 -32 -15 44 0 -21 -80 -6 -12 1
7252 1 40 9 2 -14 12 10 6 2 -8 -4 19 0 -24 -2 -48 -10 63 -28 32 10 39 60 -15 20 -68 -59 -14 10 -9 38 11 21 -46 23
7286 23 -9 9 -59 6 28 -13 10 -12 -10 -48 -43 19 -15 -3 11 -13 11 -17 27 -23 -40 -5 27 22 -37 8 47 -26 -12 5 -1 32
7318 32 -49 -2 -38 -19 20 26 -63 -56 47 -2 -21 -10 15 -36 -19 32 -18 -2 54 48 45 17 5 -3 11 23 1 7 18 11 -50 -25 9
7351 9 11 -22 27 -35 18 17 -9 33 0 -19 70 0 24 -7 18 14 -19 15 -14 12 9 -28 19 35 51 34 -30 4 33 24 35 -16 -39
7384 -39 46 -13 -13 -1 -16 -44 55 17 -18 -39 -4 -38 -25 1 20 -43 30 44 -42 -20 -51 2 -23 28 -56 9 -86 -60 -6 -13 -25
7415 -25 -28 4 25 29 48 -8 26 34 36 39 14 -14 57 -1 21 27 -18 13 45 6 -37 21 -28 -44 21 8 -31 -31 5 -14 -1 45 -44 13
7449 13 25 13 19 4 39 16 41 35 12 31 9 19 -9 19 30 -39 6 2 -26 -12 10 55 26 23 36 58 -4 -16 4 35 -46 -43 -24
7482 -24 -8 6 -22 -12 36 29 6 24 -28 73 33 -4 -13 0 -47 -27 -12 37 4 -15 24 14 20 -4 9 21 37 2 24 -6 20
7513 20 22 -9 8 -31 -31 18 -64 -11 27 -11 9 31 -2 50 9 14 -55 -50 -25 -22 10 0 -14 13 -9 17 31 7 21 -23 -12 6 44
7546 44 -45 -19 29 3 63 3 -25 -106 -16 -18 18 38 -67 55 28 16 40 34 2 21 14 10 17 36 0 16 11 22 54 -31 -11 -36
7578 -36 15 10 -21 -20 -41 -34 -8 -5 -30 23 -32 49 -1 3 15 -9 28 -14 45 -6 -4 -9 10 0 -13 41 12 4 0 42 15 28 6 -2 -3 41
7614 41 -8 -36 -18 15 2 17 -9 -36 -40 -8 19 -6 -60 0 -17 22 23 48 38 -32 3 -8 -33 -53 1 9 -41 -14 33 18 75 -11
7646 -11 53 20 -10 -14 14 -30 -29 -41 10 -73 -17 -38 33 -32 -37 47 26 -1 -31 24 10 -7 -50 0 -32 -15 25 18 3 -7 -42 -55
7678 -55 35 5 -38 -20 -44 -12 1 -22 -29 -23 12 27 61 -7 61 8 12 -21 -29 -29 -16 4 -4 32 -35 -16 -1 -46 -41 9 19 51 -4 -86
7712 -86 -19 -43 7 -31 -13 1 3 3 -35 -25 0 2 29 -12 18 17 24 -19 16 45 -58 -38 41 14 -29 -28 -10 -3 -18 -16 29 -27 10 4
7746 4 -14 -7 7 -43 28 22 55 30 20 1 24 23 8 24 11 -36 57 38 -27 11 -31 -51 -36 13 7 21 -17 41 -58 -7 19 14 24
7779 24 -12 15 18 21 -19 41 -6 5 25 -34 15 11 -13 -21 -5 -18 1 -15 40 26 60 -5 24 33 -36 29 25 21 -46 -22 15 9 5 1 5 -28
7815 -28 -2 -15 -20 -1 1 -8 -13 37 0 -2 -51 -54 -10 26 26 -1 -22 16 -15 -2 6 -4 13 -41 8 6 51 -11 16 -31 -26 26 9 13 33 -49
7851 -49 -40 61 2 -31 33 14 12 -40 29 -14 16 -52 15 31 -13 33 -19 -10 41 -50 22 -33 -17 -32 -44 -20 -13 -54 12 23 -40 7
7883 7 76 18 2 15 -17 -13 40 17 12 -24 21 56 30 -35 1 17 18 -6 0 -35 19 28 13 16 -11 32 14 -45 32 21 -25 -24 7 1 41
7918 41 -2 6 8 40 -32 -29 11 32 9 56 -49 3 9 -35 61 -15 6 -5 -29 87 9 -15 22 18 21 7 -19 -13 -32 -15 22 26 15
7951 15 8 -41 -34 21 -56 -46 -23 -4 -47 -42 -54 -49 -11 -15 -24 -16 34 32 -10 -29 40 5 -5 -11 12 -2 -41 12 -54 52 5 -15 29 -71
7985 -71 -58 -13 2 5 -45 -29 16 -24 10 -3 31 8 5 44 12 -23 17 8 23 -18 -36 20 14 -29 7 7 -60 7 24 -13 18 7 26
8018 26 33 5 2 40 40 -11 31 -35 -3 -16 -33 -3 5 -57 5 26 45 13 21 24 -64 -45 36 -69 -4 -29 19 19 15 -30 -25 -19 -15 -6 13 -12
8054 -12 -4 22 18 12 65 34 13 21 30 -10 26 28 -4 80 -25 -41 5 25 -10 -2 -36 -33 6 30 -22 31 14 -3 7 -28 -52 -63 -60 -11
8088 -11 0 -39 25 -36 -86 -16 2 -13 -16 -11 -28 14 4 -35 -16 -9 9 -8 55 -28 26 -86 -5 20 73 23 -15 8 25 -1 -3 32
8120 32 -11 0 -15 26 30 -22 43 -13 -11 -12 -28 -38 -1 -46 1 23 -21 -3 1 -12 6 34 -15 -36 31 -8 -10 32 -7 5 -11 -7 -29
8153 -29 -85 37 -36 5 -15 38 -36 18 -27 40 -12 -54 34 39 3 26 38 27 -30 -2 -41 -9 17 -15 3 -13 -9 13 21 14 -52 38
8185 38 -20 0 -4 -59 23 22
8191B2
##END NTUPLES=NMR FID
##END=
