##TITLE=1H_2MTBDP1301
 CDCl3
 8 sc, 
 16.1.2023
##JCAMPDX= 6.0         $$ Bruker NMR JCAMP-DX V2.0
##DATA TYPE= NMR FID
##DATA CLASS= NTUPLES
##ORIGIN= UXNMR, Bruker Analytische Messtechnik GmbH
##OWNER= root
$$ XWIN-NMR		Version 3.5
$$ Mon Jan 16 14:04:39 2023 Russian Standard Time (UT+4h)  she@DPX200
##.OBSERVE FREQUENCY= 200.13135
##.OBSERVE NUCLEUS= ^1H
##.DELAY= (6, 6)
##.ACQUISITION MODE= SIMULTANEOUS
##.ACQUISITION SCHEME= undefined
##.AVERAGES= 8
##.DIGITISER RES= 18
##SPECTROMETER/DATA SYSTEM= spect
##.PULSE SEQUENCE= zg30
##.SOLVENT NAME= CDCl3
##.SHIFT REFERENCE= (INTERNAL, CDCl3, 0, 15.7039)
##AUDIT TRAIL= $$ (NUMBER, WHEN, WHO, WHERE, WHAT)
$$ ##TITLE= Audit trail, XWIN-NMR		Version 3.5
$$ ##JCAMPDX= 5.01
$$ ##ORIGIN= Bruker BioSpin GmbH
$$ ##OWNER= she
$$ F:/spectra/data/she/nmr/H-F/1/audita.txt
$$ ##AUDIT TRAIL=  $$ (NUMBER, WHEN, WHO, WHERE, WHAT)
(   1,<2023-01-16 14:03:36.96 +0400>,<she>,<DPX200>,
      <created by zg, POWCHK disabled, PULCHK disabled
       configuration hash MD5:
       00 E9 B6 7A A2 85 ED C7 34 08 36 98 17 FE 4E 26
       data hash MD5: 16K
       7F 9F E4 B4 22 BE C0 9C F0 84 41 A4 1D 39 8D 0E>)
$$ ##END=
$$ 
$$ hash MD5
$$ 37 72 07 3F 9B D4 68 BB 60 B6 3B DC 84 03 B9 16
##$RELAX= 
##$RELAX= 
##$RELAX= 
##$RELAX= 
##$RELAX= 
##$RELAX= 
$$ Bruker specific parameters
$$ --------------------------
##$DU= <F:/spectra>
##$EXPNO= 1
##$NAME= <H-F>
##$PROCNO= 1
##$TYPE= <nmr>
##$USER= <she>
##$AMP= (0..31)
100 100 100 100 100 100 100 100 100 100 100 100 100 100 100 100 100 100 
100 100 100 100 100 100 100 100 100 100 100 100 100 100 
##$AQSEQ= 0
##$AQ_mod= 1
##$AUNM= <au_zg>
##$AUTOPOS= <>
##$BF1= 200.13
##$BF2= 200.13
##$BF3= 200.13
##$BF4= 200.13
##$BF5= 200.13
##$BF6= 200.13
##$BF7= 200.13
##$BF8= 200.13
##$BYTORDA= 1
##$CFDGTYP= 0
##$CFRGTYP= 5
##$CHEMSTR= <none>
##$CNST= (0..31)
1 1 145 1 1 1 1 1 1 1 1 1 1 1 1 1 1 1 1 1 1 1 1 1 1 1 1 1 1 1 1 1 
##$CPDPRG= <>
##$CPDPRG1= <>
##$CPDPRG2= <>
##$CPDPRG3= <>
##$CPDPRG4= <mlev>
##$CPDPRG5= <mlev>
##$CPDPRG6= <mlev>
##$CPDPRG7= <mlev>
##$CPDPRG8= <mlev>
##$CPDPRGB= <>
##$CPDPRGT= <>
##$D= (0..31)
0 1.2 0 0 0 0 0 0 0 0.06 0 0.03 0 0 0 0 0.0002 0 0 0 0 0 0 0 0 0 0 0 0 
0 0 0 
##$DATE= 1673863416
##$DBL= (0..7)
120 120 120 120 120 120 120 120 
##$DBP= (0..7)
150 150 150 150 150 150 150 150 
##$DBP07= 0
##$DBPNAM0= <>
##$DBPNAM1= <>
##$DBPNAM2= <>
##$DBPNAM3= <>
##$DBPNAM4= <>
##$DBPNAM5= <>
##$DBPNAM6= <>
##$DBPNAM7= <>
##$DBPOAL= (0..7)
0.5 0.5 0.5 0.5 0.5 0.5 0.5 0.5 
##$DBPOFFS= (0..7)
0 0 0 0 0 0 0 0 
##$DE= 6
##$DECBNUC= <off>
##$DECIM= 32
##$DECNUC= <off>
##$DECSTAT= 4
##$DIGMOD= 1
##$DIGTYP= 9
##$DL= (0..7)
0 120 120 120 120 120 120 120 
##$DP= (0..7)
150 150 150 150 150 150 150 150 
##$DP07= 0
##$DPNAME0= <>
##$DPNAME1= <>
##$DPNAME2= <>
##$DPNAME3= <>
##$DPNAME4= <>
##$DPNAME5= <>
##$DPNAME6= <>
##$DPNAME7= <>
##$DPOAL= (0..7)
0.5 0.5 0.5 0.5 0.5 0.5 0.5 0.5 
##$DPOFFS= (0..7)
0 0 0 0 0 0 0 0 
##$DQDMODE= 0
##$DR= 18
##$DS= 0
##$DSLIST= <SSSSSSSSSSSSSSS>
$$ [...]
##$SUBNAM2= <"">
##$SUBNAM3= <"">
##$SUBNAM4= <"">
##$SUBNAM5= <"">
##$SUBNAM6= <"">
##$SUBNAM7= <"">
##$SUBNAM8= <"">
##$SUBNAM9= <"">
##$SW= 18.05172834244
##$SWIBOX= (0..15)
0 0 2 0 0 0 0 0 0 0 0 0 0 0 0 0 
##$SW_h= 3612.71676300578
##$TD= 16384
##$TD0= 1
##$TE= 0
##$TE2= 300
##$TE3= 300
##$TEG= 300
##$TL= (0..7)
0 120 120 120 120 120 120 120 
##$TP= (0..7)
150 150 150 150 150 150 150 150 
##$TP07= 0
##$TPNAME0= <>
##$TPNAME1= <>
##$TPNAME2= <>
##$TPNAME3= <>
##$TPNAME4= <>
##$TPNAME5= <>
##$TPNAME6= <>
##$TPNAME7= <>
##$TPOAL= (0..7)
0.5 0.5 0.5 0.5 0.5 0.5 0.5 0.5 
##$TPOFFS= (0..7)
0 0 0 0 0 0 0 0 
##$TUNHIN= 0
##$TUNHOUT= 0
##$TUNXOUT= 0
##$USERA1= <user>
##$USERA2= <user>
##$USERA3= <user>
##$USERA4= <user>
##$USERA5= <user>
##$V9= 5
##$VALIST= <valist>
##$VCLIST= <CCCCCCCCCCCCCCC>
##$VD= 0
##$VDLIST= <DDDDDDDDDDDDDDD>
##$VPLIST= <PPPPPPPPPPPPPPP>
##$VTLIST= <TTTTTTTTTTTTTTT>
##$WBST= 1024
##$WBSW= 4
##$XGAIN= (0..3)
0 0 0 0 
##$XL= 0
##$YL= 0
##$YMAX_a= 711920
##$YMIN_a= -589284
##$ZGOPTNS= <>
##$ZL1= 120
##$ZL2= 120
##$ZL3= 120
##$ZL4= 120
##$ABSF1= 10
##$ABSF2= 0
##$ABSG= 5
##$ABSL= 3
##$ALPHA= 0
##$AQORDER= 0
##$ASSFAC= 0
##$ASSFACI= 0
##$ASSFACX= 0
##$ASSWID= 0
##$AUNMP= <proc_1d>
##$AZFE= 0.1
##$AZFW= 0.1
##$BCFW= 1
##$BC_mod= 2
##$BYTORDP= 1
##$COROFFS= 0
##$CY= 11.3945322036743
##$DATMOD= 1
##$DC= 2
##$DFILT= <>
##$DTYPP= 0
##$F1P= 2.36226072786647
##$F2P= -0.459571619588291
##$FCOR= 0.5
##$FTSIZE= 0
##$FT_mod= 4
##$GAMMA= 1
##$GB= 0.15
##$INTBC= 1
##$INTSCL= 1
##$ISEN= 128
##$LB= 0.24
##$LEV0= 0
##$LPBIN= 0
##$MAXI= 10000
##$MC2= 0
##$MEAN= 0
##$ME_mod= 0
##$MI= 1.114404
##$NCOEF= 0
##$NC_proc= 0
##$NLEV= 6
##$NOISF1= 3.799351
##$NOISF2= 2.8
##$NSP= 1
##$NTH_PI= 0
##$NZP= 0
##$OFFSET= 15.70392
##$PC= 1
##$PHC0= -19108.72
##$PHC1= 12.60073
##$PH_mod= 1
##$PKNL= yes
##$PPARMOD= 0
##$PSCAL= 0
##$PSIGN= 0
##$REVERSE= no
##$SF= 200.130013532006
##$SI= 16384
##$SIGF1= 3
##$SIGF2= 2
##$SINO= 400
##$SIOLD= 16384
##$SREGLST= <1H.CDCl3>
##$SSB= 0
##$STSI= 0
##$STSR= 0
##$SW_p= 3612.71676300578
##$SYMM= 0
##$S_DEV= 0
##$TDeff= 0
##$TDoff= 0
##$TI= <>
##$TILT= no
##$TM1= 0
##$TM2= 0
##$TOPLEV= 0
##$USERP1= <user>
##$USERP2= <user>
##$USERP3= <user>
##$USERP4= <user>
##$USERP5= <user>
##$WDW= 1
##$XDIM= 8192
##$YMAX_p= 0
##$YMIN_p= 0
$$ End of Bruker specific parameters
$$ ---------------------------------
##NTUPLES= NMR FID
##VAR_NAME=  TIME,          FID/REAL,        FID/IMAG
##SYMBOL=    X,             R,               I
##VAR_TYPE=  INDEPENDENT,   DEPENDENT,       DEPENDENT
##VAR_FORM=  AFFN,          ASDF,            ASDF
##VAR_DIM=   8192,          8192,            8192
##UNITS=     SECONDS,       ARBITRARY UNITS, ARBITRARY UNITS
##FACTOR=    0.0002768,     1,               1
##FIRST=     0,             0,               0
##LAST=      2.2672688,     0,               0
##MIN=       0,             -589284,         0
##MAX=       2.2672688,     711920,          0
$$ Real data points
##PAGE= N=1
##DATA TABLE= (X++(R..R)), XYDATA
0 0 0 0 0 0 0 0 0 8 -8 8 -8 16 -16 24 -32 40 -48 56 -72 88 -104 122 -144 176 -204 240 -276 320 -368 424
30 424 -485 552 -629 712 -805 903 -1018 1140 -1274 1421 -1582 1759 -1951 2159 -2391 2639
46 2639 -2913 3213 -3540 3902 -4295 4733 -5219 5758 -6363 7041 -7813 8698 -9730 10943
60 10943 -12393 14170 -16404 19308 -23253 28947 -37931 54292 -93782 396358 242052 -139170
72 -139170 711920 339710 -288442 39438 216864 -344208 -219676 -809 -337863 -337521 18575
83 18575 -229818 -300344 80476 10767 -174939 180755 122649 -227097 101624 278892 -274478
94 -274478 -141944 452295 91141 -258762 370375 471225 -127793 46638 405296 -42706
104 -42706 -205615 131903 -85218 -357717 -71607 -109529 -401661 -165879 -22594 -264694
114 -264694 -79569 182959 -33971 52974 391741 126975 -48657 343639 224286 -227497
124 -227497 53617 266486 -200658 -199057 216756 -30058 -279557 87598 100980 -231917
134 -231917 -36104 147562 -130751 -108151 113534 -73702 -141160 82625 -37236 -158204
144 -158204 114005 97679 -126952 124214 267151 -61908 135 287186 825 -184705
154 -184705 145753 66362 -278385 -48473 126289 -200166 -175888 123644 -35845 -161414
164 -161414 93203 84041 -72188 89593 117200 -60758 57411 127305 -106134 -47650 144650
175 144650 -74423 -150926 138274 47760 -191372 57188 161954 -150528 -77266 186949
185 186949 -36655 -171298 106732 76599 -153853 -35 106863 -77344 -36274 97017
195 97017 -24184 -25043 106496 -10227 -59741 108908 18183 -133269 52338 78863 -155655
206 -155655 -44493 137604 -80759 -130623 131098 44857 -150077 53688 137173 -88575
216 -88575 -37519 132894 -6949 -72219 71365 19280 -67116 36800 13366 -78104 33066
227 33066 39404 -103690 -1811 95971 -85037 -74110 122540 -5464 -131098 85982 97678
238 97678 -122215 -3940 149415 -47884 -84901 114374 34560 -100512 35799 57088 -73294
249 -73294 -6479 44905 -62294 -16371 55833 -61916 -43433 87894 -25218 -92723 85392
260 85392 50030 -117259 27658 120922 -82643 -57552 137652 4841 -112475 77404 80975
271 80975 -99493 -9656 90386 -50581 -56352 55603 -23159 -60463 41091 -11457 -68054
282 -68054 49103 24342 -84424 37514 88116 -76257 -20508 127933 -23751 -93520 100854
293 100854 54295 -122443 15766 105211 -79773 -64732 92812 -10418 -89737 44757 29610
304 29610 -69881 14659 38855 -53354 8375 54480 -52627 -13069 82534 -33656 -59500 92514
316 92514 24832 -98704 48340 88771 -91989 -34750 108739 -33733 -98601 69201 35691
327 35691 -98249 8006 65132 -57748 -27890 57937 -23753 -29883 56236 -7354 -36672 65938
339 65938 16905 -66015 49368 58858 -83949 -7737 95548 -54110 -77885 88037 12302
350 12302 -114503 30695 72439 -88130 -34536 88325 -22365 -59458 63994 22489 -52918
361 -52918 35947 34076 -49045 20842 46427 -53677 -2835 70476 -43512 -48952 78699 -1937
373 -1937 -92253 49210 58979 -93995 -15882 93521 -46789 -76549 72872 18248 -86390
384 -86390 25649 59752 -51031 -5366 65371 -18229 -18426 55260 -9302 -34502 48968 466
396 466 -62066 36174 31290 -80866 -3023 70872 -57994 -55732 82739 7314 -83105 46461
408 46461 64440 -68090 -12135 74731 -28738 -48781 51195 6451 -49977 27607 23760 -39014
420 -39014 16887 31526 -39112 5889 48400 -40449 -27164 63073 -16069 -70458 45632 33570
432 33570 -80270 -1230 72240 -40553 -42585 70457 12578 -55849 35476 40640 -46418 -2111
444 -2111 39551 -30149 -19734 31950 -19924 -25084 36178 -9165 -38429 42947 20483 -55978
456 -55978 21745 58054 -50854 -28678 68357 -12999 -67759 40545 32401 -64634 358 56062
468 56062 -31089 -26768 50203 1134 -33859 29966 13616 -32267 16723 16037 -37364 7946 30110
481 30110 -41724 -13049 52720 -20670 -45285 51686 22255 -61281 15324 53942 -44598 -29258
493 -29258 53696 -8359 -49873 30350 23012 -41039 6216 33922 -20524 -4534 30191 -11695
505 -11695 -8160 30626 -13020 -24805 34076 221 -49080 19868 31418 -50682 -14237 51877
517 51877 -20284 -43506 42331 18668 -47822 12897 40208 -29657 -13324 38145 -5988 -21721
529 -21721 24445 5136 -18286 18181 5380 -23214 18073 14972 -36993 3114 35664 -33258
541 -33258 -29766 42153 -2153 -50937 21998 31419 -41990 -7720 44206 -14416 -25881 35070
553 35070 10682 -27267 17341 20833 -19560 5121 18781 -18034 -361 20756 -22377 -13798
565 -13798 30952 -13895 -37747 28681 15385 -48379 3636 42136 -29689 -26043 43559 3803
577 3803 -37526 23967 26318 -30221 1206 31267 -15674 -12403 24725 -5672 -16753 19236 -2067
590 -2067 -21524 19330 6754 -33239 11147 27100 -34489 -14513 40933 -10984 -38560 30151
602 30151 21310 -38672 4370 37607 -19346 -16326 32361 564 -23972 17439 9501 -22435 5530
615 5530 10536 -20653 1151 15257 -21290 -5273 27781 -13928 -21934 32570 8902 -36254 15590
628 15590 32595 -30244 -13167 37574 -7889 -31269 23350 13449 -29480 4340 20899 -18083
640 -18083 -6109 17992 -10780 -9360 17123 -8792 -15877 20903 664 -26786 17508 20508 -29447
653 -29447 -403 37204 -14841 -23597 33986 9451 -34893 11608 26018 -27204 -12102 25867
665 25867 -10020 -21738 16389 2028 -19032 11149 7441 -17698 9340 15484 -20332 796
677 796 26690 -15965 -16827 30488 1496 -31909 18743 23260 -31616 -4735 34465 -13918 -25172
690 -25172 25926 7587 -29066 7482 17116 -19608 -4073 16594 -11528 -7132 17381 -7122
702 -7122 -11584 20733 1164 -21167 16738 15223 -26174 974 28005 -18210 -19861 28004 1878
715 1878 -30868 13215 20561 -24269 -5743 24515 -8164 -14889 16910 2280 -14578 10050 5397
728 5397 -13754 7728 9165 -16691 2564 17687 -15921 -9806 23639 -4908 -23821 18170 13101
741 13101 -27599 545 25477 -15485 -16325 22865 2685 -20597 10781 12652 -14500 1585 13129
754 13129 -9583 -1885 12974 -8840 -6596 15918 -5474 -16062 16003 5640 -23931 6385
766 6385 19819 -20096 -10732 25372 -4378 -23147 16212 12905 -21393 1004 19420 -10526 -8425
779 -8425 15562 -1683 -10041 10968 1335 -11413 9014 5178 -14940 5239 12516 -16299 -4634
792 -4634 19871 -8800 -17721 18469 7257 -23652 5214 20061 -16245 -10150 20144 -1950 -16287
805 -16287 11154 7802 -13372 3172 9601 -9217 -259 9607 -8165 -3275 12449 -6271 -9940
818 -9940 14205 1341 -17321 9011 12933 -17436 -3774 19860 -7152 -15559 14941 6144 -17155
831 -17155 3226 12278 -10204 -4697 10679 -4067 -6024 8041 -1297 -6413 8168 599 -9552
844 -9552 8128 6394 -13134 2657 14348 -11208 -8712 17118 -540 -17393 9868 11431 -15772
857 -15772 -2581 15021 -6631 -10056 10487 861 -10137 5332 3640 -8477 3686 5349 -8984
870 -8984 1998 9736 -9130 -3810 14507 -4048 -12732 13129 7188 -17120 2725 16302 -11273
883 -11273 -9249 15431 91 -14499 7414 7749 -11446 -239 9028 -6535 -3374 8062 -4166
896 -4166 -4935 8683 -2246 -8387 9200 3124 -12994 4985 11678 -12438 -5167 16136 -3414
909 -3414 -14016 11436 7674 -14569 1425 12769 -8108 -6296 10826 -914 -8461 6383 2365
922 2365 -7396 3666 3072 -7786 2765 6383 -9278 -1390 11501 -6055 -9324 12038 2792 -14109
936 -14109 4994 11304 -11009 -4334 13352 -2871 -9975 9055 4349 -9865 2888 7085 -6309
949 -6309 -934 6096 -4664 -2103 6618 -4775 -5172 8997 -1009 -11071 7353 6945 -12761 -819
963 -819 13227 -6930 -9574 12105 2303 -12771 5466 9134 -9843 -2085 10495 -3743 -5710
976 -5710 7740 159 -5940 5728 1428 -7351 5116 4605 -9974 910 10273 -8367 -7148 12197
990 12197 -744 -13158 7197 8162 -12294 -1416 12345 -5572 -8443 10105 2174 -9536 4609
1003 4609 6103 -6731 378 6296 -4790 -1079 6657 -4317 -4112 8448 -1180 -9209 7011 5079
1017 5079 -11126 403 10414 -7371 -7193 10684 296 -11044 5382 6975 -8917 -1241 8474
1030 8474 -3610 -4414 6194 -312 -4263 4577 628 -5178 4408 2825 -7278 2057 7312 -6838
1044 -6838 -3400 9553 -2219 -8928 7270 4584 -9927 892 8649 -6052 -5011 8082 -342
1057 -342 -7087 4132 2926 -5741 1266 3381 -4423 602 4605 -4595 -1481 7021 -2758 -5841 7387
1072 7387 2014 -8819 3606 7730 -7700 -2995 9841 -2284 -8141 6704 3923 -8416 737
1085 737 6405 -4781 -2798 5375 -2060 -3740 4439 -1124 -4526 4594 1398 -6408 3003 5557 -6793
1100 -6793 -1208 8727 -3135 -6461 7904 2918 -8924 2412 7666 -6042 -3687 7389 -887
1113 -887 -5998 4030 2207 -4983 1134 2677 -4068 92 3377 -3848 -1076 4863 -2734 -3862 5625
1128 5625 739 -6702 3505 5419 -6376 -1205 7794 -2219 -5707 5552 2534 -6001 1287 4239
1142 4239 -3481 -1097 3539 -1971 -1809 3034 -1490 -2354 3468 -596 -4283 3344 2069 -5855 956
1157 956 5634 -4431 -3233 6808 -103 -6526 3932 4459 -5417 -582 5571 -2329 -2851 4168 0
1172 0 -3267 2717 917 -3623 2050 1885 -4059 835 3837 -4295 -1926 5730 -1882 -5644 5095 2607
1188 2607 -7005 1043 6213 -4543 -3502 6157 -66 -5359 3377 3150 -4059 787 3620 -2656 -486
1203 -486 3596 -1981 -1755 3766 -1092 -3732 3969 1094 -5720 2042 4772 -5363 -2276 6269 -1525
1218 -1525 -5762 4270 2982 -5621 423 4605 -2836 -2051 4114 -470 -2681 2837 636 -2459 2206
1233 2206 1257 -3271 1640 2790 -3763 -518 4660 -2635 -3633 4963 735 -5755 1843 4054 -4381
1248 -4381 -1715 4533 -1241 -3491 3133 970 -3214 1335 1941 -2703 584 2298 -2359 -154 3299
1263 3299 -2315 -1680 4420 -434 -4348 3580 2844 -5296 80 5343 -3050 -3502 4639 557 -4872 2144
1279 2144 2749 -4045 -436 3266 -2396 -1646 3103 -954 -2408 2868 109 -3244 2752 1975 -4203 897
1295 897 4463 -3368 -2445 5176 2 -5141 3283 3390 -4819 -345 4759 -2337 -2937 3817 66 -3842
1311 -3842 1745 1728 -3012 305 2165 -2577 -325 2818 -2066 -1600 3756 -591 -3478 3221 2561 -4378
1327 -4378 618 4499 -2603 -2647 4482 362 -3924 2203 2486 -3293 -269 2698 -1667 -1553 2095 -739
1343 -739 -1641 1646 -292 -2076 2011 683 -3214 1145 2784 -3048 -1262 3730 -689 -3258 2882
1358 2882 1919 -3569 831 3274 -2118 -1751 3208 -190 -2311 1836 742 -2132 1009 1005 -2223 627
1374 627 1678 -2591 -695 2850 -1844 -2789 3182 474 -4113 1384 2920 -3297 -1031 4049 -938
1389 -938 -2911 3139 1260 -3139 915 2508 -2023 -420 2270 -1220 -1039 2331 -669 -1964 2412
1404 2412 299 -3170 1168 2237 -3072 -949 3370 -1485 -2929 2992 1021 -3667 1030 3118 -2697
1419 -2697 -1238 3249 -557 -2185 1942 871 -1794 865 1290 -1584 541 1531 -1660 -253 2378
1434 2378 -1306 -1686 2562 273 -3092 1352 2014 -2878 -796 2813 -1106 -2527 2128 812 -2487
1449 -2487 588 1600 -1346 -153 1207 -848 -237 1384 -827 -735 1812 -131 -1695 1723 975 -2427
1465 -2427 426 2379 -1963 -1524 2625 -360 -2572 1419 1345 -2454 -347 1962 -1329 -903 1521 -502
1481 -502 -1129 1455 -75 -1323 1488 853 -1905 846 2227 -1787 -526 2620 -721 -2326 2331 1025
1497 1025 -3066 523 2520 -2101 -1539 2252 -440 -2100 1316 720 -1982 357 1105 -1591 -81 1588
1513 1588 -1217 -624 2032 -320 -1738 1772 701 -2238 883 2248 -1828 -945 2621 -338 -2197
1528 -2197 1712 1102 -2211 -11 1668 -1247 -958 1443 -442 -1019 942 -141 -1288 740 256 -1432
1544 -1432 523 1241 -1454 -178 1849 -792 -1339 2011 547 -1999 1107 1836 -1444 -638 1860 -230
1560 -230 -1142 926 237 -1150 444 407 -1215 440 516 -1222 -45 1062 -1119 -966 1684 -320 -1717
1577 -1717 1289 1241 -2073 145 2177 -1194 -1344 1927 381 -1658 961 1079 -1250 247 1292 -871
1593 -871 -403 1234 -565 -1002 1239 -269 -1578 1076 689 -2011 33 1859 -1537 -1247 2214 -289
1609 -289 -2184 1334 1422 -1923 -94 1912 -828 -1005 1663 137 -1100 992 777 -1190 327 1009
1625 1009 -1027 -76 1218 -925 -827 1417 -252 -1806 1120 819 -1798 -108 1615 -1028 -1264 1584
1641 1584 96 -1507 714 952 -1197 19 1173 -463 -382 1057 -236 -407 807 87 -742 886
1657 886 258 -1245 441 1023 -1287 -540 1577 -552 -1468 995 564 -1686 174 992 -947 -613 994
1674 994 -382 -753 854 92 -677 726 313 -901 537 831 -1039 61 1427 -763 -986 1648 38
1691 38 -1769 645 1091 -1561 -338 1318 -560 -1300 1123 182 -1425 515 687 -1205 -48 1033
1707 1033 -773 -227 1084 -208 -741 1092 279 -1346 1016 1154 -1324 -192 1713 -605 -1111 1253
1723 1253 425 -1584 477 1104 -1384 -403 1136 -384 -896 716 -62 -939 433 44 -888 348 679
1740 679 -715 -58 1089 -640 -556 1044 258 -1067 678 879 -812 -156 1221 -529 -780 939 67
1757 67 -814 384 320 -578 -152 287 -454 -106 330 -780 -136 674 -514 -779 758 128 -957 411 963
1776 963 -694 -237 1095 -106 -806 828 285 -828 296 596 -392 -69 601 -494 -162 517 -375 -671
1794 -671 723 -10 -1028 425 587 -1020 -394 962 -420 -905 1005 379 -1090 346 1172 -648 -503
1811 -503 1032 -204 -615 663 240 -677 511 428 -663 76 720 -707 -380 871 -524 -921 683
1828 683 215 -1049 52 772 -763 -314 836 -331 -805 608 404 -673 13 680 -340 -271 672 -21
1846 -21 -261 454 35 -547 411 228 -662 222 483 -652 -201 480 -356 -702 605 -97 -689 295 476 -747
1866 -747 -320 679 -274 -394 394 71 -289 436 231 -176 272 432 -370 145 548 -426 -266 694 -46 -594
1886 -594 662 359 -829 54 525 -636 -490 654 -7 -840 224 397 -661 -71 581 -334 -37 619
1904 619 -256 -309 745 32 -734 709 507 -892 173 818 -477 -430 884 87 -829 740 487 -696
1922 -696 -187 763 -528 -447 603 -148 -649 333 98 -601 373 393 -309 101 655 -278 -402 756 98 -580
1942 -580 597 469 -656 166 854 -448 -529 521 34 -714 484 310 -466 -21 246 -394 -284 394 -421
1961 -421 -204 295 -21 -389 234 246 -561 390 457 -488 -38 722 -240 -513 606 264 -385 57 395 -417
1981 -417 -38 356 -441 -185 426 -273 -487 290 37 -377 294 188 -570 181 503 -501 -302 667 119 -506
2001 -506 439 458 -448 124 636 -144 -229 582 39 -569 167 211 -283 70 438 -521 -193 385 -252 -412 528
2022 528 -81 -587 335 210 -750 30 665 -283 -569 342 327 -456 371 442 -311 94 455 -193 -64 442 32
2043 32 -191 235 65 -311 84 194 -433 -63 377 -449 -447 275 46 -372 129 282 -257 -114 416 -99 -258
2064 -258 161 78 -159 204 119 -78 188 248 -57 131 174 -103 92 250 -113 -113 496 16 -470 187 257 -274
2086 -274 -128 274 -366 -232 232 -154 -360 191 170 -274 33 234 -169 83 280 -30 -137 407 68 -394
2106 -394 274 392 -216 -89 462 -157 -470 397 74 -514 119 226 -343 -190 350 -171 -281 333 141 -289
2126 -289 38 258 -213 115 337 -272 -80 466 -44 -393 453 160 -490 105 338 -245 -118 454 -88 -345
2146 -345 236 260 -369 -42 97 -234 -176 18 -46 -11 94 -19 -189 177 77 -148 104 288 -216 148 285
2167 285 -24 -89 348 205 -232 62 292 -283 -79 124 42 -43 163 -11 -128 168 -66 -212 181 -144 -321
2188 -321 62 165 -363 -110 414 -155 -199 226 87 -256 140 308 -166 79 359 -125 -130 140 47 -232 177
2209 177 55 -373 83 146 -122 -119 261 -160 -215 147 74 -286 138 228 -179 -192 449 90 -408 366 295 -291 147
2232 147 303 -98 49 366 -75 -57 200 109 -229 88 -9 -443 53 258 -200 -276 -9 -240 -176 -62 156 -339
2254 -339 -293 175 -241 -151 219 132 -171 87 314 72 110 113 -27 54 132 44 56 206 20 -102 -45 29 -264 -8
2278 -8 22 -1 64 284 -114 -228 135 133 -87 134 -34 -226 -25 136 -20 43 14 58 16 187 79 -141 248 140
2302 140 -21 245 137 -76 -177 243 -86 -270 181 289 -341 3 165 -114 -132 196 -105 -120 133 -12 -258
2323 -258 87 182 -143 -115 175 1 -35 348 188 -151 94 242 -296 26 215 -35 -243 202 -25 -222 -39
2344 -39 163 -183 -123 328 -172 -162 234 7 -75 247 159 -25 213 176 9 115 279 -83 1 80 180 -101 95
2367 95 180 -403 24 82 -193 -222 -49 -20 -166 56 30 -122 -131 181 -43 11 -2 -57 -39 85 32 -98 184 9
2391 9 -188 139 145 -87 -12 191 -3 -304 179 139 -215 27 -56 -204 97 -23 -246 -32 205 -98 -240 2
2413 2 -249 -335 128 119 -306 -38 226 -80 -224 218 18 -388 164 170 -98 68 211 -78 -97 259 22 -245 277
2436 277 23 -257 177 194 -191 -156 -36 -150 -110 51 -67 -410 -87 240 -112 -49 116 7 -39 95 219 -225
2458 -225 246 248 109 60 2 -120 -37 -35 -79 -198 158 60 -64 50 -122 -156 52 23 -167 -61 10 -148 -83 23
2482 23 69 -29 121 130 85 76 156 -69 24 110 -6 -59 75 -43 -220 11 156 -243 -114 218 -178 -54 -12 -98 -50
2507 -50 217 -36 -99 -83 212 21 -256 146 -44 -150 119 -36 -160 97 186 -158 -2 113 166 -66 190 184
2529 184 -181 117 195 -62 -25 -6 -31 -145 -62 -36 -104 -106 67 -243 -103 65 -27 -104 23 -107 -124 115 38 70 27
2554 27 66 -152 83 -30 -56 46 23 -97 -20 49 32 -178 -143 -148 19 -62 18 24 -10 2 -24 -133 -140 -73 14 6 -24 5
2582 5 32 128 42 -5 133 59 33 -8 106 -46 -1 -65 108 117 -65 68 12 61 176 -128 148 -42 -108 -7 134
2607 134 -198 -95 282 215 -206 -60 123 -191 -15 295 71 -47 140 167 32 3 134 -80 65 151 -79
2628 -79 3 64 -223 -133 -55 -3 -149 -134 67 26 -164 78 3 -87 55 157 -143 7 120 -151 132 141 118 -95
2652 -95 43 122 -133 57 123 97 37 67 -147 -105 48 -66 -104 26 10 -175 -34 98 -74 -40 93 -81 -29 98
2676 98 54 -126 68 215 93 -61 3 72 77 -61 93 151 192 21 89 42 54 46 122 27 -107 31 35 -198 -68 151
2702 151 -129 -70 -37 52 -49 119 -100 119 96 93 116 -80 23 61 71 43 63 -34 100 49 -87 -332 50 8 -242
2727 -242 -84 240 -185 -152 -40 12 -43 -123 12 -82 -15 5 -132 -59 140 55 20 50 192 95 46 45 -186 -20 148
2752 148 -13 -9 25 -54 -100 27 -41 -134 110 33 -126 -31 16 28 -180 -18 -41 32 -55 94 22 -94 105 80 -104
2777 -104 48 89 -136 -99 -73 18 -169 89 -28 -133 120 81 89 27 -65 -84 -47 -151 -85 -147 -102 -191 -62 45 42 -134
2803 -134 -122 101 -57 19 196 30 -8 65 10 -13 206 -81 33 114 9 26 48 4 -137 -112 86 -93 -23 -86
2827 -86 53 -145 -55 7 -42 64 115 -79 -10 180 39 5 -14 8 -102 21 85 -65 13 196 19 47 130 -20
2851 -20 -112 -75 70 5 9 70 66 -12 -16 -6 -215 -189 136 -102 -114 32 116 -79 135 -39 -91 42 130 -161 204 40
2877 40 -14 -182 32 132 -72 17 -57 -159 -43 24 37 -65 118 -15 143 131 104 -5 -36 -36 -102 -14 -193 -212 104
2902 104 34 -79 3 132 48 4 196 154 55 75 135 -231 135 115 19 -111 -3 -162 -57 29 114 9 -121 -9
2926 -9 -1 -36 -38 -75 -118 26 153 -72 48 -39 -29 -49 156 146 -100 110 2 -156 13 119 -148 -153 68 -24 67 119
2952 119 34 -21 21 -6 -33 -57 50 -16 -16 15 83 112 -29 -102 -78 -54 75 -56 25 -9 115 -18 2 72 24 65 35
2979 35 106 20 148 -13 -55 29 -53 56 -191 -55 -21 -41 -41 -98 -10 -54 7 -68 15 -69 -83 66 -95 49 152 42
3005 42 44 40 -55 -15 -66 17 298 61 22 81 -2 96 52 -22 -92 -27 11 -50 -3 -2 -76 -63 -165 -29 -141 54 -79 25
3033 25 168 -57 -96 -84 213 -48 92 70 24 -50 61 217 248 -71 18 -23 -2 255 9 -67 -110 38 -29 -112 136
3058 136 -119 -188 20 -171 16 -66 -24 54 21 30 -12 0 92 -62 -82 227 -33 -152 -30 -29 51 -119 -35 -2 -99 -167
3084 -167 32 -35 46 -15 -33 27 23 -47 -39 -53 -18 -87 -101 134 145 -44 -54 -4 -102 -86 -109 -10 107 15 -38 229 51 -140
3112 -140 145 34 1 157 -39 -148 -8 -107 115 36 283 18 48 100 -103 10 -79 168 -91 155 145 121 -1
3135 -1 95 37 -137 21 173 -38 263 -76 -24 -15 -13 92 29 30 36 86 -155 17 -4 -171 43 -35 -86 -35 220 -69
3161 -69 -40 161 -66 -70 -33 57 41 111 83 191 13 230 43 -120 -103 121 -111 -142 60 -73 85 123 -106 -20
3185 -20 19 -136 64 33 -123 -193 163 92 -16 -71 -94 68 44 53 34 -3 30 26 -43 45 47 68 -34 -64 130 176 85 54
3213 54 -6 40 85 99 -194 -50 -10 8 23 -24 56 62 -94 64 -29 91 -84 0 136 -36 -69 -198 -193 22 -189 38
3239 38 32 92 111 -98 -113 -128 -47 35 -77 -70 -86 278 -77 18 175 -41 45 -156 64 51 -101 91 146 -66 54
3264 54 58 -43 -12 15 146 13 -44 257 -32 -87 39 -134 32 264 -23 -64 -108 -52 -77 31 83 -45 27 112 -9
3289 -9 -85 100 16 27 -57 125 -136 88 -130 -81 53 53 -108 82 52 -7 38 59 -28 76 117 30 -115 -110 15 24 45
3316 45 -94 180 47 -241 -162 -52 -55 -56 17 47 -19 52 -71 42 -65 1 63 59 -239 54 -1 -227 -45 31 128 -13
3342 -13 139 65 -50 94 -35 -216 -123 -68 -77 64 -70 -61 85 57 92 -23 -118 -14 32 -104 110 134 76 26 20 -8
3368 -8 -64 -16 -118 -21 138 -163 -136 -133 8 62 -64 33 -50 -145 56 -43 -189 -134 136 51 127 25 -4 112 124 78
3394 78 81 -23 24 179 -64 33 4 -66 4 154 110 -154 -24 -110 -85 -87 56 41 159 36 -24 -77 3 47 -88 30
3420 30 147 32 86 212 15 241 42 13 34 -58 37 17 65 -208 219 101 -24 -25 70 -101 -35 77 -155 122
3444 122 -104 -53 -69 -38 123 22 -24 68 -161 133 31 136 -26 -134 35 -13 -167 14 -3 38 19 195 -143
3467 -143 73 43 -115 -10 51 1 -64 -44 -47 -160 27 43 -138 -28 54 -149 -124 76 -9 41 134 -54 98 83 83
3492 83 82 138 -107 3 14 -242 92 -192 -28 -5 -107 -167 -14 141 -57 -190 62 -55 -161 153 69 4 14
3515 14 -6 -11 7 -68 15 -45 101 63 -157 14 -78 90 -126 -13 -43 67 -42 98 85 77 -19 12 -7 -89 75 22
3541 22 -83 -48 52 -101 -130 -65 -18 -101 -108 12 -19 13 -68 -73 -51 -3 121 -68 40 110 -39 182 82 -24 -69 -96
3567 -96 28 -88 32 -57 67 -83 29 -45 70 31 -113 -93 -109 30 -57 -56 9 -3 58 1 -70 -61 105 140 -65 19
3593 19 59 94 92 -275 155 -7 47 130 -139 -56 70 123 -82 90 -2 -8 84 26 6 97 -45 31 22 -5 118 18 102
3620 102 58 59 56 148 -44 -71 65 -100 80 21 -153 81 62 62 54 -40 -115 -94 41 188 47 -100 10 -119 33
3645 33 121 13 -29 96 33 130 135 120 36 116 -46 -66 -74 19 59 -43 21 -172 -52 36 -149 -135 68 -52 -22 -117 35
3672 35 96 -201 -85 -189 -28 51 71 20 8 -33 182 94 68 2 -160 -2 238 68 49 14 4 86 -135 222 -39
3697 -39 -95 -41 -15 22 51 27 84 -219 -126 -48 13 -98 -102 -78 24 63 1 76 172 -177 -16 18 -90 56 16 64 -17
3724 -17 -86 -27 -47 65 34 -50 -90 -29 134 47 -36 -166 83 11 41 -86 -19 -72 -27 -65 1 188 120 -44 -29 170
3750 170 21 4 2 -29 2 -72 115 -4 -158 15 102 -29 -11 3 -205 -70 -31 -67 19 -84 144 81 113 -49 -43
3775 -43 2 -176 60 -64 15 17 89 140 161 165 -73 17 -70 19 78 30 -45 57 -39 -43 118 -25 192 -57 -13 -62 -63 -60
3803 -60 104 102 116 89 -85 -24 -53 25 -54 22 -38 -40 84 -118 21 128 95 26 -19 39 -39 -29 56 -67 67 -15 24
3830 24 -51 18 -63 -135 9 135 62 -23 76 30 -104 125 70 -6 71 82 -100 -53 -115 -15 64 -30 39 -2 -214 -32
3856 -32 -196 -21 106 -50 -103 -42 -46 17 76 -71 -196 -199 -133 -52 9 19 -12 48 -68 20 61 44 39 -24 48 86 48 117
3884 117 55 55 -102 -40 35 -8 -136 -186 7 0 -134 0 -163 38 1 54 -87 -85 90 3 19 1 -61 -65 69 -165
3910 -165 -73 -14 -48 -46 8 -150 92 15 -15 -73 -179 115 43 21 -96 39 -62 -126 -75 3 -6 -33 -45 -37 15 82 132 1
3938 1 95 -29 77 -55 162 83 -19 136 -39 151 -6 -117 -23 157 42 84 -56 -194 -55 -25 54 8 -53
3961 -53 76 -195 87 -108 -129 -132 -47 -20 -116 3 153 156 48 82 44 89 32 22 84 100 78 -136 -100 -29 86 14 72
3988 72 -74 -22 -32 -120 106 35 -115 -1 -72 78 50 -15 18 -170 -3 -12 -57 -26 87 157 3 -79 -170 4 -86 81
4014 81 53 271 -76 131 -105 88 7 -61 -146 -42 21 86 38 189 239 14 -130 -8 -43 -39 87 86 -15 107 49
4039 49 177 5 -41 85 -158 43 63 74 34 118 70 -132 54 -2 -70 20 -148 -29 -79 -173 -83 14 -177 -116 7
4064 7 55 -98 72 67 -102 -51 -88 -66 92 41 -139 -12 -93 -41 74 84 -111 -24 37 -65 -63 -12 -125 -64 34 -67
4090 -67 42 20 66 -27 -20 -30 91 -136 -104 155 -75 -14 80 104 190 72 77 74 -108 40 72 49 210 93 -49 36
4116 36 -5 -29 -8 -65 71 27 -44 49 27 -107 -4 -56 62 -26 -52 -19 -110 13 -6 151 102 62 -83 121 -9 108
4142 108 38 103 -146 59 108 -88 -123 48 123 53 -125 -12 -92 -47 -19 -150 -73 -166 -49 47 91 -23 -5 37 -10
4167 -10 -73 25 110 90 -101 93 -62 52 68 119 79 -76 -150 30 -90 -144 85 -102 -103 84 -43 -164 -88 53
4191 53 -81 49 -41 7 19 -16 62 -68 80 70 59 9 88 -62 128 123 -2 -128 68 43 72 -39 -26 -53 33 92
4217 92 -118 -93 39 -50 -36 -8 -195 60 -72 -2 -73 -49 47 -102 116 49 -64 133 -78 177 -28 65 -38 168
4241 168 137 58 90 -107 4 -54 -32 -64 -12 -77 -144 -112 -115 -149 -129 38 191 -5 80 4 30 15 -11 22 -30 -48 -34 23
4269 23 56 -96 -64 120 52 -77 -44 7 -36 -85 -102 16 147 -180 30 64 -6 -102 22 -163 -8 -68 14 -44 -9
4294 -9 -34 113 -14 119 -42 9 189 20 -45 -79 -62 -50 4 -70 33 -47 73 -78 87 -88 63 131 -51 -96
4318 -96 -105 -57 -81 35 -146 97 -56 -4 -30 -83 -40 56 61 98 -108 5 99 110 -64 42 -8 -104 172 102 1 91
4344 91 69 -94 -57 -19 -204 102 -39 53 4 -5 -2 101 -7 0 127 63 47 -88 159 87 -12 137 -67 60 -6 -31
4370 -31 -110 -2 -42 61 88 0 -41 -66 -106 -134 14 -62 57 -88 -43 -83 8 -70 -38 41 -29 16 91 4 155 23 61
4397 61 -27 -163 28 51 -57 -60 129 186 -32 55 -85 27 -63 42 31 -24 42 -180 -63 169 41 -147 45 -11
4421 -11 8 -24 39 53 31 38 -106 224 76 -53 -57 -90 -133 -146 41 19 -18 68 -96 29 141 23 133 -94 -144 3
4447 3 -70 -28 50 -173 23 79 -79 129 68 87 -46 89 -41 -224 32 -41 17 193 59 189 6 -164 -38
4470 -38 82 143 37 -120 -163 85 -2 -30 -64 -66 56 -100 -31 39 93 -42 -138 7 126 -17 -115 10 84 35 -79
4495 -79 80 -120 -55 46 -13 143 -10 -55 -118 -17 -101 -85 -5 -10 -87 -20 -57 68 -130 9 158 54 160 -43
4519 -43 53 93 117 67 193 -115 -77 -118 43 -46 -153 207 -168 36 -77 96 -35 -7 36 -23 139 -58 -70 -124
4543 -124 29 -48 182 45 -128 124 -21 -6 -55 122 -63 46 -145 -13 155 -158 -119 -134 1 29 -59 73
4565 73 172 -83 45 -87 -74 -84 -77 -92 200 31 131 26 -201 58 -17 -77 67 -69 57 -41 -85 -126 38 19
4589 19 -33 -84 134 83 56 126 -84 -21 -169 126 -25 163 164 0 70 -78 -71 23 2 7 -36 -222 58 -6 37 -46 27
4616 27 67 -99 100 39 -4 -4 33 -89 37 117 -32 -27 -149 -18 -102 25 -44 112 77 -237 -47 -108 -46 88 -17
4641 -17 -129 50 -60 -96 65 -91 27 -51 130 23 -24 -11 -5 73 76 6 32 145 55 42 164 -82 -31 62 -37 -14
4667 -14 50 -15 -63 -104 74 85 -222 -262 105 -88 -26 -33 -53 -11 -3 54 44 146 -12 50 34 -97 -8 -96 -49 15 -5 -114
4695 -114 137 -73 -35 -46 15 -73 -59 108 -112 11 29 -26 -88 10 72 99 5 -9 -90 58 -69 -25 105 -42 -36 112
4721 112 -31 -262 184 -3 -41 34 -5 -19 45 -9 53 229 -97 16 197 -33 -33 -62 0 39 6 -2 -76 -83 51 -40
4747 -40 -58 -76 30 -150 148 -31 111 -17 20 -40 27 95 53 -137 -100 54 -165 -121 32 -27 -18 93 55 -13 21
4772 21 -139 -16 -122 68 21 -161 96 59 -133 -126 120 43 116 -50 49 17 -54 15 -12 -36 -58 89 -48 66 49
4797 49 5 31 -66 -27 27 -145 -27 109 -41 47 132 15 -139 -26 -16 -86 184 50 10 75 81 -64 16 183 -60
4822 -60 35 -103 -39 -31 181 12 -245 72 -43 22 -91 -26 -102 -7 -162 62 63 -57 -28 38 61 -151 147 -63 73
4847 73 191 66 -12 -55 150 17 86 -109 4 -30 2 -202 -44 -175 -18 -116 73 7 -123 14 -211 -228 -98
4870 -98 -54 17 -94 -82 131 -53 -29 -97 177 69 -151 75 89 -171 143 127 -28 100 17 -58 -199 -26 -115 65
4894 65 -180 62 14 103 167 -32 -207 -43 84 59 13 -65 -108 -81 -84 -44 37 -46 48 114 39 -132 -3 -43 71 -65
4920 -65 22 -28 140 -77 9 -157 -117 15 -26 -48 125 -179 -123 87 -40 -200 63 74 -104 -3 -90 140 -14
4943 -14 -52 -129 -30 66 113 57 -169 108 11 -2 -115 -97 28 -25 -67 164 129 23 -5 -43 -105 8 49 -58 -49 22 -60
4970 -60 -91 52 -27 26 46 -4 30 44 -173 202 0 -46 -38 3 76 66 100 -35 -138 30 -130 -27 -28 158 -35 -104
4996 -104 -19 -46 73 -34 15 235 95 34 -5 91 13 -89 29 -35 -47 95 12 25 -29 12 -36 211 145 -17 -34
5021 -34 -246 -161 -78 -47 -139 35 -49 7 -18 4 -70 -33 3 -100 -17 170 83 -22 56 4 -36 -59 -76 -196 45 -115
5047 -115 88 -5 -65 46 6 -46 -57 19 -54 -44 83 106 202 -24 30 36 -106 4 -83 99 -201 51 121 1 48
5072 48 -64 67 -78 -66 140 -47 -67 -212 19 -127 -61 -76 80 50 84 -56 -143 29 82 120 8 41 -21 52
5096 52 -77 112 209 -82 41 -150 -104 164 30 -64 -12 230 18 115 127 -49 -3 -52 -108 -121 -4 -84 -72 52
5120 52 -55 -97 -117 -63 107 24 52 21 -100 104 -48 64 -83 89 -166 -39 -26 23 -98 -62 117 -59 64
5143 64 148 -36 54 -62 -78 42 110 -97 -126 -123 -79 -178 -188 227 -13 132 76 -232 -8 29 -69 111 -59 164 2
5168 2 -74 -49 -29 -61 -184 88 47 141 130 -56 -41 39 -23 -3 -136 -115 81 -81 -129 -29 -39 -8 -39 -63 12 -57 134
5195 134 -85 12 9 -29 -22 -170 -97 -30 33 146 -11 47 98 35 62 98 159 63 31 -19 -103 -188 -23 75 14 -74 105 25
5223 25 102 16 49 -25 -175 88 -58 42 -12 -9 -48 -172 -67 22 -51 -99 -37 -34 -29 -96 -61 146 -63 -118 61 108 29
5250 29 35 16 -44 28 46 62 39 -6 -102 -80 134 -38 68 4 14 -27 -116 -99 83 -141 92 130 -109 -182 175 -228
5276 -228 -197 -46 -116 -102 -129 84 -134 -32 51 -202 92 -104 -39 77 174 19 33 -82 66 69 -90 -11 -22 -5
5300 -5 121 -10 83 -44 -93 89 -46 73 -58 -120 34 -64 -36 -2 -55 -42 22 14 37 -58 34 -180 -64 -113 -9 -160
5326 -160 189 43 46 -48 -63 -35 86 -6 120 -95 -66 29 -45 148 19 77 -28 -17 -61 -21 -32 -27 -254 60 -10 -42
5352 -42 -31 74 10 -95 -73 126 -81 119 44 -36 0 100 -12 100 -67 -8 45 62 -28 -139 -18 40 -12 -26 12
5377 12 59 54 15 44 -50 -42 -40 -115 -4 -1 -83 1 -47 15 -91 77 -10 14 -1 -6 -16 -18 62 20 129 -26 61 -32 115 -111
5407 -111 63 40 59 24 122 -92 45 -22 -15 -109 17 -1 4 177 11 -93 11 -68 35 38 39 2 -75 -73 85 -25 -32
5434 -32 64 -4 -17 -89 65 11 226 -43 5 -48 -18 45 -73 -19 -85 96 -134 -44 72 107 69 -46 -14 -86 -45 206
5460 206 80 91 75 85 -111 -51 -3 74 -63 137 58 150 57 -191 44 161 21 -167 -88 -27 48 -116 186 1
5484 1 -133 6 -2 176 51 -23 142 94 -82 -36 132 76 -46 -51 -41 -109 -24 23 89 -31 42 -46 22 60 -58 6 -173
5511 -173 11 8 182 45 -53 -48 54 115 9 17 -82 -71 -44 -112 -46 34 6 166 -22 163 -34 -19 84 -135 8
5536 8 -118 65 -6 -62 82 -16 26 -131 -114 71 79 44 -32 1 42 -57 -22 49 35 -52 -37 -1 11 -70 -22 -165 -112 -44
5564 -44 81 55 -92 -1 121 -99 -35 23 -184 -109 77 -140 -34 -40 0 -63 59 45 -60 50 59 133 -175 -35 13
5589 13 32 -91 -64 56 -61 -73 -48 -89 -148 -179 0 -118 95 -156 26 -9 -166 28 -129 16 140 1 7 -195
5613 -195 1 -3 -6 55 70 39 205 -78 -35 11 -70 16 6 119 137 127 -29 20 50 27 -23 77 -76 -129 -63 104 -58
5640 -58 -60 68 -186 -179 44 -6 35 35 126 28 21 -55 5 59 -77 -9 -100 109 55 60 132 257 122 -271 27 -49 59 158
5668 158 21 -210 87 -91 -240 -12 -17 -142 -100 47 -17 -103 -40 151 -21 -26 79 -140 94 -20 -36 75 152
5691 152 -81 -126 -154 -10 -70 -68 29 -15 19 -147 33 37 84 -56 33 75 -4 25 16 -17 9 -78 73 118 40 49 56 -92 211
5720 211 -60 -141 -94 31 120 -64 127 -25 -4 -64 161 -60 -174 -97 6 -92 126 114 15 -19 -95 -97 53 75 -17
5745 -17 72 19 69 -196 -57 -19 -53 23 71 86 -80 -65 116 73 -103 -69 -145 21 -12 -59 -152 36 41 -184 2 60
5771 60 -122 15 -128 -7 70 -137 -46 -27 65 -168 -176 -117 19 142 -123 -34 101 -134 -3 20 2 94 -188 129
5795 129 42 13 53 34 130 -111 -19 -98 13 16 117 -93 -52 -96 -73 127 150 11 9 -66 181 44 -3 50 58 67 45 17
5823 17 -102 23 160 -39 43 -25 81 125 223 101 -177 -9 43 -26 110 106 85 6 24 -35 62 -129 -55 -55 -39 -80
5849 -80 194 -77 9 -15 63 -146 -4 -70 -56 30 -131 137 37 8 -145 -18 46 -15 43 -6 -36 13 23 1 90 168
5875 168 -38 90 34 45 39 31 24 73 9 -64 -47 -22 -27 -19 88 -34 -25 -73 -65 -27 42 52 -92 -184 -63 -45 2 -117 87
5904 87 -94 -116 149 -82 -41 -50 -45 28 -148 9 -86 31 69 158 -12 -112 49 -57 16 142 -116 -49 105 66 -51
5929 -51 -59 -326 -14 -18 77 -62 12 -58 11 -64 29 115 -74 -202 18 151 -81 102 182 -33 -32 -41 128 62 12 -41 82
5956 82 -82 103 76 35 104 -95 -19 9 -4 112 37 7 81 -13 96 -86 -40 18 -13 55 -5 -98 -39 -102 -42 99 185
5983 185 -30 11 -36 121 -88 -41 -11 3 -25 -93 -82 -134 -12 -25 -118 24 48 160 -151 85 -44 49 10 -6 -202
6008 -202 -80 135 180 59 -37 9 -16 113 -25 -41 -21 -52 -112 4 -32 -78 -63 128 124 -36 24 -32 -28 -54 -119 302
6034 302 82 -74 -88 171 -34 -26 143 -88 108 0 -4 13 -35 -12 -73 54 -64 -29 -200 -63 45 -38 68 22
6058 22 -121 -160 14 -79 18 -52 -187 -81 -85 39 -74 -161 111 63 19 -59 41 133 -24 -32 -51 69 47 -162 -87 73
6084 73 -75 -13 75 16 -74 -116 -21 147 -79 -32 13 -76 -60 -23 -112 -5 12 84 -8 59 -99 -36 104 -129 -224 -120
6110 -120 -14 228 -2 15 -68 -70 -115 145 -36 -35 -117 31 14 28 -78 101 -118 -59 95 -68 60 29 159 2
6134 2 -82 -76 -125 5 5 -8 -55 -64 -6 74 -10 7 -39 -147 0 124 -11 104 -55 -5 44 -28 4 97 -49 82 91 103
6162 103 -5 -39 107 44 124 -82 30 -34 -38 43 3 38 -44 33 71 79 -22 179 10 70 92 -72 -125 -48 10 -8 41
6189 41 -173 26 106 111 120 -117 151 29 -38 33 -58 82 164 -62 85 -32 83 186 132 30 87 -3 -20 3 -148
6214 -148 -20 55 -81 -27 152 107 12 -50 -79 -9 136 -24 -126 155 -35 -2 74 39 -3 -19 -18 72 14 -16 30 49
6240 49 1 -104 165 -10 2 14 73 98 -141 105 15 12 33 -56 165 -83 -28 23 -74 -24 -1 142 61 15 -95 168
6266 168 -71 -134 24 86 95 -43 22 99 14 10 39 -72 14 4 -190 118 -65 50 -90 -27 27 -83 16 -28 28 -70
6292 -70 -83 10 16 111 -145 -30 -134 -87 61 156 -115 -169 -13 -16 -20 -60 -3 -53 16 35 -13 -141 -90 -47 -85 -12 65 -12
6320 -12 -26 172 35 71 51 0 110 79 -52 -83 -59 59 13 -11 81 33 -5 -171 -93 30 40 -204 63 186 -38
6345 -38 -21 -119 -43 92 77 -96 113 -120 -38 75 68 -73 76 84 1 155 84 119 -29 -169 30 107 66 -31 157
6370 157 48 13 -67 -42 -133 -30 7 5 26 -79 36 -71 122 -16 -5 -51 142 -57 259 -4 -87 -62 -24 -26 -25 118
6396 118 34 -88 40 181 76 20 -22 -37 120 -33 -230 51 -26 -157 27 -71 42 -23 -147 46 -122 -74 -81
6419 -81 -74 -149 130 47 -47 -8 -59 -64 -2 33 -9 15 3 2 163 -126 -75 31 185 55 88 123 -123 72 -110 113 -116
6446 -116 119 -63 -1 -32 57 -91 -197 123 85 -127 -3 -32 -5 57 -28 -10 -18 -4 -65 -50 -41 -64 -124 121 -30 -138
6472 -138 73 108 41 104 -96 78 -95 9 87 -123 -29 -130 -40 -48 30 -92 -32 71 29 90 98 98 56 27 -7 -71 -70
6499 -70 -85 58 -100 185 -66 -20 -55 89 -127 55 13 -123 138 8 90 24 -25 179 81 72 -25 52 -65 39
6523 39 102 38 97 -27 -134 -125 41 113 -16 69 106 67 24 -124 70 -40 -9 6 -2 -25 -71 -60 -73 88 -157 50
6549 50 71 21 0 -7 40 180 26 111 12 -14 33 -27 113 -49 120 -8 -69 5 169 31 -106 -56 -53 -56 18 74 -185
6576 -185 27 20 -25 -55 -65 66 -14 86 23 -4 -52 -1 -17 -27 33 -69 106 8 -12 -68 21 12 39 148 -57 111 -44
6603 -44 -30 3 13 -35 -28 -134 -31 -15 -44 -77 -39 8 2 -48 -34 -77 212 81 4 -45 -7 -19 -76 55 57 -1 -90 71 24
6632 24 -75 -66 49 -114 -47 -4 -25 104 -23 -66 13 79 -18 -143 209 54 40 -72 -46 -31 8 -59 -88 222 37 19
6658 19 106 -44 -113 169 -86 -7 77 -9 -231 -93 18 22 -141 104 -100 -197 126 -22 35 -8 44 -52 12 -65 119
6683 119 42 -40 90 -232 98 65 90 18 93 -3 -13 22 -51 -66 -47 156 -122 166 33 -194 40 -14 5 36 -84
6708 -84 -96 12 -244 -110 -66 32 -41 -203 -4 -226 -133 1 -120 -7 37 60 -3 177 7 -40 61 19 98 -36
6732 -36 -165 -1 115 165 -113 -105 -50 -129 -82 37 126 -105 86 211 166 -141 -19 -62 108 -40 99 -34 -14 61
6756 61 -40 -47 46 47 37 71 -49 79 -50 56 96 6 -51 -52 -125 -56 27 -224 -64 -8 -62 156 8 54 122 17 -113
6783 -113 15 -140 -19 -86 -82 -24 115 90 131 22 96 80 -100 112 -40 -28 26 63 -168 13 -105 -168 109 -93
6807 -93 -94 -41 104 6 68 58 26 -80 13 -127 57 116 125 -88 -25 90 -138 92 62 131 -132 56 -90 61 28
6832 28 -116 4 -50 62 105 -52 -22 63 111 -23 14 97 151 149 -13 137 -98 -101 -142 31 -47 132 -75 -69 -62 -74 -70
6859 -70 102 147 152 -34 93 -47 144 -8 130 57 -21 84 -159 60 73 37 -52 13 67 -150 115 37 -8 86 83
6884 83 -52 49 37 -27 -54 -19 -15 -11 -81 212 117 -53 14 -50 26 -16 -121 117 164 69 -38 -56 91 -66 -9 40 59
6911 59 -3 98 84 -67 45 -304 10 -5 -17 52 78 -28 -104 194 -33 237 -55 143 129 -60 25 -58 -49 -32 -11
6936 -11 -36 22 44 -110 -102 -132 45 3 -36 -13 138 -83 135 42 -128 41 18 17 -94 64 11 -184 82 37 20 63
6962 63 10 80 -23 -123 -104 85 41 83 7 71 -141 -53 -29 -75 48 -18 -95 -98 71 113 -50 123 39 67 -56 -112
6988 -112 -33 -69 -62 -41 -16 -41 69 48 29 -35 -22 136 5 115 -107 -86 136 -12 69 46 37 195 148 0 -114 14
7014 14 15 35 -234 18 61 1 37 27 144 36 -64 39 -7 106 -75 20 -31 -37 -64 -40 20 -113 43 -138 15
7039 15 -156 -63 9 -106 64 -33 107 89 -77 -129 105 -49 14 -27 202 75 -37 -8 82 211 -2 -112 37
7062 37 178 -146 101 71 6 -84 -16 219 220 131 -50 -30 9 -65 -52 55 -1 18 23 -98 141 24 -202 -85 -99 11
7088 11 121 53 52 133 56 95 66 127 112 -31 124 35 -110 -75 -62 -148 -1 32 228 -90 11 117 114 68 12 50 100
7115 100 95 -22 0 -43 -206 -58 -83 -147 -70 -58 144 -4 71 105 -5 62 21 58 -61 -60 -153 46 -36 43 -51 -93 131
7142 131 -57 66 -89 56 -110 14 -56 71 -115 -75 -77 -50 -232 -115 -20 -50 13 -54 144 -17 90 -25 -147
7165 -147 -33 96 96 -38 76 11 98 -287 -88 31 -20 109 -49 73 8 -36 -22 85 104 -72 45 -98 33
7188 33 -38 -6 -48 177 -51 -26 38 -29 -51 -157 16 -113 26 14 29 -147 -90 -74 219 61 82 -201 -53 -41 10
7213 10 77 22 -57 17 35 100 -12 -114 34 52 155 120 14 -1 1 -115 114 32 -102 -8 -33 -30 -151 53 -39 -42 2
7240 2 60 -30 65 -38 -78 -23 -29 76 -22 18 -93 -42 -161 -174 -1 22 36 -19 -11 150 143 -37 38 -91 -27 163 66 6
7268 6 -139 55 -107 67 -16 -116 1 -9 -62 -172 -110 -52 198 65 135 139 135 -51 -156 -37 -102 -12 -217 79 -65
7293 -65 -15 -162 -17 119 -14 -114 122 78 87 20 29 16 228 20 -8 -45 -77 -19 102 -238 -26 13 -58 -30 -58 10
7319 10 -9 -119 -45 -68 -38 -82 -213 -62 10 -55 -107 67 -51 -110 -67 -119 30 -102 11 -54 -98 37 -21 -61 -134 -50
7345 -50 -127 104 -153 110 -37 112 13 -166 -7 154 13 57 25 37 -100 56 -96 -163 8 184 34 80 -100
7368 -100 -24 70 -80 89 140 31 15 -61 8 123 -14 41 -185 161 4 37 15 153 130 52 -34 -38 80 24 122
7393 122 28 135 119 -15 66 -25 -137 -93 9 -21 101 36 264 -86 111 -79 -111 124 -110 -51 91 74 44 39
7417 39 -147 45 9 -22 61 -54 105 52 15 54 0 -33 -8 7 23 -83 54 65 -167 -29 -5 -103 -16 -196 -4
7442 -4 -63 -13 -134 57 -146 -28 -125 115 25 -6 55 14 173 55 21 106 85 3 19 61 -4 -118 -4 30 -45 77
7468 77 -37 -155 -66 2 -181 -115 -18 -151 -35 112 -17 70 19 97 -3 -45 60 109 -12 169 74 -1 2 73 -93
7493 -93 50 5 2 -59 44 -24 -66 75 108 0 74 -7 124 -43 171 -65 2 18 -30 121 -128 -63 22 -123 11
7518 11 -134 -25 -53 70 56 71 70 -17 60 -72 156 63 19 121 23 103 35 189 5 128 138 41 33 62 -18 -113 70
7545 70 0 -31 -70 -89 -108 -24 -29 96 -49 190 -113 175 68 -236 49 -7 -58 145 24 136 -120 30 174 -162
7569 -162 -12 -87 32 -191 68 -39 -45 -27 106 -134 -113 -160 -116 166 -27 25 127 71 35 149 57 1 324 74
7593 74 -74 56 50 47 -62 59 -106 -8 -120 -11 130 -44 -42 145 66 -112 57 17 56 -126 207 12 -12 -75
7617 -75 -76 -66 46 72 21 -36 25 -25 119 125 -168 -80 -69 -3 -71 15 -92 -154 20 -10 -132 64 -72 9 22 43 -41
7644 -41 -1 -101 58 1 -132 -93 -81 -14 -6 -54 146 44 29 -35 -46 -144 -25 -23 102 -9 38 89 -126 184 -49 15
7670 15 -90 -58 64 -118 57 -37 22 -77 159 -48 -27 -84 -112 21 -112 41 47 -69 -28 -21 71 6 -140 131 14
7695 14 -26 32 -99 81 -4 11 131 -123 125 23 15 -132 34 143 44 -53 123 139 35 159 -43 -165 85
7718 85 70 -77 46 -22 -96 2 32 18 69 -43 -110 54 2 16 45 67 -114 61 105 58 -33 -58 -4 39 -54 -82 64
7745 64 -47 72 -118 -41 -60 -57 -19 7 -89 -45 19 -54 20 -86 39 21 -43 60 166 -90 -74 -22 -2 26 7 97 -167
7772 -167 194 111 91 171 2 16 -66 96 72 59 58 -10 80 179 9 -39 4 -19 -38 91 -59 -105 135 -54 29 42
7798 42 -22 -115 -78 -23 23 -59 13 -49 15 -6 36 -5 -73 12 72 -37 97 56 -2 204 32 57 133 75 -116 -37 -1 -59
7826 -59 -100 -21 -110 77 97 -104 -62 -18 -88 -111 61 94 267 -57 36 45 51 -101 -12 89 -156 46 56 -19 7 90 76
7853 76 24 -20 -68 72 -14 38 -59 -32 73 196 52 -9 148 6 128 52 -16 18 176 -93 22 106 140 -95 41
7878 41 -147 20 -62 14 -38 -36 -29 -130 -147 -59 -4 -20 -103 50 34 -46 -16 12 -188 4 -102 136 -1 -95 -201 -84
7904 -84 -88 93 -38 116 89 98 98 -12 -13 71 63 100 -130 -86 76 -53 45 55 83 110 -24 -6 -16 2 87 -111 93 -7
7932 -7 103 4 -22 17 -63 23 -6 -53 5 -107 11 114 46 -110 3 28 6 -45 64 -19 38 89 144 72 12 -53 54
7959 54 167 62 -17 117 9 18 18 12 55 -114 72 -37 5 61 54 202 -84 -26 -24 24 53 -93 -119 67 -6 -150 -52
7986 -52 -148 -29 18 107 87 12 -10 -88 1 -4 -38 86 -45 112 109 -94 8 -40 -7 -88 68 -210 87 -87 -11 -29
8012 -29 69 -82 -69 -1 -22 -85 -120 71 -230 -42 -126 -26 -109 71 104 -120 10 67 27 90 -32 -2 54 16 -27 -35
8038 -35 -83 -68 85 64 -57 -9 13 19 -84 75 149 -83 -25 -77 50 -105 -67 -93 -113 -94 -7 26 35 55 23 -27 36 -30
8066 -30 -39 -40 -173 31 93 -69 44 68 -108 -118 47 121 -49 -37 68 -6 -137 13 -148 13 11 129 -2 -72 -131
8091 -131 80 -154 16 102 -60 -49 -55 28 -91 144 -64 42 48 -171 20 -43 -3 78 -70 -11 -80 -16 98 -14
8115 -14 -132 178 29 18 44 -34 -97 0 -62 34 86 12 -39 46 -67 -50 -50 34 -130 -19 31 -191 146 -59 -81 -15
8141 -15 100 -154 23 -63 59 38 -62 -119 -72 -3 33 -153 -9 14 35 -120 -65 120 -8 -140 91 73 26 16
8165 16 94 143 -65 -233 186 13 27 -30 -19 -65 43 66 -50 89 49 -62 -3 75 -90 -104 13 -16 -261 70
8189 70 -76 125
8191A25
$$ Imaginary data points
##PAGE= N=2
##DATA TABLE= (X++(I..I)), XYDATA
0 0 0 0 0 0 0 0 0 0 0 0 6 -8 8 -8 8 -16 16 -24 24 -32 40 -46 54 -62 72 -83 96 -110 126 -144 165 -188 215
33 215 -242 270 -305 341 -381 425 -473 526 -582 645 -713 786 -868 959 -1055 1162 -1279 1411
51 1411 -1553 1715 -1892 2096 -2324 2590 -2898 3257 -3692 4222 -4884 5743 -6897 8537 -11038
66 -11038 15283 -23754 46873 -233670 -589284 379119 429339 -206658 204572 652846 141092
77 141092 80426 396710 53257 -159042 144280 -54085 -305027 27176 46331 -240847
87 -240847 16375 107934 -256181 -60591 218279 -258951 -305484 276000 13210 -482242
97 -482242 46654 306002 -289648 -189771 373823 106842 -103418 350112 326111 -13681
107 -13681 213619 264458 -130312 -69288 81624 -242946 -262615 -6391 -213089 -280207 66213
118 66213 -57254 -270589 134245 219300 -186524 42467 395402 -8845 -143677 286189
128 286189 119124 -257139 47308 172044 -194582 -81764 203948 -35576 -105867 163442
138 163442 40675 -128557 72271 19813 -190246 1117 50566 -215296 -67193 149184
148 149184 -129076 -142615 215425 64656 -159725 178793 237928 -125237 17784 259570
158 259570 -67532 -177086 122608 200 -231798 -9197 57722 -144191 -26991 93122
168 93122 -71289 -6377 139888 -43581 -54153 167342 13426 -142490 113463 98592 -186694
179 -186694 -13048 168558 -121439 -131834 176742 25954 -177631 87139 135996 -135806
189 -135806 -41429 126657 -60250 -93318 76535 -11146 -76264 69613 15425 -76335 83372
200 83372 68708 -101720 40942 133105 -94585 -60768 149827 -31215 -160764 85617 64257
211 64257 -173660 -17148 132775 -86477 -93059 121121 22907 -94079 60580 64913 -58087
222 -58087 27489 58707 -51156 17967 69813 -69755 -25174 101591 -49391 -100648 96000
233 96000 23493 -147479 32807 106589 -120678 -61919 136935 -24975 -119121 93601 72154
244 72154 -100040 18041 98008 -45441 -20096 73982 -25571 -31392 63439 -27280 -60945 71054
256 71054 2362 -105644 47210 66761 -114836 -20834 118043 -63148 -97640 113102 32409
267 32409 -128287 43901 108330 -83644 -34280 113343 -9985 -63913 68682 23907 -59041
278 -59041 34860 21425 -69080 18648 35726 -86478 -9893 78499 -68871 -64490 104785 1366
290 1366 -110813 73602 88698 -104953 -7986 129936 -41733 -81676 95450 28243 -97277
301 -97277 28270 58076 -67171 -11987 52833 -43504 -22380 52844 -37757 -42361 67808 -12353
313 -12353 -77030 65779 47421 -96672 16693 104779 -65901 -57019 112501 7363 -101971
324 -101971 59391 72267 -88145 -15451 81032 -43531 -57026 52555 -9263 -56808 35651
335 35651 6023 -55003 36659 30598 -67204 21402 74580 -59852 -25062 105529 -12649 -81489
347 -81489 81596 51719 -105054 7607 92748 -70357 -64821 82596 -5616 -87644 37993
358 37993 34912 -68102 5745 46741 -43826 -2577 58092 -32577 -20636 72416 -14976 -59103
370 -59103 67750 28985 -86920 28880 82405 -72399 -37731 98532 -17574 -91409 58399
381 58399 42565 -92010 -4090 67012 -50809 -41725 55965 -11778 -44937 43189 11660 -38946
393 -38946 43012 32546 -47027 28743 58135 -56993 -18740 76582 -34620 -74955 64128
404 64128 24135 -94734 14795 73163 -62019 -38924 77303 -6549 -61152 46470 30522
415 30522 -53211 11900 37525 -38912 -5839 36876 -30589 -12935 50929 -18660 -34561 60735
427 60735 12096 -66449 33099 53492 -69721 -24638 71789 -29317 -67902 51988 23785
438 23785 -68546 13981 54383 -37844 -14210 54079 -8494 -25556 37587 345 -33088 26323
450 26323 3683 -46277 21310 27664 -54313 -382 61851 -34256 -41235 67117 12545 -67857
462 -67857 29845 51659 -57537 -20284 58402 -22456 -48162 39702 11898 -44663 18426 28545
474 28545 -29182 7143 31204 -25288 -2639 36975 -26850 -25906 46443 -6804 -54617 35301
486 35301 34326 -58843 -2181 62522 -28999 -40611 53843 11544 -54454 19655 34829 -42135
498 -42135 -12486 35246 -18961 -22642 27036 -3431 -18336 27211 3374 -24153 30123 19173
510 19173 -39647 12304 43479 -37321 -26202 50611 -6742 -53914 28827 28425 -50736 -5271
522 -5271 43752 -24451 -28807 35360 2685 -31702 17391 14540 -22310 9296 15649 -19617 9896
535 9896 24996 -24932 -3243 41777 -15625 -32929 39953 13980 -50722 9631 39169 -38485
547 -38485 -25228 40086 -8892 -40584 23225 16378 -34423 4139 26622 -17963 -5171 24888
559 24888 -8399 -5931 26053 -6569 -14744 31281 2987 -34709 22067 27240 -42102 -9528 43406
572 43406 -21612 -40083 34102 11419 -45499 8705 31844 -29280 -12371 33635 -7993 -20830
584 -20830 24297 5537 -19982 15972 9867 -20348 12837 17004 -26717 2448 32496 -23674
596 -23674 -22739 38479 483 -44103 18645 28109 -38956 -11154 37665 -14240 -28534 27982 9918
609 9918 -27262 12660 20873 -18185 1118 20236 -12895 -4939 18746 -13447 -13939 23216 -6819
622 -6819 -29354 21989 15203 -36787 3284 36721 -22579 -22316 37316 4309 -34450 17885 23857
635 23857 -27720 -3974 26784 -12405 -13775 19983 -2368 -14483 15587 472 -18555 14648
647 14648 7701 -27472 6191 22729 -26974 -13422 33585 -7812 -31465 26889 19703 -33160
659 -33160 4770 35467 -17352 -17189 30113 1658 -24835 13620 10507 -21535 2559 11804 -18422
672 -18422 -1329 16558 -16860 -8792 24876 -8268 -22805 24909 10634 -32088 9519 29643
684 29643 -25697 -14064 35396 -3948 -29977 22223 17924 -28055 1349 24586 -14678 -11322
696 -11322 18585 -5781 -14499 13995 -1707 -17421 13655 6288 -22307 8268 20414 -21298
708 -21298 -6355 29785 -8654 -24013 24810 11741 -30801 5473 26256 -20481 -14514 24719
720 24719 -2532 -21156 13356 8673 -17013 4539 10900 -12689 1583 13144 -12566 -3320 18687
733 18687 -9099 -14357 21078 3477 -24517 12344 19571 -24118 -6879 27351 -9234 -22517
745 -22517 19197 8711 -23994 3816 16635 -14051 -5721 15025 -5777 -7441 13224 -2676
757 -2676 -9452 14411 2010 -16175 11840 12188 -20659 125 22692 -14011 -16649 23089 2623
770 2623 -26142 9906 17932 -20753 -6703 20730 -7014 -14780 13919 3475 -13603 7619 6798
783 6798 -11359 4867 9917 -12183 649 15407 -10776 -9099 19256 -1908 -20043 14025 12955
796 12955 -22452 -1329 22393 -11633 -16078 18598 3805 -19567 6847 12290 -13508 -2229
808 -2229 12202 -6897 -4940 10549 -4077 -6690 11353 -1100 -11687 11061 6249 -16316 4056
821 4056 16049 -13676 -8846 19485 -1709 -18378 11869 11401 -16694 -1108 15224 -7460 -8867
834 -8867 10998 -281 -9343 6226 2175 -8413 4753 3653 -9824 3553 8458 -11033 -2128
847 -2128 14743 -6621 -11907 15120 4811 -17764 5636 15446 -13146 -7091 16477 -2055 -13079
860 -13079 9380 5632 -11029 2549 6920 -8122 -379 7019 -7500 -2504 9601 -6028 -7676
873 -7676 12062 52 -14340 8997 10889 -15495 -1721 17894 -6858 -12991 14448 5310 -15603
886 -15603 4305 11911 -9934 -3834 11106 -3705 -6741 7872 -498 -7267 6514 1405 -9243
899 -9243 5662 6103 -11959 605 12975 -9116 -9026 14921 968 -15935 7626 11306 -13410
912 -13410 -2993 14356 -4897 -9725 10217 2905 -9893 4324 5863 -7268 974 6022 -6115
925 -6115 -240 7788 -6462 -4383 10695 -2482 -11269 9101 6405 -13936 771 12952 -8786
938 -8786 -8279 12546 371 -12353 6503 7354 -9886 -456 8989 -4764 -3723 7357 -1767 -4034
952 -4034 6575 -919 -6391 7362 2588 -10655 3981 9698 -10651 -4299 13268 -3373 -12222
965 -12222 9812 5720 -13373 1596 11143 -8293 -5928 10566 -1300 -8614 6214 3024 -7275
978 -7275 3441 4359 -6725 2410 6889 -7299 -1817 11059 -4441 -9097 10819 3427 -13433 3797
992 3797 10925 -10667 -5360 12678 -2640 -11125 8002 5047 -10691 1154 8129 -6235 -3069
1005 -3069 7078 -2595 -3900 6640 -1231 -5608 7172 2087 -8923 4657 7924 -9148 -2310
1018 -2310 11379 -4103 -9424 9322 3724 -11646 2490 9006 -7858 -4471 8858 -1708 -6928
1031 -6928 5223 2135 -5837 2746 2823 -5243 2013 4483 -6236 -469 7808 -4564 -5535 8904 848
1046 848 -9527 4916 7154 -8877 -1687 9811 -3722 -7058 7558 2334 -8118 2281 5150
1059 5150 -5340 -1057 4656 -3215 -1897 4716 -2990 -3560 5880 -789 -6935 5272 4044 -8444
1073 -8444 685 8891 -5855 -5568 9342 518 -9232 4967 6555 -7735 -1036 7931 -2957 -4440
1087 -4440 5650 273 -4813 3550 1381 -4951 2692 2952 -6304 552 6046 -5479 -3891 7833
1101 7833 -1097 -8027 5714 5037 -8553 -96 8895 -4258 -5565 7326 1715 -6578 3007 4494
1115 4494 -4524 -179 4170 -2855 -1192 3895 -2193 -2586 4526 -1146 -5000 4237 2104 -6864 1276
1130 1276 6117 -5334 -3593 7408 -505 -6680 4246 4378 -5954 -295 5648 -2558 -2593 4226 -196
1145 -196 -2700 2872 241 -2915 2674 1143 -4296 1762 3215 -4943 -960 5684 -3188 -4975 5626
1160 5626 1549 -7036 1974 5493 -5106 -2583 5761 -910 -4229 3641 1509 -3635 1866 2400 -3134
1175 -3134 817 3288 -3073 -494 4444 -2478 -3022 5397 61 -5965 3619 4029 -6504 -993 6594
1190 6594 -3101 -5496 5294 1617 -6193 1607 4117 -4078 -1025 4137 -2073 -2172 3700 -696 -2693
1205 -2693 3359 659 -3852 2954 2730 -4803 440 5545 -3481 -3703 6096 399 -6551 2789 4214
1220 4214 -5348 -1649 5297 -1919 -3760 3454 425 -3711 1685 1699 -3012 978 2123 -2762 163
1235 163 3294 -2686 -1471 4634 -822 -4214 4104 2575 -5296 636 5165 -3319 -3046 4557 27
1250 27 -4467 2221 2318 -3481 182 2644 -2537 -736 2607 -1779 -1463 3000 -1056 -2847 3423 723
1266 723 -4418 2111 3999 -4226 -1413 5626 -1365 -4485 4236 2243 -4869 1007 4180 -3248 -1601
1281 -1601 3903 -1228 -2808 2815 246 -3242 2066 1094 -3337 1131 2660 -3640 -751 4603 -2308
1296 -2308 -3689 4660 1203 -5290 1919 4632 -3967 -1705 5032 -940 -3798 3603 1896 -3765 1066
1311 1066 2981 -2726 -796 2805 -1738 -1466 2570 -1223 -2689 2961 560 -3964 1968 3178 -4349
1326 -4349 -996 4681 -1624 -3716 3766 1564 -4125 1250 3598 -2627 -1171 3442 -391 -2179 2306
1341 2306 491 -1978 1426 703 -2006 1193 1513 -2804 -227 2928 -2337 -2425 3474 90 -3941 1956
1357 1956 2661 -3725 -583 3691 -1478 -2540 2787 711 -2658 1321 1526 -1870 434 2051 -1547
1372 -1547 4 2369 -1461 -1225 2974 -619 -2970 2585 1532 -4029 229 3360 -2783 -2344 3603
1387 3603 -179 -3530 2144 2205 -3290 -209 2935 -1692 -1303 2595 -316 -1548 2191 382 -1981 1723
1403 1723 1387 -2716 336 3028 -2302 -1551 3505 -407 -3448 2203 1985 -3895 -182 3259 -2103 -2212
1419 -2212 2832 132 -2784 1262 1572 -2209 152 1509 -1385 -400 1749 -1116 -816 2316 -510 -2064
1435 -2064 2189 1252 -2710 636 2675 -2022 -1229 2954 -222 -2889 1614 1501 -2565 -224 1969 -1273
1451 -1273 -1034 1245 -607 -1091 1172 -428 -1205 1557 444 -1899 1154 1655 -2070 -414 2697 -1048
1467 -1048 -1863 2553 686 -2529 1188 2108 -2204 -735 2201 -689 -1758 1241 133 -1663 789
1482 789 292 -1728 667 1174 -2013 -111 2084 -1475 -1375 2480 33 -2506 1691 1899 -2488 -98
1498 -98 2956 -1205 -1935 2374 640 -2453 930 1604 -1775 -227 1498 -1198 -989 1522 -769 -1388
1514 -1388 1339 219 -2045 1026 1207 -2003 -106 2243 -1350 -1473 2461 406 -2494 1282 1977 -2003
1530 -2003 -408 2321 -587 -1283 1529 405 -1385 785 531 -1176 364 670 -1453 -48 1173 -1324
1546 -1324 -879 1725 -562 -1779 1411 929 -2198 106 2148 -1159 -1279 1732 232 -1584 914 930
1562 930 -962 475 991 -751 56 1117 -795 -361 1222 -503 -1066 1259 257 -1915 804 1306
1578 1306 -1947 -754 2048 -787 -1973 1375 682 -1860 292 1495 -1293 -356 1431 -485 -707 1346
1594 1346 149 -1113 1119 528 -1373 531 1344 -1650 -249 2029 -914 -1505 1880 448 -2425 619
1610 619 1762 -1787 -948 1875 -317 -1628 1127 572 -1644 584 1214 -1129 -164 1448 -641 -333
1626 -333 1490 -161 -1067 1286 390 -1519 892 1428 -1560 -482 1957 -623 -1643 1165 491 -1674
1642 -1674 224 1093 -1105 -471 1247 -505 -870 781 194 -831 647 257 -838 693 751 -1046 296
1659 296 1567 -768 -668 1654 95 -1553 872 1064 -1497 -314 1308 -741 -924 877 -105 -1074
1675 -1074 492 409 -883 331 567 -937 105 914 -782 -355 1346 -371 -1368 1254 745 -1404 268
1692 268 1821 -893 -725 1569 53 -1294 1047 642 -1331 206 1023 -939 -552 1090 -639 -687 755
1709 755 -195 -1210 952 524 -1420 307 1272 -916 -596 1639 -89 -1275 1052 832 -1403 80
1725 80 1357 -749 -672 1272 54 -822 547 424 -918 106 471 -954 -172 790 -678 -558 975
1742 975 -383 -844 761 490 -1229 339 839 -930 -448 1135 -60 -843 948 448 -771 201 806
1759 806 -341 -89 389 -240 -251 549 -270 -466 592 -1 -852 411 365 -981 -51 810 -699 -730 975
1778 975 38 -1012 449 687 -791 40 1009 -219 -335 697 144 -396 578 -8 -538 572 391 -743
1796 -743 192 712 -779 -651 1042 -242 -1053 572 734 -1361 -186 934 -614 -915 863 126 -1058
1813 -1058 452 546 -561 11 634 -501 28 732 -242 -342 801 175 -818 484 656 -837 -21 1048
1831 1048 -471 -662 985 -68 -854 198 591 -910 -312 876 -370 -561 427 121 -552 420 246
1848 246 -389 315 484 -523 46 602 -407 -284 659 90 -684 615 260 -613 142 664 -546 -555 659
1867 659 -97 -633 105 200 -550 1 122 -391 84 384 -421 1 494 -289 -354 655 130 -490 394 773
1887 773 -686 -63 925 -331 -699 478 289 -915 181 597 -700 -68 452 -497 -165 600 -224 -492
1905 -492 614 295 -842 191 549 -684 -212 1002 -363 -547 913 422 -977 457 856 -664 -276
1922 -276 1073 -49 -677 349 70 -810 167 265 -624 -63 466 -425 -228 634 -122 -645 440 121 -597
1941 -597 210 566 -794 -222 746 -285 -561 465 454 -440 241 671 -298 94 563 -167 -179 367 2 -294
1961 -294 180 62 -459 289 18 -479 -50 446 -450 -296 614 -81 -550 408 191 -470 56 528 -177 -66
1981 -66 635 -157 -291 246 116 -236 247 375 -392 187 208 -536 -55 549 -295 -670 529 -115 -631 90
2001 90 537 -691 -339 666 -202 -577 523 135 -500 228 415 -248 45 452 -201 -120 584 -107 -406 340
2021 340 405 -581 88 497 -513 -344 719 -101 -682 376 264 -424 121 373 -338 -407 407 105 -282 200
2041 200 7 -259 284 322 -127 126 319 -195 -210 415 -141 -161 306 54 -408 -29 360 -390 -251 160 -131
2062 -131 -432 211 97 -287 38 -19 -128 -103 333 -170 57 355 -117 57 277 14 -341 375 346 -274 78
2083 78 537 -220 -189 293 -99 -327 131 212 -197 -4 170 -217 -131 223 -272 -276 229 1 -318 61 341 -260
2105 -260 102 384 -255 -180 528 6 -397 543 273 -508 148 446 -272 -149 432 25 -515 185 135 -517 -306
2126 -306 285 -321 -324 331 -149 -210 521 32 -410 245 220 -391 -116 419 -167 -312 518 1 -293 191 349
2147 349 -351 -50 261 -92 -165 145 -36 -275 38 -271 -304 53 20 -200 133 253 -178 -191 198 6 -348
2168 -348 245 122 -147 133 224 -155 174 343 51 -38 287 -179 87 136 43 -72 120 69 -437 -9 26 -129
2190 -129 -412 267 -108 -384 152 233 -251 -117 266 -214 -191 414 -21 -387 295 111 -264 27 187 -150 168
2211 168 454 -411 -325 277 230 -49 324 224 -484 -226 340 -207 -271 360 -9 -315 76 286 -351 -97 357
2232 357 -273 -253 220 119 -224 256 245 -189 160 286 -75 -51 326 114 -205 283 60 -335 31 45 -355
2253 -355 -243 170 -84 -286 59 -70 -155 63 201 -160 -66 157 34 133 137 -55 61 87 81 -211 98 194 -49
2276 -49 129 151 -62 -131 171 -19 -171 198 128 -203 49 58 -216 3 127 -179 -103 94 47 -64 -97 38 -312
2299 -312 105 150 -11 78 157 -84 -198 367 121 -196 226 252 -280 39 334 -131 -208 267 -65 -302 11 153
2321 153 -80 -85 54 -278 -203 168 -203 -276 217 83 -285 39 191 -259 -107 192 -81 -258 223 235 -207 79
2343 79 338 -120 -271 0 110 -85 56 -30 -57 83 -10 -264 -72 115 -102 19 156 47 -107 272 66
2364 66 -265 83 51 20 -214 97 124 -144 81 21 -75 -135 64 -47 -99 190 -160 -79 -26 -19 -187 8 -61 -98 238
2389 238 86 -183 -73 188 -115 -54 136 122 -51 241 39 -146 164 156 -65 126 301 42 -129 128 -206
2410 -206 -219 232 15 -179 -9 -37 -343 -144 146 2 -197 176 96 -312 54 54 -120 -74 277 158 -129 151
2432 151 207 -134 208 268 -130 -47 176 -145 32 223 -10 -292 130 -64 -227 107 147 -62 -87 58 122 -22
2454 -22 -60 28 -86 26 19 -55 18 69 51 -133 68 3 -18 186 53 -80 133 120 -156 5 9 45 -120 89 43
2479 43 49 -38 36 -112 -186 -200 -40 -44 75 -63 -25 82 -10 -89 99 125 -168 111 43 -63 62 310 -88 -29 124
2504 124 61 -117 84 18 -195 -25 183 -162 -143 153 -102 -143 -90 51 -27 -6 135 8 -51 254 -28 16 41
2527 41 119 -143 26 277 -56 -102 258 41 -232 43 12 -175 -138 181 -140 -264 -16 -191 -280 -205 196 -9
2549 -9 -39 72 0 -106 22 -7 -85 36 47 -258 74 -3 -27 0 184 124 -90 40 54 -45 -53 44 -66 45 -47 89
2575 89 21 97 41 -47 -143 -152 -53 38 58 -1 -14 31 28 -164 -23 12 87 -59 136 -25 90 -78 120 -35 -78 22
2601 22 42 211 -116 24 272 -198 -357 127 -59 -283 -194 90 -12 -12 3 68 -79 52 145 -241 -19 199 -64
2624 -64 -72 119 25 -101 217 137 -28 130 102 -110 7 63 -103 -209 36 1 -235 176 -26 -169 -121 158 169
2647 169 -339 86 -118 -103 123 176 -114 -139 153 -19 165 192 56 22 46 257 -105 145 204 -4 -220 190
2669 190 -102 -134 30 158 8 -46 -85 -102 -36 61 -54 -142 -12 -163 -40 -118 9 23 71 -167 111 -32 71
2692 71 75 57 55 -54 -45 73 46 -154 77 93 -201 69 -45 -97 -50 99 65 127 -328 190 -123 -4 212 -79 -132
2717 -132 101 9 -63 16 -58 4 165 71 -124 52 321 -34 1 -97 -13 -43 90 -10 1 -84 40 4 -250 140
2741 140 48 -124 34 164 -173 34 59 45 -306 117 22 82 91 -42 -104 -76 351 -95 -133 71 -14 -128 23 25
2765 25 -50 117 49 -95 -108 155 68 -35 -36 -102 -60 146 43 -9 20 149 -37 -102 40 20 -118 86 69 71 103 -34
2791 -34 1 69 49 51 0 150 61 -2 -66 -1 -17 94 -124 -57 -23 -42 -80 -180 134 -155 -119 -119 6 28 1 227 30
2818 30 -139 213 36 54 22 51 186 105 -53 102 48 -22 -138 1 36 -32 -88 43 -83 -108 11 79 -146 -81
2842 -81 134 -23 -91 166 -106 59 49 144 -79 -188 -3 163 -93 -74 79 -77 118 -45 200 -81 145 71
2864 71 -128 -56 -44 -32 -100 82 4 -39 110 82 145 25 30 -26 -157 48 -37 188 -45 -37 -43 29 -4 42 -155 -38 0
2891 0 150 -68 -163 -60 -150 -25 -141 3 -100 125 -44 -53 -65 -47 -78 -82 2 65 -82 -43 40 48 -127 234 75 -95
2917 -95 76 -12 -129 211 103 56 -54 -115 3 -52 53 17 -129 241 22 -186 -35 -102 2 -101 57 25 -102
2940 -102 94 -20 -29 -1 80 -1 -12 -64 41 5 84 37 -152 1 -8 -58 55 115 163 -57 -122 166 10 9 -197 34
2966 34 -108 -137 -40 -165 -85 -14 -167 -125 -88 24 -45 -83 -80 17 -35 -119 52 -41 5 -126 -16 -55 75 74 6 -6 100
2993 100 29 31 -3 157 -61 113 -106 -79 -34 117 -12 -51 -34 43 -45 74 34 16 79 170 94 -63 24 31 53 71 195
3020 195 -131 -86 -36 7 28 88 30 -334 -238 16 -42 -4 -26 -129 -135 -39 29 -59 -66 32 -78 99 102 71 165 87 16 -119
3048 -119 39 130 111 -152 34 -77 -101 -44 -108 -1 36 50 52 -94 -20 -98 -217 -4 23 -99 37 -31 14 -45 -30
3073 -30 18 69 33 26 29 2 -73 112 57 -117 -14 -65 -25 82 30 -128 -111 -132 84 28 0 55 -169 -51 -39 -114 32
3100 32 0 -3 39 -121 0 -83 65 77 -157 101 -57 210 1 -39 -24 -91 -91 70 -21 5 -1 83 -35 -99 71 -175
3126 -175 -102 24 80 -84 23 37 61 -60 59 33 -160 -87 1 -8 -2 94 -85 0 79 -143 -64 110 7 -63 -116 166
3152 166 -77 -18 -67 41 -77 -78 -61 -161 -30 -94 -66 -200 -16 40 -103 70 -100 -171 -6 -46 -4 13 51 105 -22
3177 -22 -17 44 -109 -72 244 -90 -27 86 37 -152 36 19 26 -64 -182 -99 42 -41 -215 66 43 -37 -78 53 8 23
3203 23 -17 205 -11 -31 130 29 66 65 -52 -62 35 80 69 84 148 -119 -13 141 44 -27 28 -133 -53 170 38
3228 38 -174 18 -15 -123 -79 -82 32 7 56 -89 -114 143 8 -75 92 97 -25 117 -54 -60 121 23 -70 -59 198
3253 198 -153 -25 17 -42 -33 107 -171 117 24 2 48 -28 9 110 59 -21 45 10 -20 -35 55 37 38 52 255 -71 -123
3280 -123 11 73 86 85 -38 95 89 106 9 -105 -98 -26 -166 -167 17 122 160 -111 -44 120 -75 -78 -6 -55 -6 -62 19
3307 19 162 -48 34 10 78 -14 -12 83 -85 5 65 87 51 22 -21 -235 17 -121 8 -58 -13 -58 98 -40 66 -79
3333 -79 -72 -40 81 71 9 -24 69 -76 53 175 -11 -44 37 -99 -101 12 -7 -17 -44 -44 -142 -33 -89 -155 -99 33 -29
3360 -29 32 -19 -12 13 -24 62 -54 258 -16 -79 34 -27 -90 -20 -48 84 -92 -34 54 -29 -158 -72 65 -31 110 -76
3386 -76 -165 47 -13 -97 -104 -126 51 -17 -128 18 175 164 -79 15 -9 -21 23 5 32 44 43 19 -61 -26 93 -13 -26
3413 -26 -38 -88 -63 -45 58 39 -33 14 -55 14 43 31 -36 -92 -40 166 -3 -24 -56 -36 -58 149 140 117 29 -58 123 99
3441 99 16 -119 123 -118 -71 148 21 -116 61 112 -104 -245 107 -24 -175 -17 -62 -38 -21 106 -22 30 191
3464 191 4 109 148 -137 -135 -67 134 -54 -99 103 -65 -116 69 2 -104 186 106 -35 -52 40 -77 -32 15 49
3488 49 -24 -122 35 -100 -88 -132 111 102 45 11 128 -55 -11 14 -145 14 81 -282 -15 -45 -78 -149 -160 -70 -61 88
3514 88 -33 -18 121 36 124 13 -77 -21 -11 7 47 -15 -139 19 118 -92 -78 -39 12 64 81 23 -76 32 39 241 -64
3541 -64 109 15 83 -1 -31 -101 -82 -26 -123 -52 13 -31 -223 41 -59 -109 59 -45 -96 -1 -10 103 -94 -6 221 -156
3567 -156 65 -92 -2 -97 80 -27 21 -25 22 -6 -100 18 5 99 -134 43 15 40 1 -3 -48 -23 -87 -57 -18 230
3593 230 94 111 0 33 -56 -108 38 -28 1 74 -121 -46 88 93 62 -144 53 -111 -79 191 8 -74 -59 -101 74
3618 74 76 20 -69 66 41 -46 -212 -47 -197 117 76 71 -9 -64 -20 8 -72 -117 21 -62 -28 42 -46 -100 -200 -49 108
3645 108 83 11 29 101 -168 -14 -40 129 78 44 -82 72 -26 122 65 0 83 -135 207 249 30 195 -68 38
3669 38 -65 -130 -9 -73 -72 33 -127 -93 33 -73 -141 -162 22 -79 -32 -9 29 -107 -75 79 9 -139 59 133 -19
3694 -19 103 118 87 -76 25 180 -87 -40 118 22 -158 30 -23 -217 -18 -51 -15 -87 -105 169 -106 -42 -96 80
3718 80 -143 15 56 95 -36 -89 35 -150 82 33 38 134 -8 -55 14 12 -90 -17 36 12 -137 -17 -95 17 -15 81
3744 81 -30 57 42 28 44 -64 -28 130 83 10 121 -76 -37 -78 -13 -75 -16 83 -31 3 -71 32 -138 4 43 -18
3770 -18 67 -2 12 -51 -4 -164 117 168 19 156 44 -97 68 66 -85 -119 60 -4 -109 16 -13 101 64 75 96
3795 96 -55 -25 -89 -59 -109 16 9 -2 68 -27 -60 -57 -25 -13 12 43 -23 -5 8 95 89 86 161 95 41 91 40 17 84 104 -209
3826 -209 150 1 20 48 25 -70 -56 -102 124 42 -21 113 -73 76 -33 8 30 22 -56 24 62 -27 -43 -84 -74 89
3852 89 116 74 4 89 36 185 -51 -26 18 6 -140 98 144 17 -72 104 -49 81 -8 -73 52 -59 2 60 -21
3877 -21 33 29 -4 31 171 94 -134 -46 -49 110 126 -168 160 105 -91 -126 -147 -64 -67 -80 124 -97 20 14 -59 81 -71
3904 -71 -94 129 120 -191 64 64 45 -36 -150 134 88 107 -151 1 -30 -36 -2 -89 -17 74 -93 -65 -21 -54 -114 116 16
3931 16 -5 54 -122 -128 -6 -10 -67 -48 -160 -72 -105 -144 30 -113 -111 7 70 88 9 -23 -81 -135 6 81 106 -34 -15 186
3959 186 68 134 26 -82 65 -47 -60 -98 -45 -65 89 -161 -13 -32 -48 -12 -69 -49 -193 -66 70 17 69 125
3983 125 10 6 148 45 18 -33 135 -47 -41 -35 220 42 -37 141 98 -66 -73 -142 -139 58 -144 120 -17 -43 29 160
4009 160 -45 51 25 38 -95 -204 -51 98 133 177 13 40 9 21 31 49 -6 55 27 56 -112 -124 -5 -116 13
4034 13 35 -85 -116 -13 -155 -60 35 33 65 -156 -67 106 -168 83 16 20 14 -74 -48 80 -1 144 -27 -118 32 -40
4060 -40 131 -81 -79 -178 -14 51 162 -153 -21 30 -102 57 -137 49 -19 156 92 -22 146 -55 -16 69 29 38
4084 38 -123 83 2 61 -27 92 64 -2 -52 -7 89 -80 -20 80 -75 145 -7 -109 88 25 -20 33 -70 36
4108 36 67 22 -80 40 76 31 -212 41 144 -268 -40 -62 -19 -83 -153 -30 -99 -12 25 -166 25 117 62 -146 -92
4133 -92 -21 -106 -78 74 96 -72 -64 -33 -100 147 -16 -13 144 79 -65 -11 82 -164 30 -79 -2 183 102 44 -71 -70
4159 -70 -48 -147 -178 -63 -12 -108 117 26 -64 43 -93 60 -3 36 50 52 36 -93 84 -36 108 94 -138 52 50 276
4185 276 8 -57 -146 27 57 -47 -276 42 -63 -14 25 -44 17 -33 99 -65 -18 -10 87 -12 -45 -36 117 111 23 -198
4211 -198 -54 -209 93 47 31 -54 192 74 32 -114 -119 -94 -105 -47 -65 -188 79 -30 61 47 -6 40 25 -1 -1 -121
4237 -121 136 -108 -91 -81 -128 107 -87 -14 -90 170 101 61 48 67 106 83 -93 9 111 7 90 -23 -222 81
4261 81 -42 -52 -77 -26 -33 91 17 13 12 23 -99 -71 40 -8 48 -2 -121 29 22 -66 -19 44 -49 -129 -114 -94 -99 -1 23 72
4291 72 100 53 -41 9 -94 109 34 -64 74 102 -4 35 20 -36 74 -27 22 11 219 -10 7 -42 54 18 132 216
4317 216 21 -113 -6 13 148 -67 11 -29 -134 94 -183 -214 23 -127 -74 -99 -28 47 51 163 -89 -130 46 -83
4341 -83 -56 -26 25 -20 -35 200 41 -25 3 38 -40 30 -16 94 -73 125 -50 54 85 19 9 -75 -163 138 -90 16
4367 16 179 29 36 43 6 135 91 -35 17 97 -137 92 197 22 146 -44 2 -65 66 5 150 86 -124 108
4391 108 -58 -93 -61 -10 -80 7 -12 -8 30 -86 13 58 -104 18 -86 95 -74 -4 49 133 -134 -60 20 117 -11 -63
4417 -63 -90 -20 44 -94 174 29 -14 -124 -96 -215 -50 58 -221 -50 -3 -87 -19 14 93 30 36 61 -151 -89 78
4442 78 -47 17 -52 -182 100 -82 -70 -34 -130 -71 -89 -88 -37 5 77 -104 20 58 104 0 -7 0 72 58 -76 -14 51 64
4470 64 -76 61 18 30 -210 63 -71 37 -103 31 85 118 -60 -39 28 -86 -16 84 28 -3 67 -13 -15 -72 78
4495 78 -52 -49 25 -114 34 75 -153 152 109 -17 123 -16 -177 -54 159 3 -85 90 12 11 -111 -21 -63 -27
4519 -27 53 114 -125 -28 90 -52 112 102 -54 25 84 -29 -45 -61 -23 78 -21 -146 144 24 -64 -34 27 78 7
4544 7 8 -125 112 20 1 -62 -8 -128 106 -108 1 -44 -81 105 -114 -76 -18 102 24 173 166 -31 30 119 110 -23
4570 -23 26 21 244 1 -170 3 -40 43 -121 179 33 123 36 -39 -92 62 -61 75 -10 99 -17 18 -17 -30 74
4595 74 84 145 -59 -10 -102 97 53 12 -78 77 123 -55 56 -74 90 132 59 35 34 -178 53 64 122 68 22 -52
4621 -52 -36 135 -8 81 -94 -22 -74 -58 53 65 -67 -12 64 22 24 116 87 -191 -126 6 68 -39 -172 -79 21 89
4647 89 -144 120 27 -86 -49 -33 116 89 -35 65 -75 -178 -216 -30 105 -141 -14 107 -97 58 -144 120
4669 120 -39 -58 22 -87 -58 -43 65 -17 188 76 59 -20 123 -16 173 151 -11 58 -39 -146 32 50 -48 -110
4693 -110 -61 68 -106 114 -22 -49 128 -67 -87 43 -107 -23 -9 -117 -59 66 -82 32 -50 2 -47 49 -68
4716 -68 -11 -55 25 -40 0 -1 10 81 -81 -158 -70 33 77 -101 -17 48 -31 -46 82 -50 8 40 -89 -157 -100 -11 44 -102
4744 -102 -24 59 -15 -7 17 -36 97 31 -121 25 72 4 182 116 -157 21 175 -158 -52 -66 94 223 -36 156
4768 156 137 -87 -32 104 164 -5 -10 13 -48 -62 27 73 -95 -16 -12 -87 21 49 189 16 7 -32 75 28 104 -9 36
4795 36 -22 -197 -65 16 -4 -115 -70 -46 33 -15 18 -47 120 19 76 -141 21 -22 -261 129 82 44 -2 22 -109
4820 -109 74 -2 -135 43 94 -42 -1 -171 -5 63 113 44 -127 -58 -20 -32 52 107 -46 58 130 189 15 63 51
4845 51 -61 -75 21 -38 -36 179 191 -84 71 21 -36 41 -19 -24 83 94 62 -212 80 -36 -27 71 23 -30 50 119 17
4872 17 -42 -67 136 -113 -25 -103 -23 -109 -51 70 15 14 30 -50 181 82 -36 -1 26 182 -49 44 -13 0 -7 80 32 -99
4900 -99 -7 79 -24 -82 1 54 -121 -26 -110 -19 -91 139 -46 -141 -110 -4 -50 -2 -56 64 49 45 -19 -136 71 -32
4926 -32 154 -3 -35 -87 0 -74 -9 108 -95 -51 -70 14 25 110 -8 8 -71 -12 -71 74 -30 -155 -7 -6 122 -100
4952 -100 -85 -44 -49 139 -94 143 -60 2 104 -18 78 -55 16 -72 -169 64 125 -131 -246 -5 44 -141 -133 -34 97
4977 97 -37 -23 111 -13 29 135 122 63 -33 90 -78 18 39 -54 -24 -34 -30 -6 7 100 87 96 89 137 -118 167 -159
5004 -159 -261 87 103 10 -23 -23 104 245 35 44 136 -42 -13 0 -48 -25 -55 -93 94 13 58 88 -66 30 45 56 -60
5031 -60 -161 14 117 -99 33 -63 94 74 -74 -5 -53 9 13 -125 -18 11 111 150 63 64 95 121 18 47 121 55
5057 55 21 -143 84 156 -5 -5 -201 -5 -70 -64 -50 99 55 31 44 68 55 -33 20 85 46 -59 -28 2 2 -48 -78 68
5085 68 -5 -65 -41 27 42 27 -86 -6 -75 65 38 -40 -119 8 30 -25 3 -40 -55 -96 -1 -86 -11 -165 61 -153 58
5112 58 -77 -43 -26 184 -45 87 68 -95 -33 68 -3 -120 62 -46 133 79 68 -108 -79 26 -49 -228 -47
5135 -47 32 3 19 -19 96 -41 139 89 50 -20 -249 -3 27 -75 -17 -35 -17 52 -37 101 -69 -63 -54 53 6 83 -100
5162 -100 -69 -52 92 -34 -139 168 47 -61 169 79 102 17 126 21 139 95 29 -37 -135 5 -191 0 14
5185 14 67 213 -28 -116 -15 -18 -67 -95 11 -117 133 -204 35 -163 41 67 27 127 180 133 68 -76 52 18
5209 18 -142 5 -67 -47 -1 -190 -23 284 -59 -20 14 270 -25 -66 -12 54 -24 -84 -22 -15 -40 -3 -103 -214 -14
5234 -14 -53 43 -12 0 -42 113 -38 -41 17 -184 48 -79 155 42 -76 108 -83 -110 -1 -126 41 -48 93 41
5258 41 109 -13 -44 -74 -43 70 -42 84 -92 146 -138 -3 -11 141 80 -46 116 -85 -86 181 8 47 -19 199
5282 199 -80 -181 98 17 -42 -24 -11 188 74 -82 -14 -278 -34 43 -145 9 27 41 -9 116 161 5 -15 17
5306 17 -42 199 -13 11 204 -29 146 -64 -63 8 19 -66 64 65 134 -125 -88 -30 23 14 76 16 67 101 -103 101 182
5333 182 -240 94 -16 134 16 118 70 -142 106 14 79 -149 60 99 129 -137 32 -44 41 -32 -100 101 79
5356 79 -95 -58 -18 158 -35 -65 -81 -80 -49 -100 -138 -22 55 -153 -126 98 64 -43 56 77 2 168 -181 -79 39
5381 39 -117 -2 -23 -26 -37 -10 67 15 -34 -36 45 -12 -4 -105 -3 -54 -12 36 160 -188 184 -36 -111 -58 -54 23 27 -24 111
5410 111 -46 -112 22 8 158 -271 25 49 142 -60 -76 14 -75 89 120 4 42 -141 10 -87 -18 -201 5 -108
5434 -108 -12 -78 -44 24 -80 3 -7 23 0 14 -56 -101 -147 -87 59 -144 -147 -90 -43 -113 -128 21 -78 -5 13 31 -37 21
5462 21 -18 -64 -74 116 -159 -31 -2 -66 3 -17 -5 -42 22 174 208 -81 18 98 30 -192 105 -26 -27 15 -34 -44 -95
5489 -95 -17 -166 51 -43 8 -93 255 -30 14 -48 52 50 69 -103 -92 -39 80 3 -90 -7 -27 83 -52 64 -36
5514 -36 -37 -82 -29 -76 21 -62 99 -89 91 -21 102 88 -106 50 101 94 -117 22 147 -32 153 13 76 -274
5538 -274 82 -143 -18 25 31 -116 102 138 152 75 -9 -96 37 46 52 9 89 78 -62 38 58 9 51 -123 18 -41
5564 -41 109 55 -140 -105 9 -59 -64 -71 -53 -22 53 21 15 -259 -148 30 -194 110 -90 69 -1 18 113 23 -74 -30 174
5591 174 25 26 92 -77 98 89 -48 113 -74 -5 87 -93 25 -56 2 109 84 -33 92 -80 -105 122 35 -115
5615 -115 -116 25 -15 -81 28 12 39 68 30 -94 -10 60 0 48 134 -72 21 119 52 60 54 -60 26 33 -37 49 7 -67 98
5644 98 -93 -86 -34 31 57 87 53 128 133 65 -48 -70 236 94 124 -46 -39 27 -82 -13 11 111 -119 -199 17 30 -29
5671 -29 13 -94 40 35 -170 25 -2 34 -163 22 94 125 -61 -87 109 -39 122 103 -25 104 39 207 -28 15
5695 15 36 104 60 63 102 -64 -155 51 -90 -19 55 -100 12 -56 -52 -14 -38 87 48 -40 14 40 36 -84 -79 -14 10 108 41
5724 41 -41 -3 45 -111 8 -27 68 -10 8 -76 -2 -67 52 -136 -47 -14 -75 61 48 122 127 -75 55 -2 -47 43 -64
5751 -64 16 -121 15 -39 3 -59 -117 -48 -26 107 -89 157 43 122 -90 1 -107 17 -10 46 81 -92 90 100 -7
5776 -7 -56 198 -60 -54 25 46 131 40 19 119 -232 -190 -103 -55 82 87 -42 56 186 60 100 11 146 109 -99 29
5802 29 141 32 49 -284 -133 -148 -36 19 -85 35 -49 134 25 61 -47 10 -17 42 -65 34 32 36 -234 156 -1
5827 -1 34 -207 -90 -93 -78 64 42 3 -113 -19 -6 53 -74 148 -126 67 -30 -123 62 -65 154 14 -36 -55 -10
5852 -10 92 -63 -72 -71 -13 -42 -27 83 -212 -87 26 39 54 23 225 97 235 -38 122 21 18 2 -83 67 -19
5877 -19 -48 78 -103 -87 -15 42 -138 -80 85 83 60 -71 105 57 -6 -76 -29 -48 -42 -32 19 16 149 22 26 -10 48 213
5905 213 -101 -88 -148 117 29 -96 -43 -122 -53 78 110 50 68 -96 46 -15 177 73 -43 -149 64 -9 -47 -3
5929 -3 -173 32 99 -115 41 -104 -180 60 40 -54 -117 113 5 189 46 87 50 60 104 -176 27 -8 -167 66
5953 66 -30 87 106 -40 115 77 42 -29 29 39 61 -5 121 -8 -94 -40 -26 -24 7 39 -48 26 -42 196 14 4 -64
5980 -64 -121 -80 -40 54 -65 -11 -95 -168 -63 -146 -32 155 37 -5 -22 -6 -25 98 37 -132 73 -55 111 35 -3
6005 -3 73 -181 55 172 11 -91 -25 28 75 80 5 30 -39 -49 20 153 -137 -115 -186 46 68 -36 135 15 -10 -71
6031 -71 16 -68 -131 0 12 -68 -5 -24 124 74 70 52 -24 49 5 -10 35 20 53 -43 -44 28 7 134 -46 31 -15 84 81 111
6061 111 -74 8 36 -35 142 10 -54 -17 85 -14 57 79 7 156 -18 -36 228 -58 -113 30 26 59 34 71 73 -13
6087 -13 -65 -36 -33 -117 85 15 111 6 16 -65 14 -206 82 -62 -7 148 71 -221 22 -20 -221 112 -96 38 98
6112 98 -101 -9 83 -31 55 -29 -22 -52 126 13 83 -121 -80 -15 137 74 69 -147 59 58 -37 112 -13 -15 -55 46 -5
6139 -5 -171 -31 71 -105 25 31 -29 -35 -18 -194 -94 126 -127 -157 107 -83 26 68 115 -105 12 -116 -80 -144
6163 -144 -16 143 -18 122 31 99 27 59 40 -45 10 47 30 -35 -46 39 -7 97 63 -80 24 -173 -10 -24 -70
6188 -70 -6 -61 1 -79 -16 16 31 45 -152 -25 -82 -37 126 34 4 11 -69 -142 -130 95 -14 -120 2 0 56 57 -3 -57
6216 -57 -36 65 130 115 -68 -79 131 52 90 -39 52 -111 159 -29 -59 -16 113 93 98 83 36 133 49 -24 27 34 -41
6243 -41 -144 -172 106 -36 -176 -45 59 55 -32 14 -82 41 -49 19 165 -51 -75 -87 20 -75 0 16 8 -67 27 -85
6269 -85 226 29 39 -37 39 -64 -193 147 50 -48 67 -128 -30 -17 177 274 4 122 -69 -48 4 67 -39 125
6293 125 -51 -27 -130 61 1 58 -38 135 -80 161 -64 -75 84 32 -108 -6 22 17 65 -62 94 -59 232
6316 232 -103 -3 8 -87 -3 -23 -139 109 65 -68 -49 48 -55 0 -63 -92 -72 1 -107 94 -4 36 38 81 -33 -14
6342 -14 21 -37 64 41 80 -29 79 -32 170 13 217 24 -29 -31 79 -67 -11 -51 -115 -38 -5 -50 -91 143 -140
6367 -140 16 90 -52 -74 -252 137 -21 -153 -4 -16 35 21 -62 -144 8 -2 29 -37 57 56 52 -50 35 -124 124
6392 124 9 21 -170 -74 -2 136 67 72 23 -36 84 -104 -32 -36 -6 -1 3 -25 -15 -131 136 54 -53 86 -176 33
6418 33 129 -121 -46 132 -57 -18 -49 80 -20 -47 71 151 -12 -26 -38 57 3 -92 87 -86 -8 84 -71 -191 133
6443 133 4 80 60 -84 31 -93 120 -131 26 85 -20 35 52 4 26 -14 6 -53 95 45 78 102 -296 -144
6467 -144 10 -20 -26 87 140 13 68 142 -31 70 -108 -23 86 -51 -53 -39 44 -4 74 33 -106 58 6 -150 8
6492 8 -39 -109 16 -81 -40 -71 -144 4 27 -22 -68 -129 -148 33 -95 111 28 -117 -143 36 -188 39 -26 -93 -85 -141 57
6519 57 26 -33 -53 133 162 -20 -35 -102 147 0 -151 -11 39 30 7 -6 -125 8 -54 36 48 10 -92 -1 -40 -138
6545 -138 -52 -130 74 -117 60 -27 32 42 -130 -94 177 2 -30 306 3 108 26 -123 169 75 -38 -71 104
6568 104 -42 -105 159 8 44 56 -150 210 149 -21 -3 67 46 11 -138 25 -5 -75 -45 -66 119 -91 95 -137
6592 -137 -74 -28 -170 217 -3 0 -73 81 49 109 32 -253 -19 -15 -41 42 147 17 23 111 13 -68 14 92 -82 16 112
6619 112 173 -30 83 -135 107 45 -51 37 -8 -25 123 -74 -198 104 69 -84 -157 -52 -150 -63 103 -31 38 -72
6643 -72 86 -49 54 -3 -4 -45 73 -59 -47 98 75 54 -52 102 -57 -27 35 -181 -74 102 38 -52 157 115
6667 115 122 132 -86 6 -120 160 -6 -91 -38 29 81 -115 -200 -87 17 12 109 -54 140 73 -55 32 -96 -10 -27
6692 -27 -113 112 -105 63 -23 1 63 -52 -89 -65 27 43 0 112 46 9 24 -54 -87 138 -13 -28 61 35 128 188 -58
6719 -58 93 41 19 5 21 -161 91 -11 18 58 73 12 -19 -24 -62 -76 -21 -13 62 -38 -141 41 -176 -102 -37 65 -263
6746 -263 -50 -31 -50 12 -84 -17 -101 -18 41 -165 -86 -102 -139 20 -131 -39 76 86 19 33 58 -36 48 -70 -22 103
6772 103 -211 -107 44 47 25 46 -20 -43 199 -106 -32 -145 -123 -145 153 -61 -70 69 99 -42 -184 -19 -30 -102 -32
6797 -32 2 -61 16 28 58 31 119 -102 -79 24 -61 16 -24 -44 -31 -46 -195 86 -16 -74 8 -49 -3 -69 77 -55 -6
6824 -6 -142 -74 248 13 -150 -20 49 -4 -222 51 31 77 -90 47 -86 45 72 -119 107 -170 38 -231 -73
6847 -73 71 55 -1 -70 94 30 -138 -55 -49 13 26 -58 -60 -28 -82 -45 -136 76 -10 -90 -23 134 53 -50 63 -4 -75 142
6875 142 82 -90 40 44 -54 11 -43 -35 -133 39 82 -54 -94 39 12 -19 -66 -29 66 -141 -1 -4 -33 114 67 167 -2
6902 -2 29 69 70 93 44 207 140 -81 156 65 -12 105 75 -115 -57 -12 45 -91 237 -109 101 -161 -28 -12 66 -5
6928 -5 10 -22 -41 -58 -34 -32 23 87 -126 -39 -28 -24 -60 37 82 -73 -104 126 58 130 16 -59 -118 1 134 87 117 -143
6956 -143 -73 85 -79 39 -49 14 -68 -33 -171 19 -133 -45 100 75 51 -30 94 -31 -38 -100 139 64 105 118 -183
6981 -183 -101 -116 86 56 -61 112 -44 5 29 -107 47 125 -68 40 -46 68 121 30 -129 -36 205 -142 47
7004 47 165 57 -60 -43 -55 -86 -39 -12 74 36 23 -103 -1 77 -80 -109 -31 -38 -12 -57 -6 96 -86 -184 68 88
7030 88 30 12 42 -56 71 -26 -119 136 -32 -30 156 -192 -79 -26 40 -13 67 -73 -91 21 -125 14 -116 -83 -125
7055 -125 104 125 -51 2 -28 -28 20 37 107 -109 41 95 -26 93 40 113 84 57 -41 8 116 -42 45 -125 60
7080 60 -68 62 14 -156 21 -47 -13 87 -34 30 63 -41 -189 56 97 3 -120 53 -26 -55 -85 43 -72 44
7104 44 -96 -97 -6 -87 -41 -138 -246 -119 -5 -19 77 155 -58 118 88 123 67 3 -68 -5 -165 -50 -76 -57 -78 -32 57
7131 57 -12 130 -149 11 219 -8 -39 -126 5 191 -54 11 50 -60 -51 -78 -45 201 -131 -14 -106 -157 -56 9
7155 9 44 39 -80 -211 107 80 5 13 -7 -114 74 148 55 52 -18 -59 1 -6 67 -60 14 -76 2 46 50 -63 -5 -102 9
7184 9 30 -114 43 0 78 107 -6 -57 9 -43 15 -37 57 42 1 -139 0 113 -10 94 45 42 30 28 38 -54 -4 -17
7212 -17 5 30 130 165 170 61 -90 -191 19 -26 71 -33 100 -51 34 30 124 -109 9 118 -64 39 -33 82
7236 82 72 32 -112 112 55 -135 123 3 -35 158 -112 135 38 18 82 -42 -56 71 54 104 -71 191 -149 35
7260 35 -68 170 55 108 -151 -55 89 -22 62 -77 90 32 -122 -32 -85 65 -138 -57 43 1 33 95 -137 -105
7284 -105 -19 -26 -127 4 -7 -212 -43 -33 110 -54 -33 70 68 -5 -56 60 3 -72 129 -15 -202 19 3 -253
7308 -253 86 -206 70 43 25 76 -52 -105 152 -22 -49 57 25 -86 141 -102 -3 20 27 -79 60 18 22 101 -30
7333 -30 27 69 176 -67 -46 78 -39 -25 114 93 -5 109 -94 6 -104 -25 127 52 105 39 85 -170 55 68
7357 68 -69 -214 59 119 -23 100 -69 -20 52 -63 -85 33 -20 -72 38 28 -66 70 -69 19 -13 87 71 103
7381 103 95 29 -70 -174 62 56 -73 -135 39 170 -20 -75 -20 56 -51 -81 -60 -142 95 43 -112 -16 110 79 17 -90
7407 -90 65 128 44 -58 -59 130 -140 -23 -217 -144 -158 -61 -106 -29 -3 124 50 -216 -154 16 -168 -8 26 136 -5
7432 -5 -10 34 1 16 123 40 -206 59 27 -63 -198 -174 18 125 50 -38 -80 -62 61 -139 -23 75 166 -81 -203 23
7458 23 79 50 57 17 -98 100 121 -74 -102 140 3 200 -77 72 -95 -52 87 -25 19 99 37 4 158 23
7482 23 -10 67 158 -98 -41 -47 -208 -84 -39 42 -22 -27 21 -100 -32 22 -66 -2 -114 -76 7 -76 -112 16 53 -103 173
7509 173 -118 17 -5 31 170 -8 201 -101 65 -135 -12 -11 -69 -55 -21 -41 42 213 136 78 -127 -55 -10 18 83
7534 83 68 -116 124 -17 -102 -26 81 28 111 199 -109 107 -257 84 -6 -87 -170 -92 -53 -47 -149 33 -149 55 -87
7559 -87 -28 -68 130 31 -126 20 3 -3 25 127 154 -33 25 40 26 -87 -290 29 21 117 -75 24 -149 -154 96 -76
7585 -76 -55 -51 7 -6 54 -90 50 170 4 95 -52 -46 26 -57 24 -32 85 -74 -15 77 107 28 0 -65 125 -89 71
7612 71 94 -14 21 -93 -4 -167 22 -50 56 -137 25 -49 11 -98 -66 76 44 88 126 70 -46 -20 -8 35 -162
7637 -162 -92 154 -71 45 60 -69 62 -74 -113 -98 105 125 -84 103 21 2 -48 -1 -107 34 -7 98 93 147
7661 147 -30 18 -84 35 43 171 30 49 7 -161 59 -7 93 -23 -8 -101 -72 -1 -31 -90 -46 47 -182 -90 -58
7686 -58 117 79 117 -63 219 -33 135 -16 -12 -57 -93 -21 -104 23 44 -143 55 120 10 -19 -75 -57 11 49 -94
7711 -94 -24 -205 106 -142 103 91 -170 -85 -6 -80 75 3 -88 36 37 70 179 -64 76 -112 62 -93 10 9
7735 9 -138 -3 -85 -9 -78 -33 8 -35 -91 150 -89 167 -26 76 39 -14 109 -142 23 -33 -25 -46 135 -97 54
7760 54 -13 69 -147 4 101 67 59 21 95 36 7 -11 -9 -115 94 39 -5 -85 105 -98 -106 44 109 28 -111 86 15
7787 15 -124 95 -187 -69 -42 -20 73 41 -57 -27 58 204 0 -66 66 -37 109 -106 -160 92 -37 -4 88 -146
7811 -146 -37 -122 -30 0 155 -69 117 -12 -67 154 76 -11 -17 -54 2 64 -41 194 55 6 66 -151 62 10 139
7836 139 94 94 4 38 103 5 -67 -43 52 0 188 -39 -10 -101 25 50 77 -56 -106 10 -97 -126 -212 50 -114 -34
7862 -34 200 -9 10 -45 -99 103 8 -52 41 139 -81 -119 48 -41 13 -84 -202 -47 -71 89 113 -4 -128 50 40
7887 40 -10 -87 99 93 -25 -39 -65 -123 -80 -3 -9 24 -145 -26 154 -86 34 -91 45 -69 31 -149 -18 -55 62
7912 62 -100 39 167 -141 -217 93 38 -75 141 -81 141 -69 27 -152 152 83 -52 37 33 43 -54 133 104 23
7936 23 118 5 8 41 122 -24 48 98 -15 -44 -119 -218 -43 39 46 104 -62 -79 89 146 -87 -82 172 87 52 25 -37 -81
7964 -81 -57 -38 -58 -90 65 -15 -88 1 5 119 32 81 28 -25 -37 41 209 -68 -35 -76 55 -23 64 -72 -42 30 -24 104
7992 104 14 -154 39 -8 -32 20 -83 -31 61 79 -58 2 -33 -2 -89 1 5 -79 95 -143 29 86 81 -63 30 -138
8018 -138 -35 -5 -24 61 -180 62 83 125 214 -12 -143 -123 -105 51 108 8 21 25 -22 108 189 -52 -37 -77 -12 172
8044 172 -59 169 104 24 96 10 -145 13 94 34 -44 51 100 18 76 88 107 -173 71 -30 -2 -34 -84 95 -223
8069 -223 73 -9 11 -63 -9 123 -61 -22 -112 42 80 -107 112 21 -38 -76 6 -53 -133 -100 107 55 -14 63 -40 -21
8095 -21 120 -98 -129 -96 20 141 47 24 -13 -66 -120 16 108 -28 -78 -152 3 45 39 101 -78 -97 -118 35 228 42
8121 42 -27 6 27 2 119 -36 -50 52 -77 -4 33 18 -19 205 -62 -15 -110 51 -128 0 139 -29 62 2 -39
8146 -39 -183 22 24 30 -57 -79 -84 20 -121 39 127 -5 -26 -16 2 -14 13 112 -169 -73 73 -63 2 -31 -41 65 21
8173 21 -6 141 48 -84 -211 40 1 -98 -160 67 -213 23 -26 -24 102 46 155 15
8191A5
##END NTUPLES=NMR FID
##END=
