##TITLE=1H_2MBDE-3.1
 CDCl3
 8 sc, 
 21.11.2023
##JCAMPDX= 6.0         $$ Bruker NMR JCAMP-DX V2.0
##DATA TYPE= NMR FID
##DATA CLASS= NTUPLES
##ORIGIN= UXNMR, Bruker Analytische Messtechnik GmbH
##OWNER= root
$$ XWIN-NMR		Version 3.5
$$ Tue Nov 21 15:34:31 2023 Russian Standard Time (UT+4h)  she@DPX200
##.OBSERVE FREQUENCY= 200.1313
##.OBSERVE NUCLEUS= ^1H
##.DELAY= (6, 6)
##.ACQUISITION MODE= SIMULTANEOUS
##.ACQUISITION SCHEME= undefined
##.AVERAGES= 8
##.DIGITISER RES= 18
##SPECTROMETER/DATA SYSTEM= spect
##.PULSE SEQUENCE= zg30
##.SOLVENT NAME= CDCl3
##.SHIFT REFERENCE= (INTERNAL, CDCl3, 0, 15.7039)
##AUDIT TRAIL= $$ (NUMBER, WHEN, WHO, WHERE, WHAT)
$$ ##TITLE= Audit trail, XWIN-NMR		Version 3.5
$$ ##JCAMPDX= 5.01
$$ ##ORIGIN= Bruker BioSpin GmbH
$$ ##OWNER= she
$$ F:/spectra/data/she/nmr/H-F/1/audita.txt
$$ ##AUDIT TRAIL=  $$ (NUMBER, WHEN, WHO, WHERE, WHAT)
(   1,<2023-11-21 15:32:27.04 +0400>,<she>,<DPX200>,
      <created by zg, POWCHK disabled, PULCHK disabled
       configuration hash MD5:
       00 E9 B6 7A A2 85 ED C7 34 08 36 98 17 FE 4E 26
       data hash MD5: 16K
       CD 91 2C E1 D0 F6 9D 6F B3 00 A7 BF 6C 55 0D F4>)
$$ ##END=
$$ 
$$ hash MD5
$$ 38 23 50 EC E2 3F 9E F6 77 9E 01 D1 91 90 0E 74
##$RELAX= 
##$RELAX= 
##$RELAX= 
##$RELAX= 
##$RELAX= 
##$RELAX= 
$$ Bruker specific parameters
$$ --------------------------
##$DU= <F:/spectra>
##$EXPNO= 1
##$NAME= <H-F>
##$PROCNO= 1
##$TYPE= <nmr>
##$USER= <she>
##$AMP= (0..31)
100 100 100 100 100 100 100 100 100 100 100 100 100 100 100 100 100 100 
100 100 100 100 100 100 100 100 100 100 100 100 100 100 
##$AQSEQ= 0
##$AQ_mod= 1
##$AUNM= <au_zg>
##$AUTOPOS= <>
##$BF1= 200.13
##$BF2= 200.13
##$BF3= 200.13
##$BF4= 200.13
##$BF5= 200.13
##$BF6= 200.13
##$BF7= 200.13
##$BF8= 200.13
##$BYTORDA= 1
##$CFDGTYP= 0
##$CFRGTYP= 5
##$CHEMSTR= <none>
##$CNST= (0..31)
1 1 145 1 1 1 1 1 1 1 1 1 1 1 1 1 1 1 1 1 1 1 1 1 1 1 1 1 1 1 1 1 
##$CPDPRG= <>
##$CPDPRG1= <>
##$CPDPRG2= <>
##$CPDPRG3= <>
##$CPDPRG4= <mlev>
##$CPDPRG5= <mlev>
##$CPDPRG6= <mlev>
##$CPDPRG7= <mlev>
##$CPDPRG8= <mlev>
##$CPDPRGB= <>
##$CPDPRGT= <>
##$D= (0..31)
0 1.2 0 0 0 0 0 0 0 0.06 0 0.03 0 0 0 0 0.0002 0 0 0 0 0 0 0 0 0 0 0 0 
0 0 0 
##$DATE= 1700566346
##$DBL= (0..7)
120 120 120 120 120 120 120 120 
##$DBP= (0..7)
150 150 150 150 150 150 150 150 
##$DBP07= 0
##$DBPNAM0= <>
##$DBPNAM1= <>
##$DBPNAM2= <>
##$DBPNAM3= <>
##$DBPNAM4= <>
##$DBPNAM5= <>
##$DBPNAM6= <>
##$DBPNAM7= <>
##$DBPOAL= (0..7)
0.5 0.5 0.5 0.5 0.5 0.5 0.5 0.5 
##$DBPOFFS= (0..7)
0 0 0 0 0 0 0 0 
##$DE= 6
##$DECBNUC= <off>
##$DECIM= 32
##$DECNUC= <off>
##$DECSTAT= 4
##$DIGMOD= 1
##$DIGTYP= 9
##$DL= (0..7)
0 120 120 120 120 120 120 120 
##$DP= (0..7)
150 150 150 150 150 150 150 150 
##$DP07= 0
##$DPNAME0= <>
##$DPNAME1= <>
##$DPNAME2= <>
##$DPNAME3= <>
##$DPNAME4= <>
##$DPNAME5= <>
##$DPNAME6= <>
##$DPNAME7= <>
##$DPOAL= (0..7)
0.5 0.5 0.5 0.5 0.5 0.5 0.5 0.5 
##$DPOFFS= (0..7)
0 0 0 0 0 0 0 0 
##$DQDMODE= 0
##$DR= 18
##$DS= 0
##$DSLIST= <SSSSSSSSSSSSSSS>
$$ [...]
##$SUBNAM2= <"">
##$SUBNAM3= <"">
##$SUBNAM4= <"">
##$SUBNAM5= <"">
##$SUBNAM6= <"">
##$SUBNAM7= <"">
##$SUBNAM8= <"">
##$SUBNAM9= <"">
##$SW= 18.0517328524113
##$SWIBOX= (0..15)
0 0 2 0 0 0 0 0 0 0 0 0 0 0 0 0 
##$SW_h= 3612.71676300578
##$TD= 16384
##$TD0= 1
##$TE= 0
##$TE2= 300
##$TE3= 300
##$TEG= 300
##$TL= (0..7)
0 120 120 120 120 120 120 120 
##$TP= (0..7)
150 150 150 150 150 150 150 150 
##$TP07= 0
##$TPNAME0= <>
##$TPNAME1= <>
##$TPNAME2= <>
##$TPNAME3= <>
##$TPNAME4= <>
##$TPNAME5= <>
##$TPNAME6= <>
##$TPNAME7= <>
##$TPOAL= (0..7)
0.5 0.5 0.5 0.5 0.5 0.5 0.5 0.5 
##$TPOFFS= (0..7)
0 0 0 0 0 0 0 0 
##$TUNHIN= 0
##$TUNHOUT= 0
##$TUNXOUT= 0
##$USERA1= <user>
##$USERA2= <user>
##$USERA3= <user>
##$USERA4= <user>
##$USERA5= <user>
##$V9= 5
##$VALIST= <valist>
##$VCLIST= <CCCCCCCCCCCCCCC>
##$VD= 0
##$VDLIST= <DDDDDDDDDDDDDDD>
##$VPLIST= <PPPPPPPPPPPPPPP>
##$VTLIST= <TTTTTTTTTTTTTTT>
##$WBST= 1024
##$WBSW= 4
##$XGAIN= (0..3)
0 0 0 0 
##$XL= 0
##$YL= 0
##$YMAX_a= 803145
##$YMIN_a= -940536
##$ZGOPTNS= <>
##$ZL1= 120
##$ZL2= 120
##$ZL3= 120
##$ZL4= 120
##$ABSF1= 10
##$ABSF2= 0
##$ABSG= 5
##$ABSL= 3
##$ALPHA= 0
##$AQORDER= 0
##$ASSFAC= 0
##$ASSFACI= 0
##$ASSFACX= 0
##$ASSWID= 0
##$AUNMP= <proc_1d>
##$AZFE= 0.1
##$AZFW= 0.1
##$BCFW= 1
##$BC_mod= 2
##$BYTORDP= 1
##$COROFFS= 0
##$CY= 11.3945322036743
##$DATMOD= 1
##$DC= 2
##$DFILT= <>
##$DTYPP= 0
##$F1P= 15.7292609196834
##$F2P= 12.9074282941183
##$FCOR= 0.5
##$FTSIZE= 0
##$FT_mod= 4
##$GAMMA= 1
##$GB= 0.15
##$INTBC= 1
##$INTSCL= 1
##$ISEN= 128
##$LB= 0.24
##$LEV0= 0
##$LPBIN= 0
##$MAXI= 10000
##$MC2= 0
##$MEAN= 0
##$ME_mod= 0
##$MI= 1.114404
##$NCOEF= 0
##$NC_proc= 0
##$NLEV= 6
##$NOISF1= 3.799351
##$NOISF2= 2.8
##$NSP= 1
##$NTH_PI= 0
##$NZP= 0
##$OFFSET= 15.70392
##$PC= 1
##$PHC0= -23868.99
##$PHC1= 11.85269
##$PH_mod= 1
##$PKNL= yes
##$PPARMOD= 0
##$PSCAL= 0
##$PSIGN= 0
##$REVERSE= no
##$SF= 200.130013532006
##$SI= 16384
##$SIGF1= 3
##$SIGF2= 2
##$SINO= 400
##$SIOLD= 16384
##$SREGLST= <1H.CDCl3>
##$SSB= 0
##$STSI= 0
##$STSR= 0
##$SW_p= 3612.71676300578
##$SYMM= 0
##$S_DEV= 0
##$TDeff= 0
##$TDoff= 0
##$TI= <>
##$TILT= no
##$TM1= 0
##$TM2= 0
##$TOPLEV= 0
##$USERP1= <user>
##$USERP2= <user>
##$USERP3= <user>
##$USERP4= <user>
##$USERP5= <user>
##$WDW= 1
##$XDIM= 8192
##$YMAX_p= 0
##$YMIN_p= 0
$$ End of Bruker specific parameters
$$ ---------------------------------
##NTUPLES= NMR FID
##VAR_NAME=  TIME,          FID/REAL,        FID/IMAG
##SYMBOL=    X,             R,               I
##VAR_TYPE=  INDEPENDENT,   DEPENDENT,       DEPENDENT
##VAR_FORM=  AFFN,          ASDF,            ASDF
##VAR_DIM=   8192,          8192,            8192
##UNITS=     SECONDS,       ARBITRARY UNITS, ARBITRARY UNITS
##FACTOR=    0.0002768,     1,               1
##FIRST=     0,             0,               0
##LAST=      2.2672688,     0,               0
##MIN=       0,             -940536,         0
##MAX=       2.2672688,     803145,          0
$$ Real data points
##PAGE= N=1
##DATA TABLE= (X++(R..R)), XYDATA
$$ [...]
2251b330L800Q2m123J069L893j977k702K919J583l508p27L679k69l507J779L007
2267B668k987k142L820Q89m726J359M386l392l502M805J460n495R21N566l390
2282B40l885M903J620n216N90M858k396l450L618J545m304K75L502j316k821K167
2298g0K123k774j410L556K19l566P23L743j904l350L018K643m204j273M992p94
2314A672m590K522L397m123j637M944p06m702K799L532m229j600M887l70m848
2329c052K499L896l748k499M608Q80m843N38M560k047l467L037K041l804r14M285
2345A970r65l447K382K676l700j267M441l39m231K309L329l886k203M490R00m540
2361b081Q24L855j994l675L148K467l792o37L864o92l840K079K912l186j205L974
$$ y = [-2330, 1470, 1552, -2571, -1502, 2391, 414, -2288, 631, 2214, -1294, -2021, 1658, 1389, -2118, -339, 2668, -319, -2461, 1359, 2248, -2478, -1119, 3267, -125, -3627, 1178, 2638, -2857, -1936, 3630, 240, -3645, 1258, 2878, -2338, -1748, 3110, 714, -2736, 882, 2427, -1877, -1602, 1900, 584, -2237, -70, 2053, -721, -2131, 1425, 1644, -1922, -1199, 2544, 640, -2710, 308, 2951, -1253, -2526, 2466, 1672, -2918, -396, 3001, -1122, -2759, 2185, 1479, -3223, -424, 3108, -1121, -2721, 2166, 1796, -3052, -553, 3343, -405, -2904, 1704, 2584, -2259, -1721, 2839, 792, -2675, 362, 2403, -1401, -2315, 1970, 1005, -2442, -60, 2616, -1084, -2351, 2090, 1751, -2480, -171, 3158, -728, -2931, 1559, 2459, -2081, -1257, 2598, 604, -3071, 77, 2544, -1248, -1885, 1979, 1287, -2553, -474, 2438, -748, -1953, 2021]
2377B021m67m027J985L212l425j891M223N08m767J241M308l065k769L742J642
2392B471m014k76L627o62k985J802K132k557j175L134j72l148J224K736k362k256
2408b481L512J094m455Q66M444k595l709L955K556m872o40M934j514m026L072
2423A41K731l959o97L960r60l602K302K329l497o24L385o19l490J957L080k436
2439Ak379L462J526m256QL954j152l943K500K857l683j400M089k50l592K155K765
2456B662l577r64L865r83l601K380K410l142j135L737N6l502Q49L289j683k711
2472b050K081J990k869j077L110k47l101J518K559k438j423L428R6l572J576L070
2488B651l169j704M007j16m234J626L300k454k317L420R80l641K97L016j363j933
$$ y = [2021, 1554, -2473, -488, 2724, -701, -2592, 1631, 2139, -2628, -1387, 2921, -144, -2913, 829, 2471, -1543, -1819, 1808, 1146, -1839, -37, 2095, -462, -1637, 1497, 1325, -1823, -599, 2137, -225, -2481, 1031, 2125, -2330, -1464, 2980, 385, -3324, 631, 3187, -1685, -2325, 2609, 1095, -2931, 141, 2872, -1087, -1784, 2176, 1216, -2386, -84, 2245, -1252, -1876, 1509, 890, -2600, -643, 2437, 1, -2378, 1084, 2610, -1646, -1638, 2316, 1164, -2779, -279, 2578, -1105, -2505, 1584, 1334, -2258, -103, 2662, -915, -1879, 1986, 1003, -2598, -218, 2192, -950, -2085, 1652, 1708, -1794, -945, 2344, 661, -2050, 31, 2021, -848, -1925, 1185, 938, -2163, -645, 1914, -524, -1947, 1481, 1577, -1995, -419, 2651, -518, -2222, 1785, 1669, -2565, -939, 2361, -93, -2410, 1010, 1990, -1651, -1354, 1662, 299, -1634]
2504a634J785J499k175r75K438kk121Q19K362j947j859K787O41l490Q69L327k111
2521B13k995L139J565l967K38M348j748l196K837J802l372k28L181r80k366J782
2537B53J032k575j74K675o24j974J428J511j914j423K298R22k333j66K351p52
2553E35k526J672K325j950j458K770N6k966N98K542j615j636K329O00k964M88
2569a200K454j323j587K620J093l129m50L229j057k589J966K303k939j443K999
2584I47M74l118Q11L014j870k316K697R04l267K93L425j401k617K520J457l345
2600a392k07L921r83l419K201K339l678j301M075J94m202J546L415k858k300L732
2616A083J069l878O35L600k241k862L490J299m030N17L801k185l087L287J905
$$ y = [-1634, 151, 1650, -525, -1500, 938, 936, -1185, -366, 1996, 49, -1810, 977, 1618, -1872, -1003, 2324, 213, -2782, 357, 1922, -2045, -1807, 2541, 793, -2403, 434, 2236, -1136, -1364, 1817, 837, -1529, 253, 1285, -1290, -1464, 1211, 587, -1387, 41, 1552, -362, -1785, 513, 1435, -898, -1064, 1287, 535, -1991, -319, 2006, 56, -1402, 1368, 1424, -1542, -944, 1598, -17, -1653, 676, 1276, -1688, -1200, 1254, -69, -1656, 964, 2057, -1072, -1522, 1707, 650, -1939, 27, 2330, -609, -2052, 947, 1421, -1697, -886, 2128, 258, -2058, 639, 1543, -1724, -1431, 1994, 593, -2024, 496, 1953, -1392, -1599, 2322, 1339, -2080, 121, 2460, -1218, -2519, 1556, 1750, -2452, -906, 2509, -349, -2649, 1083, 2152, -1726, -1091, 2509, 268, -2594, 896, 2195, -1835, -1318, 2483, 298, -2789, 498, 2403]
2631B403m178j00M405j624l736K812K517l594j196M085k84l815J924K887k856
2646c50j680L523J47l278J029K636k244j908K898P54l347O82L187j484k825K303
2662D3J770k886o52L719n61l321J640K356k659j434L370K93l206Q70K489k427
2678e96j649K996O22k576O76K399k055j795K728Q68k597L10K588j558k148J693
2694i4J704j964m86J879j09k258M99J778r91j071J618N38j890j80J847k91j584
2711a055J620J333k163j130K391n8k625J476K368k474j767K802L53k850R50K731
2727A902j844j597J986M75k209N84K257j013j522J432O91k432J85K466q22j570
2743a031Q85J374j739j379K194J082k272oK499j069k450J724K065k193r11K895
$$ y = [2403, -1775, -1875, 2530, 906, -2830, -18, 2499, -1095, -2291, 1794, 1510, -2305, -381, 2506, -350, -2030, 1493, 1640, -1638, -609, 2027, -217, -2125, 773, 1527, -1820, -1138, 2049, 565, -2260, 43, 1813, -1073, -1725, 1994, 1433, -1888, -248, 2108, -551, -1985, 1385, 1678, -1528, -658, 1831, -596, -2245, 751, 1373, -1203, -527, 1872, -183, -1978, 750, 1618, -979, -669, 1919, 361, -1787, -94, 1610, -354, -840, 1039, 930, -1328, -829, 949, -42, -1113, 505, 1043, -847, -1027, 820, 529, -1055, 565, 1898, -265, -1395, 996, 938, -1687, -211, 2157, -317, -2084, 718, 1071, -1779, -829, 1902, 58, -1539, 447, 922, -1287, -703, 1554, 541, -981, 451, 1142, -1290, -1105, 1361, 539, -1031, -146, 1228, -511, -1890, 304, 1386, -886, -892, 1607, 538, -1912, -188, 1877, -316, -1227, 1668]
2759A668p09k864J736K098k640p39L137q33l213K164K102l102n31L690o97l296
2775b029J457K616k405j338L070k7k694O05J997j157j556J957P34j829j95J652
2791H58q17j408J275J763k152q71K330J69k856J066K772j921k177K855J023l710
2807a801N52L248j584k538K657J180l224J66L191j513k065K572O73k999N39K502
2823A556j288j867K000J063k251l68J947J6j943M32J893q73j640J337J021j556
2839e21o60K242k90j903Q55J626j675p58K400k56k681J347K229k511j417L135
2855A162K2l101J122K571j885j702K602O23k462J46K289j021j817J758J014j774
2871d53l23J782l92j803J337J138j728r75K131K61k290N86K289j569j728K191
$$ y = [1668, 959, -1905, -169, 1929, -711, -1450, 1687, 854, -2359, -195, 1907, -1195, -1726, 1964, 1267, -2029, -572, 2044, -361, -1699, 1371, 1344, -1350, -745, 1252, 95, -1461, 496, 1230, -599, -794, 858, 41, -1367, -92, 1671, -481, -1352, 978, 1147, -1709, -643, 2129, 208, -1969, 886, 1909, -1801, -1249, 1999, 415, -2123, 534, 1714, -1510, -1344, 1847, 334, -1731, 841, 1514, -1485, -946, 1556, 268, -1599, 401, 1464, -787, -1155, 792, 808, -1135, -703, 1190, 317, -1323, 14, 1035, -521, -1181, 1061, 771, -1132, -277, 1349, -326, -1084, 1316, 1060, -1621, -274, 1955, -556, -1973, 1162, 1184, -1917, -795, 1776, -109, -1811, 791, 1414, -1048, -902, 1387, 366, -1451, 307, 1321, -453, -776, 1006, 614, -1189, 148, 1286, -442, -1417, 714, 975, -1315, -729, 1560, -9, -1737, 454]
2887D54J231k572q6K534n82k540J507J695k254p62K401l32k297J466J545k163
2903g55o10K451l95k056R98K112k101j111K498L71k831N26K535j271j954J740
2919A47J557k532l65K300q24j681J178J523j718p13K025j17k001J039J791j894
2935b85j064K356M12k692N43K301j354j856K109J048k537k01K321o80k072J613
2951c8J726k340m26K227l43k204J507J522k162p15K434l25k406J162J963j775
2967a93j503K408K94k225K92K189j053j482J617Q66j796l30J807k54j680R58J383
2984A298j837m71J974m16k006J194J715j823r54K106J10k133N14K085j210j391
3000a245J785N36j518k18J528m71j242Q29Q11j210m34J315Nj203M37J105r54j111
$$ y = [454, 1685, -887, -973, 1561, 979, -1561, -54, 1641, -613, -1375, 1026, 694, -1603, -137, 1408, -755, -1365, 1086, 691, -1365, -367, 1745, -356, -1467, 1031, 1402, -1429, -903, 1632, 361, -1593, 147, 1704, -828, -1193, 1107, 283, -1398, -220, 1303, -415, -1128, 897, 780, -1221, -182, 1609, -285, -1349, 1007, 1419, -1273, -730, 1571, 217, -1639, 470, 1518, -1019, -1220, 1101, 421, -1651, -38, 1688, -652, -1078, 1149, 806, -1398, 109, 1631, -531, -1246, 1188, 863, -1543, -381, 1582, -193, -1696, 712, 1006, -1219, -927, 1262, 209, -1273, 344, 1210, -586, -916, 891, 637, -1043, -85, 1298, -539, -1010, 964, 548, -1458, -264, 1451, -372, -1326, 780, 890, -1243, -729, 1356, 146, -1245, 540, 1076, -442, -660, 868, 397, -845, -16, 795, -415, -849, 466, 471, -732, -295, 810, -144, -1255]
3018a255J706N82j854J07J852q03j620J466J169j767m07J731l14j454O98J077
3034I14j120p25J282J38j385L99J372n78j139Q09J028j470l11J729L8k239R75
3051b83J792j914j325K680N22l258Q36K640j908j670K682O78k673N82K253j888
3067b54j362K331P36k449M64K018j544j525J833J004j893m44K397n80k563J348
3083d83J909j469j427K426K04k595N80K506j544j662K572N22k853M55K600j974
3099b33j636K916M45l054N45K397j421j753K392J024k493j14K297r69j832J636
3115A47J344j617p54J614j43j980J031J588j330r36J708Q9k015L88K108j112j111
3132i81J741K97k188K23J881n70j070R15P24j342n81J267K15j106M03R20p69j014
$$ y = [-1255, 451, 1033, -821, -714, 1138, 335, -1285, 181, 1350, -417, -824, 907, 593, -861, -163, 914, -206, -931, 351, 489, -896, -497, 875, 297, -842, -33, 995, -475, -786, 943, 981, -1258, -283, 1509, -405, -1730, 950, 1472, -1786, -950, 1690, -218, -1888, 794, 1472, -1201, -619, 1634, -254, -1616, 715, 1451, -998, -534, 1484, -60, -1585, 248, 1252, -641, -1085, 1312, 732, -1831, -483, 1426, -43, -1470, 956, 1160, -1435, -855, 1651, 107, -1555, 1017, 1539, -1314, -859, 1741, -233, -1869, 1047, 1492, -1562, -1017, 1380, -41, -1794, 598, 1622, -871, -985, 1312, 343, -1489, 147, 1491, -126, -880, 734, 591, -1389, -358, 1230, -100, -1036, 672, 761, -1254, -866, 1242, 130, -981, 760, 1057, -1131, -908, 973, 403, -667, 248, 972, -370, -951, 316, 531, -575, -172, 748, -21, -1035]
3150a035R10P54j150J25J552n96j666J049J232j734k18J923j25k120P48J265j511
3167e97m10J767P2j713M93J067r28m89J185K17j047j72J074m75r24J000J078j125
3185G3r75J621p7j681L41J971j361j482J894P83k311N09K241j495j347J974O29
3202A307k388L98K116j316j337J550P80k237K25K023r16j389J249J081j609n98
3218a061J795Q4j895O72J733j327j245J829M96j977K68J862j049j460J450R76
3234A151j939M4J937r41j813J482J344j886l56K116m69j896J184J503j833r30
3250a302K269J03k188L57J906j292j153J805M40j846L05J707r50j246J554N41
3266A010j930L05J859j004j367J391R30j628l53J714m23j268M76J072p76j139
$$ y = [-1035, -125, 629, -521, -396, 1156, 560, -1106, -57, 1175, -559, -777, 1146, 1021, -1099, -351, 914, -597, -1007, 760, 832, -881, -388, 679, -249, -738, 447, 664, -383, -555, 519, 44, -880, 120, 1198, 73, -902, 719, 642, -1039, -698, 1273, -88, -1570, 324, 1107, -1204, -695, 1546, 51, -1296, 678, 1307, -1081, -683, 1433, 117, -1220, 330, 1110, -1127, -902, 1121, 205, -1184, 65, 1146, -463, -1061, 734, 818, -1077, -405, 1328, 1, -1244, 585, 1081, -896, -628, 1234, 185, -1275, 175, 1151, -788, -744, 1193, 252, -1561, -79, 1265, -621, -977, 1139, 670, -1226, -42, 1461, -372, -1302, 967, 1070, -1118, -761, 1145, -147, -1300, 505, 945, -901, -596, 1111, 161, -1085, 469, 1010, -920, -615, 1244, 240, -1127, 264, 1194, -434, -787, 927, 504, -764, -288, 784, 8, -1131]
3282a131J388M69j391k79J674m11j232Q89J074j353n74J789m51j645R22J585j899
3299e76m91J888k46j746R27J425j548o34J534K42j756O11J205o24r91J013M52
3316F85r94l0Q64K2j088L98J021q30j049J404K83j628K14J675p11j696J699R87
3334A226j955p2K073p45k060J654J083j865j88J811p20j467J457P53j597k20J419
3351E87l22j391J042J032j303n26J461K57j623K98J417n31j351J145Q51j461m38
3368h56J567k10j649J015J103j305o55J675J05j824Q31J313j223p26J547Q6j736
3385i42M44J711j196j272J640O74j823m5J593l90j473J146P21j329j72J340j33
3402D94j264Q34Q30j091o41J462k0j383M72J198r28j075J493L96j223m18J520
$$ y = [-1131, 257, 726, -665, -944, 730, 319, -913, -24, 1050, -303, -877, 912, 461, -1184, -262, 1323, -576, -1067, 821, 575, -1171, -244, 1181, -367, -1001, 533, 775, -981, -370, 835, 211, -780, 233, 685, -309, -339, 525, 547, -541, -143, 878, 48, -1001, 403, 686, -942, -728, 947, 236, -1460, 239, 1226, -729, -801, 1272, 527, -1533, 121, 1204, -661, -849, 962, 242, -1225, 232, 985, -612, -832, 587, 265, -1126, -84, 948, -355, -881, 580, 837, -786, -488, 929, 398, -953, 192, 1043, -418, -856, 711, 501, -1148, -133, 970, -335, -990, 685, 790, -1034, -203, 1110, -113, -839, 708, 794, -942, -498, 1213, 17, -1255, 385, 1059, -764, -809, 784, 394, -1079, 67, 788, -541, -713, 627, 494, -770, 64, 894, -197, -838, 624, 604, -779, -307, 891, -37, -1112, 381, 777, -446, -864, 656]
3419F56l18j364Q97R73j064m23J316j20j264N35J240j101q66J585l0j502L87J511
3437A048j197j096J590L12j415K82J540r13j188J286P84j584j46J391l69r19N91
3454cO92j161k70J332j81j052L70R29q92p22J486K35j609L12J567q15j366J293
3472A45R20j496l34J688m25j505J082Q12j363k27J393l91j264Q15R74j056n57
3489g89J585k47j246M30R95p14r20J130N91j409J34J003l01j150Q36Q56j129l91
3507g36J231p2j402P22J194j196m20J278M4j461N21J232p64q67R91L40j257P8
3525e44J323n61j172R85P24r75m69J021P5j281N94J077q98n61J071L68j340K91
3543b72J250r11j058J459K37j585R0J763q94j001R06O59r83j98J240n87p58Q06
$$ y = [656, 338, -1026, -129, 844, -220, -643, 673, 553, -711, -176, 1064, -37, -903, 682, 652, -850, -463, 1048, -149, -1245, 345, 657, -758, -476, 1064, 151, -1037, 249, 1033, -551, -697, 694, 325, -594, -3, 689, -472, -742, 590, 409, -643, -273, 656, -236, -958, 528, 763, -846, -534, 1033, 218, -1148, 145, 1065, -431, -765, 923, 498, -1007, 75, 887, -476, -703, 690, 299, -965, -150, 824, -232, -789, 796, 549, -697, -267, 728, 14, -906, 224, 815, -594, -460, 543, 242, -908, -72, 784, -345, -736, 495, 423, -979, -257, 937, -259, -679, 599, 643, -818, -297, 935, 171, -696, 295, 635, -622, -544, 779, 218, -954, 31, 755, -220, -689, 332, 407, -874, -280, 797, -101, -662, 409, 777, -563, -272, 978, 67, -991, 468, 705, -880, -790, 973, 79, -922, -16, 643, -340, -538, 702, 115, -643, 163]
3561A63N00p23o09J116N2j007Q7J106p01p30Q91M08j228Q6J291m25r11R43O00
3580I09j405j26J222k81j175Q63J074j550l20J326j85r00N45Q78r44p47J001K10
3598C95j030L15J013m64q23O91M30q94lJ029j41j147M45R01j094m75J410N2j173
3617e63L65Q52p07q91J202M00j150M3J224o01j007O83R15p81l04J053k39j419
3635i25O52J071q60o20J147P2j541M03J425q92q83J491K64j334J52J096o01p22
3653f05J019O25j428l30J228l96r58J097O24j149l18J046k85j133Q21J168r29
3670I7q45J081K97j352M40J292p51r71R09O61j535m1J203k02j015P85P52j455
3688f50j52J419k26j164R26P24j370l35J376Lj175N29R09q67q49J041K27q20J45
$$ y = [163, 663, -60, -669, 447, 499, -508, -421, 685, -16, -746, 145, 553, -675, -589, 702, 277, -634, 309, 909, -496, -622, 600, 319, -856, 7, 1081, -469, -789, 537, 352, -548, -3, 875, -69, -816, 185, 395, -635, -320, 693, 229, -594, 97, 527, -367, -370, 659, 518, -629, -184, 717, -377, -852, 558, 610, -563, -198, 654, -53, -944, 258, 658, -492, -449, 775, 174, -833, -150, 765, -16, -320, 733, 494, -925, -273, 798, -62, -682, 465, 537, -1004, -601, 824, -68, -951, 540, 804, -530, -378, 718, 117, -605, 414, 1039, -389, -719, 509, 113, -845, 252, 876, -273, -591, 455, 170, -963, -142, 1026, 97, -748, 333, 630, -722, -282, 1010, 259, -712, 197, 858, -677, -718, 485, 283, -732, 53, 805, -650, -802, 617, 391, -773, 153, 877, -493, -828, 548, 551, -624, -95, 814, -53, -902, 139, 366, -454, -309]
3707c09R71n41q22P41L96p66j85J219k70j047M63R56j126l57J320Q7j461L88J194
3726H51r01j005J411K41j281L51R96n59j031J118N58j046q3J161l24j319R57O45
3744G40j157o6J187m46j003M67J039r85m80J061J55j041K42R38o45p25O91Q96
3762H68j113j68R71l04p44M57N40p56k10Q66l4j098M10R36p56o98J252K86j464
3781g59L53J322o50r28P68O90j216n5R98j99q94P91K90q76l3Q42j50j058N29R21
3801F86q06l47P00L73j058J55R79l33r65O82O02o36o35R30m1j005M86R29j139
3820d43m58J423n0j156N32R80j066n02J158L39j642O14R36q31m83Q43L31r97K3
3839d49Q50l62n60O13K90n51j21O98ln80j8P97o04n24Q90J79q83j02J046l67q08
$$ y = [-309, 662, 121, -701, 40, 436, -330, -515, 704, 434, -613, -150, 806, -320, -677, 643, 730, -731, -343, 851, -50, -1055, 356, 597, -684, -333, 663, 104, -927, 191, 749, -297, -380, 781, 457, -862, 95, 740, -417, -483, 704, 258, -745, -278, 761, -224, -704, 357, 512, -529, -287, 651, 6, -719, -28, 868, -245, -413, 558, 254, -490, -33, 507, -249, -459, 407, 373, -725, -315, 621, -135, -833, 419, 705, -759, -406, 916, 266, -662, 106, 796, -420, -475, 523, 324, -570, 221, 511, -365, -398, 444, 294, -764, -235, 686, -120, -467, 233, 606, -452, -297, 682, 349, -616, 66, 668, 32, -603, 327, 286, -719, -233, 696, -443, -901, 522, 472, -684, -152, 828, -238, -740, 418, 757, -885, -271, 665, -166, -649, 194, 525, -472, -449, 401, 39, -521, 92, 382, -169, -290, 408, 405, -175, -193, 604, 0, -524, 366, 545, -338, -440, 606, 239, -569]
3860e69N35O94j154l64J382k60q42O55O54j043M1Q24j52r18M39P02q22l12J055
3879E45j92q09L42O97n38p19Q21K61p06j68Q67l22n78M38O68r36rQ01q2r20L37
3900b02Q75p72o22J193j05j016M48Q64n84o58P61L46r17J24Q76l61q32P06M74
3919E98p62k63J022m04p33N05O64j080j31J028j15q12L31P18o59n59J051J44j017
3938d74J38R10o51l78O88J59n61j98Q14l22o87P19M24p75l50J041K0j196N14Q20
3958F55o14n21O91M83j183J02J048m98p59O86L13r00K02Q78o85n56Q58K55r39
3977d84J35Q30l46q87P95M99o94k89Q45P0q07j0P12l1p71L89P96r92k7O81j93
3998B21o40N22M12r29j05J048m48p34P47O24q72k99Q70L8q73J73Q96p14p50P53
$$ y = [-569, -34, 660, -494, -858, 524, 264, -578, 77, 731, -312, -271, 553, 401, -517, -78, 624, -198, -510, 545, 353, -456, -114, 583, 45, -674, 147, 408, -298, -466, 401, 79, -499, -61, 607, -329, -338, 463, 381, -539, -202, 673, -99, -721, 472, 367, -649, -201, 663, 79, -579, 182, 528, -389, -265, 611, 250, -582, 124, 598, -164, -427, 595, 191, -542, -37, 627, -453, -584, 444, 329, -483, -152, 566, -93, -652, 399, 543, -474, -336, 574, -77, -455, 233, 392, -169, -367, 447, 125, -562, 157, 581, -194, -544, 497, 517, -679, -165, 655, 41, -480, 211, 694, -489, -387, 661, 163, -596, 90, 403, -497, -295, 583, -102, -658, 200, 455, -484, -349, 481, 135, -752, 43, 542, -152, -441, 404, 474, -333, -343, 369, 338, -433, -44, 752, -240, -267, 414, 221, -419, 103, 515, -414, -519, 529, 81, -653, 94, 718, -154, -453, 417, 455, -418, -245, 651, -63, -813, -60]
4018f0L97o25P5O19k33o42O28L10q55J55R17l45o65L49O17j004j92J098p6r78
4038e10L02P00n64n72O45M18n80j16O11m13m56N68K73l45K95J96k98o55L60O56
4058E15n12m55R67R0j153MQ86l85n84P86M21p96k25Q10k13o08N45O30p26j56L72
4079B13k36l37M17L45n65j26M53mq04L08J061m52o34M63M45q41j37P15J16p12
4099c12K51O70p03l93N98M7l92K52M99q12l21R45j59p11N72P50q40n98R60J74
4119D77r12P9J139o02r60O34O11o77k03R66k97o33N16K26p32o5R70l45m72L14
4139C4M88j008j57J145j35q29L64Q90p58n28N98L76q05J25O34k88p71M16M90m54
4159a73P8O60l98n53L75O21p19m42R05k4q53L37O53q68j95R20K44p31R3K69l48
$$ y = [-60, 337, -288, -213, 406, 173, -469, 159, 469, -386, -231, 686, 341, -324, 25, 642, -362, -554, 544, 468, -510, -208, 492, -72, -644, 1, 419, -161, -277, 334, -79, -535, 33, 306, -39, 256, 452, 154, -501, -141, 515, 3, -452, 515, 605, -548, -544, 342, -43, -627, 159, 580, -216, -441, 369, 156, -452, 93, 723, -3, -159, 213, -23, -360, 57, 402, -163, -289, 164, 160, -644, -336, 725, 273, -361, 102, 547, -294, -431, 284, 400, -312, -61, 609, -94, -487, 111, 158, -234, 18, 517, -295, -616, 329, 170, -541, 31, 781, -59, -657, 303, 477, -435, -356, 783, 181, -779, -145, 466, -211, -414, 552, 255, -378, 138, 364, -368, -433, 537, 192, -280, 34, 522, -486, -643, 502, 367, -462, -98, 792, 34, -494, 104, 480, -325, -200, 434, 146, -625, -209, 281, -173, -95, 565, 167, -386, -11, 610, -109, -551, 354, 330, -523, -186, 467, -401, -596, 324, 568, -163, -70, 199, -149]
4180a49l58N86K31l95L3O36o09k56K71L27k98j18N16l16n38K4P49m34l85N35J50
4201B02n58j69P32J84o41L81L73o00k71O12j72l80K72N87o32l23O19J0p35L55
4221a54N88m99n75O57L89p82PP59r3p25J97N75l98l44O53M0n20K02M07o17l22
4242e55P74J64q07K81O26n70n84P42M92r64K44P56n32n96L62N13n87q9Q51l07
4262B14p62L04N68n53k58R24j87p37M14L80m39l01R54j91o09k1O22j81n59M51
4282C3M66p18j85O37k03l11K16L54n20k1O43j24o14L30N07o10k37N72P3p60J73
4303b99O89m49k90M98J4m67J3O73m77k57M25L76o67J31M59k01n43L81L37l21l11
4324b86N37M6p15J88L78k8m21K15K44j58m6K29j38k22J91J19m12k16Q61j09o94
$$ y = [-149, -507, 79, 310, -85, -52, 584, -25, -281, -10, 317, 19, -99, 417, 101, -437, -413, 336, -98, -483, 52, 202, -356, -525, 207, 391, -250, 131, 504, -96, -367, 245, 73, -307, -35, 552, -80, -403, 216, 226, -509, -154, 434, -65, -640, 17, 406, -376, -369, 390, 297, -428, -231, 344, -54, -398, 255, 295, -225, -23, 384, -233, -555, 219, 383, -424, -143, 483, -87, -671, 71, 563, -401, -157, 599, 67, -529, -167, 346, -241, -330, 521, 214, -548, -244, 324, -229, -487, 437, 250, -487, -73, 307, -132, -433, 521, 330, -279, -300, 322, 141, -418, 33, 499, -219, -404, 233, 30, -281, -65, 289, -231, -252, 391, 267, -347, -17, 490, -120, -357, 215, 288, -472, -299, 390, -59, -349, 149, 163, -304, -291, 382, -95, -352, 73, 449, -218, -87, 372, 171, -372, 9, 346, 25, -286, 251, 297, -418, -230, 148, 120, -301, -86, 158, 0, -46, 183, 45, -177, 14, 133, -279, -495, 366, 257, -437]
4345d37M91M16o16j60M94J87o94LN38k23m32M23K33m91L80K03k25k60K56L00o47
4366b61K00N25n09l41L58L03n55j45O60n1m40O9N40k77n80M43L28k82k28M52O8
4387B77m58J86L26n07j17M74j59m83N14M20p86k9P33Jq90P7P87m06l96N54K78
4408C96p53L10K30k03k27L05J73n24J09M33l41k57O71l1n30o1N98l03k29mO57
4429D19l23n66O02L76o72j06N99L6n43K25J22n80K07M10j81l32M35J48p20R9P27
4450C82k19o04M87N28n98n69P78K95o83o2O82j92m58J30J93k70k4L03o7l72L41
4471AK18m26ML46m4l93M28L60p28k61O98K96o53k40O09J2p57N19K01k82j51L75
4493A32K2l46K50R5k75o0N16j83n72M33M22n54o8N15j43n76K08M72j79m00L99
$$ y = [-437, 54, 470, -146, -306, 188, 375, -319, -316, 222, -1, -433, -10, 223, -268, 112, 315, 90, -170, 86, 386, -261, -61, 464, -45, -386, -28, 275, -280, -425, 235, 184, -256, -187, 353, 76, -504, -61, 267, -15, -243, 209, 277, -181, 5, 331, -176, -293, 181, 22, -461, 53, 473, -313, -342, 391, 392, -498, -421, 366, -40, -436, 118, 396, -357, -47, 183, -20, -247, 58, 231, -293, -184, 249, -92, -349, 322, 291, -239, -300, 298, -5, -234, -238, 419, 96, -470, 132, 508, -164, -270, 329, 365, -178, 47, 169, -411, -204, 206, 25, -307, 128, 276, -444, -345, 382, 163, -441, 46, 574, -24, -593, 185, 480, -203, -265, 417, 225, -233, -103, 90, -180, -204, 99, 32, -340, 1, 219, -207, -203, 143, 99, -294, 134, 494, -234, -495, 203, 499, -154, -394, 215, 227, -530, -11, 190, -92, -243, 132, 154, -192, 58, 153, -122, -182, 334, 151, -421, 12, 434, -120, -188, 327, 184, -392, -184, 288, 109, -291, 108]
4514A08K71m03j67K30J75l31J17Rr6K09P7j89k90K81N31o86k68O25R5o84K08P40
4536E62l10o57N61L69n99l46O57M6k49M0R9l40N8K30j98j64M99J31p54J32M50
4557B17q0l18K09L34l21n94O44K17m35j7M67j72m31L41J46l22K6L57l36l35L03
4578a00J00l68K68N66k99m06J51M35o05j92N59K57m77J6J73K8l46J19M50j61k78
4599a10L04l26k14N47K5n16J92M82n40k79K89N24l47k99L37J81n97J8N33j68j64
4620a28O9K39j59j68L2J4l7J40L04m52k6M92j34l76M28L49o90j12M25j1m32P5
4642a58M26j46m70L43J70l11o1N28j72m24L39J71l00j35N16l28j77K27L18m79
4662a23j39N65j64n20L05M07k78l66J73M30m18k46N39Nl33J89J70l77j4M53l44
$$ y = [108, 379, -24, -191, 39, 214, -117, 0, 9, -87, 122, 199, 10, -280, 1, 532, -154, -422, 203, 298, -386, -178, 562, 252, -405, 156, 525, -74, -420, 237, 283, 34, 74, 173, -167, -109, 121, -77, -241, 258, 389, -365, -233, 217, 137, -181, 28, 362, 41, -553, 91, 308, -127, -144, 323, 151, -280, 61, 207, -115, -89, 268, -68, -403, -100, 0, -368, -100, 466, 167, -239, -88, 347, -258, -450, 109, 366, -111, -95, 78, 106, -240, -121, 329, 168, -110, 194, -132, -346, 201, 226, -290, -98, 384, -156, -435, -146, 378, 31, -268, 69, 250, -347, -329, 204, 36, -128, -59, 180, 21, -147, -115, -101, -138, 2, 306, -146, -172, 320, 186, -190, 238, 587, -103, -215, 210, 199, -233, -158, 268, 122, -348, -5, 165, -146, -207, 321, 149, -275, 64, 235, -65, -200, 316, -12, -189, 38, 356, -123, -262, 303, 139, -381, -76, 331, 53, -313, -140, 290, -128, -374, 165, 170, -163, 26, 196, -181, -195, 258, -86]
4683h6J46K59j68l33l5L76j38m79L08N24m65k68L43K46m64K8O96l84l13L87K3
4704B03m42J88K39q9l57L79j9l95M0O44l04l58J59M03n78J2L79J88k71j95K02
4725B8L0l17K00J60o0n0K5j0k33K20J02j80j34M73q5m47J65L08j20r6J77J00m58
4748b02L4M53k83l06K85J73k12L8J2j32J7J37J91l06q8L34J54n60J67M29j94m44
4770c03K44N04o48N4J26J80j66j14L59l30j39L80m9q8K37l0m78Q6N34k24l17L09
4792A27K95n60j83M28k2l98O9N23k72j98J15J99l32K89m4j13j24K10j30j64K29
4813e6L75k01l84M93Q1m37k58M36K53n06p2M48j97j96J84J72j78mK66k58j89M19
4835A91j38k97J83J87j65k04K55J77k71p8L50k1l82O9M27k76j05K67p2o2j91K29
$$ y = [-86, 60, 319, 151, -182, -217, 159, 21, -458, -150, 374, -91, -359, -16, 230, -234, -206, 490, 106, -207, 180, 203, -239, -51, 188, 99, -258, 121, 102, -293, -253, 391, 87, -271, -112, 291, -287, -275, 104, 292, 21, -174, 28, 58, -259, -59, 101, 41, -9, 16, 6, -227, -7, 95, -85, -219, 254, 169, -278, -113, 195, 75, -21, 156, 256, -202, -168, 285, 2, -304, -19, 154, -58, -20, -8, -140, -123, 14, 205, -101, -189, 145, 299, -261, -94, 335, 141, -303, -59, 445, -203, -149, -23, 157, -9, -123, 236, -94, -233, 147, 98, 10, 247, 217, -261, -175, 359, 135, -182, 127, 422, -138, -321, 107, 85, -313, -244, 279, 7, -191, -76, 123, -209, 80, 36, -77, -201, 9, -121, -285, -56, 319, 118, -266, 227, 308, -129, -387, 49, 302, -204, -276, 172, -25, -221, -37, 135, -43, -47, 219, -39, -228, 191, 53, -244, -61, 126, -39, -243, 12, 189, -82, -160, 190, 169, -213, -144, 283, 7, -98, 169, 97, 35, -156, 73]
4857G3j91J06K01j66j13K14J57l88o9N7L67l72j54M94j56l25P3M19j60l99L52
4878B0L19l19k24K71pk5M6O0j86K2K24k92J59k1N7m53J73M81j77m54K24M55k83
4901G0k92J29M27m61M2R5o2k03J85P8K1n5J9M0k05K6M39l33mM68l05m05L12L34
4925C60l10m22K80L10l66l1L53k8k92K58J52k91j53K09k12M6J91R2n11M78K89
4946D02l00j96K68L01n52l30O92K3m11k3L67j37m20Q6K43j36n6L58l25K9K59r5
4968D7k50K80J64k66l66O07J29n68m5M55J34m68N0L99l16l34K99L24l78O6P2J4
4990D9n3J25j06l19L24J14j46k74N60k14k53J25K42j42l04K76R4Q6m20J63K31
5011A58M4l51qK47n4p7j43J67P7p4o4l2J41j42j29O1L65r0l95L21J59j13l25K92
$$ y = [73, -118, -12, 189, 23, -90, 124, 281, -107, -176, -119, 248, -124, -278, 216, 60, -265, -192, 227, 67, -332, 20, 339, 20, -204, 67, 60, 35, 81, 141, -45, -23, 201, -91, 68, 47, 104, -349, -176, 305, 128, -326, -102, 353, 70, -222, -93, 334, -127, -85, 10, -52, -255, -70, 8, 29, -26, -7, 33, -172, -146, 293, -40, -44, 424, 119, -286, 26, 360, 50, -372, -92, 218, -148, -179, 174, 146, -146, 112, 264, -27, -180, 29, -183, -137, 54, 146, -365, 113, 402, 102, -94, 174, 475, -77, -407, 285, 308, -103, -126, 241, 104, -316, -230, 13, -123, -179, 179, -146, -117, 142, 47, -203, 77, 241, -25, -391, 216, 345, -223, -268, 187, 321, -147, -97, 302, -14, -348, -49, 275, -103, -37, 35, 49, -4, 121, 15, -304, 20, 134, -12, -286, 274, 60, -193, -68, 174, 32, -272, 4, 98, 184, -236, -73, 158, 202, -149, -157, 90, 36, -41, -184, -17, 60, -14, -78, -110, 31, -111, -240, -179, 186, 96, -299, 22, 181, 68, -257, 35]
5035C5J09j61j88K13K69k58j46J09J24j22K1m4n9K1M1j08P3K53j17l42J23N22
5057C68l21l32L60K01k09n22M55J63l10K42Rq2j50J20j39j36K63K03n76J65L44
5078A16r2l91N25K34m59l05M57L1m04N8N14j24l13J95O4j13R0L2j13l8J13L7l26
5101b12J38N55l79k18L00J54n54j37N63K8l03J23J21l30q6N43k87j65M10j24m01
5122b61K4M25k89r6L40J06l48j61K02%j24K79k5k55m2J33K79k22K1K7j28OK58
5145A49k74j23O19j77k87J4J18P9l46K21O7J98m57L36p5j87N3r5J75r3K39l37
5167a83J57K12k94J2L14j5l55J24N4p2K28l9j54p7Q6m1k95L36K50l55L0J29J80
5190B32o04L56J16mj54p0M91m48n9M09k19l87M38o0k38K61K5j35j51L08K00m97
$$ y = [35, 144, -17, -205, 8, 277, 19, -127, -18, 106, -16, 5, -39, -98, -77, -36, -144, -71, 182, 65, -277, -154, 368, 47, -285, 75, 276, 67, -455, 0, 163, -147, 95, 104, 22, -128, -8, -147, -283, -20, 183, -393, -228, 116, 24, -367, 158, 392, -67, -372, 85, 116, -288, -230, 284, 160, -153, 42, 106, -7, 83, 115, 2, -36, 77, 114, -212, -74, 481, 102, -116, 184, 338, -216, -353, 210, 238, -65, 58, 179, -151, -237, 306, 19, -146, 264, 140, -261, -237, 188, -101, -197, 143, 249, -99, -260, -58, -58, -182, 97, 72, -183, -225, -92, 187, -35, -14, 13, -115, -109, 149, -125, -248, 371, 194, -93, -79, 39, 118, -228, -7, 60, 258, -199, 137, 62, -125, -72, -167, 8, -85, 154, -183, -26, 186, -108, -96, 218, 203, -152, -28, 26, -46, 182, 143, -11, -88, -2, -43, -338, -2, 248, -107, -77, 52, 232, -372, -16, 100, 96, -58, -128, 363, -85, -144, 265, 46, -341, 97, 37, -201, 60, 85, -50, -201, 107, 307, -190]
5212a90L7M70l62k49K94M23m71j28L41j8m10L13L35m63j12N27j29o06M02L76m52
5233g2l5M78k12m12J77N76m80l43M82o7k86K5N57l75n3K32j73j95K48J79m57J79
5255b7L23j98n10M29L23j50m16L54R4n85l4O66j71j99O7K02k26J5M7L9r4P8R6
5278A23m42K27L83l14k42O09k0l88n7N33k92l37J17K35n6o2N3l8qj2j5r5K21o3
5302F0j69r8J50J69p2o6O7J6r8J34L5q9j1L8K8p3k14mL43nk82J76l9J4O3j05K95
5329B63j33j56m8J27qO7l60K45K38j25k51j0J91J96k95j5L29r1m51P0K27J02k04
5352i2J78n6R7j17q4L2J67j57J0j31K14K03l29J7J96j17k05J40N29n37n6O9K54
5375B25j96j03J12L5k22O9k4Q8O6j23K2N6n6N0J0j4K50k29k16J43K06j93r1J74
$$ y = [-190, -153, 317, -45, -294, 0, 423, -48, -176, 165, 147, -263, 50, 385, -78, -190, 337, 208, -398, 4, 380, -72, -107, 371, 159, -253, -76, 500, 20, -323, 159, 92, -194, -169, 388, 13, -40, 192, 19, -176, 72, 251, -206, -27, 296, 98, -412, 17, 340, 190, -226, 128, 222, -363, -397, 269, 98, -101, -34, 168, -58, -43, 4, 43, -51, 27, 123, -319, -92, 291, -23, -265, 344, 324, -64, -121, 412, 120, -217, -100, 135, 79, 17, 70, 32, 24, 12, -3, -98, 123, 60, -109, -207, -57, 112, 40, -26, 41, 57, -41, 93, 128, 39, 28, 66, 94, 21, -193, -197, 146, 141, -141, 35, -4, 10, 73, -32, 263, 130, -26, -74, 53, 45, 112, -248, -3, 235, 110, -141, -151, 40, 236, -59, -74, 255, 164, -287, -217, 10, 112, -92, 86, 30, 127, 10, -74, -42, 125, -32, -22, -153, 61, 264, -65, -48, 148, 31, -174, -34, 495, -42, -98, -29, 225, 29, -74, 38, 73, -149, -80, -104, -16, 50, -73, -51, 5, -51, -1, 9, -5, 245, 16, -200, -57, 149, -44, -135, 39]
5399C9K60l83l7K35J2j33j34P6J3K07j12k48K56J33j54j01L6J52j00k32L36J80
5421C01k79k25K83J24k18Q5K3R8k51L1m9QL6RnR2l8J68k48K04K9k67L3J00nk27
5447a88q6L38J00l97J04L02j49M7P5j47J60k16J2K2J21m7n8p0K78k3m31N6M30
5470B33k47k36K38kQ0j34K04j38J36k29J7P4M7l2M2r6J88o2j4p0R1j83n7K27m8
5495B9L0q4k10L08o3k05P0L78l24p6P4K96k67K7J24j00Q3j21M5k34K45J27j66
5518a4j8J83q4l00J11L05K6l54K56P2o5j96L1J57q7m6j5J44q9j06pO1J69k5k13
5543a04l8L05j68j31J81L20k50m23M27J9j02k02J44J35j05l9K6p4J20o0m5J43
5565G9K1r6j67J54K06k10jJ69j91m7j72N00n9k92k0L09O8m67J27P8K0J70k3j98
$$ y = [39, 299, -84, -121, 114, 126, -7, -141, -65, -52, 155, 43, -205, 51, 184, 30, -71, -35, 117, 17, -215, 121, 301, 22, -203, 80, 204, -14, 71, 94, 192, -59, -28, -77, -69, -33, -24, -29, 63, 25, 193, -55, 149, 178, -89, -56, 44, 39, -188, -274, 64, 164, -233, -129, 173, 24, 71, 146, -1, 159, -57, -45, -23, 98, 51, -7, -77, 201, 178, -253, -197, 233, -14, -250, -12, -14, 66, -68, 136, -2, 134, -95, -78, -4, 43, 11, 53, -43, 145, 83, 69, -1, 90, -93, -150, 77, 29, 59, -25, -235, 73, 10, -195, -125, 253, -71, -147, -73, 223, -44, -17, 107, 7, 90, -31, 14, -220, 25, 152, -14, -32, 151, 67, -233, -122, 183, 209, -145, 111, 183, 118, -78, -47, 110, 23, -23, -38, 106, 17, -89, -96, -35, 134, 109, -104, -142, 163, -5, -136, 45, 365, 115, -308, 119, 138, 36, -166, -22, 113, 8, -31, -5, -79, 41, -19, -64, 79, 100, 4, -163, -9, 197, -13, -14, 155, -36, -83, -255, 245, 186, -106, -126, 183, 251, -216, -89, -11, 9, 179, 156, -42]
5589d2K5j3m6m2L75rk88PK63j45k34q6M25K8j95L5n1m4J4j11K33M5L5k05J2k8
5615d2p9K53kJ1n8j38l0J68k4q9J24Jj30Qj94J68K42K4l06J13O6k40l3K57J42
5640B12j15k16J58j17K4o8k8J12J53K3l33M12k19j92l3M54l9k50j39M12j02l51
5662b42Q5M27l25o9K03l03J25J82j27N0P6R3j00l09K77K93l13p3L83l72k71L31
5684B1J34k19j56K65p7j03K1J12o2O8J15j26o9Q3K42m76P9J81J07k05L4K70p1
5707A68l61K03K19m13M8J92o3j4L4M4l1k11J95j09Q9K32q2k86J76j0L0l40M62
5730A72j90j12N0J09L4j39qK10J21k25k99K62o1nJ58j02J53J30m64K4L98j05j73
5753f2k0L92k53k13J37K23k57Q7j83K85q8j25l2k9K39l8j0M6r6P1j01j50K94P
$$ y = [-42, -17, -30, -76, -118, 257, 248, -40, -33, 230, 85, -149, -235, 190, 218, 23, 58, 7, -37, -23, -134, 99, 144, 179, -26, -14, -42, -121, 132, 130, 141, 83, -55, -85, 83, 59, -30, 94, 95, -35, -27, -221, -53, 189, 213, -93, 20, 86, -154, -187, 70, 212, 97, -119, 39, -78, -54, -122, -150, -38, 115, 138, -195, 217, -2, -194, -227, 227, 188, -62, -201, 211, 109, -242, -157, 270, -55, -124, 79, -224, -99, 83, -44, 6, 82, 175, 75, -234, 43, 336, 23, -50, 333, -39, -310, 21, 155, -64, -220, 45, -32, -135, -114, -2, -64, 4, 119, -7, -76, 7, 249, -227, -148, 33, 140, -65, -31, 239, 168, -193, 10, 229, -184, -136, 56, -7, -21, 13, 57, 26, -185, 10, -99, -10, 222, 140, -146, 30, 20, 50, -290, 172, -18, -130, -80, 29, 63, -76, -84, 126, 247, 22, -277, -15, -76, -81, 77, -25, 128, 258, -206, -182, 216, 111, -62, -82, 310, 57, -156, -19, 204, -53, 34, -149, 136, 48, -77, -109, -138, 101, 63, 53, 99, 3, 74, -27, -177, 117, 124]
5777A24p0k44K72j62J6K4JN6J2j06L3pR5j85K09l9n4Q8k7mj22j00K63kr5N3q5
5804e6J52N9k14J89n6J9k44J71Q0k5j27j05K14%p3%K05j07j62L6JJ13m5N6q5j0
5830a4J7j48J27N6R3l08J64K41l28r7K72N1R3l35k9J05l9L5J44R3j10r0o5J9O5
5855A2qj09o8K16P6j99q1K69p4l9lK88l85j10L12M7j66K0p5Q3R5j34l9K20q0k69
5881b01K03Mk6j09q6L22L7k13rJ17l0k8j87K80q6M1n6%L9n9L0j61K61r2p9nK50
5908A57R0k00j84K16Q0k38K00n5l9mOJ8n4o3j10J33R1j46J58P8L2p2k20Q5j4J59
5934A04k72J32J07j0j60j0J35J11j76k7K24L1k78J7L06k00k2P1N5j47J19j63k5
5957g8m0O9j04K14Q6j20j09j4J62J6j89J30J21p5j99J1K38k7j27J77oj29j4Q8
$$ y = [124, 54, -190, 82, -80, -64, -40, -39, 17, 29, -77, -44, -51, 44, -141, 68, 29, -25, 63, 36, 32, -90, -190, 73, 71, -24, 29, -56, 96, 155, -59, 130, 74, 93, -151, 20, 100, 75, -52, -157, 57, 57, -16, -16, 189, 82, -80, -44, -43, 70, 25, 81, -4, -14, 3, -145, -18, 38, 131, -177, -13, 228, -100, -197, 75, 126, 219, -116, -145, -40, -79, -44, 100, 193, 83, -7, -72, -53, 12, 4, -105, -173, 43, 119, -80, -161, 108, 34, -5, -8, 280, -105, -215, 97, 144, -22, -2, -77, 6, 101, -33, -72, 148, 68, -201, 2, 6, -20, -129, -215, 107, 144, -69, -78, 39, 9, -19, -206, 74, -12, 29, -27, -27, 12, -47, -17, -178, 83, -9, -88, -93, 157, 247, 47, -137, 79, 159, -79, 121, 66, 27, 23, 29, 47, -7, -70, -180, -47, 44, -102, 56, 134, 166, 94, -126, -41, -55, 104, -168, -36, 71, 61, -99, -109, 26, 137, -39, -66, 158, 189, -89, -72, 234, 34, 12, 83, 138, -9, 110, -53, -78, -118, -49, -153, 61, 147, 27, -82, -96, 66, 82, -107, 23, 144, 69, -130, -119, 119, 92, -35, 142, 136, 7, -7, 81]
5981H1j74J27r6K6L9J36N4l78K29P1r0j44%L66l17q4K37O3j42j07q1L43J60j89
6005A30r4j06Q0j35N5J93j05oj91K11K16k28k50K07J42oj07MJ08o0k76J77J21
6028H0j44R2M9J9m9j90j14K28J55j84m2J15M8q5J5P8J4j90k6J23K11m36J45L7
6052e1K19j67j51J35L6J27k17P4l2P2J8o6K7J38k83J11M9Mj73P6J46nk24l1J26
6077d2J67l20K39n9J26j03j65R4K21k24p8J6J92k5k83J71J35K6j47M3o3J17j92
6100a54N1J73qm1j70J88p5J00l9O7R0k72J40j35K51o2k60k3J88k4o6Q7j13J53
6124D6j58K56j72J09j67O0L9Q6n1lQ0j86K4M4j0J9o6l9J33J1p2r7O9J51j24m0
6150e8k6J97r5m8J04r2J34j35N9j47N6k4l7j9o9J74k41J73M43l49l9J29J26k14
$$ y = [81, -93, 34, -62, -36, 3, 139, 193, -185, 44, 115, 25, -119, -119, 247, -70, -154, 83, 146, 4, -103, -184, 159, 319, 130, 36, -70, 10, -125, -70, 123, 18, 12, -179, 32, 248, 20, -230, -23, 119, 113, 6, 10, 118, 58, -218, -41, 80, -64, 28, 77, 96, 47, -143, -257, -29, 126, -58, -100, 15, 63, -22, -7, 71, 85, -105, -131, -8, 203, -233, -88, -51, 168, 1, -150, -15, 21, 148, -69, 5, -27, 45, 63, -3, 24, 162, -121, -10, 39, 43, -130, -54, 92, 87, -137, -168, -42, 125, -195, 44, -15, 111, 8, -157, -63, 158, -66, -144, -128, 64, 39, -244, -73, 62, 88, -59, -16, -79, 38, -154, -103, 70, 62, 21, -149, 39, -36, 64, 25, 92, 182, -90, 50, -85, 166, 104, -156, -179, 9, -15, -81, 6, -107, 46, -112, 144, -28, 81, -86, -26, 13, 99, 48, 45, 125, -61, -37, 7, -3, 16, -50, -89, 44, 55, -17, -114, -45, 106, -18, -58, -84, 113, 18, -30, 74, -18, 116, -19, 40, -107, -51, -75, -112, -131, -200, -26, -267, -94, 349, 0, -39, 90, 216, 2]
6174Bk80J82J17P9j95Q4O5k15R9J57j40j0n4K74l51J40L6J21k7O6m3l42J11K60
6198A36j13j45L79k57q0jJ1J12j24L6K86k10l6j09P1K32j21j04m8J29L9k81J54
6221d4OJ16p5o3R6r2j3j05L25j17j0L4L0m6r8k7K45j7l3m1k44J92M9p5j96J88
6247a5J46L7l32K57Oj79q8J59K6j06j3J99k0q7j46J49K78l42M5L5kL1j36m7J62
6272A7j83Q8q0L06n9j70P9L8j52M9r4J27Mj42K14l8p4q0j9K92k42j00J68N0P3
6297G2j6k45K36R1j15j45o1M80l45p6J52K15j70k54J72K05j39k51J89Q6O8k59
6319a10M5O4J40Q3l54LK48l1j64k1K69j72k1q5R6n2m6OJ15O0j5Kqk6k0M1p0K4
6347AK3O6r9J21n3j36J4J58N8l17J54K86k81o8k0K70ml42J22j88K77j11J5Q7M5
$$ y = [2, -278, -96, 21, 100, -95, -11, 54, -161, -62, 95, -45, -55, -109, 165, -186, -46, -10, 111, 84, 150, 107, -235, -124, 136, 23, -122, 257, 0, -80, -81, -70, 42, -82, -46, 240, 30, -6, -115, -44, 188, 67, -37, -85, 44, 83, -198, -44, -38, 78, 3, -60, 36, -56, -69, -174, 151, 34, 24, 58, 88, 42, -56, -83, 162, 145, 112, 71, -173, 19, 68, -7, -203, -15, 131, 168, -164, 93, 99, -80, -168, -9, 17, -89, -102, 97, 77, -10, -156, -7, 271, -71, -26, 9, 7, 38, -98, -145, 17, -166, -78, -158, 148, 89, -81, -2, 36, -116, -67, -161, -34, -30, -172, 42, 4, -70, -150, -169, 123, -119, -219, -51, -1, 72, 56, -189, 47, 138, 23, -122, -183, 297, -48, -124, 28, 243, 73, -181, -9, 196, 57, -194, -5, 81, 149, -110, -65, -1, 139, 222, -132, -129, 119, 88, -76, -97, 172, 0, -21, -106, -10, -62, -108, -102, 13, 73, 58, 60, 52, 26, 6, 47, -23, 1, 24, 90, -9, 112, 59, -77, -63, 95, 153, -164, -10, 276, -5, -73, -93, 177, 173, -169, -47, -235, 42, -69, -54, 33, 78]
6372G8k68J82m8J97j04m8J9k5p2J18j60K02j51k7J86O3j81j39Q8J57n0l7j28J87
6396C9q3N0o1NJ28j01M3L8Q8l00L4Q3L39l21j15J08Lk5L7po3nR0J7k5J02j48m6
6424i6K48k2j64M9J42k30j31LK12nj66L4K49j35J0j13J91m9n1j40J73q1N4Q0m1
6449B1K33j94Qj07R9j37n3K05M0M2l44K05J11kk68J82J6j3k75K35p2l3R5q4m9
6474a39K6P1n9J49M9r9j5m7K23k51J49O2P9r4m16K28J65j75J5P1J20r0n4L9l5
6499b8Q4j41j65K82m8O8j00J9P2P5j91N5J12q2l8j08J58l9LK0Q2j08j08J35J09
6524A18K5k82j1K04l1J4K3k1j82P3p2K48k1j00l7K22K1j13j82J93k2J5j07R9Q2
6549A56j74M9J3j8o9K6J81l03K07j39j5Q7J28k53l7J4J80r5kJ53n6PO5j68J47
$$ y = [78, -190, -8, -56, 141, 37, -11, 8, -17, -89, 29, -131, 71, -80, -107, 79, 142, -39, -178, -90, 67, 17, -20, -148, 39, -44, 6, -55, -50, 78, -23, 20, 58, 146, -154, -120, -37, 302, -19, -134, -26, -23, -48, -11, -18, -81, -86, 4, 21, -4, 98, -50, -96, 152, 130, -34, 15, 157, -73, -204, -201, 11, 6, -160, -126, 123, -12, -2, -115, 76, 27, -24, -164, 9, -72, -18, 62, 21, 254, 60, 68, -39, 60, -77, -130, 75, 115, 157, -187, 18, 129, 127, -141, 41, 57, 44, -231, 4, -68, -101, -6, -90, -139, -113, -42, -101, 48, 97, -2, -17, -64, 159, -92, 57, 119, 198, 104, -312, -84, 81, -94, -79, -8, 112, 22, -32, 7, -28, 56, -85, -250, 32, -16, 52, -48, -29, 43, 118, -73, -18, 94, 12, -26, -134, 24, -15, -12, 8, 90, -18, -126, 9, 118, 143, -139, -150, 54, 23, 37, 60, 39, -143, -70, -142, 106, 85, -15, -52, 170, 191, 78, -104, 89, 67, 82, -25, 74, 156, -18, 31, 44, 26, -43, -17, 164, -139, 68, -71, -86, 1, 129, -124, -161, -147, 33, -62, -64, 89, 33, 40, 105, -63, 84]
6574H4j08j24J92m8N4j3n5m0J19q5m3R0J15k29J57L5N4k11k7J17k5M4p0L01l69
6599h5k4L32k65J50m1n7o4m5J10q6%J05j06K7K5J02k65J42p1Pr4J37l2L02l5j31
6625C8q8J92j17j81J82j08J03j54J43LO8k07J29m8J82q0Q8j86J7J83l24J55J05
6648I5r0m4K1J99n1j26n7J62m7j80rQ5m5M9Lm5L5J78j00l1J15P6k89J41J8j77
6674a14o0J56o9J43j01j1M9j34K64k47K72j43k7j82P9K28nj05L2N3m0n1j30J30
6698a3l7OK38k45L4j23K09j37r8K77j48r1K37J5j66J65q5n9n2L5K65k47l4J03
6722D9J55k79J64N0l45L6J37O5o9Q2j35L4J20j8M0N7Q3m9l52J23N0L2m9j15K39
6747A05j4j41J36r8q6J82pj62q5k0J84j12J64q8m4J68j42R2k37J9J53o0K55k68
$$ y = [84, -24, -148, 44, -4, 50, 37, -18, -58, 61, -24, -67, 23, 138, -91, 66, 101, 155, -56, -83, 34, 9, 53, -17, 284, -85, -109, 223, -42, 108, 67, 10, -54, -99, 11, -75, -75, 30, -76, -49, -24, 78, -187, -45, -116, -109, -203, -66, -98, 204, 169, 38, -50, 142, 25, -156, 26, -82, 21, -133, 10, 13, 81, -126, 3, -45, 137, 57, 145, -41, -24, 159, -165, -10, 95, 5, -39, -18, 181, 130, 4, -53, 109, 62, -118, -127, -42, -87, -38, -35, -80, -45, 133, 33, 2, 117, 193, -96, 45, 63, -114, -174, -18, -87, 56, -45, -56, -7, -141, 123, -124, 148, 5, -22, -204, -125, 103, 98, -7, 25, 78, 38, -13, -143, -13, -50, -44, 194, -51, -17, -140, 69, -68, -166, 111, -37, -128, 109, 124, -42, 123, 38, -21, -73, -38, 227, -20, -54, 49, 204, -75, 89, 139, -206, -170, -33, 32, -37, 45, -90, -56, 64, 46, 86, 143, 226, 177, -175, -52, -2, 30, -19, -134, 105, 91, -50, 86, -12, -98, 84, 77, -85, -170, -190, -6, -118, 46, -42, -86, 82, -60, 32, -205, -186, -33, -93, 162, -106]
6771a06J20J48r1l33K65j46J10p6J92o2N3k73J67l2l4K40j89Q4q2l8P3J59k39
6794i0J66p4Q1j24O2q4n1K14j89R6Q3J9k02J2Q3k6NP1J8j64J17j40J17O2J24l15
6820a29K32l1J24m22K08m1j3o7J26j04J40k52J69J82j75j0m3qR4o0L5J54j78R0
6844B1j97K27j47N9k7mK44M1k72J43j01k20R0K68M2q2k15J03m0K5J36k4j3j67
6868a10K19j94J75p6j23j19K66J25k16m2L47j86j66pK5K2j2J14m4K0oK1J15pJ2
6893A53j21j49K78l8k30m4L27j62j22j03K78K6j72J5m5L24k23J0L3j1l5j81K72
6916H0Q4j80j89J48K27j19m6r3R4k82K49K7J41k14Nj1P8K5n1P4n2J73j93j19K39
6941I5o7r2o8J82j19O9j48J50m3K01j88N1J18l46J75J17RR2k50j41L73k36J84
$$ y = [-106, 14, 162, 71, -262, 3, -143, -33, -109, 83, 21, 74, -199, -32, -64, -98, 142, -47, 37, -45, -83, -10, 149, -90, 76, 2, 83, -41, 21, -63, -114, 100, -89, 7, 90, 109, -93, -81, 2, -24, -19, 52, 70, -94, 23, -117, 0, 62, 186, -129, 103, 72, 196, -226, -18, -59, -72, -139, -13, -117, 23, -229, -60, 122, -53, -63, -106, -114, -20, -80, -45, 109, -69, 21, -176, 51, -96, -37, -64, -68, 176, 217, -55, 88, -13, -233, -143, 125, 167, 85, -130, -27, -67, -42, 94, 70, 57, -110, 109, -85, 90, 14, -109, -228, 38, 163, -53, -95, 252, 66, -100, -107, -82, -60, -72, 42, -2, 18, 12, 33, 148, 141, 153, 32, -117, 161, 123, -107, -151, 176, 14, -108, -211, 67, 93, -79, -64, -109, 215, -8, 2, 35, 24, -11, -192, 80, 164, -16, -205, -57, 170, 51, 5, -88, 6, -276, -27, 0, 141, -73, -68, -79, -1, 24, -27, 47, -5, 168, -25, -144, 95, 28, -64, -132, 50, -69, 0, -148, 2, -41, 160, -28, 23, 141, -205, -30, 87, 96, 188, -62, -203, 170, -66, 118]
6964A18k59J89k15k1J85j29J52Pj0j33J97N3j60j18Q9J11j63o3L21k5j26j64K41
6987G7k20o2L19j0j46l5J7R3k6n7mQ0J2q7R5j29Q5N4j29P0J15k12J5K84n3n4k01
7014a09J62j39J75q0K6l1q3j2Q3K99r5O6j28k10K59l45o1J28J15p2J24Jj64Q9
7038bj68J41M1r6P2j8N8NQj8K6o5N3j21J28J18k96J61q5Q3p6R4J1K6j38M3qN3
7066C0n7J16j70J47m8m2l1J02k6j9J15p6p9k7K3q5J45j13j32J68K9M0Nj4L8j24
7092h5K22j02k6j13J78q1j28K06k00J91J8m2K8l40K77q8J62j01j2R6o1qO6j3P7
7117A21j15J23J5j44j44K69p4p7R3q1R9o9k53J52J58l2k09PL30o2k26Q0J52j8
7141I5l81K89R6j49nr6J20lM6j0O3K1j26n1j1J05m4K6Q8K0o7j2J7J09k14n8K96
$$ y = [118, -141, 48, -167, -188, -3, -132, 20, 27, 17, -116, 81, 134, -26, -144, -55, 56, -107, -170, 151, 126, 0, -164, 77, -143, -205, 114, 104, -42, -77, -60, 33, 7, -50, -54, 26, 38, -49, 46, -83, 2, 56, -73, -3, 112, -100, -85, 199, 146, 92, -109, 53, -86, 89, 9, 35, 4, -79, -91, -8, 291, 196, 262, 134, -76, 183, -162, -223, -95, 20, -52, 72, 73, -91, -2, -170, -29, 12, -84, -12, -30, 28, 33, 41, 23, 49, -16, 37, -84, 44, 162, -134, 27, -58, 25, -51, 43, 54, 80, -58, -15, -23, 30, -27, 89, -81, 66, 18, -24, -55, 47, 21, 2, 117, 41, -38, -65, -42, -127, 18, -95, -227, -59, -30, 10, 15, 1, 39, -85, 137, 35, 9, -104, 74, -7, -135, 71, -129, 62, 80, 38, 66, -274, 3, -85, 77, -24, -36, 60, -1, -9, 57, 44, 121, 6, 129, 144, 0, -144, 125, 51, -26, 67, -14, 85, 16, -237, -85, 73, 41, -168, -161, 169, 107, -119, -39, 113, 95, -286, 3, 99, -50, -55, -151, -31, -34, 12, 2, 65, 86, -40, -91, -102, 3, -41, -15, 73, 93, 26, 14, 31, 140, -74, -132, 164]
7168A64j19j11l1J60L8j06q7Qj6J94L4k03j2K48j66J4l2k6J63j46L18k54j86J49
7192ej86K15j08J28O7n0k37J87R4j06N0j09o7J01j45n7J59J25O3k27O4o4j7O0
7216f5P8k02L36k68N5J30nj5o9O0n0M5k47K23J50k47L8JJ70k41r7L16l0k17J55
7241Dk9j75K96l7j28K0O8l1q9R7J19k39J5J06O7j54K42j42j10J14j36P3Q6j90
7265a53J65k2MQ5P3j68o5J22j62J33O4j17M1M4p1K41k83K0K00k03lL2j15J43J09
7290A14q5j8Q6j31n9l1K93k09L2R5j79k8p9K44p4kJ17j11j9N0j63K39k9k38K07
7315B2j47J36o3N3k60L00m1Q6J7j76K8O4m6j15O1R5O0nl0K1R5l38J88l0mR1o4
7342bJ17k28J47J11j10K3k15L50m06J53J08P8m9OL6R8k27j02K40j20K5J16j31
$$ y = [164, 45, -66, -97, 63, 101, -5, -92, -84, -100, 94, 128, -75, -87, 161, -5, 9, -23, -49, 114, -32, 286, 32, -154, -5, -191, 24, -84, 44, 111, 61, -176, 11, 105, -1, 49, -60, -127, -26, -171, -228, -69, 56, 119, -108, -44, -108, -125, -65, 13, -189, 147, -121, -66, 64, 59, 44, -25, 35, -15, 30, -217, 6, 156, -91, -53, -52, 118, -123, -220, 96, 66, -151, 4, -25, -200, 96, 59, -69, -49, 19, -12, -101, -4, 115, -124, -109, -3, 64, -90, 152, 10, -100, 14, -122, -49, 37, -153, 12, -10, -6, 79, 152, -16, -81, 41, -121, 12, 76, -41, 0, 44, -27, 214, -69, -49, 151, -52, -55, -23, -138, 5, 114, 29, 11, 97, -34, -93, -124, 169, -40, -8, 87, -92, -120, -199, 45, -29, -31, 86, -25, -44, 6, -157, 82, 53, -185, 22, -125, 11, -52, 1, -259, 41, 0, 86, 103, -73, -45, 19, -27, -142, -81, 14, 74, 69, 39, 60, 155, -183, 5, -25, -29, 62, -2, 115, -113, 34, 145, 35, 58, -157, 193, -213, -60, 48, 126, 77, 83, 119, 217, -10, -112, 128, 8, 33, 149, 18]
7365A8k2K3j02j65L24K0kj17r5J69J0j43L2LM8J36j10lO0l6m6R7j57oJ60j39J17
7392G4o1L2j47K7K34k88J12K50k48k7J9J46l4j55j16J37J03j88R2J19p2L5j7L8
7416F5o4jr3K2Nmr9J84J41j41R6k62K35N2j64K1J31o6nj69K44l31K75L4j62J51
7442I5j21J48j96j21R9N3J73lm5k03J95R8j55J07k02J21k7J07k62k4Q2J22r6J16
7466F1P1o0q4L1n9J05j79J34N1k05j8J64k21K68M3j98R2j54J24N8R5l30L06l0
7490F5q0R8lr0r4P2Ll7PJ14k1j10J53j38K3O9n2N7O9j93l8K86j32Q9k95K28m6
7517Dj9J49r6p4K79n18K42N3j4Oj05J15l5p9Q5j2K3Om1K0p6P5pO2J04m8k09m3
7545a53Q1Lo6K42l6j70PK55oj00l22K13l9N3RJ60JJ15l57J46p2KJ42j34J34j06
$$ y = [18, -4, 19, -83, -248, 76, 96, 94, -23, -118, 51, 61, -82, -50, -47, 1, 137, 27, 24, 84, 48, 2, 99, -58, -64, 96, -43, 74, 13, 45, -102, -75, 159, -129, -17, 233, -15, -42, -23, 123, 89, -66, -182, -45, 58, -130, -38, 81, 9, 44, 27, 65, 1, 0, -93, -71, -66, -70, -169, 15, 156, 15, 111, -151, 84, 136, -28, -7, 124, 58, 53, -116, 128, -203, 72, 106, -56, 95, -26, 122, -74, -195, -96, -43, 130, 127, 82, -121, 74, 172, 17, 124, -78, 43, 16, 123, -139, -163, -81, 41, -55, 61, 132, 72, -12, 19, -40, 65, -114, 20, 71, -134, -152, 12, -209, 59, 102, -96, -4, -158, -34, 24, 119, -211, 95, 65, -15, 83, 80, -10, -104, -32, -29, -66, -59, 55, 34, -76, 77, -61, -38, 31, -21, 36, 105, -88, -126, 160, 28, 117, -178, 50, 4, -15, 134, 38, -36, 243, -275, -33, 20, 6, 12, -93, 22, -13, -92, -7, -19, 4, 10, -31, -11, -87, -12, -19, 43, 147, 99, -110, -153, -72, -69, -135, 107, 71, -99, -92, 163, 157, 57, -265, -52, -91, -38, -29, 131, 132, 247, -110, 36, -36, -34, 108, -26, 108, 2]
7571BQKl9J8r8K26j99mK04n5Q0j65Q6j55PNK3N8O8j20K64j44L5j10O0M6j57R9
7599D5J14j70q3K2P8j08J34o6m4J65l3q6J41k10K52j43Mn6r4J99J3j85O7L7jJ14
7625A06j4j05K46k48N4j24M7J24p5j64K06n7j23J77K04m88K22k3OP7r7J24j01
7648b6M6K30k71j43J14J69k12pK27k36J59KJ02k56N1r4J19J30k7r2P8Lj10J43
7672I9k0j92J14r8Q1P5o3l7j2K16j48q7J0o5Q4P3k15L92k44J88l11J69J07n7K5
7697H4j64J76p5m5N4n8m3N8j50K38j48J97K2L4j03k73K02m2J36j91O1m2J48q8
7721a2j46L01k44PM3%nO0m7J42j83Q9J56r3O8p9n0N0r8M0j25J71O9r8Q2Q7k74
7748h9J26j32K8j1J05m8n7J61j39P9j93J41j2M8j5K6N2n0p5L1O5k8R9r5l9k27
$$ y = [2, 10, 12, -27, -9, -107, 119, -80, -84, 120, 65, 145, -20, 66, -89, -82, -77, -54, 4, 72, -48, 216, 72, 107, -3, 57, 103, -54, 45, 159, -11, -94, -72, 6, -102, 32, -34, -78, 87, 54, -32, 109, -101, 151, 8, 12, -44, -138, 61, 74, -111, -44, -7, -8, 106, 92, -13, 233, -15, 39, -85, -38, 86, 11, -153, 53, -4, -127, 50, 254, -234, -12, -35, -29, 48, -49, 75, -26, 20, 250, -21, -164, -50, 119, -93, -100, 127, -109, 50, 52, 154, -102, -51, -145, -26, 104, 77, -15, 63, 66, -44, 99, 79, -113, 1, -97, -16, 59, -4, -41, -53, 163, 15, -72, -62, -127, -43, 30, -185, 207, -37, 151, -160, 9, 116, 59, 84, -80, 96, 21, -24, 30, -28, -71, -13, -163, 75, -73, 124, 146, 180, 77, -196, 6, -36, 100, -91, -30, -72, 76, -12, -158, 143, -101, -94, -51, -51, -56, 4, -43, 99, -84, 5, 161, 68, 136, 57, 7, 57, -41, -1, -126, 45, 114, 16, 98, 185, -89, 37, -95, -67, -78, 27, -21, -78, 83, -56, 23, -170, -29, -41, 7, -8, 18, 70, 20, -55, -24, 41, 13, 112, 17, -22, -249]
7774b49K78P6q6%J3J39j38J62j31J51j52r1r0R5M6J63j35k5N2Kr2J03j62J6k3
7799g8K29l20M7J45m3k6P5k7J56j77J27k53J0J35m7J99j55N0j12O4J20r2j72J36
7823ij30Q2o4J35j15R3K8p5J49qk33L73k67J19R0j10J28k42P0K7R8j12J23j18
7847C2j56K28R4k76J4q0J64J8pj20P8L4p4j09J86N5j40L3p1O5J06l7r7O2l8J19
7873H3j62J19j08J11P1q4J3j3p9p1P7L0j06J44nl4M6r7J22j56N8l4o4K08r0M8
7899B7M0o7O1p4Qj8L7m9J43k46J3N5J57o5j40J49J2k4ro8P9q2J54j47L8N9m6L2
7927B9O7j90J26j04J3J79j09l8o0K43j85L28l87J52k2K6K1q5J30Q7l40J54j38
7950a03Q5p8J05P3j25n1N9m7Q8j35J4J84k2o4k8J45J0p8K4p8J05j94J74n7j55
$$ y = [-249, 29, 105, 19, 19, 32, 171, 33, 195, 64, 215, 63, -28, -118, -23, 23, 186, 51, 26, 78, 80, -12, 91, -71, -55, -78, 151, -169, -122, 23, -20, -46, 29, 2, 158, -19, 108, -145, -135, 0, -47, 152, -3, 47, -65, -1, 119, 27, -145, -9, -139, -57, -121, 14, -101, -8, 20, -55, 94, 86, -147, 226, -41, 78, 168, 58, 186, -56, 14, 41, 139, 27, 150, 32, -124, 104, 198, -78, -64, -144, 20, 38, 31, -89, -11, 23, -51, -160, 26, 81, -59, -26, -97, -32, 74, 37, -60, 2, -36, 83, -79, 40, -68, 43, 114, 30, 43, 30, -49, -120, -43, -13, -119, 25, 20, -14, 32, -65, 57, -99, -41, -75, -139, 69, -21, 27, 67, 0, 61, -13, -5, -23, 14, -35, 108, -138, -125, -70, 87, 22, -118, 31, 43, 19, 10, -58, 21, -61, 93, -54, -16, 43, -3, 29, 96, -94, 32, -72, -59, 120, 11, -27, -87, 156, -29, 299, -88, 64, 42, 68, 89, 4, 134, 221, -119, 35, -103, -18, -96, 9, 82, -43, -94, -35, -82, 6, -129, -115, 69, 47, -17, -45, 100, 110, 32, 56, -22, 83, -111, 63, 6, -149]
7975a49J14Q0m7J13J4J6o7k35K41r3P0p2Ml8R1j78R7KJJ90n2Ml4n7o3o3N9Q7N2
8004H7j05m2J58p6L0N8j72J18L7m4q8J05j52J01O4j21J11R0j65m4J60L6j73NL3
8029A1j04Q2Q2j6j83L4Q1p1J97q5j79R8k6m5R0K4Nm8J08rJ0Pj7o3Q8j12O0j25
8057a06J9R2l9R8j02K6m4K7R3M5J00k96j9K39k68Q3Q1Oj3j30J56j2r5J1J2R8p0
8084hN8M5j60l3M3J55j05L4Q5L4l24R4J38j98k7R5Jm6L14j26j00J23Qn1j12n9
8110a22L4O9%n1qR2L0K4j9j15J46j13j6J99j4l3p1P5j76O8J5j11J34n6M2J0N3
8137H6l00N4J30J25QJ95m06O7q2O5p1K69p9j8P6j88J4L7P4j93N0K03k01k6J53
8162D2Op5j51P6J56J6L9k1j74M1L7j08P4J13N8j10R6p9q7mJ62j58n2K67j86J14
$$ y = [-149, -35, 45, -2, 111, 125, 141, 74, -161, 80, -13, 57, -15, -11, -49, 42, -136, -39, -37, -36, 154, 102, 106, 72, 15, -48, -111, -52, 35, 87, -18, -60, 98, 22, 52, 110, -62, 56, 93, 49, -39, 66, -86, 15, 79, -42, 69, 159, -6, -50, 110, 146, -27, -22, 11, -93, -11, 71, 55, -128, -94, -13, -84, 113, 28, -151, -53, -79, -124, -34, -10, -5, -53, 55, 46, 56, 63, 46, -17, 71, -41, 19, -106, -87, 5, -34, 64, -38, -12, -56, -29, 64, 109, 209, -87, -106, 133, -135, -52, 29, 35, 22, -108, 48, 36, -59, -48, -36, 62, -8, 50, 95, -65, -98, -55, 100, -5, 29, 114, 148, -176, -82, 56, -142, -169, -74, -73, -119, 195, 69, -31, 92, 100, 49, -63, -122, -88, -19, -19, -70, -78, 14, 44, 68, 49, -66, 80, -33, -49, 150, 136, 103, 32, 107, -69, -1, 14, -97, 37, -19, 23, 33, 86, -214, -160, -30, 95, 103, 298, -108, -41, -123, -58, -129, 140, 61, 43, 119, -69, -55, -18, 56, -137, -87, 116, -85, -111, 42, 48, -27, -178, -102, 54, 70, 109, 88, -86, -45, -8, -116, -42, 71, 129, 19, 115, 36, -51, -55, 107, -51, -103, 164, -22, 92]
8188I2o1J10j05
$$ y = [92, 31, 141, 36]
8191C6
$$ Imaginary data points
##PAGE= N=2
##DATA TABLE= (X++(I..I)), XYDATA
0@%%%%%%%qJ6j6J6k4M0n6O4q0J04j28J60j92K32k80L29l85M54n34O24p22Q32r59
30e13J099j254J426j617J830k065K322k603K913l254L626m032M476m962N492o071
46c187O702p392Q150q980R894j0898J2007j3243J4624j6172J7922j9924K2237
59A1740k4942K8156l2051L6882m3066N1304o2870Q0404j10411J75162n48282N11172
71G3198P29636j316475L19193R37986p75949p10366R86188J06958p33450L59978
81b3103N32306o45032k35610N07834k9746l42499L04024K48767l06117k43147
91b32323K01687J05797j90582j3616L47181M396l84246L9796K87526k64817j72012
102b71213M58427Q4068m44904J07793K67377l48430r4970M61840n2020l41956
$$ y = [0, 0, 0, 0, 0, 0, 0, 0, -8, 8, -8, 8, -16, 24, -32, 32, -48, 56, -72, 88, -104, 128, -152, 177, -208, 246, -288, 336, -386, 446, -513, 586, -668, 758, -859, 971, -1094, 1228, -1375, 1538, -1716, 1910, -2122, 2354, -2608, 2884, -3187, 3515, -3877, 4273, -4707, 5187, -5711, 6296, -6947, 7677, -8495, 9427, -10497, 11740, -13202, 14954, -17097, 19785, -23281, 28023, -34847, 45557, -64854, 110308, -437974, 73198, 802834, -513641, -194448, 743538, -32411, -742777, 243411, 350369, -383081, -23103, 509203, -135829, -371439, 136395, 106649, -235850, 68174, 316941, 10824, -232323, -30636, 75161, -115421, -129037, 218144, 222540, -161706, -121910, 165616, -99201, -271213, 187214, 271282, -173622, -65829, 201548, -146882, -241852, 219988, 167968, -173988]
112a73988K16323J22995l66199J0915L34988p5588j35477J70895j0627k02017
122a07780K2238Q8692j5508M8015K8384p0902M179J0861q4437L1966J20052l6095
134C9665n2687O0716m6198j14410P0332R9901n5610l17R6611o5781j44778N9917
146e2639J11113q0193m2851J56681K1335k01559r291J79134n4805j32459J50273
157D4739R4475k12384m9946J92428m6034j37831J61028R8554j98230k5771J66874
168H7902r1262j35943J76339J00015j90644k5887J74750o4335j64631J21332J40911
179A28547j40073q3164J53746J0556j74056M4928J68381q4161j14885J31531L9367
190H0717j75723K5408J75538q5938j21689J53160N4728j95300R247J84614p7816
$$ y = [-173988, 42335, 165330, -200869, -189954, 145034, 69446, -66031, 104864, 94237, -107780, -85542, 3150, -12358, 35657, 64041, -6861, -2682, 8179, -76258, -44292, 75760, 39665, -13022, 47694, 1496, -112914, -42582, 57319, 1709, 1392, 98003, 32222, -112556, -52639, 58474, -21719, -64570, 92111, 113446, -88113, -97404, 81730, 26925, -105534, 44739, 139214, -73170, -123116, 69312, 23278, -114553, 46475, 145029, -53201, -78972, 87902, -3360, -139303, 37036, 137051, -53593, -79480, 95270, 30935, -133696, -12364, 128547, -11526, -94690, 59056, 69612, -104444, -59516, 108865, 24704, -90181, 41350, 80717, -95006, -69598, 105940, 20002, -101687, 51473, 106201, -89099, -79852, 104762, 26946]
201B6946j41141J36394Q6128j66876l0978J60935k2829j29836P2713R6298j01634
212a3880n9116J09321J2473j10168L2846J05576o6770q4587R6661M6906j26899
223e7637m451J42715m0858j34335Q9071J03438j34723n8192J62327M662j59037
234h7020N6914J30339j13566q3703J49009K4214j53420M2752J30243j05361q8360
245i7959J44564L1183j56500L2726J44326r0030j12106J29695O3144j48728o044
256f5729J48365m5748j25280Q8892Q4978j18251l6113J29262j6481j19875O4858
267a1122Q9633j04366m6044J27258l718j27009N3356J03904r5626o6914J21920
278D1272K3656j23699K3273J06861o2279p7784Q4223L9743r0212j415Q3284l0310
$$ y = [26946, -114195, 22199, 108327, -58549, -89527, 71408, 48579, -81257, -8544, 87754, -13880, -72996, 36325, 48798, -61370, -28524, 77052, 10282, -74305, 22356, 69262, -57637, -62088, 80627, 39769, -94566, -5495, 97943, -36780, -94972, 67355, 72017, -87020, -30106, 100233, -13333, -97036, 51973, 76187, -77233, -34481, 95762, -9599, -97959, 46605, 77788, -78712, -45986, 98340, 8310, -103796, 25899, 89043, -59685, -65729, 82636, 36888, -88392, 500, 85478, -32773, -68886, 60376, 43895, -75980, -11122, 78511, -25855, -71899, 55359, 51641, -75368, -22012, 81892, -13734, -80648, 41272, 64928, -58771, -35498, 71363, 9084, -68700, 15523, 55266, -34946, -36361, 46923, 16613]
290A6613o6116N2276M2480o5706j6817P1707q806p2186K9246O3708m6992m6901
302d7494O7406L1331p8726j2825P8504j2501p2160L7850N9357n8265m1364O8722
314A9835J5666p0216J4779O5733m3722n2777O5035K9488p8549L795Q6065l7298
326A7834q0335O7615N8884r3384k8151J06759r315j04079M9101Q6065q0900n4450
338f4356R8970J1654j02137L1416Q6942o9262n5662R6268J6250j04638L0197R6942
350G2584p2322p3686J01855L5837j18057P672J16267n0106r6694Q4103O1891j04942
362c5598j8839J07164k4568q9489O3952N8552q9080j8379R5557k6060q3865O4790
374D137N8259r0854k4314J00078j3358r1942M7536P2105p1180m5859P8056J4348
$$ y = [16613, -49503, 2773, 45253, -20453, -37270, 34437, 25631, -46555, -17309, 46399, -593, -47494, 19912, 51243, -27483, -40308, 38196, 25695, -46465, -8615, 50742, -7523, -48887, 19835, 35501, -34715, -19936, 45797, 2075, -50702, 14333, 43821, -34728, -30933, 55132, 17834, -62501, 5114, 63998, -29386, -57537, 49222, 39907, -64172, -15071, 70994, -9906, -64356, 34614, 46268, -55869, -24453, 62489, -6773, -62435, 33833, 50083, -54555, -24358, 72584, 262, -73424, 28431, 64268, -53789, -46117, 70150, 20044, -76650, 7453, 69344, -35598, -54437, 52727, 28159, -61330, 2622, 61174, -27906, -46285, 49272, 23212, -60653, 4137, 62396, -28458, -52772, 47306, 33948, -57994, -10458, 61647, -9533, -55392, 22664, 37012]
386C7012p4013J4697O1765l3514m0363M4428J8016m6921L234M3090k1333l4993
398b8895L4334K3599m5667j1741N1914k099n3801J8501N3285l4871m7404M7736
410D891L3936n6486j3442O0303o935n4890K4674L8683l7862j7145M5278l683m2968
423b5646K1354L0172l7650j6297M7963K484n0082J2945M8671k8056m5899M1005
435I64M0688m9916k7452N8441P432o5087J2761O2484l1716m5084N1375J8273o6074
448c2911P799O1495l6325l9895O5752J3006q1755J4919P6694m4430n5471P2310
460B1188L3137q5198j0578P7536j8309o3608M4623N1539n4703l3696N1917M382
472A8230n1295K3503N1708l9101l7809M9821P914o5196K0775P5036l9403n9296
$$ y = [37012, -37001, -22304, 39461, 5947, -34416, 10012, 28028, -18893, -15659, 27431, 6098, -28895, 5439, 29038, -16629, -28370, 23544, 21445, -32356, -13855, 39430, 4559, -42845, 4891, 38827, -17659, -31101, 29202, 22267, -32623, -7949, 30734, -7128, -24273, 21005, 17322, -25646, -4292, 25880, -11770, -28067, 19896, 22380, -27702, -14757, 33914, 5858, -40041, 964, 41652, -8264, -35716, 22725, 30157, -34930, -22169, 40315, 8599, -36485, 14890, 33163, -32911, -25112, 36383, 58, -39837, 25915, 38921, -42834, -27915, 48779, 4349, -51122, 21188, 54325, -30873, -41451, 36085, 17776, -45832, -1209, 50330, -4373, -38069, 13848, 18230, -33065, -9562, 42146, 3045, -34764, 15057, 22971, -42225, -21450, 53586, 14183, -45113]
484d5113O1235K8217q7658k422R7110j8868p9581M5580M9860p4337k7818Q1613
496B7818P405o3963K7069M5607n9700l5699O8446J4666o0994K5685O0320o1785
508e125n9627P7375L5094q5766J0651R8216m9874r8720O9618O2276q8197o593
520d0672J08470l2852r9658N7364N3203q3593R53J01580l5139q4763N9221L7832
532D1946q8941J905J04119j9763q3772L9298M6952o9898k7644Q3678K0015o8569
544b0674L808N0955l9390m8851N7466M2098n2076m672N1832m2374o0304O2947
556G65M3450o6187N637P4438n1045p6332O6508M4428o7852R354P3988m1396o5293
569d9537M0236K4163l4990K0969L7178l0647k2629J5418j1718r286K9472J1218
$$ y = [-45113, 16122, 44339, -43319, -45741, 51369, 32501, -47080, -1500, 48360, -25977, -53795, 27818, 35223, -28740, -1671, 43936, -15764, -51463, 16983, 31649, -29345, -3660, 56660, -5125, -64752, 12623, 47717, -38049, -27398, 70818, 20944, -77776, -8158, 54118, -34079, -40672, 67798, 34946, -64712, -7348, 45855, -37738, -36785, 64795, 29656, -55107, 4114, 41946, -46995, -45090, 59029, 39266, -44506, -5208, 41744, -28154, -55798, 27880, 47895, -20674, -16866, 34089, -5301, -54152, 3314, 45412, -6664, -11336, 40496, -1878, -62182, 765, 44215, -21972, -16335, 58103, 7058, -69274, -2766, 41662, -26190, -16836, 57152, 15756, -49537, -9301, 14862, -20128, 841, 38019, 7372, -15257, 161, -11557, -20843, 8629, 19847]
581A9847j2798o35j1157j5992J2431O286l413K9139P074n1232n275M3977k3190
594d938l0827N9907K5900o9583q752N2338k9963l8243O0666K9950n8244n486L9278
607B2003l4138l1519N6149K5638m9430l61M1836l0664m7469M3436M7091m1128
619A444k5940N0174r54p0334J3036P4113k5563n2795N4848K5982q4315k968Q6455
632D3183l1162o1186P7462K9126j07528O908J01301n4988o9336J03174L1728j22272
644e3590J0724J04362o0912o8902R7948L1586j02254Q755P7586n0494m7415P5127
656B2521K1024p1087R820N4377l9150m0074N4101K6461n3458p293M9869j3876
668A3235n1301K6586M7057l3831l1773M4421J2729n3476L340N1039k0369l5468
$$ y = [19847, 7049, 6414, -4743, -20735, -8304, -2018, -5431, 23708, 30782, -20450, -25725, 18252, -4938, -35765, 24142, 50042, -19541, -28293, 24045, -5918, -44161, 16505, 46455, -11789, -17275, 22003, -12135, -43654, 12495, 38133, -11297, -11658, 30178, -486, -47955, -4519, 42572, 1444, -24496, 25678, 24724, -45610, -32574, 41539, 15976, -36819, 18029, 44011, -40304, -43272, 43183, 12021, -49165, 28297, 57423, -50105, -43197, 58104, 3116, -66220, 36954, 68682, -53590, -42866, 61496, 584, -68318, 29630, 61216, -41038, -32283, 45303, -5191, -52606, 22521, 43545, -27542, -17722, 36655, -2495, -42569, 11532, 37993, -15465, -22758, 27111, 13235, -38066, -11480, 35577, 1746, -30027, 14394, 27123, -26353, -23013, 28026, 7657, -27811]
680b7811L8532J7452n0033P13M6589k0576l3193M0446J9486m9950n514M6465j2002
693A0604l9231K7516L1194l5321k1859L4974Q888l2427M944L1912j2089k6494
705a7389J6128J6688k1824p202K5680o12k6823Q778K4194j9569k0378L0856J4990
718B3517l9223l643M3696j3352m4439L1056L7944m5592k1099N4736k372n4666
730c3437K6806M3360m4895k0545N3213p429n0944L1490L6401m8340j5014N4153
742B4819q185m9816K7243L9326l7588k4095M1573J0492m1059J404L7332j1241
754A0205l3084J9683K5465k8030j5463L4753J328l6565J5751L2695l2396k0767
766b6425M4662K338m8758J7186M3592l5067l0133M5901J3314m7365N145M2214
$$ y = [-27811, 10721, 28173, -21860, -21147, 25442, 4866, -28327, 12119, 31605, -18345, -23859, 22606, 10604, -28627, -1111, 30083, -5238, -27097, 7877, 16765, -15662, -10718, 21194, 9105, -17389, -1261, 15427, -6397, -13599, 12081, 11469, -15354, -6576, 17618, -1951, -22329, 8527, 23517, -15706, -19349, 24347, 10995, -33444, -2388, 35556, -10036, -31135, 23601, 21229, -33437, -6631, 36729, -8166, -28711, 24502, 17073, -33871, -2381, 34020, -14320, -29334, 24819, 16634, -33182, -5939, 33387, -4201, -28296, 13277, 23769, -17290, -15886, 21446, 10205, -22879, -3196, 22269, -5761, -21224, 13529, 14857, -21708, -5957, 26738, -5658, -26425, 18237, 20575, -28183, -10997, 32595, -2472, -32605, 13296, 26610, -20755, -15610, 26604]
778B6604j8991l2194K6416J8843l0123o973K9385m542k6356J3915K1984k1966
790c998j4216L0631N431l5664P198L6179k2051l2674L5213K2916m5069p842M7951
803B4005j0192m4145K6619L4108l7096j6943M1289l284l9787J9809L1279l1799
815f137j5950L9414j501m1823J8279L8218l1362k6804M2151J0914m9196L605M7435
828B7243j8532l8620L1947K4845m0577r059M2663o899l5139K2973K3428l4315
840a0042r236L7529p378l4514K3078K6290l4960j5321M0533J316l9360J2852L5326
853B6113k3660k7533K9566J5595l2113l147L1217p716k6180J6786J7849k2297
865e520o734K6312m881k6398J4992K0928k5062j2900L1693K158l4011Q911L2253
$$ y = [26604, 7613, -24581, 1835, 20678, -9445, -16418, 12967, 8425, -17931, -4016, 17968, -3998, -18214, 12417, 17848, -17816, -10618, 25561, 3510, -29164, 6049, 28965, -16104, -23946, 24005, 13813, -30332, -3713, 30395, -6701, -23644, 17645, 14361, -25426, -5617, 25662, -6137, -22087, 17327, 15826, -25997, -7718, 30500, -862, -27666, 14485, 25399, -23797, -20192, 27243, 8711, -29909, 2038, 26883, -13694, -22753, 19910, 13011, -22128, 845, 24273, -10042, -19278, 18251, 10873, -23641, -563, 25727, -9233, -24554, 15979, 17295, -22065, -9213, 26113, 2453, -25080, 4486, 20081, -12032, -15179, 16038, 8322, -17858, -1072, 16777, -5520, -12254, 14058, 9177, -17221, -2229, 18699, -6363, -19263, 12430, 14588, -19423, -10512, 21741]
878B1741j8577k4858K5972J6412k9468o819K9087k736k5724J0431K0033j7156
890a662j2693K2085L619k4303O265K3983j7770j9998K8658J0936l6699K208L9732
903B4361j7165l5613L2006K5052m1608r120M3783q694l8229K3850K4730l2874
915i521p671L4255r339k8728K2046J8104k9407n286L2324o622l0809J6085K6183
928B1614k2870j9421K9505J2226l4359l745L5011p870l1549K0210K3716l0896
940h428j1337L4811n717l0442K3051K0474l4654m397L7215j4075l1781K9745K0512
953B4977l6610o444L5385q117k8298J7362J9212j9021j0348J5636K470j2745P41
966e800J0897q46q385K212P386p030o396J3765L947j8140L248J9417j4662j8123
$$ y = [21741, 3164, -21694, 4278, 20690, -8778, -15597, 13490, 10754, -14970, -4539, 15494, -1662, -14355, 7730, 11349, -12954, -6689, 17294, -476, -20474, 8184, 19120, -17579, -15371, 24361, 7196, -28417, 3589, 28641, -12967, -22087, 21696, 13002, -25227, -1377, 23353, -9521, -17192, 17063, 7724, -21004, 1042, 19146, -10261, -15547, 16777, 10155, -20654, -4569, 21614, -1256, -20677, 8828, 21054, -13305, -17050, 17961, 10091, -21458, -1248, 22468, -8428, -19765, 15046, 9329, -21113, 1938, 22412, -12242, -16639, 20576, 6501, -25280, 4465, 24977, -11633, -18077, 17308, 9191, -19107, -1745, 17467, -1554, -11902, 3734, 6204, -6541, -5800, 5097, 4251, -4134, -1922, 5464, -1566, -7962, 5803, 9750, -8390, -5142, 14275, -387, -18510]
980a8510K4424J1684k9212k88K9266j2676k5895K0771J7750k3212n145K2414m984
993F387j9267J1084J2773j4022l971J6200k651j7858O696J5479j1710j1375J9024
1006F789P959k4978l952K6419m703k4943J5346K3001k3431j6716K6130N297k6054
1019a3836Q633K4649j7388j7836K2036L824k5151R171K5437j9005j9369K6106
1031G271O512l2775O349L6002j5199k8956K4290J6840l3835n303L6541n230k9711
1044a7204J7000J7817k7286p526K9386k299k2481J4766J3616k5000q282K6491
1056H998J152k2121R631J9461j7879j8505K0273J4201k0680m045K5113n309k8563
1069a8273J0772K3045j8359j1141K7756j765l1718J2908K4562k4865r989L6397
$$ y = [-18510, 5914, 17598, -11614, -11902, 17364, 4688, -21207, -436, 17314, -5898, -11043, 11371, 6387, -12880, -1796, 10977, -3045, -7016, 9184, 6533, -11325, -4629, 10850, -860, -12235, 6789, 14748, -10230, -14182, 12237, 7534, -17409, -2063, 20938, -2493, -19209, 6921, 12218, -13836, -5203, 19446, 2058, -15778, 6258, 10082, -15069, -5898, 19539, 534, -18835, 7271, 13783, -18992, -12643, 23359, 8160, -20796, 3494, 20334, -13501, -18804, 17737, 12507, -17204, -204, 17613, -9673, -17199, 12187, 9888, -12593, 2173, 15789, -9211, -17493, 8998, 10150, -11971, -2340, 17121, -758, -19263, 1010, 15211, -5469, -9514, 15599, 10290, -18273, -7501, 15544, -2815, -13956, 13800, 12035, -19683, -6775, 17787, -7078, -17067, 19330]
1081A9330l721l7263J6043K6720k8926j2656L6906Q98l4198Q996K3169j8485j2488
1094a5675K3430N953k0645J210J4014r856j1336J4872R769j5433l799J6871m752
1107D623k0013J2570K1445j7964j5203K3626L989l0209N328K9288j3897k0117
1119a6534K2102Q862k6933J292K4257r328j4804J7130N276k1302J213J8460p403
1132B288j2547J4023Q600j7540n341J6366N16j5096O146J4260j0462j3288J1874
1145b01P834j3393J31J5463n229j3640Q671Q312j2671j682J5661k682j5950O741
1159b635J2233j2212r203J6776P257j9557k637K0095m861k0049J2873J7648j8042
1172b314j0898K2166K62k2901J0150J9289j8522r659K3255k969k4489J4031J9819
$$ y = [19330, 15609, -21654, -5611, 21109, -7817, -20473, 16433, 17331, -16867, -7871, 15298, -3187, -15675, 7755, 13708, -6937, -5727, 8287, -1569, -12905, 1967, 11736, -3697, -7496, 9375, 4623, -15390, -2820, 18625, 661, -14542, 9084, 13073, -17136, -11808, 17480, 3583, -16534, 5568, 14430, -12503, -11211, 13046, 3718, -11086, 6044, 11320, -9982, -8769, 9691, 2288, -10259, 3764, 12364, -5176, -10517, 5849, 6365, -8731, -2585, 11675, 1213, -12075, -201, 7633, -5760, -5629, 9834, 4605, -9035, -364, 7948, -4723, -6405, 9256, 6574, -9376, -2635, 9598, -2614, -11817, 4959, 12216, -7341, -9978, 10117, 5256, -14793, -1920, 15728, -2314, -13212, 8954, 9216, -13685, -3535, 15754, -2768, -12427, 10828, 7859, -16630, -2599, 17220]
1185A7220k2169r742K6535j053k7110J0085K2857j6863j5114K1277P227k2686
1197i536K57K1009o673j6505J2656J1017j7858n024J9830l636j8912J2258J6214
1210A5097k0348r435K5500k3k6420J0789K3919k0354j6568K5554O071k6865N556
1223g527K3533j4414j6111J9840N457k1142M680J8286j2899j2353J7483M381j9107
1236i893L098J8642q795j4796J2938J0711j5162o300J5406K397j5098J116J3485
1249G749m418j1951P507R138j0589m606J2528o05j3071O520J1398j2432o435J7449
1263H182k81j9595P931J8171j5317j2804K0336N594k2825K250K0583r533j5360
1276a2668J4435Q480j6133j479J5013m542j1693R443P617j2373l097J4347k171
$$ y = [17220, -4949, -14691, 11844, 10791, -16319, -6234, 16623, -240, -15354, 5923, 13150, -9536, -9279, 11730, 5057, -11448, 1208, 12225, -5633, -10657, 9173, 5537, -13375, -1117, 15097, -5251, -14686, 10814, 10791, -15629, -4840, 19079, -1275, -17843, 7711, 13782, -13083, -7527, 16006, 1592, -14519, 5321, 10778, -10364, -5684, 12602, -297, -12650, 4833, 9214, -9893, -6795, 11847, 3052, -11744, 1194, 11905, -3257, -9557, 5849, 8246, -6852, -5736, 7749, 3331, -8620, -1113, 8025, -2564, -7170, 5358, 4753, -8318, -1798, 9600, -2832, -9267, 8182, 7901, -11694, -3763, 14408, -909, -13713, 6623, 12217, -10608, -8358, 12225, 2692, -12668, 1767, 10247, -5886, -7365, 7648, 3106, -8587, 856, 8473, -3900, -6997, 7350, 5179]
1289E179j4497O983J4283j2593j1769J6838P024k0844Q5K1775p728j9582J4875
1302B9J3349j9721l887K1238n549j7708J3521J0395j8693j211K0056p829j6565
1315a2575J4305J0336j8855l533J9882l028j7824P934J4204j1544r969J4072N764
1328I169j4135j044J3361m124j1725Q798Q397j2260k640J3700l936j3590R810
1341b19J0253j4236n123J7247j269j7176O789J4445j0552j0288J3548N977j4525
1354e129j646J3650l083j1432P387Q916j0862n389J2560n13j3469P439J2210j3256
1368b617q056J7186J314j9200P074J7865j3263j2761J7439N386j9246K278J7580
1381A0979p972j2910J1584O291j3814n86J3698m213j1116Q655P818j2840l937
$$ y = [5179, -9318, -2335, 11948, -645, -12414, 4424, 11448, -9396, -9311, 12464, 4736, -14846, 29, 13378, -6343, -10230, 11008, 5459, -12249, 1272, 11667, -7026, -8237, 11819, 3990, -12575, 1730, 12066, -6789, -10322, 9560, 6532, -11292, -3358, 10846, -698, -10667, 3405, 9169, -4966, -6010, 7351, 3227, -8498, 300, 8697, -3563, -6203, 7497, 3561, -10029, -219, 10034, -4202, -9325, 7922, 6653, -10523, -3734, 10711, 159, -10129, 3419, 9396, -5129, -6775, 6875, 3792, -7640, -253, 8663, -2199, -7588, 4972, 4459, -9010, -1571, 10639, -2617, -10673, 6513, 7827, -11373, -4299, 13566, 303, -12458, 4981, 10367, -8879, -6601, 10979, 3007, -9903, 1681, 7972, -5842, -6428, 7270, 3057, -8059, 596, 8414, -4426, -8363]
1394h363J5405j36j6186O243J4709j2590j1608J8038N671j9795K333J8374j0550
1407A545j4099J5521O342j6868J987J4719r215r900J3814M112j4234K347J2204
1420H275o778r693R294P099j0043n007J0317K168j1465L00J2692l262j2068P078
1434a093R270j1674l931J4744k193j3934Q409R100j3905k695J6678l975j3967
1447i166R919Q825j3932l902J4265o2j2059L138Q747n654p618O954P068p256m499
1462e232R369J051j1897L209J2471q541r034J4332K068j8618N438J7533j2970
1475h21j1492J9487L249k1532M982J8205j2349j0854J6856L170j6775L200J2373
1488G699q135o721J0842L317j0512j98R063l509r161O226Q930q551p359J1244
$$ y = [-8363, 7042, 6906, -9280, -3037, 11672, -918, -12526, 5512, 11183, -8612, -6279, 12095, 1545, -12554, 2967, 9309, -7559, -5572, 9147, -68, -9968, 3846, 7958, -6276, -3929, 8275, 1497, -8196, 1098, 8197, -1846, -6853, 3464, 5632, -5833, -5533, 7159, 3897, -8171, -1093, 8177, -3497, -7428, 7316, 5123, -8811, -402, 8698, -5207, -7902, 8776, 4801, -9166, 753, 9578, -4354, -8256, 6009, 5947, -6112, -2974, 5773, 119, -7499, -545, 6523, -733, -5232, 4137, 5188, -6709, -3500, 8971, 430, -8604, 5728, 7796, -10822, -5384, 12149, -821, -12313, 7174, 10423, -11109, -6127, 12078, -271, -11125, 5731, 8901, -7874, -4674, 7699, -436, -7157, 3685, 7002, -3510, -3708, 5355, 1846, -7315, -1089, 7841, -710, -8069, 3175]
1502C175L453j4378J534J6558o315j3845J2247P284j6640r63J7019n838j2083
1515h792J1771N348j5851J361J4545p173r789J1905M703j3923o26J2571l021r881
1529f852O612Q236q370o863Q692M166r147l70J0129l044r448N661O051q745j604
1544d896J0692k721j0251O695O859j0016k720J2299n42j1995M340J0065p779p822
1558g792J0017N135j1298j713J1073k613j0328O587Q234r529l528J1510k172j1696
1572h113Q055Q569j2738l071J5218l585j4105Q997J0643j2428m972J3440k62j2111
1586f463L459Q453n559n390O242K892n760p65N608m45n370K576N730n993m955
1601e740R293J906j2099K980J2926r112j0715J4362N518j7119J865J6075q970
$$ y = [3175, 6628, -7750, -6216, 10342, 4027, -9818, 2429, 9713, -6927, -7890, 9129, 3291, -8792, 2979, 8327, -7524, -6163, 8382, 1209, -8580, 3325, 8028, -5895, -6521, 6050, 3029, -6852, -240, 7996, -374, -7237, 1455, 5621, -3526, -3896, 6233, 3189, -6259, -598, 5453, -3292, -4896, 5796, 3075, -7176, -481, 6378, -3638, -6358, 5941, 5399, -6596, -2256, 7809, 30, -7792, 2225, 7360, -3938, -5651, 5422, 2809, -7519, -932, 7302, -2227, -5755, 5755, 3583, -8113, -58, 8511, -4227, -7298, 7920, 4335, -9770, -773, 9870, -2558, -7530, 5910, 5648, -6463, -3004, 5449, -110, -5500, 742, 3634, -2126, -2891, 2717, 2272, -3098, -522, 5208, -785, -5740, 3553, 5459, -6640, -3660, 9266, 154, -10561, 3801, 9319, -7800, -5935, 10140, 1170]
1614A170j1872J3509M796j4199K954J1659q233o436J0496Q45r947L762P531o407
1628c72m961O110L401o051k497O733K299p864j873R705p43j0711N079R803r246
1643a188o534J2748L24j3041P061J0032j2519m220J4841l701j4014J0397R568
1656I754j4884l164J5922l053j3862Q128J0011j0537n141J0795J046r602J794
1669b793P548l814n641N302M233o718k068P787j694q335N755P481r486m583J2237
1684E211l14j3390O203J1988j0119p892J2917K082j3376L096J1367p156p183Q898
1698B332K115r286J784Q069m793n291O838K806q138j11Q571k210q365N380P002
1713F703p892n268R539K247j0306J708R455n102p468P760L309q439Q97P718m348
$$ y = [1170, -10702, 2807, 7603, -6596, -3642, 8017, -216, -6652, 3844, 4689, -5258, -1496, 6035, -372, -5333, 777, 4178, -1873, -4370, 2363, 4662, -3202, -5075, 4630, 3887, -6824, -1745, 8058, -1188, -7722, 5026, 5350, -7691, -630, 9402, -3117, -7337, 7504, 3803, -10211, 186, 9754, -5130, -8294, 7628, 4575, -9287, -1159, 8852, -1685, -6826, 3969, 5015, -4587, -2793, 4755, 941, -4700, 602, 4835, -1883, -3951, 3836, 2142, -6193, -438, 7043, -2443, -7026, 5211, 4897, -8493, -2290, 9698, -421, -8313, 4604, 6686, -6690, -3594, 7773, 617, -6566, 2332, 4447, -4839, -3055, 5014, 221, -5070, 1768, 4574, -3564, -3675, 4896, 2686, -5679, -299, 6703, -1189, -6457, 3082, 5329, -4977, -3269, 6186, 1084, -6384, 1376, 4685, -3754, -2857, 4861, 513]
1728E13n542O325K542p186L56P494k624o217M248N190o040l997P084K667q391
1743c578o36Q821k525q924O212O999q309k890R930j747r634O051O861r258j990
1758d617J0404l472r519P143O500r248k113J0348j924r441M078P101n856m116
1772d732O662J972o871o54P169j566n846M289M655o406k913P800p80q234M529
1787i26P241q265m702J0340O34j0281L989R228p629n851R299J731r477K284P980
1802E595n254n554O630K468p189O34P200l110n831M606M020o077k093P014k75
1817B784p598K760O967n111m650P153K638q019M06P445l583n988N697L562p356
1832b893j043P569j747o907M645N530o580l261P918O81q350K487P751n667o003
$$ y = [513, -5029, 1296, 3838, -3348, -2992, 4502, 1878, -4339, -91, 5099, -941, -4938, 2146, 4813, -3578, -4214, 4607, 2082, -6842, -630, 6369, -1940, -4830, 5100, 3353, -6281, -230, 6631, -2627, -4617, 5787, 2315, -7204, -61, 6439, -2809, -4922, 5426, 3502, -5939, -1861, 5240, -616, -4732, 1930, 3902, -2969, -3623, 3546, 1980, -3866, 423, 5078, -1328, -4241, 3559, 2779, -5455, -926, 6315, -1950, -6652, 3688, 4322, -5959, -1970, 7258, -371, -6222, 3077, 4808, -4669, -2385, 5595, 341, -5213, 1417, 3885, -3304, -2670, 4530, 1420, -4411, 195, 4215, -1862, -3955, 3059, 2784, -4814, -2054, 4913, -198, -4848, 2305, 4943, -3076, -2670, 4775, 1192, -4796, 901, 4463, -2893, -3936, 3633, 1886, -5021, -376, 5154, -1426, -4687, 3231, 3912, -4438, -1951, 5800, 133, -5870]
1847e870Q048K899r352Q69R039m832o988Q069L615r238J51Q966m401p095P009
1862H89M406q661q54Q730k174p266M616N846o354l311O869Q91p444J526O610m016
1878C03n364O172L331p921j27Q527l150p292O574M906q910j548R332k238q479
1893e884N756N956p708k783Q297q76p496L962N051n361k837N806L60n473J606
1908a624N042l035l712M462K835n726j240O446q39o733K897O158n601m425P001
1923A906J995p688J238P216m150n253O269K208o751Q09O289l639m604N546K645
1938D036o705j17O834k107o628L964N343n496l965P061J884p955P18P671l412
1953A126o048O039L390p421R6P349l892n466O671K713q050P92P411m048o247O370
$$ y = [-5870, 2178, 5077, -4275, -3406, 5633, 801, -6187, 1882, 5497, -3741, -3590, 5376, 975, -6120, 889, 5295, -3366, -4220, 4510, 2336, -4930, -314, 5532, -822, -4133, 2736, 3627, -3817, -2291, 4319, 303, -5061, 1111, 4442, -3479, -3606, 4921, 1771, -5521, 1053, 5959, -2951, -4499, 4833, 2595, -5884, -128, 5828, -1880, -4663, 3634, 2758, -4738, -776, 4275, -1086, -3923, 1883, 2243, -3230, -1624, 3418, 383, -3329, 1133, 3968, -1758, -2998, 3448, 2609, -4124, -1227, 4931, -670, -5095, 1906, 3901, -3787, -2549, 4667, 517, -4736, 1533, 3741, -3010, -2201, 4088, 449, -4155, 1391, 4036, -2669, -2786, 4048, 1941, -4687, -723, 4620, -876, -4841, 2220, 4104, -3851, -3133, 4538, 1126, -4922, 1117, 4507, -2914, -2818, 4531, 639, -4827, 1844, 4557, -3493, -2701, 4710, 662, -5585, 785]
1969G85M093p395j637P626j025o755K925N678l812l842M777J861n645l13N878
1984C199j929m949M253L291o504o56P144k428o374N608M638q394j727Q836j451
1999B557p582M883N853o559l171O664l0n964K669M387l979k533L998J22m002J600
2015a087M480k676l697L731K105n334o66O354m90o293K731N312n326l686O814
2030B272J734o769J180N312m286l853N359J650m955J493M496m094l461N070J667
2045B815m766P34N095k704n219L385L850m040k073N567N12o183N22M851k095l450
2061c199M388K013n025l42L924j732k799M285J934m609n50M305k422m061L969
2076G9L817m404k302M103L98m703R70N096j454m037K486K436m388j019M896N08
$$ y = [785, 4878, -2517, -4154, 3472, 2447, -4308, -1383, 4295, 483, -3359, 1418, 3279, -2366, -2679, 3199, 1270, -3679, 574, 3865, -2639, -3295, 3849, 1421, -4953, 655, 5293, -3101, -4828, 4008, 2557, -5025, -142, 5711, -848, -4019, 2645, 2615, -3349, -680, 3707, -272, -2805, 1193, 1315, -2687, -1087, 3393, 717, -2980, 751, 2856, -2478, -3144, 3210, 2720, -3573, -842, 4470, -856, -4542, 2272, 4006, -2763, -1583, 3729, -557, -4410, 949, 2599, -2356, -863, 3633, -461, -3922, 1148, 2815, -1951, -1217, 3878, 1174, -4045, -660, 3190, -850, -2923, 2644, 3156, -3027, -2505, 2346, 251, -3199, 1189, 3202, -1823, -2165, 1759, 27, -2772, 1513, 3447, -1162, -1712, 2593, 171, -3890, 79, 3896, -508, -2810, 1293, 1691, -3012, -2042, 3054, 1600, -2437, 49, 2485, -1903, -2922, 1974, 2482]
2092B482m490K161L393m955k363O299n6o107L329N198o297l999P470J115p111
2107c931K572O756m972n290N834K188n913J058N700k740m650L559K512m613l4
2122a964N128j056n486K675L897m868k439O748J113p290J487O895m661n676P392
2137A895L400q666L68P960m123o472O954L075p966Q52P531m464n750O989K422
2152D005p696J202P092l927n300N705K685o081l46O001j417n019K854L391l635
2167d86k382M031J151m533M43M391k019l776L488K896m915n63N686j748n429L792
2183B7L857n454j548O465j051n928K990M241n022j885N869m06m918K109L293l465
2199h26k073M417O07l662O57K927j756k497K408K272k844j284L218k79l941J282
$$ y = [2482, -2008, 153, 3546, -1409, -3772, 2527, 2471, -3636, -307, 4891, -1406, -5405, 2065, 3180, -3931, -1359, 5397, 425, -4865, 969, 3157, -2756, -1698, 4002, 1262, -3388, 171, 2683, -1930, -1964, 3164, 2108, -3378, -703, 3194, -1674, -4113, 2635, 3748, -3542, -2055, 4840, 179, -5497, 1895, 5295, -3371, -3003, 4957, 834, -5638, 1316, 4391, -3575, -2723, 4808, 344, -5406, 1583, 4005, -3691, -2489, 4603, 676, -4624, 1081, 3766, -2315, -2661, 3340, 1923, -3096, -242, 3149, -486, -2868, 1163, 2314, -2219, -1776, 2615, 596, -3180, 308, 3204, -1711, -2274, 3412, 1664, -3765, 27, 3884, -1570, -3118, 3347, 2296, -3632, -642, 3599, -1423, -3308, 2561, 2155, -2763, -654, 2639, -826, -2899, 1518, 2125, -1537, -880, 2047, 291, -2206, 202, 2474, -370, -1654, 1564, 1285, -2656, -1374]
2215a374L569j748k789L148J571m286k01M478j111l505K944K517m763r91M695
2230B154q30m138K873L569m781k053N114j30m923K490M227l899k889M758M88m742
2246b712J907M210l227k760L841R83m316N28M011j540l268K375K153l488j042
2261b345L624M31l564J064L137k458k670L986J346m177J1M640k444m119M362K340
2277C164n411k76N609k251m708M437K736n314n41N347j588m319L228K627m066
2292a326m73L915q10l278J485K935k809j829L114R24l643J46L622j127l749K561
2308c42L166l695j944M666J79m700J645M299l688k337M668K34m853J756M117l638
2324d67k797M950M40n040J682M354k959l408M089J908m668j28M762j307m025K462
$$ y = [-1374, 2195, 447, -2342, 806, 2377, -1909, -2110, 2368, 1257, -2248, 696, 3213, -1550, -2541, 2154, 1324, -2814, 59, 3628, -1153, -3206, 1908, 1778, -3145, -655, 3572, -327, -3216, 1542, 2030, -2712, -805, 3405, 178, -2582, 1259, 2242, -2074, -1546, 2465, 925, -2343, 32, 2185, -1303, -2345, 1279, 1710, -1854, -790, 2347, -111, -2781, 1205, 2551, -1626, -1615, 3025, 581, -3538, 824, 3164, -2247, -2523, 3086, 835, -3873, 564, 3300, -2014, -2555, 2792, 1204, -3115, 113, 2740, -1326, -1799, 2116, 1306, -1972, -487, 2448, -361, -2190, 924, 1848, -1795, -1649, 1973, 846, -2903, -342, 2824, -871, -2815, 1851, 2030, -2670, -1025, 3274, -414, -2751, 1917, 2151, -2702, -946, 3171, -467, -3264, 1686, 2126, -2914, -1232, 3122, 163, -3245, 844, 2752, -1916, -2044, 2718, 1411, -2614, -152]
2340a52K952l521j460L950m3m058J564L043k834k056M234K78m071J141L812k747
2356C2l290M420J710m472j18M245j382m103L001K822l497j711L946k4l938J368
2372i91L169k430j839L495L48l972J130L973k954k395L927J218m912P64M212k055
2388F88l720L242K385m023o46L921m41l460J434K576k154j831L026M56k871M80
2404i38L069j936k363L003J596l984k71M552j891m141L234L226m549j517M903
2419A993m21m509K430L736l652j809M037m2l995J700L012k998j251K959K58l575
2435b127J154L354k046k784L064J778l962q71M254m02m072K048L419l148k151
2450b492L938O54l939J147L058k858j737L468J27l642J386L290k948j895L578
$$ y = [-152, 2800, -721, -2181, 1769, 1726, -2332, -768, 2275, -559, -2615, 1619, 1897, -2174, -1033, 2779, 32, -3258, 1162, 2872, -1600, -1718, 2527, 1145, -2958, 43, 2865, -632, -2343, 1603, 1579, -2359, -991, 2178, -252, -2091, 1404, 1752, -2220, -1090, 2883, -71, -2466, 1461, 2679, -2233, -1469, 2743, 688, -3032, 210, 2595, -1428, -2074, 1847, 1406, -2054, -620, 1956, -198, -2029, 997, 1453, -1418, -938, 2131, 195, -2168, 835, 2431, -1553, -1824, 2728, 837, -3304, -70, 3156, -1393, -2910, 1993, 1572, -2937, -507, 3229, -423, -2232, 1805, 1763, -2232, -532, 2480, -518, -1769, 1190, 1448, -2127, -973, 2381, 335, -2449, 615, 2393, -1569, -2440, 1814, 1412, -2660, -612, 2807, -341, -2492, 1446, 2100, -1839, -692, 2366, -492, -2229, 1239, 1366, -2276, -890, 2400, -548, -2443, 1135]
2465A135Q25l385L83L364j369l226K050K442k667j452K898N67l217P35K838j810
2481A11k217K969O12l439R23L309k439k320L671P66m075Q30L948k167k865L233
2497H50J493l826k69L298m79k961J651J701j980j274K349M93k199M08K646j637
2513B64j937K168J172k943j98L835j746l194K571K357l670p62M208q89l790K208
2529c46K644l313j018L567l79k981J392J772k038n16K531k5k525R39J649j438
2545h5j617K093J279k681m76K480k94k613J243K856j915j982K378P78k855L15
2561a096K704j043k148K085J004k778L3K889q65k332J811J547k851r46L360m97
2577H77k764J564K700k828j707K971J208l402N81L066j425k969K066J865l024
$$ y = [1135, 1960, -1425, -1042, 2322, 953, -2273, -223, 2219, -448, -1900, 998, 1565, -1652, -917, 1921, 111, -2106, 863, 1475, -1964, -1041, 2268, -171, -2491, 1180, 1946, -2129, -1299, 2649, 482, -2383, 850, 2343, -1483, -1752, 1546, 1067, -1894, -243, 1458, -522, -1796, 553, 1046, -1153, -745, 1901, 264, -1673, 495, 1667, -1276, -1474, 2361, 615, -2579, -8, 2349, -1321, -2083, 2125, 1236, -2554, -346, 2298, -1015, -2033, 1534, 1155, -1826, -434, 1338, -700, -1216, 1315, 1290, -1235, -296, 1353, -85, -1702, 391, 1670, -1011, -1487, 993, 699, -1914, -671, 2185, 270, -1712, 666, 1444, -1411, -1096, 1608, 565, -1583, 502, 1506, -1272, -1239, 1650, 785, -1547, 264, 1811, -1040, -1986, 1374, 877, -1887, -323, 2377, -451, -2158, 813, 2021, -1381, -800, 2266, 841, -2128, -62, 1803, -1221]
2592a221l09L278q66k981J957J917k703p62L543k34l795J539L197l237j780L963
2608A506P35m100O83L495k228k886L585J679l820l70L705j569l193K951K225l741
2624a343l31L836j199l600L014K457l833r89M224o10m297K136L119l368j892M109
2640A433K96l900J357K913k334j993K959J073l208M57K939j759k259K595J098
2655A667k917J53L089j221k902J757K179k649j219L518Ql568J220K873j945j969
2671a926K960R92l445L11K817j488k135K693J154l200J93K565j421k264K693J335
2687A834k824k13K448o71k395J625K207k071r86J725L84k245L30J987o72j372
2703i09J001R70j814m93J950O3j725J125J334j935j385K669M37k532P22K508j905
$$ y = [-1221, -1530, 1748, 882, -2099, -142, 1775, -928, -1690, 1853, 1619, -2176, -637, 2560, -677, -2457, 1506, 2241, -1859, -1176, 2319, 91, -2795, 790, 2469, -1351, -1721, 1984, 415, -2778, 173, 2398, -1343, -1674, 2162, 963, -2637, 377, 2834, -999, -1988, 2236, 1626, -2671, -535, 2584, -784, -2676, 1433, 1729, -2171, -814, 2099, -235, -2228, 731, 1804, -1404, -947, 1992, 233, -2026, 569, 1667, -1250, -1097, 1992, 771, -2131, -374, 1805, -844, -2063, 1455, 1463, -2105, -885, 1988, 43, -1926, 1034, 2026, -1419, -1108, 1709, 221, -1914, 779, 1933, -1267, -1074, 1491, 70, -2194, 499, 1834, -990, -1203, 1245, 574, -1821, -196, 2011, -60, -1046, 679, 1063, -1182, -852, 1135, 463, -909, 92, 1062, -752, -1245, 705, 768, -957, 168, 1502, -433, -1818, 851, 1288, -1244, -522, 1986, 81]
2720H1k226K695R60k714L18K852j472k381J856J102k330K98K469p14k079J458
2736A73P63j915r8K426m24j820O47J567j502j369K060J115k210o76K330n72k438
2753a943J465K335k108j315K668r5k750J124K752k364j272K941k21l444J689K874
2769B336k941j444L393J73l645J163K962k148j883K881Q51k958R2K509p84j890
2785a333J676J228k006o88J971j33j987R06J901j905j171K095P31k755L63L216
2801B109j572k776K609J603l167o00L931j207k851K027J895l028m23L062j008
2816F04k529K092J378k983J38K655q03k217J609J632k130q12K270L83k318M59
2832e72J963q30j846J020J457j581r50K045k1j807N00J922j397j306K271L72k594
$$ y = [81, -2145, 550, 1510, -1204, -886, 1966, 494, -1887, -31, 1071, -1259, -961, 1508, 794, -1285, 173, 936, -979, -1077, 1349, 925, -895, -248, 1319, -183, -1552, 508, 1623, -587, -1263, 1067, 495, -1943, -478, 1857, -251, -1566, 1102, 1007, -1743, -619, 2133, -231, -1503, 1438, 1217, -2227, -538, 2336, -605, -2049, 1344, 1517, -2128, -965, 1997, -151, -2034, 847, 1698, -1260, -1168, 1341, 557, -1333, 343, 1571, -435, -1123, 848, 715, -1272, -366, 1535, -370, -1541, 554, 1285, -1470, -1107, 2109, 537, -2239, 370, 1973, -1194, -1794, 2137, 930, -1921, 106, 2001, -1027, -1450, 1612, 604, -1925, 167, 1545, -1438, -1300, 1355, 552, -1665, -56, 1576, -554, -1366, 904, 1287, -1031, -572, 1391, 561, -1285, -265, 1192, -389, -1339, 706, 685, -1122, -622, 1300, -97, -1403, 868, 1240, -1354]
2849a354Q05K564k184j574K744Q02l325N05K919j670k290K463J240k661l15K390
2865A059o59j710J261J343j705o76K027n0j831Q57J490j613j166K023O24k267
2881i93n2K322r82j898J769J457k370q22K770j79k716J209K161j957j056K427
2897A090K9k516J070J973j936j093K155L11k445N09K321j600j605K163J037k724
2913a261J76K586p28k322J736J436k126p91K327m0k174P39J756j686r83J898K32
2930G75k076P26J868j539j190K012O96k324J04K412r22k044J634J493k418n00
2946a293K418l27k209J045J916k028p91K005K3k160R93J712j519j228K272M21
2962A250k463P21K180j580j684K353M43k111k01K201m82j987J112J320j325q40
$$ y = [-1354, -549, 2015, -169, -1743, 1001, 1803, -1522, -1017, 1902, 232, -2058, 405, 1645, -1016, -1331, 1059, 400, -1310, -49, 1294, -411, -1087, 940, 890, -941, -84, 1406, -207, -1373, 650, 1274, -993, -1045, 1277, 295, -1603, 166, 1623, -747, -1569, 1201, 1022, -1694, -485, 1676, -281, -1337, 1090, 1119, -1397, -327, 1646, -290, -1383, 772, 1083, -1362, -853, 1468, -132, -1737, 426, 1463, -1261, -1085, 1501, 773, -1549, 187, 1623, -503, -1294, 1033, 993, -1181, -442, 1314, -372, -1355, 543, 775, -1301, -575, 1293, -246, -1436, 576, 1272, -1052, -948, 1464, 542, -1502, 132, 1625, -793, -1293, 1125, 798, -1411, -366, 1550, -478, -1269, 736, 759, -1401, -408, 1304, -215, -1443, 829, 1250, -1213, -492, 1688, 108, -1576, 777, 1220, -891, -1092, 1109, 627, -1360, -248, 1072, -253, -1093]
2978a093J919L3j780Q51J322j474j055K063J68j851M56J976j525j599K024O32
2994A067k129J01K237r34j847J637J112j773l77J788l52j421Q22J067j025p10
3010g37J564j36j328K18J352o71j314J196R62j812l53J655Qj849J026J705j832
3027c46p24J745J30j814N06J774j291r32J295L27j244J01J164n78j143Q91R15
3044G76j215m55J679J52k012M41K266j428j786K366R30k865n2K618j120k133K439
3061F01J188k829J38K369j272k008K163J106k475O9K268j085j782J627J454j897
3077c65p23K193l68k172P32K082j062j820K063R54k989K10K897j086k233K422
3093G35Q72k734p6K747j157j983K315J190k945k69K513p76k175J986J342k455
$$ y = [-1093, 826, 859, -921, -70, 1252, -222, -1277, 786, 954, -897, -441, 1535, 10, -1589, 435, 1067, -1062, -961, 1276, 342, -1505, 132, 1244, -529, -906, 882, 530, -891, -69, 998, -27, -737, 827, 691, -637, -419, 933, 262, -1052, 144, 1106, -706, -1059, 596, 604, -1245, -219, 1486, -346, -1070, 675, 805, -1009, -503, 1271, -20, -952, 343, 670, -574, -473, 691, 113, -1030, -139, 776, -439, -894, 785, 937, -1075, -634, 1632, 204, -1582, 784, 1714, -1151, -1203, 1415, 295, -1838, 601, 1789, -1040, -902, 1467, 195, -1813, 350, 1456, -1019, -950, 1318, 233, -1549, 78, 1532, -365, -1088, 1105, 737, -1435, -703, 1379, 317, -1503, 560, 1514, -1475, -1265, 1632, 546, -1687, 735, 1607, -1127, -1203, 1544, 387, -1596, 719, 1909, -1036, -1305, 1208, 432, -1743, 243, 1585, -870]
3109h70n67K250l17j834J265J482j480j090J755J01j639N39J900r98j588J498
3125D07L19k040O17K133j138j409J298O53j714k83K172m07j415Q90J014j437n40
3142h80J329K90j037M7J131q84r89Q90Q74q28m73J332k43j901R89J418j445n14
3160h94J725L8k136O24K038j445p67J436N18k082L78J172n29q58J082N27j440
3177f13k07J109Q8j132P66J054j037r44J250M63j742J22K123j086j647J565J091
3194A223k052L2K000p39j926J711R34k036p4K122p92j669J588R51j728m99K141
3211A187n53j784J071J625j970p73J812J64j891M61J678q73j440J520R70j786
3227e82k89J956l82j847J325J061j757l15J957o13j852J216J497j886o92K131
$$ y = [-870, -1437, 813, 496, -1338, -73, 1409, -71, -1161, 594, 695, -944, -405, 1495, 497, -1091, 407, 726, -1314, -697, 1436, 298, -1111, 187, 840, -874, -1157, 1015, 608, -807, 83, 1097, -340, -880, 449, 739, -298, -251, 880, -4, -993, -103, 771, -57, -530, 802, 559, -1342, -353, 1065, -380, -894, 831, 869, -1267, -643, 1395, -50, -817, 619, 1137, -945, -567, 605, 76, -782, 300, 827, -613, -820, 289, 377, -755, 11, 1065, 28, -916, 334, 797, -945, -823, 1300, 214, -1433, 132, 1223, -829, -797, 1203, 464, -1462, 249, 1183, -853, -927, 1195, 403, -1266, 322, 1273, -455, -954, 1187, 634, -1150, -79, 1546, -424, -1197, 615, 779, -1112, -651, 1027, 154, -1286, 234, 1204, -582, -871, 1085, 703, -1144, 181, 1242, -515, -830, 1127, 514, -1338, -122, 1375, -511, -1203, 928]
3243I28j30k135P71J670j393r15J835M18k027K05J951p61j644J677Q41k001k37
3260i47K094p67j646J220J047j590o45J948l70j488J333J150j652n86J511K62
3276H74j665M99J168n93j178J057O26j154k61J185j07j342O77J125j299p48J801
3293F65M7j909R32J693j568r67J940K05k046O60J600j528j120J907L83j759K68
3310e97J313q22p29Q60O88q73l59R96M3j269M16J119p28q87J137N45j544L4J645
3329I88p78j649J561J056j852m98K158k29k024J304J220j684o18J895q9j726R34
3346c1J313j436o98J460j09j537O38J283p98j073J148P04j555n3J627n04j448
3363a069P80J202j303o71J666J4j473O98J078r59r69J553J66j477J43J426o91
$$ y = [928, 798, -1337, -566, 1104, -289, -1204, 631, 1049, -978, -773, 1178, 417, -1227, 450, 1291, -710, -947, 1147, 380, -1266, -46, 1001, -589, -1234, 714, 344, -1144, 189, 1339, -313, -899, 612, 874, -791, -292, 876, 283, -895, 162, 788, -366, -627, 558, 451, -891, -214, 911, -388, -1136, 665, 712, -1197, -265, 1428, -140, -1107, 833, 1038, -1008, -348, 1252, -276, -1396, 511, 894, -865, -597, 716, -106, -835, 25, 713, -160, -519, 477, 520, -749, -333, 786, 58, -829, 308, 853, -691, -657, 988, 210, -1439, 122, 1178, -674, -1172, 986, 757, -1267, 37, 1257, -427, -1045, 850, 761, -965, -31, 1282, -154, -852, 608, 499, -1038, -400, 883, 85, -988, 160, 864, -691, -744, 883, 379, -1069, -289, 913, -390, -1061, 605, 619, -854, -156, 922, -37, -1006, 547, 713, -764, -621, 805, 114]
3380A14j329J657M52j630O0J720q80j210J254P85j379l40J708m89j671R42J160
3397I24j205o66J401J49j581O43J166j064n25J124M07j542N14J117q33r45J107
3414A91R10j487m51J561k08j550O30J318j172p21J608Qj162J43J324q29r79J345
3432D79M10j632K27J626j032j121J409O06j740j4J623m01j503J005J085j520n55
3449a048J801j73j459Q70Q48q24o22J404m5j481M04J280q88r72J196L72j195j69
3467g01J588o61j274J135R48j299m99J531p5j616P07J194j191n66J299O9j410
3484h21N72J127j071p30J314J14j231J79J220m59j035R70Q22j278k48J266j82
3501E29j262O34R32q78r00J387J94j365M02J021n61j030J330Q4j275J60J441p17
$$ y = [114, -1215, 442, 894, -736, -676, 1044, 164, -1046, 208, 993, -386, -726, 982, 493, -1178, -236, 924, -281, -947, 454, 603, -978, -335, 831, -233, -758, 366, 773, -769, -255, 862, 29, -916, 191, 1101, -386, -837, 724, 516, -1034, -404, 914, -258, -979, 629, 637, -525, -382, 942, 113, -866, 479, 889, -743, -516, 1110, 78, -1043, 366, 972, -768, -782, 841, 440, -1063, -58, 1027, -493, -1048, 753, 580, -879, -9, 839, 15, -607, 797, 752, -729, -325, 955, 67, -905, 291, 663, -532, -701, 887, 226, -1048, 87, 1035, -264, -763, 768, 693, -923, -216, 978, -213, -779, 520, 589, -821, -249, 878, -193, -923, 391, 505, -726, -547, 673, 214, -821, 149, 971, -307, -555, 711, 529, -733, -99, 833, -45, -945, 442, 636, -729, -327, 694, 133, -897, 433, 517, -758, -598, 843, 126]
3519A26q55J039O34j420j9J316k43j241N78R04j108o51J153L97j282P5J238p32
3537i1p22J285K83j344qJ383n32j164J113P53j477m9J435o52j237R03R74j301
3555d48k80J232k31r76N08J153j018n99R98M94j281J39R67n15r12Q42O82j135
3573c80k10J289k74j243P32P41j107n35J393k4j046M49J032r80o86J450J61j275
3591e13J84J126q14q56R07N32r15k79J162l69r16O65P26o48l80Q59kj279N07R03
3611F00o22o75J152K93j345M3J162p42o43J010O96j241l48J032l94r00P63Q21
3629F62o39n63R24Q7j267O57J201q23p07Q59L22j441K46J343o55j012J159L25
3647F78j514O8J568n42r31J030N87j336l40J287k27q06N67P81j152m37R51J57
$$ y = [126, -729, 310, 944, -476, -495, 821, 578, -663, -85, 819, -289, -940, 213, 610, -672, -597, 641, -91, -813, 472, 755, -589, -597, 786, 254, -910, 203, 956, -521, -570, 865, 213, -1024, -121, 853, -448, -728, 504, 273, -703, -195, 958, -60, -659, 339, 833, -448, -309, 658, 143, -769, 73, 755, -380, -590, 699, 425, -818, -86, 655, -452, -987, 406, 382, -664, -215, 817, -163, -849, 601, 762, -513, -329, 797, -17, -873, 34, 566, -349, -628, 534, 165, -751, -86, 640, -8, -388, 471, 469, -810, -303, 600, -22, -697, 455, 748, -597, -554, 608, -134, -777, 233, 929, -312, -660, 372, -22, -922, -159, 662, 23, -540, 384, 471, -796, -139, 1062, 239, -468, 391, 713, -728, -482, 861, 206, -806, 353, 678, -836, -768, 800, 258, -673, 357, 944, -392, -732, 555, 328, -478, 89, 870, -282, -719, 232, 389]
3665C89j050O28R79p98j114J114L94j094p7J620o37j073O57R58j389l16J674k61
3683F04j415P54P47j185m32J543N4j570Q68Q20j201n56J454J68j232L83J108r57
3701d5q25J107O01j132n1J089n82q66N65N61o84k38R19M8j187K21J185p66n67
3720f47J182L57j440J6J440q72q45R48P86j113l03J110l11j368J057O54q10l68
3738e27R87j25j170N96J065r47j67P43J68j187L01J066q34p31J054L70j117l2
3756d87J098n00p68N29O89q21m90J132m5q21M42O94n16p44Q04L57j241M19R89
3775G20o38q18J039M46j439K25J015p9j293Q58O63j091k43J165m3q51L63O89q75
3794a87l90Q30J15q00L18O67m38p00P11L02p71n6Q69q3j021L56J004o81p15R16
$$ y = [389, -661, -33, 946, 148, -966, 148, 542, -552, -629, 991, 354, -719, -62, 896, -493, -809, 865, 604, -811, -57, 690, -495, -927, 616, 670, -900, -32, 788, -413, -969, 485, 653, -579, -196, 912, -45, -870, 237, 838, -294, -345, 744, 162, -704, -139, 422, -262, -500, 419, 467, -720, -499, 686, -80, -647, 535, 892, -548, -532, 908, 36, -809, 139, 925, -188, -491, 619, 308, -1060, -3, 651, -159, -527, 460, 335, -835, -239, 826, -121, -288, 455, 623, -564, -263, 803, -31, -762, 292, 662, -455, -487, 611, 111, -657, -128, 561, -260, -750, 382, 337, -484, -42, 652, 136, -608, 196, 553, -688, -269, 720, 82, -736, 303, 749, -690, -465, 550, 471, -822, 36, 699, -392, -635, 530, 487, -364, -1, 688, -187, -577, 253, 368, -432, -114, 553, 115, -585, 126, 428, -343, -399, 470, 387, -634, -278, 726, 45, -670, 246]
3814B46K05r63J84J087o70p48J005L27j299L73R07o75q37J115L28j281M41J169
3832I14r41o20Q91M73j103j3R45k76p33M45O00o52m20P51K37q20J33Q05p09l57
3852d50P41K92p16k42J068l62r17N80P26r94m57J105m2j027N61J037j266k09R73
3871D01o9r89N99O65q19l73Q54L55j076K18P91n70n09P13K23o12k82Q94l36p25
3891f47M31O64n28n10R89Jq54K50P04o62m21Q68L18r98j00J197n61p29O10P41
3911G63j084j51Q79k84o55O35L54p22k60J106l65r96Q32O30q05l40R28L8j046
3930e43R6J096o46o76Q20L07q54P6P91l53m58N73L31q25j59Q89l1r38M40O19q12
3951b57l20R61P2j052P2J152o04p58Q92L16j023j30J199k68p93O51O53j050j04
$$ y = [246, 451, -512, -328, 759, 89, -659, 346, 673, -626, -253, 654, -21, -858, 257, 585, -696, -255, 914, -27, -647, 244, 717, -386, -399, 546, 270, -463, -18, 582, -70, -490, 261, 498, -322, -189, 616, -93, -450, 291, 583, -133, -375, 693, 331, -586, -6, 720, -274, -731, 374, 332, -695, -134, 903, -363, -572, 401, 332, -657, -58, 607, -212, -585, 269, 624, -452, -234, 557, -13, -522, 191, 414, -198, -480, 414, 78, -647, -216, 448, -80, -590, 399, 400, -454, -204, 500, -162, -583, 285, 603, -395, -495, 702, 141, -588, 22, 763, -321, -472, 407, 123, -532, 103, 457, -265, -525, 581, 216, -780, 52, 682, -123, -463, 465, 503, -543, -447, 649, 3, -673, 147, 454, -400, -324, 467, 114, -344, 229, 560, -265, -424, 465, 434, -504, -64, 555, -257, -577, 384, 456, -596, -524, 628, 24, -734, 158, 474, -549, -679, 520, 252, -541, 110, 763, -287, -391]
3970c91R63m69m92O59L21j013j74R43j12r09N55O93o25o17J007J31o84k47R07
3989D46j43o68L51M19o35j73O27M8p12J82O30o17l70J123k34r29M47P00o42n97
4009g47J127J7o65m9R74o14o28O17N76q06k51P55r4o36K52N39o61J5O49M5j046
4030f31M11O54o01l90Q07M96j301J08J052m23q40O66M39n71j67N00j54m83L62
4049f6K58k17j80M41k30m88M94M20m22k65P14O5r84K8P87q2q12N57O07r67l56
4070f98R21J55q42M07N08n45l88P49k3m16J85O22p60j95N70J3p26K13Q65m55q56
4091f96M59O43o68k31Q95J10q51K80N01n45n37P05K75m89P3N76p89j83P98op18
4112c98L08O23p08p31J057N15r94j49J095m67q07N26P19n18m60J012k06q08J95
$$ y = [-391, 572, 103, -389, 270, 591, -422, -596, 347, 235, -674, -119, 574, -51, -668, 339, 470, -214, -461, 446, 303, -365, -14, 405, -230, -403, 224, 272, -440, -258, 372, -245, -615, 508, 274, -655, -208, 492, -150, -747, 380, 397, -268, -317, 657, 43, -585, 32, 608, -198, -449, 306, 212, -424, -172, 367, -294, -279, 370, 415, -631, -220, 434, -167, -557, 250, 746, -555, -447, 605, 182, -658, 8, 447, -124, -291, 209, 55, -428, -66, 192, -25, -205, 236, 6, -482, 12, 432, 10, -255, 459, 524, -460, -432, 355, 273, -539, 18, 625, -342, -698, 223, 378, -464, -57, 451, -94, -482, 267, 244, -172, 13, 635, -125, -320, 250, 263, -463, -250, 615, 160, -696, -237, 406, -262, -493, 402, 512, -339, -59, 442, -103, -640, 65, 340, -149, -76, 500, -289, -472, 326, 320, -398, -90, 533, -175, -906, 151, 666, -328, -477, 618, 151, -656, -130, 589, 71, -389, 623, 417, -391, -196]
4131a96N99o57k91R66r4o89K67N35o27m36J005J51r52K45P80o48o25O72O30q07
4151a72k33P31k59n18M80J44k25k51P18j13p33J25Q12p08k49Q38N1q16J33Q04
4171E59l92p65R52L33q58j11N41j19o20N30J92m49J49L01p3n27L66L85l46j26
4191g8L09j18n32J82O51k8p22L73L86n48n93R24J92q90M99K98m42m88P88J09o75
4212d03M23M92n40m33Q32k0n62LQ00n02m10J96O41r52J81P36j01o16M6N15l96
4233g0k66N44K24o05j33Q49n31l87O08J84p89o3P52k20p04N78N81q34o2O99k99
4254E6q22P82M15l76k75O75j29q03L41O34m75m54O57l6p20K82P08l85n75O07L16
4275D23q34MP20k24l19L62L81o59j45N91p9m37J99K64k46k53M82Q5p36K35O17
$$ y = [-196, 403, -254, -545, 421, 327, -362, -95, 440, -187, -623, 382, 533, -419, -174, 606, -42, -667, 5, 635, -172, -405, 326, 67, -451, 29, 173, -52, -303, 415, 302, -431, -306, 506, -202, -451, 387, 438, -378, -245, 559, 167, -598, 354, 687, -171, -282, 259, 140, -480, 50, 242, -207, -58, 243, 170, -357, 9, 394, 48, -78, 231, 113, -419, -237, 414, 386, -336, 37, 423, -125, -718, 206, 398, -492, 7, 305, -137, -625, 163, 272, -403, 20, 512, -28, -461, 371, 351, -211, -208, 592, 90, -320, -124, 517, -435, -254, 482, 381, -235, -189, 326, -70, -336, 208, 432, -173, -306, 543, 12, -375, 233, 417, -372, -435, 317, 97, -607, -29, 552, -282, -344, 355, 56, -766, 16, 431, 55, -220, 455, 326, -477, -136, 498, 23, -431, 226, 190, -530, -248, 460, 75, -500, 107, 423, -411, -407, 313, 89, -230, 132, 513, -146, -291, 300, 221, -216, -17, 247, 1, -252, 230, 315, -421, -186, 431]
4296D31m58m56O25M25o88j02N82j16l96K82J29m97p2M95K0n41L06M20p02l4P76
4317D29k70n75O55J20n05k80N90jl52M1N24k96m22J54M24l49q9M14j1m45J85J24
4339F5l41J67M95j3p21J47O64k63n45M88M12q27Q2M52j23n46M52K46l90p4L95
4360B22k5l73J72L20m67j65O02j11m80L21N77n50j15L83n7l94k21O73k73l11L71
4381I9kk49k61O28L0n03P8M97k68m40Q64k24o42N55K56o11k82O72K89p83j78Q35
4403C60l35o65P13L74o47L3M77k14l42L88Ll20J43L79l99k97N84N1n11j36P12
4424C51o9p11J66N79j35o78N04M17m74l51O53j28n02M03L40l80l17P15k80m11
4444c08L72K19o01m3P92k96p31N05L44k26m70O90L48p25j46O45j99m92K92M19
$$ y = [431, -27, -483, 142, 567, -121, -223, 359, 243, -153, 129, 258, -239, -311, 184, 204, -337, -31, 389, -313, -347, 429, 159, -416, 239, 359, -146, -426, 164, 163, -189, -148, 376, 80, -342, -188, 236, -113, -202, 212, 201, -244, -59, 65, -276, -109, 386, 373, -348, -201, 463, 200, -345, 143, 555, -272, -190, 262, 139, -407, 45, 291, -99, -173, 222, 197, -176, -4, 316, -151, -316, 286, 175, -305, 16, 593, 43, -72, 311, 254, -140, -361, 312, 39, -272, 99, 97, -152, -413, 215, 245, -258, -180, 317, 49, -391, 473, 249, -393, 162, 418, -193, -475, 197, 486, -297, -475, 360, 25, -640, 73, 447, -200, -167, 310, 96, -246, 142, 145, -175, -32, 347, -52, -349, 235, 286, -225, -361, 351, 282, -429, -263, 316, 181, -497, 7, 424, -50, -401, 252, 124, -378, 25, 365, -15, -332, 383, 103, -308, 64, 283, -318, -361, 431, 135, -596, -91, 253, 27, -443, 247, 595, -130, -276, 369, 170, -322, -30, 389]
4464C89k71j95K15j11l37L51J55n56J33N76k59m84K67P19n75m64N84L41o73k0
4484b15N92j03o81L19L24j36l39L40Q8m93K91K07k69j88N30j87l33J26N43m95
4504g9k06O21om81k4N10j47m72J80M87m32j93L57p1q5RJ57k81j38M56j6l72M22
4527A96K02l82m66O38K96p75K35M83j84p57N25L69m80k88P63j37l61J88j3k67
4547b15J40L23j8m12L38R1m17k3L73k0k48J49M48o02n01O12M42m21k79M22mm63
$$ y = [389, 118, -77, 138, 27, -310, 41, 196, -360, -227, 349, 90, -394, -127, 592, 17, -447, 137, 478, -195, -215, 377, 274, -407, -88, 236, 100, -239, 101, 189, -304, -13, 194, -75, -263, 267, 80, -253, -127, 416, -79, -285, 336, 330, -151, -175, 335, 188, -284, -104, 383, -49, -242, 115, 44, -41, -32, 125, -156, -294, 162, 146, -226, 196, 398, 16, -450, 188, 484, -291, -56, 427, 243, -514, 11, 380, -100, -388, 375, 238, -123, 65, 52, -215, -75, 248, 230, -182, 156, 247, -170, -193, 180, 160, -88, 61, 509, -93, -594, 18, 460, 39, -240, 182, 178, -285]
$$ [...]
8191b2
##END NTUPLES=NMR FID
##END=
