##TITLE=1H_2MBDE-2.1
 CDCl3
 8 sc, 
 21.11.2023
##JCAMPDX= 6.0         $$ Bruker NMR JCAMP-DX V2.0
##DATA TYPE= NMR FID
##DATA CLASS= NTUPLES
##ORIGIN= UXNMR, Bruker Analytische Messtechnik GmbH
##OWNER= root
$$ XWIN-NMR		Version 3.5
$$ Tue Nov 21 15:44:58 2023 Russian Standard Time (UT+4h)  she@DPX200
##.OBSERVE FREQUENCY= 200.1313
##.OBSERVE NUCLEUS= ^1H
##.DELAY= (6, 6)
##.ACQUISITION MODE= SIMULTANEOUS
##.ACQUISITION SCHEME= undefined
##.AVERAGES= 8
##.DIGITISER RES= 18
##SPECTROMETER/DATA SYSTEM= spect
##.PULSE SEQUENCE= zg30
##.SOLVENT NAME= CDCl3
##.SHIFT REFERENCE= (INTERNAL, CDCl3, 0, 15.7039)
##AUDIT TRAIL= $$ (NUMBER, WHEN, WHO, WHERE, WHAT)
$$ ##TITLE= Audit trail, XWIN-NMR		Version 3.5
$$ ##JCAMPDX= 5.01
$$ ##ORIGIN= Bruker BioSpin GmbH
$$ ##OWNER= she
$$ F:/spectra/data/she/nmr/H-F/1/audita.txt
$$ ##AUDIT TRAIL=  $$ (NUMBER, WHEN, WHO, WHERE, WHAT)
(   1,<2023-11-21 15:43:47.68 +0400>,<she>,<DPX200>,
      <created by zg, POWCHK disabled, PULCHK disabled
       configuration hash MD5:
       00 E9 B6 7A A2 85 ED C7 34 08 36 98 17 FE 4E 26
       data hash MD5: 16K
       34 DA 7E B9 7C 30 80 81 EB 55 A8 0E 60 3F 3E A0>)
$$ ##END=
$$ 
$$ hash MD5
$$ 64 90 BC 08 4D 36 55 74 86 BE 35 87 61 DF 3B 7D
##$RELAX= 
##$RELAX= 
##$RELAX= 
##$RELAX= 
##$RELAX= 
##$RELAX= 
$$ Bruker specific parameters
$$ --------------------------
##$DU= <F:/spectra>
##$EXPNO= 1
##$NAME= <H-F>
##$PROCNO= 1
##$TYPE= <nmr>
##$USER= <she>
##$AMP= (0..31)
100 100 100 100 100 100 100 100 100 100 100 100 100 100 100 100 100 100 
100 100 100 100 100 100 100 100 100 100 100 100 100 100 
##$AQSEQ= 0
##$AQ_mod= 1
##$AUNM= <au_zg>
##$AUTOPOS= <>
##$BF1= 200.13
##$BF2= 200.13
##$BF3= 200.13
##$BF4= 200.13
##$BF5= 200.13
##$BF6= 200.13
##$BF7= 200.13
##$BF8= 200.13
##$BYTORDA= 1
##$CFDGTYP= 0
##$CFRGTYP= 5
##$CHEMSTR= <none>
##$CNST= (0..31)
1 1 145 1 1 1 1 1 1 1 1 1 1 1 1 1 1 1 1 1 1 1 1 1 1 1 1 1 1 1 1 1 
##$CPDPRG= <>
##$CPDPRG1= <>
##$CPDPRG2= <>
##$CPDPRG3= <>
##$CPDPRG4= <mlev>
##$CPDPRG5= <mlev>
##$CPDPRG6= <mlev>
##$CPDPRG7= <mlev>
##$CPDPRG8= <mlev>
##$CPDPRGB= <>
##$CPDPRGT= <>
##$D= (0..31)
0 1.2 0 0 0 0 0 0 0 0.06 0 0.03 0 0 0 0 0.0002 0 0 0 0 0 0 0 0 0 0 0 0 
0 0 0 
##$DATE= 1700567027
##$DBL= (0..7)
120 120 120 120 120 120 120 120 
##$DBP= (0..7)
150 150 150 150 150 150 150 150 
##$DBP07= 0
##$DBPNAM0= <>
##$DBPNAM1= <>
##$DBPNAM2= <>
##$DBPNAM3= <>
##$DBPNAM4= <>
##$DBPNAM5= <>
##$DBPNAM6= <>
##$DBPNAM7= <>
##$DBPOAL= (0..7)
0.5 0.5 0.5 0.5 0.5 0.5 0.5 0.5 
##$DBPOFFS= (0..7)
0 0 0 0 0 0 0 0 
##$DE= 6
##$DECBNUC= <off>
##$DECIM= 32
##$DECNUC= <off>
##$DECSTAT= 4
##$DIGMOD= 1
##$DIGTYP= 9
##$DL= (0..7)
0 120 120 120 120 120 120 120 
##$DP= (0..7)
150 150 150 150 150 150 150 150 
##$DP07= 0
##$DPNAME0= <>
##$DPNAME1= <>
##$DPNAME2= <>
##$DPNAME3= <>
##$DPNAME4= <>
##$DPNAME5= <>
##$DPNAME6= <>
##$DPNAME7= <>
##$DPOAL= (0..7)
0.5 0.5 0.5 0.5 0.5 0.5 0.5 0.5 
##$DPOFFS= (0..7)
0 0 0 0 0 0 0 0 
##$DQDMODE= 0
##$DR= 18
##$DS= 0
##$DSLIST= <SSSSSSSSSSSSSSS>
$$ [...]
##$SUBNAM2= <"">
##$SUBNAM3= <"">
##$SUBNAM4= <"">
##$SUBNAM5= <"">
##$SUBNAM6= <"">
##$SUBNAM7= <"">
##$SUBNAM8= <"">
##$SUBNAM9= <"">
##$SW= 18.0517328524113
##$SWIBOX= (0..15)
0 0 2 0 0 0 0 0 0 0 0 0 0 0 0 0 
##$SW_h= 3612.71676300578
##$TD= 16384
##$TD0= 1
##$TE= 0
##$TE2= 300
##$TE3= 300
##$TEG= 300
##$TL= (0..7)
0 120 120 120 120 120 120 120 
##$TP= (0..7)
150 150 150 150 150 150 150 150 
##$TP07= 0
##$TPNAME0= <>
##$TPNAME1= <>
##$TPNAME2= <>
##$TPNAME3= <>
##$TPNAME4= <>
##$TPNAME5= <>
##$TPNAME6= <>
##$TPNAME7= <>
##$TPOAL= (0..7)
0.5 0.5 0.5 0.5 0.5 0.5 0.5 0.5 
##$TPOFFS= (0..7)
0 0 0 0 0 0 0 0 
##$TUNHIN= 0
##$TUNHOUT= 0
##$TUNXOUT= 0
##$USERA1= <user>
##$USERA2= <user>
##$USERA3= <user>
##$USERA4= <user>
##$USERA5= <user>
##$V9= 5
##$VALIST= <valist>
##$VCLIST= <CCCCCCCCCCCCCCC>
##$VD= 0
##$VDLIST= <DDDDDDDDDDDDDDD>
##$VPLIST= <PPPPPPPPPPPPPPP>
##$VTLIST= <TTTTTTTTTTTTTTT>
##$WBST= 1024
##$WBSW= 4
##$XGAIN= (0..3)
0 0 0 0 
##$XL= 0
##$YL= 0
##$YMAX_a= 315730
##$YMIN_a= -393426
##$ZGOPTNS= <>
##$ZL1= 120
##$ZL2= 120
##$ZL3= 120
##$ZL4= 120
##$ABSF1= 10
##$ABSF2= 0
##$ABSG= 5
##$ABSL= 3
##$ALPHA= 0
##$AQORDER= 0
##$ASSFAC= 0
##$ASSFACI= 0
##$ASSFACX= 0
##$ASSWID= 0
##$AUNMP= <proc_1d>
##$AZFE= 0.1
##$AZFW= 0.1
##$BCFW= 1
##$BC_mod= 2
##$BYTORDP= 1
##$COROFFS= 0
##$CY= 11.3945322036743
##$DATMOD= 1
##$DC= 2
##$DFILT= <>
##$DTYPP= 0
##$F1P= 15.7292609196834
##$F2P= 12.9074282941183
##$FCOR= 0.5
##$FTSIZE= 0
##$FT_mod= 4
##$GAMMA= 1
##$GB= 0.15
##$INTBC= 1
##$INTSCL= 1
##$ISEN= 128
##$LB= 0.24
##$LEV0= 0
##$LPBIN= 0
##$MAXI= 10000
##$MC2= 0
##$MEAN= 0
##$ME_mod= 0
##$MI= 1.114404
##$NCOEF= 0
##$NC_proc= 0
##$NLEV= 6
##$NOISF1= 3.799351
##$NOISF2= 2.8
##$NSP= 1
##$NTH_PI= 0
##$NZP= 0
##$OFFSET= 15.70392
##$PC= 1
##$PHC0= -23865.31
##$PHC1= 6.65269
##$PH_mod= 1
##$PKNL= yes
##$PPARMOD= 0
##$PSCAL= 0
##$PSIGN= 0
##$REVERSE= no
##$SF= 200.130013532006
##$SI= 16384
##$SIGF1= 3
##$SIGF2= 2
##$SINO= 400
##$SIOLD= 16384
##$SREGLST= <1H.CDCl3>
##$SSB= 0
##$STSI= 0
##$STSR= 0
##$SW_p= 3612.71676300578
##$SYMM= 0
##$S_DEV= 0
##$TDeff= 0
##$TDoff= 0
##$TI= <>
##$TILT= no
##$TM1= 0
##$TM2= 0
##$TOPLEV= 0
##$USERP1= <user>
##$USERP2= <user>
##$USERP3= <user>
##$USERP4= <user>
##$USERP5= <user>
##$WDW= 1
##$XDIM= 8192
##$YMAX_p= 0
##$YMIN_p= 0
$$ End of Bruker specific parameters
$$ ---------------------------------
##NTUPLES= NMR FID
##VAR_NAME=  TIME,          FID/REAL,        FID/IMAG
##SYMBOL=    X,             R,               I
##VAR_TYPE=  INDEPENDENT,   DEPENDENT,       DEPENDENT
##VAR_FORM=  AFFN,          ASDF,            ASDF
##VAR_DIM=   8192,          8192,            8192
##UNITS=     SECONDS,       ARBITRARY UNITS, ARBITRARY UNITS
##FACTOR=    0.0002768,     1,               1
##FIRST=     0,             0,               0
##LAST=      2.2672688,     0,               0
##MIN=       0,             -393426,         0
##MAX=       2.2672688,     315730,          0
$$ Real data points
##PAGE= N=1
##DATA TABLE= (X++(R..R)), XYDATA
0@%%%%%%%%%%%%%%%qJ6j6J6j6J9k7L2l2L9m7N2o0O9p9R0j01J14j29J44j61J80
37I5k01K25k49K75l05L38l75M14m55N01n53O07o66P33q08Q93r87J094j218J358
57G16j523J719j954K245k612L094l752M694o146Q621j3559K6726j19803k91892
71c93426M40373J16055l40765K06789K79273l61805j70992L01198l8246k02666
81a64212K11583J28011k09846j5202J19676j23536p5121J54846N7627p4927O427
92A5326K4560n3988n5517J8565P8494K6497n2640K5946N0062j22736q0816J51167
104B4920M1504j25908Q8306J16619j91003r1847J87768k1916j46936J68898J25106
115A75511k17604o3536J64056o6855j05244J72779P1506j68154m831J02559q7865
$$ y = [0, 0, 0, 0, 0, 0, 0, 0, 0, 0, 0, 0, 0, 0, 0, 0, -8, 8, -8, 8, -8, 11, -16, 16, -16, 23, -24, 28, -32, 37, -42, 48, -53, 61, -68, 76, -85, 95, -106, 119, -130, 145, -160, 178, -197, 217, -238, 263, -290, 317, -349, 384, -424, 469, -518, 576, -642, 716, -807, 912, -1042, 1203, -1409, 1685, -2067, 2627, -3519, 5102, -8457, 18269, -101534, -393426, 46947, 163002, -177763, 29026, 308299, -53506, -224498, 76700, 38454, -164212, 47371, 175382, -34464, -49666, 70010, -53526, -128647, 26199, 83826, 8899, 15326, 39886, -14102, -69619, -51054, 27440, 53937, 1297, 27243, 77305, -45431, -126247, 24920, 66424, -59484, 28822, 145441, -45562, -137409, 50359, 28443, -118493, 50405, 175511, -42093, -105629, 58427, -8428, -113672, 59107, 130613, -37541, -42372, 60187, -27678]
126b7678o0467J20092K2243q3141M8303N2562j06400n4325R5486K8985n8329L8951
138A6282O3508q0543q2031P1586N2366o6032R825R1335m1495r6230M1694M3577
150B3842n8212J7203Q2182m1675o7255M4982J3537n5600K9135N7403l8024k7295
162a9777M0837p334m4979J4240L3129o635r860Q798L380j4218j8179R247J9915
175H564j2240l085L4327j2670m8875K2546K9326m1182J2217O5973m2273o1902
187d9274N8743K0141p3302K9298P3291n8054m1815O6967j1646o4803N0216M2362
199D2124o0817N09N2892m1319l3099N9659L661n2738K6614L5589l9641j3476L3329
212A3287r141j9262J8974P061j1880J803m195p069J1818R06r061J2972L065k0245
$$ y = [-27678, -88145, 31947, 54190, -28951, 19352, 71914, -34486, -88811, 6675, 35660, -22669, 16282, 79790, -753, -82784, -11198, 41168, -24864, -15039, 76296, 34801, -61429, -19735, 23842, -34370, -17167, 65015, 23340, -43915, 1067, 14604, -40996, -11861, 45542, 7518, -19777, 21060, 13726, -31253, -17013, 16116, 9481, -379, 8419, 11799, -2419, -20598, -11351, 8564, -3676, -6761, 27566, 14896, -33979, -11433, 17893, -23289, -11072, 54901, 12628, -49274, 9469, 29610, -43692, -14394, 58897, 843, -40972, 25995, 14349, -50454, -238, 42124, -18693, -18184, 34708, -6611, -39710, 19949, 23610, -29128, -2514, 33075, -6566, -20042, 13287, 4146, -15116, 3858, 10919, -961, 842, -3353, -10422, 1396, 2302, -6759, 6213, 9278, -10967]
226a0967O526J3180j7762L979K5844j9442j9991L1104P21l6776K0180L1832l5404
239f976j6136M0184n390l6338K2108K2120k9674k412K8943j3979j9195K3696M471
252A1422k5171J0742K2120j9396j3610K1253J548k0618O677J7571r553j2102P449
265a668M451o581j1O101Q40k916j739l47J561J842O21k76j270k14J477j682l199
282c010L219M364o276m213Q845K075j1569L47J1777l276r580P422P067q725l520
297e053Q088K20m474L124R40m793J181K505l755O9N917k464p229K547N377j852
313C48l108K320L179j795l960J355N250k97n737J378N577k983n550M198L943n859
329a741k408M827M31k880J906j77l441K288L847l588j006O359j368p828K603Q140
$$ y = [-10967, -4441, 8739, -9023, -5044, 20800, 1358, -18633, 12471, 13192, -23584, -3404, 28428, -6976, -23112, 17072, 11682, -24656, -2548, 19572, -10102, -12514, 16429, 2450, -16745, 6951, 11422, -13749, -3007, 19113, -283, -13893, 7360, 8908, -11710, -5033, 12538, 2985, -9117, -1668, 2783, -3798, -3809, 2292, 3132, 216, -1523, -1870, -309, 1533, 2154, 1878, 608, 394, 1871, 189, -3010, 209, 4573, -1703, -5916, 2929, 5004, -6565, -6218, 5559, 2283, -7297, 125, 7192, -1533, -5053, 3035, 3255, -1219, 1905, 2845, -1948, -767, 1738, -2017, -1948, 3969, 1505, -5724, -3177, 2200, 348, -2760, -440, 2739, 944, -3016, -1661, 3589, 3292, -2445, -1067, 4510, 1527, -4023, 175, 4118, -1741, -4149, 678, 1109, -1771, 135, -42, -3483, -1195, 2652, -936, -1942, 4417, 3049, -4779, -2176, 5964]
345E964l605o605N224M271p298l876O862K738n892r01M781j550m032K994L116
360B191l152j85L921k376k734N366L64p287K300P830n441o706P535L373r387r52
376e340Q416j370n337K525K920k180j055O85J173J538j692q99K958r03l043L862
392B258l01o798M812O240j0325j457J3824p612j4739J6291R878k0592J395K1189
406A4063j3012j5984K0200N082j9602R371J4446j9893n491K0207p543j3698J8571
419F717M729k1805L045J5234j0543n838J3490L43p658K895j93l025L173j592K87
434g41R185m415j0609Q345J340j4185R393J3631j5899j104J9518j7350k0114K7075
448D070R551k6078J3487K3475l0948j5701L1642k773k3150K4367J4712l0715k090
$$ y = [5964, 2359, -4246, 978, 5249, -2049, -5925, 937, 3675, -2217, -3118, 1663, 113, -3919, -925, 2191, -961, -1146, 2775, 399, -2335, 3031, 3395, -3892, -1592, 6238, 797, -5909, 1626, 4999, -4388, -5340, 3076, 1706, -3631, -1106, 1814, -366, -1421, -736, 437, 1975, 283, -616, 2342, 1439, -1604, 2258, 1957, -4841, -29, 6211, -4114, -5571, 8253, 641, -14098, 2193, 12071, -8521, -7126, 14063, 1051, -14933, 5267, 10349, -9253, 118, 14564, -5329, -10820, 9387, 1844, -11854, 6717, 11446, -10359, -7314, 7920, -2623, -8461, 5029, 5372, -2286, 609, 416, -2609, 564, -1028, -741, 8444, 4029, -6580, 1765, 3105, -11080, -1687, 11944, -3955, -5059, 14459, -2891, -23005, 4070, 13621, -12457, 1030, 24505, -6443, -22144, 9498, 6725, -16425, 7942, 22654, -8061, -10151]
461a0151J9890j8082r924L0166M216k3655O134R264j8830m836K0383N747r358
474I64Q01N484o390j3403J667J6874K773p976P533P92k4294j210K3358o549r443
489i019K5568J47l4504O552K1208k3631k641M2440l893l7491J1510J3576k8488
502a8666K073L6230n089k0413J2434Q27k5824k63K2447L859m814P347J322k1067
516i597j4364J8480J8325j3273p23K6556j4549m0203J8593K6130l0550L804N1840
529D0469k2243n2613L0660J8780m7586J8148O0009l6162l8715M8000l338o1826
541d6417L0594N6097l6490j9102M5298j7331n4083K4875L8305k1099o327K8368
553B2688q486l3066j44J7806n58l729J8640J4641k7929k6907K1370J1854k4464
$$ y = [-10151, 9739, -8343, -18267, 11899, 16115, -7540, -1406, 7858, -10972, -15808, 4575, 10322, 964, 1765, 7249, 859, -12544, -10877, 5997, 8770, 794, 8327, 9119, -15175, -16385, 6973, 424, -9019, 16549, 16696, -17808, -11256, 9952, -13679, -16320, 26120, 22227, -15264, -3754, 9822, -18666, -16593, 19637, 14548, -5865, 6569, 7396, -18428, -18691, 3756, 7615, 2801, 10148, 11470, -9597, -23961, -5481, 12844, -429, -1152, 25404, 10855, -29348, -10755, 15375, -15175, -11371, 40469, 18226, -34387, -3727, 15053, -32533, -14385, 45624, 9462, -29253, 18747, 15409, -46417, -15823, 40274, 3784, -15318, 29980, 12649, -41434, -16559, 21746, 647, -5680, 22688, 14202, -18864, -19008, -1202, -1760, -5489, 13151, 27792, -137, -27044, -5674, 6180, -18284]
566a8284J9322M1178l4923l8575L9919L815n3737K9884O0317m2261l3155M9259
578B2759j4552o0785M3514N1773m8355j1080N3204k8454n4070M1428L0429m2402
590a6591R052M8724k8845m6072K5664J8790k7138Q221L8162j2435l5626R383J6023
603G312k2633n288L9677P962l5161K345K0754l0519j7120M9287J4387m3645Q826
616c816L1845m0086k7127N0109J1067m0797K1018L2941m4806k5946M2798M230
628A1430l0829K5346K6862l7396j8569L1021k349k7123K0890K8986k2254k1389
640a5374J8993J884k7189R657L5321j0775k7501J7557J0770l2747N48L8451r418
653A0177k5540K7259Q886m2867L100L8913j7110k0832L5737K936m3074R403L0911
$$ y = [-18284, 1038, 42216, 7293, -31282, 8637, 12452, -41285, -11401, 48916, 6655, -26500, 22759, 8207, -52578, -9064, 42709, -5646, -16726, 36478, 8024, -46046, -4618, 25811, -16591, -7539, 41185, 12340, -33732, -8068, 10722, -16416, -8195, 29967, 17532, -18094, -8711, 7312, -15321, -20609, 19068, 27030, -8131, -5786, 14968, -15551, -32671, 16616, 31003, -12642, -3816, 28029, -12057, -39184, 10925, 21992, -18805, 2213, 35154, -9652, -35598, 7200, 11430, -19399, 5947, 32809, -4587, -23156, 7865, 5516, -21607, -717, 28269, 6015, -15374, 3619, 5503, -21686, -12029, 23292, 12517, -14984, 2573, 13343, -19404, -18856, 19595, 10177, -15363, 11896, 20782, -22085, -18985, 19928, 2818, -18014, 17723, 20659, -22415, -13012, 17899]
666A7899k4800j2675L6814p3l2060J0483J5784k2695k431K7928k654j8762Q615
679A373O475j6031k257J7053J311j1337K733Q205r148j1479J0868J1914j0976
692a296n091J5065l452j8620R902J5453j5554n177K1594m987k0981J3201J1207
705A1264k0963J078K4489j0825j9705J7071P614k2348L605K2049j0017j4013J4773
718D072L460j6953L856J5290p294q002R792N40j1449L203J0059n903o073P769
732B367K472r735j30R464k995p861O551O607q785l424R532l67q693M431P060o623
748a29l668O940j100p029M213N333n918k573O521j069o387L276N794m337l160
763c293N082R76n423O00N536j104m266K268K372l929j324M277p04l625K867J540
$$ y = [17899, -6901, -19576, 17238, 17165, -14895, -4412, 11372, -11323, -13754, 14174, 11520, -7242, 1373, 7848, -8183, -10440, 6613, 7924, -3413, -680, 7525, -1623, -13102, -2234, 9680, -1296, -6387, 8678, 5226, -13394, -3492, 11961, -3593, -8770, 12824, 7837, -13144, 57, 11264, -9699, -8621, 15868, 5043, -14662, 2409, 10023, -12325, -8720, 13329, 3312, -10701, 4072, 7532, -9421, -5565, 9725, 2431, -5571, 4221, 4761, -6688, -3485, 6574, 671, -5402, 2367, 4839, -4896, -5026, 4438, 1443, -6418, 133, 6740, -2045, -5469, 4063, 3696, -4997, -566, 6494, -129, -3797, 3143, 2043, -4986, -773, 4560, -1358, -3931, 2590, 1521, -4866, -1590, 4204, -133, -3293, 1789, 2765, -2658, -2058, 3478, 2374, -1892, 376, 2748, -1181, -2505, 1772, 1068, -2557, 310, 1850]
779A850m270m29M741j265l469M018K091n142q40N013p20l280K516J955k956j018
795a205J414k84m49O23p6j83j15r79m29J896K05o83O89M07j099O82M46j928J071
814CK546j860k131K026Q36l606M38L304j340k008J842P33k340m6J922m8j64J029
832A136l38j080Q5N96k92K31L97M45j012j408Q08M52j336q6K463k06k511L99K029
851G72n78j434J706J103j076n58O42k7n63j95O70N65r64p97O00j16j120J121J136
870H87k194O43K423k235k140L957J131m580J822M302m037l020N088L06m855K003
886d99L096l802p38L782k106k648L398J187l306Q03K638j482j649J422J179p07
902E68j194Q44K367k006l270K610K464m200m73N236k284m626M247J635n439K333
$$ y = [1850, -2420, -2849, 1892, 627, -2842, 1176, 3267, -1875, -2715, 2298, 1578, -1702, 814, 2769, -187, -1205, 209, -75, -524, 99, 23, -160, -275, -1254, -1683, 213, 418, -265, 424, 831, -268, 414, 860, -1068, 3, 2549, 689, -1442, 584, 1420, -2186, -1748, 1556, 216, -1792, 50, 783, -1557, -1603, 319, 271, 107, 1136, 798, -282, -197, 399, 107, 338, 735, 1180, 168, -1240, -432, 20, -1316, -1402, 1061, 855, -1656, -1257, 772, 194, -1240, 466, 1569, 493, -65, 577, 550, -13, -208, 462, 1027, 63, -734, -134, -250, -1370, -249, 887, -1307, -664, 1759, -476, -2616, 1341, 2472, -2108, -286, 4016, -21, -3041, 2047, 2353, -2502, -499, 2597, -1205, -1943, 1839, -267, -2915, 483, 1670, -1636, -833, 1805, 323, -1326, 96, 1275, 568, -626, 218, 2585, 579, -2691, -81, 2383, -1817, -2290, 2946, 662, -3964, 283, 1918, -3521, -1188]
918a188N737n138k547O971k176p223N782N893p720j308Q121l855p550N595M234
933C628o021J89O341l076n283L044K255l014J244N102k066n202J872L314l903
948a576j892P372J255p664Q90N092o445l540R215K167p654K838M029q600j805
963f318R670j283n343P748K178j1396q6P704l945k655R339J378r539j580L581
978e47j739j052M530L563j863m613o89J191k745P74R336Q19q855J676L654j0568
994g128p10J6094k241j2038J0606M524k0559J47J9420o827r116J8214O23k3242
1008a2233M396J5340j2332k531K1087m099j8526Q232N966j5737K474J8975l515
1021G497j0842N333l23j1273J820J1215J909l337J20O26m765o545L321J0588l77
$$ y = [-1188, 4549, -589, -3136, 3835, 1659, -5564, 218, 6111, -1609, -2917, 5204, 1349, -6201, -606, 3628, -2393, -2204, 4137, 1061, -4222, -1178, 1077, -1937, -693, 4409, 2343, -2859, -987, 2327, -1576, -3468, 3904, 5159, -2505, -1615, 3477, -2968, -6508, 2707, 4874, -2780, 58, 4087, -4513, -6318, 3352, 2069, -3274, 4474, 6652, -4744, -4830, 2874, -1071, -3726, 5613, 6991, -2548, -4128, -547, -2286, -3338, 1192, 4755, 2892, -1721, -2410, -1219, -3964, -3190, 6146, 6965, -1890, -214, 3440, -7128, -7838, 8256, 6015, -6023, 4583, 9107, -11452, -11305, 8115, 1288, -7828, 10386, 11009, -12233, -7837, 7503, -4829, -7360, 13727, 9628, -8898, -666, 5300, -10437, -7963, 11012, 7497, -3345, 1988, 1665, -9608, -7788, 3427, 5336, 1999, 2119, 2745, -2020, -8565, -5244, 5344, 4967]
1036D967m423O960k415j7274K957J6602p058o027J8030j763k4457N703J6209j4816
1050f805l956K6178j858k4447P202J1048j8395K1K5689l537j8647R957N716k0253
1064a2087o27K1103j734j1639J0814M171k0226l820J7737Q39r310J0088P476j6971
1078d186p566J3715O1j0198J1649J2506j5287j0925J1481n20j2567J1198J5971
1091A5332j2303j1470J1070M5j5097N795J7843n281j0110Q374J147j5897M71J7439
1105G358p61j0426Q086M907j7166m007J7394k314j2021J4463R542k2327o174K0700
1119G254n573j5146J9377J1998k4508l620K0827j0662j5759K1168R480k1090K043
1132d211J5386j5429j1236K0281M450j5818O607J0300j4389o675J3685Q10q224
$$ y = [4967, 544, 7504, 5089, -12185, -9228, 7374, 316, -5711, 12319, 10556, -13901, -8198, 8011, -6805, -10761, 15417, 13559, -10888, -3686, 7362, -11033, -11012, 14677, 11140, -7507, 2450, 8166, -12087, -12714, 8389, 6655, -4984, 5830, 10001, -10225, -14045, 3692, 4531, -4779, 5309, 12785, -4186, -11752, 1963, 2024, -8174, 3475, 15981, 694, -10231, 1250, 730, -11837, -639, 15332, 3029, -8441, 2629, 2674, -12423, -6628, 11215, 5934, -4176, 4198, 5345, -10552, -10081, 7358, 6597, -3829, 4257, 9164, -8002, -12009, 5385, 3071, -8950, 5513, 15055, -7272, -13446, 7254, 1681, -13465, 5912, 17910, -6598, -10218, 10609, -53, -15812, 5356, 14836, -6254, -4211, 11175, -4254, -15490, 4791, 9241, -6577, 30, 10330, -4059, -10734, 2951, 3761, -4463]
1145d463O639O046q074n497L860J693j681J847M360j183o852o42M989k339l761
1160e058Q317M115j0997n50R979p807q132J5382M855j6377L079J3607j2661r380
1174a1628J7374J900j6446Q204J1713j5590n768J6675l105j2996J2521P490j6562
1187f218p22J4982o814j0158J2871M623j3279J113R741o719o069R257K337p924
1201b979J170N117m739k451N103R40l892R59L018j728l106J874L566k320k652
1216b120L524J905n449j250O666j054o763M215N114p004k513Q048j378p146O001
1231G96M655q646r30R473l930p158Q188L487j0018P12R377n619o787Q621K742
1246D963r606K104P126n579l827P755n50o619M167M173n781r31N876j964m127
$$ y = [-4463, 2176, 8222, 148, -5349, -1489, 204, -1477, 370, 4730, 3547, -3305, -3947, 1042, -1297, -5058, 3259, 7374, -3623, -4173, 5806, -2001, -10133, 5249, 10104, -6273, -3194, 10413, -2248, -11628, 5746, 7646, -8800, -596, 11117, -4473, -10241, 6434, 3329, -9667, 2854, 10344, -6218, -6940, 8042, 1228, -8930, 3941, 8564, -4715, -3602, 6139, -580, -6649, 2608, 4945, -2979, -1809, 3308, -1431, -3882, 1221, 2161, -1731, -772, 2246, 518, -2588, -714, 2852, 532, -2120, 1404, 3309, -2140, -3390, 3276, 2222, -4541, -326, 4788, -2216, -4729, 3319, 1941, -5205, 796, 5451, -3195, -4125, 5348, 1418, -5740, 2448, 5935, -4083, -3371, 6006, 387, -6400, 2221, 4963, -4643, -2539, 4587, -992, -4819, 2936, 2386, -4233, -66, 4107, -1674, -2605, 3271, 1307, -2820]
1261b820L823J742l964m82K732q94j130R54R1o6q2j263O91J842j293q06K415l79
1279A111k869J954J970l146O46K862k914j976M153l90m666K882L653m834j298
1294b862M961j285m183L740K178l930L02L336k349j363L182r28k553K805J070
1309B121l877M81K978k335j298K796m36j882J624K77j918J589J102k245R24K609
1325B510k629j824L388K2l012J680J841k722m73J943j172q93J835j85j496J326
1341A39N57j933O33K134j177j363J702M19j043k13L08k02M88q5r57O79M43j566
1359a037j80J803k46j263P40P10q90oN06N5L87J92p47l88R12j55o44J80O67k37
1379C59j208J40J147l39j405P00J688r65j176J177N69j252K28J170q20j45J288
$$ y = [-2820, 1003, 2745, -1219, -1701, 1031, 137, -993, -39, 52, -14, -96, -1359, -668, 1174, -119, -925, 1490, 1111, -1758, 196, 2166, -980, -334, 2528, -386, -2362, 1791, 1401, -3265, -383, 3270, -1564, -2862, 2099, 814, -3369, 371, 2549, -1381, -1079, 2257, -92, -1455, 1727, 799, -1754, 1051, 2121, -1756, -1275, 1703, -632, -1930, 866, 430, -1452, 172, 449, -1469, 120, 1222, -1023, -99, 2510, -119, -1943, 1445, 1467, -1545, 135, 1976, -746, -1219, 724, -448, -1341, 494, 309, -1187, 139, 696, -1237, -604, 1530, 353, -1010, 692, 1111, 68, -145, 163, -39, 449, 364, -593, 86, 529, -1037, -1217, 586, 340, -923, -183, 527, -363, -369, 137, 192, 579, 771, 24, -364, 548, 393, -251, -71, 596, 359, -849, -709, 438, 99, -1306, -606, 1082, 117, -1059, 118, 687, -565, -337, 833, 13, -132, 1156]
1396A156j026j275J895J06k343J040K069j919j904K251J095k287j1K156l55j283
1412f35N16P00k70p87L54R38j85o55Q5P1j053M79R34j046l72K183n49l090J642
1431g40K558k599q43L724j72l875J293K886k788r61L216l53k607J804O96l316
1447b077M50L453j564k006L075N79m327J81M251j201k641L105J873l954j219K909
1463H87o44j881K801J381l686l60K393k253j455M434P94m177J415K899m015k420
1479c887N235J631l714J116K501l549k301L094P17j483J848J139k625j766J150
1494h94J84o94J616K866j243l955M71K704k414j186N778J414o689L07M581m694
1510a848l357P826K128p335K362M106p747k245R851j248o879P101L769j1257j016
$$ y = [1156, 130, -1145, 750, 856, -1487, -447, 1622, -297, -2201, 50, 1145, -1142, -1153, 1003, 648, -635, -119, 581, 311, -476, -122, 816, 631, -24, 61, 132, -921, -442, 492, -554, -926, 1257, 708, -2382, -740, 1818, -781, -1624, 2100, 1928, -1947, -654, 2232, -556, -1517, 1699, 1346, -1261, 543, 1239, -2077, -1627, 1826, 262, -1744, 1331, 1910, -2417, -2236, 2015, 814, -1827, 1278, 3151, -803, -2022, 887, 243, -1638, 1163, 2544, -1142, -1502, 891, -1362, -2817, 1617, 2411, -1766, -351, 2548, -1467, -3887, 1348, 2979, -735, 381, 2882, -667, -2968, 126, 843, -640, 1208, 2347, -278, -2044, -894, -710, -1404, 212, 3078, 1835, -2120, -1649, 1055, -1359, -2545, 3233, 4647, -2042, -1735, 2846, -1848, -5205, 2621, 4749, -2586, -224, 3882, -3865, -6110, 3741, 2493, -4386, 2715, 6484, -4773, -5789]
1525e789J0238l830n678R341L048j0862n00O711m452l010Q467J197p121J107L038
1540A905n174j596O791K048m086L89K273l586l735L420N052j554k940K727Q65
1555B799o900q48P310l92m480N190K527r421j437Q349k478m542Q906K281j1478
1570d614Q64Q650o764n462J2343L157j2026J255P673q002m898J1104K548q830
1584c002K647N266q115l487R073P89o422M830M960q489m288P486J395n873L771
1599E41N358n280n431M203J757l974J363N568j659m796J438J352l388Q64N763
1614C679o01m696K097K063n472j296P492O07o583K636M802o968m259P847K408
1629C756o611K433N605o497m243P230Q62o565M824N472p801k739P645k272o979
$$ y = [-5789, 4449, 619, -5059, 4282, 7330, -3532, -4032, 2679, -1773, -4783, 3684, 4881, -2240, -1133, 1905, -3269, -4865, 1926, 3974, -112, 277, 2550, -1036, -4771, -1351, 3701, 2147, -793, 1934, 2799, -4101, -4949, 2361, 1969, -2511, 2679, 5206, -4215, -5652, 2697, 219, -4323, 4583, 6864, -4614, -3750, 4900, -1864, -7326, 5017, 8174, -3852, -2597, 5076, -2926, -7824, 3280, 5828, -3002, -355, 4911, -3204, -6691, 2382, 3171, -3251, 1579, 6539, -1950, -6238, 1248, 2643, -3230, 541, 5899, 619, -4812, -609, 1148, -2826, -1463, 4105, 2446, -2350, -912, 440, -2948, -2084, 3679, 3078, -1618, 479, 2542, -2930, -4226, 3266, 3873, -2710, -74, 4728, -2240, -6499, 1348, 3756, -2855, -422, 5183, -1314, -5557, 1673, 2535, -4030, 794, 6266, -1535, -4274, 3371, 1099, -5880]
1644e880P182N308q734k200P790k744o487N957M182n858k29N161l798l881N146
1659I15J663m072J837L128m065k458L590J014k801L75K899p03l289N6K894m55
1675E28k626K158K622l266k096L875L27m063K738L244m588r81N035k464n121O114
1691A436K577p383Q22O894m413n252P040K120p436J853O139m569l365N836j28
1706B171n162L336L237n297p85N381j826m438L651K435m495l86L794o12k748J238
1722e06J861j243j026J150N66p79k81P93l9j229N28J255j405r59K206L53k974
1739a729P12L061k623k024L944Q79m193P55L645k180k381L143P88l164R73K170
1755A776k459r43L069p63k656K054J715l309m95L669q03k838J874K091k450r91
$$ y = [-5880, 1302, 6610, -2124, -4324, 3466, 722, -5765, 192, 4374, -1484, -1713, 3448, -350, -4231, 915, 2578, -1494, 343, 3471, -594, -3052, 538, 1552, -1249, -874, 2025, 1322, -1967, -1911, 983, 528, -2098, 60, 2682, -584, -2680, 1195, 1522, -2541, 197, 3441, -1147, -2128, 2907, 443, -4678, 1436, 4013, -3370, -2548, 4346, -67, -5319, 1721, 3841, -3595, -1742, 4397, -172, -3537, 2299, 2171, -2991, 345, 3582, -1715, -2500, 2881, 1055, -3383, 268, 2703, -1792, -2178, 1616, 1004, -1744, -506, 1355, 112, -914, 236, 802, 23, -258, 535, 496, -733, -205, 1050, -355, -1314, 892, 1245, -1729, -1017, 2044, -579, -2603, 1341, 2220, -1973, -1218, 2427, 247, -2134, 1009, 1797, -1367, -394, 1776, -683, -1626, 1443, 680, -1976, 78, 1793, -1516, -2011, 1658, 855, -1983, -109, 1982, -468, -1459]
1771a459K159M03j751P98Q72j258L9N64o38k12J061m45q34Q09M47r92l64Q70K59
1790C28o7l73l76J045J08j144J14J462o42j447J182R09j685m32J373m88m32Q86
1808C21n10o32J132J57j564R21J754j878p64K037J8j946P00J177r58m65P05o10
1826d05J68P77j011n79J751p1j762R87J151j272m30J477l61o90O54l02j94R07
1844G95o89j016J078Q60j787k28J443l95r39O72M12l04%N4j97O12Q5q12L69J008
1864A021o27r01O45M01p43K7J91m3J52l71n50Q08N55j041k7J046j3j259M77Q71
1884F19Q8q74L9K54M36n28o65O30M90r11jP14l62n75P18p5l92R38l58j145J294
1905C34R72j845k57K130n42j872J053J089j467m84J271k10o15M14Q4m62O24k82
$$ y = [-1459, 700, 1103, -648, 150, 1022, -236, -197, 367, -271, -483, 578, 133, -701, 108, 555, -437, -801, 69, 328, 261, -112, -488, 557, 665, -479, -365, 1097, 455, -992, 190, 1099, -586, -1018, 355, -133, -565, 321, -189, -821, 311, 468, -1096, -175, 1579, -299, -1063, 974, 992, -954, -254, 923, -35, -500, 205, -405, -237, 540, -471, -1050, 701, 630, -1132, -145, 1006, -266, -696, 781, 420, -270, 384, 82, -112, 795, 106, -910, 168, 1028, -759, -987, 456, 61, -878, -206, 206, -98, -98, -44, -241, 371, 456, -356, 13, 1021, 394, -507, 138, 539, -204, -177, 14, -29, 123, -248, -798, 10, 565, -476, -503, 543, 530, -729, -252, 619, 707, -167, -128, 126, 562, 34, -631, -1, 489, -422, -423, 291, -71, -646, 72, -3, -395, 543, 185, -960, 334, 1306, -539, -796, 1334, 792, -1080, -27, 1062, -405, -889, 382, 172, -443, -29, 55, -407, 217, -65]
1923f5n33P05N08m53k07M12j78J05k40m88R61L47j294m3J282r12j354J474Q00
1942H27j439K85R10j257J96J145p58n61J586J8j849R75J059j860l70K124k09j784
1960i62O77N59j047L29L99j85N62L39r20k39M27p6J24M38K52q9p21o47P83P36
1980G39j282J6J671n09k390J031J259j514L74K174j288j404J720j30k350K096
1996B13J886k318m78K585j373l065K369J791j993QJ747j236j836J138O69n16O98
2013B89P52q47n68K05l33J15N57J101J86j796q87J544m03k003K257K448l133j274
2031a790K858r72l085K783K911l089l33L006k695k594L686J236l410J795L164
2046C471m049k563L781M75l556K222L423k838k809K099P22k055J292K347r01j916
$$ y = [-65, -598, 107, 615, 162, -45, 367, 189, 294, 54, -434, 527, 874, -420, -463, 819, -93, -1447, 27, 827, -612, -327, 583, -674, -478, 667, -91, -652, 934, 952, -897, 78, 1137, -723, -1093, 1031, 822, -962, -285, 274, -773, -444, -45, -230, 332, 671, -249, -488, -61, -137, -13, 425, 677, 588, -133, -780, 3, 739, -543, -527, 1144, 635, -1755, -724, 535, -979, -605, 1569, 281, -1123, 597, 467, -1883, 213, 2099, -219, -697, 1888, 515, -2550, -181, 1610, -383, -375, 1372, 136, -1700, -562, 107, -409, 289, 1041, 194, -374, -169, -502, -387, 170, 1271, 1457, -339, -1226, 318, -85, -2088, 169, 2617, -516, -1790, 1068, 96, -2989, -206, 2705, -384, -717, 2289, -406, -3000, 686, 1922, -1488, 307, 3471, -578, -3141, 640, 1115, -2441, -219, 3204, 366, -2443, -344, 378, -1677, -385, 1962, 1061, -855]
2062h55Q06O89j970L30K849l25k390J094J146l093r52M302J0l206J618K498l817
2079a266j866L957N32k903K232K152l570j356L007p09k023K669J779l274j075
2094a714K663j015k450K344K949k560k062K523K11l256J177L740j469k455K352
2109I78M06l436P55L562k326j357L370n08m438J769L410k982j583M740n07m451
2125b598J648K808k865o17L623o47k604J475Q00k408N34K104p02j325J110K56
2141E92j469m78J630O19j285j91J712m53k434J120K499j798j204K434k2l238J687
2158b79K044k658m59L268j437k983K869J677m153P33M117k496k913L874N68l802
2174b030J378L091k538j513K974m82k383J451J286k048k59K005p64j771J521J110
$$ y = [-855, -49, 640, -1330, -1000, 1849, 1524, -866, 228, 1374, -1719, -2671, 1631, 1641, -1565, 53, 2551, -1266, -3132, 825, 1357, -1546, 686, 2838, -732, -2088, 919, 210, -1813, 856, 2635, -639, -1714, 949, -66, -2516, -172, 2777, 217, -1845, 678, 889, -2367, -1190, 2550, 1081, -1374, 978, 1384, -2052, -1297, 2265, -61, -1418, 1952, 1444, -2994, -1225, 2185, -797, -2380, 2360, 1853, -2598, -950, 1858, -1007, -1624, 1999, 1352, -1252, 223, 1023, -1385, -851, 1253, 551, -774, 336, 592, -877, -1355, 275, 894, -391, -582, 1130, 677, -1757, -637, 1862, 64, -1140, 1294, 1272, -1966, -279, 1765, -893, -1352, 1916, 479, -2504, 365, 2042, -2111, -1378, 2739, 243, -2670, 1204, 1772, -2030, -652, 2439, -99, -1612, 1362, 880, -1503, -52, 1234, -814, -1073, 932, 168, -1603, -82, 1028]
2190A028j429m82J495J37j358L1J465j68j227L23J196j120q53J441J66j360L96
2207c19R20j164l25J520oj938J188J313j724o30K435k38k286J071J876j661j559
2224a527K032K62j727N53J442j413r79J845q5j572Q74J443j566n30K009l31k120
2241a390J318J770j911q30K051k81j916Q05J322j216k20J150o24q76R07J1m83
2258d13M07O10p07l32M45J96j16j93J8N91q5j130K72J122q31j052J905j8j899
2277a210P48J351j322l58J682o27r99J325jj683J072J503j887l97J798n17j738
2294a260J184R96j573K75P89p10k30O53l13m21J232l49q63P84O08j172P1Q15l93
2313A23n21O74l31m14Q30k98p90P60M44j329L71J162n28o51P23R0m06L78Jm86
$$ y = [1028, -401, -883, 612, 749, -609, -578, 887, 719, -508, -185, 1011, -109, -962, 479, 645, -715, -319, 601, -563, -888, 632, 626, -1312, -124, 1189, -535, -1165, 1270, 1032, -1254, -183, 1693, 32, -1527, 505, 767, -960, -407, 1035, -378, -1357, 488, 403, -1169, -295, 1148, -418, -948, 1061, 730, -1390, -72, 1698, -213, -1043, 1008, 727, -1189, -384, 938, -278, -498, 652, 28, -848, 59, 70, -413, -6, 604, -103, -435, 10, 206, 90, -103, -85, 506, 421, -709, -437, 685, -146, -1198, 707, 689, -1210, -462, 889, -433, -791, 891, 264, -735, 590, 589, -1094, -22, 1481, -406, -803, 995, 478, -1260, -76, 920, -653, -378, 411, -299, -529, 124, -189, -610, 622, 273, -590, 194, 802, -370, -299, 516, 123, -398, 276, -55, -469, 361, 63, -727, 33, 477, -852, -481, 681, 153, -498, 225, 315, -91, 287, 288, -198]
2333a98N73j02o23K37N78o10m51P43J47o17N8K72j02o6kL2L66J6m63J73M31k1
2355C71m56J62J78k22j71P9K65J7n46j9M87j01m19L77J71l50L10L3l84L87L42
2376E11n52l16J046k63r79N53O50j110p3O53k3k89K51r1l42P11l08m26P56R0p83
2397c34J44Q80o61l20P24l54k94N61m21o33J053K06j309M14J112j008n72J277
2415D65pj144Q61N50p54l7M07n17j70P58l58o55R20J19r11J52N08m31J10J84k01
2436a51K14J93o55J21Q66p07k18R60k02r05L19O18o56J60M86o60l80J038p45p21
2456a025J454Mq90M66N69p05l85Q66j09l00M76k30k96M14j59j010P47M72n15l8
2476a94M41m95m11N87PP7P30p66n69R58l5j037P64R74j009l88P09m86p52J200
$$ y = [-198, 375, 273, -350, -113, 465, -145, -596, 147, 294, -323, -265, 7, -95, -161, -163, -131, 235, 251, -212, -39, 392, 371, -85, 77, 255, 33, -138, -59, 206, 223, -323, -342, 145, 44, -375, 2, 173, -177, 133, 166, -218, 169, 511, -41, -357, 689, 426, -553, 0, 650, -460, -533, 120, 97, -192, 59, -32, -374, 337, 29, -397, 359, 449, -334, -190, 690, 29, -291, 433, 79, -215, 346, -75, -708, 345, 551, -758, -344, 768, -240, -812, 465, 458, -686, 175, 725, -29, -66, 341, -176, -346, 412, 54, -601, 319, 438, -473, -321, 187, -244, -134, 50, -151, 63, 256, -399, -278, 588, -119, -337, 623, 421, -484, -165, 453, -203, -43, 443, -217, -597, 441, -304, -1025, 429, 433, -457, 9, 578, -127, -512, 354, 245, -55, 421, 191, -105, 309, 150, -860, -113, 359, -156, -194, 247, -248, -659, -72, -65, 12, 742, -24, -593, 365, 330, -707, 57, 1031, 22, -366, 343, -143, -895, 305]
2496C05j44n42R85k26j554P11J295j251l23J973n58j454R74J84j109N82J364j209
2514Ck05R45q88j043J397K81j205N86J101j103q35O94K46O7M07m3M0l26n67n6
2534e04Q85J3m38N66q7r39o9O44n84L54J173p49j273J098K67j655R94J738j327
2553A07r13J566L5j831N20J324o02o28Q12N0j426N73O05l77j59J186n56j280L86
2572f08J166m91p83J346M99j639k71J428l39j205J068R40j404j49R15q13o48J294
2590C06K77j062M60P10j242k86J350J54r99N95N53o76p38K68O14N3o26K38N16
2609D65o25o15Q22J30q57Q82O39j447j12J594r17j050K078L99k418N22K305k102
2627c07j148K440k2k281J260J225k262J80J867r66r51J616J77j957J086J122j496
$$ y = [305, 161, -381, 604, 378, -1176, -465, 830, -421, -744, 1229, 671, -783, 191, 375, -734, -152, 1212, 3, -202, 743, -145, -1188, 209, 490, -715, -129, 972, -131, -966, -272, -26, 41, 448, 405, 445, 119, -448, -504, 381, 394, -44, 522, 435, -504, -573, 71, -513, -159, 1014, 265, -1008, 90, 357, -1298, -304, 1434, 107, -806, 760, 795, -1036, -516, 808, 206, -422, 390, 440, -986, -413, 192, -185, -344, 842, 286, -994, -608, 558, 67, -716, 630, 1129, -510, -781, 647, 308, -897, 171, 1111, -293, -442, 473, -340, -988, 306, 583, -479, -19, 691, -551, -837, 513, 667, -332, 263, 816, 140, -598, -330, 284, 337, -289, -51, 465, -160, -775, 47, 177, -680, 202, 841, -606, -718, 876, -41, -1091, 987, 1386, -1032, -510, 1795, -307, -1455, 985, 963, -1318, -58, 1167, -1095, -915, 952, -14, -965, 651, 828, -1129, -43, 1079, -417]
2644d17l24J639l62j172Q11K31o57J71J01k19J84O3o23N08L60o34J62L53k51p3
2664a49P62n73n26J285k43j489R26J150j721j55J743p14j685J472P57j742M92
2681d10J337j216o76J475j63j159J091Q98j656j24J488p89j036R93Q59j213k99
2698f00J068k84q81M18O22n12K6N54k25m93M71L52r09K28Q39k55q67L48O20p44
2718b24l23R30O8q32Q2N22l35l95L60N19k02l09K66P5m55JP38k62p08P50K5r47
2740f56M05J002q06j022J772M6j755M14J427r13n88J415j39j459R61P20j308J80
2758c04J376r20j051J314m7j113L59J095p96l54N53k08k68L25n4k05O91l31m23
2777c61P91P9r64O29N52p15k56Q11p32l13Q69l69q62J012N36j242L4J110n64q29
$$ y = [-417, -741, 898, 536, -636, 175, 406, -251, -80, 21, -198, -14, 49, -574, -66, 294, -340, -178, 175, -76, -149, 613, 40, -486, 799, 556, -933, -7, 1143, -578, -733, 1010, 296, -1389, 83, 840, -902, -410, 927, -289, -965, 510, 347, -812, 279, 1177, -479, -603, 885, 96, -940, 53, 912, -301, -600, 468, 184, -697, -279, 343, -169, -143, 411, 186, -307, 164, 516, -393, -165, 674, 419, -448, -100, 520, -224, -547, 383, 451, -381, -299, 223, -112, -507, -147, 372, 170, -139, 127, 202, -253, -252, 486, 224, -484, 266, 291, -656, -251, 751, -55, -1077, 695, 741, -1014, -600, 827, -86, -674, 741, 602, -857, 104, 824, -484, -304, 1072, 152, -899, 415, 368, -745, -386, 709, -87, -441, 112, -96, -364, -39, -93, -298, 393, 62, -361, 430, 509, -455, 174, 726, 11, -245, 566, -166, -479, 390, 21, -841, 171, 707, -535, -501, 609, 45, -784]
2797g84J239J69j022K92P50r08M2N25l19m05Q67m55o48N86K65n60J02N87m57j40
2817b74L93j56l7K17J64m46L50J53p18L67L02l64k44O08k24k17J60j51R1k4j7
2838f7l2k3J03j51J83L9J31j20Jj6J83k95J42k19Q1j95o3L55k34J93q6P8n1K84
2862B21l24O9K89p6l00J00M34l82k7K80j97k31K60J3l47K14K37p48L55N21k93
2883F8p35R32L7n56M3O34n09q2N20k17l97N22j30l32K54j04l10J54K34j96p3K93
2905E0l48K34L59k40l05P33k20p42O33J99n85L1O25m83m74P08K22q53K29O31o20
2926b16r1Q66p62l16Q05m2n68L30M13l85k46L44r7j72Q5J2M8p8p8k0N10m27j15
2949b00L26l6l86M61ok24K4M00n20K7P51m10o79M35M51p40J54N67n47k06L59j46
$$ y = [-784, 455, 624, -398, -106, 644, -264, -222, 303, -16, -421, 446, -9, -657, -71, 194, -366, -264, 323, -134, -274, 119, -37, -74, 143, 307, -139, 211, 364, -354, 13, 315, -49, -293, 315, 91, -126, 34, -117, -26, -50, -67, -99, -122, -19, -170, 13, 52, 183, 63, 64, 48, 231, -64, 78, -141, -60, -255, -318, 37, -197, -4, -90, -12, -63, 221, -103, -34, 255, 179, -121, -21, 413, 31, 4, 284, 87, -144, 116, 129, -218, -4, 233, -515, -160, 361, 68, -667, 265, 302, -254, -211, 423, -86, -168, 352, 135, -262, 260, 130, -202, 52, -52, -362, -208, 26, -170, -243, 50, -298, -64, 295, 55, -250, 483, 263, -479, 154, 353, -232, -201, 424, -59, -533, 175, 397, -456, -227, 404, -216, -307, 559, -203, -519, 286, 244, -324, 6, 419, 34, -212, 132, 35, -137, -52, -40, 8, -70, -148, -168, 342, -85, -200, 126, 90, -296, 165, 159, -65, -41, 359, -161, -134, 617, 207, -472, -37, 414, -326, -172, 395, -152, -358, 1, -145]
2971a45j62K16K10l90L58J7k20J31J70j00J9Q4j88j14J57l02R8M47j45m04J56
2992a07K82p22L02M84l04j98P12k03k87K63j65l68O38O1m53J7M16n23k42O91j71
3013A23m91N11J44o96M0M94j84K0N48k64n34L30J69n24L50K86k17j71p9J80j80
3034a45J02l5j8K24j37j52J00j45n1N12J68o51L11K63o99K08O85o44k43M76J89
3055C18q66L23N78o42r5Q17k32n24L68J70n21L28M34l50k96K36J54l54MK23K8
3076A01j74p5J86j01p60Q94L30n19l00P95k36o11N68M91p13j48Q37n41n61P26
3096A89Q3o39K95Q07r54m11Q52j34o09L61L90m97R2M90l26p7J80j13J31k2r0N0
3118D8J35k71j21N26l81k02M90r0p35M64N16q06J79P28m01o14Q35Q8q03K75P44
$$ y = [-145, -307, -91, 119, -271, 87, 104, -116, 15, 185, 85, 104, 188, 0, -114, 43, -259, -161, 286, 141, -263, -107, 175, -547, -245, 239, -65, -263, 449, 246, -41, 222, 57, -311, 327, 388, -65, -48, 368, -155, -397, 294, 123, -368, 143, 287, -409, -369, 125, -59, -39, 509, 245, -289, 41, 210, -314, 36, 322, 105, -66, -145, 35, -145, -43, -78, -96, 128, -9, -161, -61, -206, -257, 255, 423, -228, 83, 346, -353, -145, 540, -104, -347, 129, 318, -548, -225, 353, -289, -384, 433, 201, -323, 45, 215, -306, 22, 456, 106, -190, 46, 200, -154, -150, 73, 101, -73, -148, 38, -63, -823, 71, 401, -118, -418, 377, 141, -470, 98, 589, -124, -272, 565, 24, -537, 189, 272, -367, -72, 735, -219, -630, 222, 88, -521, -160, 230, -267, -175, 315, -11, -88, 92, -21, 110, 88, -2, 48, 183, -88, -209, 317, -64, -266, 224, 134, -601, -137, 379, -427, -248, 480, 79, -535, 300, 388, -415, -140, 604]
3139F04p20l25R09k71q59P34J85p57L0Q93o49K9O38q9q17K25N31k73m2L37L6m49
3161a00r5P8P7J18n9K3n4r6n8J25j61J59L48k89k7J3Q6l66K54N95n35l13L95P1
3185A89n95K08L51j79j94M96m86j77K95K58n02L54L34j55o36N07J56l54p0O74
3205D74o1p41J07L65k32k59O43M5o24m1N72n08m15R18J18n92O16J36p65k49R28
3226D35j18m05J52N90p74j42M21j08k51J10J24k21n8J01j65p8N71K6o2k42k8J89
3248F7j54j18M25J66o32m6M97j87p40R19K48p77K15N60m88m31P08j23n12O37K28
3269D62p61j26Q13k93l51L04L19n54q6M18l13J98k7R8m4j20o6P2J51j11j71M31
3291B43P2l58J44k55J25K01q2k96J59J74k28k41K03L15m14J69J56o9j42OL11k40
$$ y = [604, -116, -441, 468, 197, -662, 72, 257, -500, -470, 423, -226, -197, 441, 352, -465, -240, 291, 18, -24, 313, 349, -100, -195, -117, -40, 78, 19, 42, -12, -108, -166, -41, -202, -43, 305, 16, -11, 2, 88, -278, -24, 571, 36, -277, 118, 189, -406, -198, 153, -26, -220, 276, -210, -387, -92, 166, -336, 18, 352, 197, -439, 68, 224, -130, -200, 474, 413, -328, -221, 144, -88, -347, 296, 341, -283, -324, 248, -260, -675, 243, 361, -231, 385, 521, -244, -493, 435, 317, -88, 64, 654, -120, -262, 159, 51, -200, -90, 34, -187, -245, -144, -309, -387, 184, 210, 148, -94, -122, 67, -87, -205, 220, 386, -246, -292, 205, 18, -722, 197, 445, -332, -117, 443, -45, -476, 232, 109, -403, 234, 462, -299, -425, 388, 95, -256, 48, 367, -187, -273, 145, -168, 30, 3, 101, 57, -63, -129, -57, 94, -17, -188, 243, 315, -43, 101, -154, -29, 172, 90, -206, -47, 127, -101, -342, -139, 176, -238, -69, 87, 18, -124, -118, 193, -47]
3313d7j8K27o5k9j52n8n1K55K02k60j02L4N7k35K06J92K7k22o0K67N7m16J66l8
3337f3J02J55k26r6L53k08j80J00J98j35k12L98j35p7J35m7k57K54Q6l90L37K75
3359C67m50p0K87K05n12L0M66m42J04k03L76l89K59j53N9J44p9j04O9K06j48O1
3381H3J21k76R2P1j83R1K77k57k36K87K01n28n5O19m32j04K11L46m37O6J90j88
3403d1n9L11k13j9K06L8l08rO3j18m4N6L7n4O7r3L07j23j03J44J92k14k84L34
3427G3J68l31M0K08k33p7P1J0j49L43J07n16%M57j63k47K55O8k20J1K55M2m8k42
3451a18K18m0k44J94K3j04j7N7J3j58K60o8k54L9N27k49j45j23N26n92J11L76
3473B32k20j66L13j29j59P5j91J50K4K00l23J75P3j36k4O5J69j53lM2P7n6j07
$$ y = [-47, -65, 162, 97, 68, -84, -142, -193, 62, 264, 4, -98, -64, -7, -242, -36, 156, 183, -39, -99, 168, 225, -191, -25, -63, 39, 194, -32, -128, 225, 17, -163, -63, 135, 0, -212, 186, 51, -26, 109, 62, -195, 59, 145, -245, 92, 367, -83, -153, 134, 339, -173, -143, 323, -119, -15, -218, 158, -231, 28, -125, -66, 78, -1, -105, -36, 170, 22, 83, 204, -72, 20, 91, -92, -1, 276, 19, -217, 70, 271, -257, -312, 307, -125, -229, -18, 328, -109, -43, 147, -41, -100, 211, -2, -21, 185, 223, -85, -94, -31, -149, -193, -137, -100, -154, -87, -180, 127, 4, -99, 45, 237, 23, -261, 73, 241, -90, -50, 158, -75, -152, -81, -71, -220, 123, 230, -286, -286, 171, 8, -239, 16, 84, -136, -125, 130, 172, 124, -118, 100, 60, -184, 10, 33, -71, -88, -31, -18, -176, 84, 16, -238, -199, 328, 79, -66, -189, 337, -255, -144, 232, 12, -154, 159, 30, -129, -54, -245, -95, -71, 129, -194, -19, 54, -82, -106, -41, 128, -25, -28, 14, 91, 35, -72]
3496g2K0K60m5l12jK05j22k00L51p2n1K66l36J04R4N6k74J28K29l08n3K26K28
3519C21l63rJ77k23Q1r2q7jJ86J65k47J43N9k57l7K95J32k03O4K3J22k67m7N0
3543a5K55j58j50J48m7j62J10J4k22M07k54q8J83K19l66K6N68l55l76L03L21m93
3565a32M6L19q8k95K56r2l05J92J29n7OK72j89j48k3K60K7j66o3L39j39m48K17
3588h2M30l78j09K24M8m02J92K62k59k00M62j31l66N63m2m57K07M12m68l38N15
3609H3Lm05J19O67m83k30K00J27r9Q1j32n5Q2J75r2k23K99L0m6l07J46J53j60
3632f7k4J31J02k22j45L42j18k45J97J95l8q4P3k09m5J08l8j63M18J16l07j76
3654a99J98J34k27K03K0r5l33J23K76j67k4o8K27k6n6P5k40K00J88j64K7J58m84
$$ y = [-72, -52, 208, 163, -149, -150, 55, -67, -267, 84, 12, -39, 227, -109, -5, 89, 145, -129, -1, 228, -80, -133, 93, 321, -42, -51, 126, -97, -16, -108, -195, -196, -10, 155, -92, 51, 110, -147, -184, 111, 243, 40, 104, 127, 249, -18, -65, -15, 240, 82, -68, 80, 33, -129, -19, -5, -227, 180, -74, -162, 21, 240, -126, -100, 468, 113, -263, 40, 361, -132, -86, 233, 145, -150, 106, 14, -291, -99, 30, -27, -21, 251, 62, -86, -109, 151, 178, 12, -51, 288, 149, -299, -82, 348, -30, -139, 85, 133, -269, -77, 185, -74, -274, 188, 57, -309, 254, 212, -245, -38, 374, -94, -432, 83, 86, -319, -200, 467, -16, -246, -46, 81, -18, 63, -69, -124, -42, 133, 41, -182, 117, 147, 101, -206, -60, 93, -67, -91, 40, 142, -80, -225, 117, -1, -246, -49, 146, 108, 24, 97, -112, -157, -49, -87, -250, 168, 284, -23, -199, -1, 133, -94, 109, 129, 34, -299, -176, 100, -67, -91, -159, 68, 42, -14, 61, -179, 21, 209, 45, 72, 230, -254]
3677b54k56M58K63l60J50O9l27o0J91J5j10L07P7j77j09K76k62l06P66K0m99J35
3699GK29n09j28L25K37o8Pp6P5k76q4J98K66L6k7k60l8n7K40M0j23J29K09m20
3723f8j85L77j55m83M56L93n35j62M38l1l78M01K02j87k02M04m56l7N29Jn56J34
3745a00M52n61M9K47J15m26L90j52R1k65j61J36J26L42k94K47j45k14K2J12k1
3766a0O3M6m6j9n2o4k12M23J71l81j81L88o0l21K82P2R8k35N6m4j24K17k4j05
3790f2J16k01J54j92J15K15k76J44K33j94j96J52j49J50J7J71Q9j63j71P4j67
3811a41M1N7%J98j51L1k53J75R2j01L8O1j58J63J24j22k5K03k66P0k4P7j55j47
3835b13M17j97k65K20N8j00m7J34o2R6j7j47Q1L53j62j01K0J20j62%p2J56j55
$$ y = [-254, -510, -52, 211, -149, 1, 70, -257, -317, -126, -111, -221, 86, 163, -14, -123, 153, -109, -415, 351, 371, -128, 7, 236, -273, -401, -76, 161, 93, 100, 24, 99, -177, -261, -63, 203, 239, 212, -48, -86, -143, 97, 137, 14, 143, 352, -68, -253, 124, -31, -514, -58, 335, -200, -362, 76, 45, -333, 68, 270, 83, -119, 285, -171, -208, 321, 322, -234, -100, 352, -209, -160, 87, 202, -224, 166, 14, 105, -160, -321, -185, -59, 283, -11, 236, 91, -123, -101, 11, -10, 53, 99, 53, 34, -18, -82, -294, 129, 300, -81, -262, 126, 66, -255, 27, 99, 197, -38, 18, -26, -150, 67, 43, -62, 54, -147, 7, -185, -70, 145, -131, 13, 246, 52, -144, 8, -141, 9, 26, 197, 286, 123, -48, 26, -141, -100, -43, -43, 155, 4, 35, -218, -43, 49, -52, -14, 47, -111, 52, 176, 54, 29, 232, -34, 36, 12, 89, -66, -213, 204, 7, -258, -38, 20, -80, -127, 7, -55, 41, 24, -123, -42, 311, 149, 48, 68, 188, 26, 26, -46, 110, -45]
3858d5J59l03R2J57j96q6J62J61k68K48M0j50p2K45k3r7nJ49k21K4K70l91j2K88
3882A26k9l32K59j07K10k99Q4J31J33k29Q7J1j94j72K68M03m10p6L80j53n6J8
3904E3R9l29J33J22j13k02L88p4k22J45J32j61n1K15P9m16K38l8R6k58K45j24
3926d3o0J87m5l1j64J05J05o3rK23k19j26K66j4j52j5K25K7l21J69n2K41l65j6
3950a47L39m04l7L32j06K3J02r2O4J15L0j57k71L92n5j43l7J51K46l80K1K16r1
3973A11k08M2Q2N6k64J09K7Q3j8j64J97m2l7k01K28R3l4j51J14j67J36J%L0j1
3998A2rj86L02m0k33J33L15p7j88K9j29K53k98J63j17R3Mj92O9M7K8Rp8J16O2
4023H8K8Q9l64O8J1J14O5j6Nj96J10P2l79J20L55m4j97O5J04j48j09K73L9j24
$$ y = [-45, 114, -189, -97, 60, -136, -222, -60, 101, -167, 81, 121, -29, -101, 144, 121, 24, 19, 168, -53, -29, 241, -150, -162, 126, 97, -235, 24, -83, 127, -172, -88, 43, 176, -53, 34, 45, -149, -321, -53, 350, -60, -136, 244, 91, 35, 53, 152, -177, -44, 78, -35, -237, 151, 77, -145, 0, 132, -29, -80, 135, 214, -202, 36, -2, 94, -164, 81, -43, -103, 84, 39, 8, -156, -51, 54, -9, -18, 205, -14, -140, 126, 112, -40, -55, 170, 197, -124, 45, -7, 234, -131, -147, 192, -212, -249, 83, -23, 0, 102, 10, 74, 189, 219, 62, -209, 183, 128, -15, -52, 99, 345, -35, -14, 202, 111, -97, -55, 27, 83, -181, -72, -45, 38, 20, -144, 53, 11, -26, -227, 1, 94, 60, -91, 23, -144, -8, -7, -7, 23, 12, 3, -183, 119, 79, -154, -21, 294, 217, 29, 58, -71, 182, -116, 47, -70, 23, 27, -165, -96, -49, -21, -12, -90, 26, 88, 116, 205, -159, -91, -80, 34, 99, 83, 88, -108, 2, 74, -305, -185, 170, 126, -71, -6, 98, -50, -159, 114, 153, 29]
4047B9lp9O0NK5n7N0O9j09r3K7J36m5k70J95N5o2L3N9j28M6K5L3J06o9N5j4k37
4075a58K56o7r6q1L40m30J67K22j65lm7L88l27l2N9jO9n6k7Q0l3l1j58K37r1m3
4101b8pm7jJ31j18j52J41Q4k76J28K15j3r7n6K98p2q2K1J14l27L86l14J5L03j7
4126B29l45N8L3k4j34J50N4J10j63n3J2J2j71J47K64K2j23o7q7J80j61k4R4k9
4150a6J78k03P6P6j86k90K58J52l1n4l2M5l6j47N4M61j54l58M7n6Om0K23Q3j60
4175a04K51k26k8P1M5J10j66K91j00k05mR2j01J83l21K06n1M0j16K37Pk86K48
4198G3j70j8l19K63K22k17K92J98l70J11k56J02J37L2J92l56oK05l47K8J40K38
4220A74k87P8Q8m3k03K13J67L4j43j03R1J8l52l9M90j78K9r1j30q5K19L8K3J67
$$ y = [29, 26, -53, 7, 12, 37, -20, 30, 99, -10, -103, -76, 60, 15, -255, -60, -5, -67, -34, 25, -103, -57, -32, 1, 107, 38, 93, 79, -158, 98, 31, -65, -146, 194, -236, -69, 153, -12, -15, -62, 326, -1, -33, 26, 25, 94, 38, 11, 91, 58, 27, -131, 106, 15, -28, -35, -82, -83, 48, -70, -222, -81, 3, -273, -145, 70, 57, -40, -96, 202, 130, 48, 69, 183, -144, 242, -72, -57, 246, 229, -116, -58, -25, -49, -183, -33, 21, 131, -32, -85, -73, -61, -232, -85, 179, 201, 78, 11, -76, 104, -57, -81, 13, -16, 162, -41, 35, 111, -75, -365, -107, 45, 14, -40, -72, -27, -63, -210, -156, 305, 151, -207, -160, -216, -210, -250, -27, 56, -104, 147, -79, -107, -36, 9, 119, -47, 244, 144, -61, -65, 27, -74, 109, -212, -6, -57, -17, -133, 104, 111, -175, 73, -97, -115, -434, -171, 51, -166, 126, 324, -46, 65, -191, -89, 48, 80, 272, -84, -90, 115, -232, -204, -64, 174, -113, -35, 53, 10, -193, 20, 187, 221, 78, -25, 66, 84, -268, -307, 183, 5, 34, -57, -187, -272, -53, -15, 8, 175]
4244A75ok10k06L93j42j73J90J68mk74K08lk27J62K19k68j12R5p0j8J65R0j48
4267Dr2K44p8j89J18M6J50j64OJ07j36q6O3Q6Ok43J36l1O4k42j3L35Kj9J93k88
4293b1p6K0J4Q8J14R0j32o2L3k29P4J9K64l34N0l8K75j88p4J35j11K81j50m5Q5
4318H2j37%N2j2J18J5r5Rk3m6P9nP8k36P2JJ03p9p0J28O1j89o6K51r0L6J24p5
4346H6j3j24P2o8O1O3M4j99J87K07l15N3J4P4j61j08J89j32J00L2j40J67M7q0
4370E6k62J34M5m5j1J17k56K05N2j70K21m1k15J87R4j21j03K76m4j80J9O6M6j72
4394a02j9J11L0o1m8j73K24M0n1m6J80p5P8j19O2p5Q9j41K34j17q3RJ26r9k15
4419b41J03M5O1j39K51J16p5j1r7r8K6K11q1k11J74j9m3QK65j38k07m0K28k00
$$ y = [175, 169, -41, -247, 146, 4, -169, 21, 189, 185, -89, 119, 116, -111, 51, 270, 2, -110, -15, -85, -103, 62, 152, 4, -88, 156, 78, -111, 7, 53, 203, 39, 45, 152, 16, -70, -7, 79, 85, -158, -22, -53, 11, -231, -244, 91, 93, 74, 267, -21, -97, -77, -63, 25, 139, 229, 97, 35, 68, -161, -87, -68, 196, -138, -88, -126, 149, -39, -113, 22, -89, 192, 42, -3, 82, -55, -55, -3, -15, 103, 118, 23, 32, 9, -37, 42, 37, 115, -121, -49, -48, 55, -24, -94, 34, 95, -94, -160, 91, 1, 37, 161, 86, 73, -51, 21, -47, 14, 77, 121, -78, 109, 316, 1, 54, 68, 142, -19, -127, 62, -70, 30, 62, -78, 89, 136, 56, -206, -72, -27, -72, -83, 34, -222, -17, 35, -135, 86, 45, -170, 17, 111, -10, -113, 163, 119, -61, -42, 24, 70, -102, -121, -10, 20, -41, -89, -262, -38, 2, -49, -95, 85, 10, 88, -31, 31, -44, 45, -96, 138, 21, -62, -53, 73, -26, -241, -138, -93, -32, -171, 80, 196, 121, 110, 13, -85, -59, 152, 71, -140, 34, 15, -28, -20, 245, 107, -100, -140, 88, -112]
4443a12j01K6K80l00Q3J33J60l40J35J38k6p6P8j03j23J68R2j46r1l4J03r0J75
4466B9p5j17L4j1K98k53J52n4L0q6Q4rR2k35k3J79L2j26M6j19K0J70j17l1N8J04
4492G2j46J26j93J66o5N7q3J42r8n1L8P4j47J83p4J7J2n8J23k73Q6j0K04r1k1
4517a0J12p5rR0j14J6k03J38j00J6J55J3k55J83rJ46o2j04j5N0j02M22j60q6O5
4542A02N9j68N5J75l82J58M6j44pJ50j04j49J81K4l8J9r3J23k5k9j67L86j83m4
4566e5O7K83m44J03J17q4p9jN9j61L5N3Q4N6j58K15k93J40J93j14J64j01L7k06
4590i0l5O0J1j03J92M5j22m8J8m7J8JK19j20M8J17k34r4J97Q8k74K13pr0o6R7
4616fOJ27r9j89J60r2j3J60n1k7R9p0L8o5RL5j5Q7PJ47j87j73J37k4j76K75m8
$$ y = [-112, -213, -187, 93, -207, -124, 9, 169, -171, -36, 102, 76, 0, 78, -25, -148, 20, 112, -34, -125, -159, -56, -146, 29, -46, -163, -129, -140, 158, -95, 57, 3, 33, -53, 31, 22, 114, -121, -144, 35, 67, -59, -13, -132, -112, 58, -59, -90, -32, 72, -74, 52, -141, 25, -40, 17, -66, 76, -22, -73, -35, 39, -108, 75, 1, 18, 30, -28, 95, -178, -92, -102, 102, 11, -10, 102, 27, 18, 108, -6, 10, -193, -55, -155, -139, 16, 29, -226, -43, -52, 94, 32, -72, -87, -37, -139, 283, 123, 37, 102, 161, -7, 48, 223, -159, -1, 45, -99, -106, 44, -60, -209, -28, -4, -42, -23, -116, 7, -18, -47, -214, 172, -11, -55, 12, 295, -149, -46, 71, -13, -92, -93, -34, -195, -160, -107, -23, 33, -125, 90, -203, -63, 130, 16, 180, 79, 116, -90, -125, -65, -54, -157, 35, 80, -42, -90, -72, -119, -101, -100, 119, -1, 47, 164, -70, -164, 33, 121, -153, 60, 53, -37, -103, -6, 0, 127, 28, -161, -1, -93, -106, 54, 3, -24, 75, 5, 43, -22, -13, 22, 7, 94, 101, 248, 61, -112, 25, 1, -175, 100, 52]
4643E2m2n2j39J03J32j98L77k00j12k4R0J38k06R7J37r7k8p6N4j45J31P2q0k1
4667c7l2L5r2Q0K7R5k12K22Q%j77O3j35J49J17K1j48r7RO7l9K0J67q3k17K72j87
4694a04j97K86L49m07n6K02j21p5K55Q8l23Q3J69j38j45r3J71J37L6j26k6q9J3
4717a11K4R5o8O2R9n5q6O2j94J24RM1K63n38J70o2K25p8K0R5j44M3q1l6Q9K1R4
4744H3N1J18k73j90J63J8J64j57J39j86j6j86J44NK16J9j53K4l1k2J49j19K10
4767A70j27Mk57K12K57j60j07k4P4j37J78j48k11K00J9K1P8j57K2J07N3O3j06
4790B4k3J08n9k63J53j10R8N0P8R0r0j7j87J83r2J45j24J70p3n6k0R5j06q5K13
4815A02k70K44j18L9l5n1J15n8J0r4O0m2Q1j8p9m0J18Q9L0j95R9M7J29j51J3J51
$$ y = [52, 10, -42, -181, -78, 54, -144, 233, 33, -79, -103, -13, 125, -81, 16, 153, 56, 28, -48, 6, -139, -8, 64, -16, -37, -69, -34, -126, -46, -19, 76, -136, 86, 94, 94, -83, -20, -155, -6, 111, 132, -16, -113, -104, -37, -76, -56, 111, 28, -189, 83, -104, -301, -15, 334, -73, -129, 73, -48, -123, 132, 220, -103, -20, 149, 11, -134, -227, -56, 81, 117, -9, -35, -124, -111, -87, 8, -60, 2, 101, 46, -40, 22, -172, -48, -39, 2, 265, -273, -103, -165, 60, -18, 2, 97, -47, -4, -85, -121, -32, -11, 83, 134, 252, -21, -211, -48, -30, 134, -23, 116, -70, -86, -272, -128, -123, 93, 112, -41, -17, -48, -70, 79, -40, 170, 43, 47, -210, 2, 259, 99, -8, -32, 42, -95, 83, -65, -276, -76, -57, -36, 42, -115, -93, 14, 67, 130, 24, 1, 109, 50, -213, -60, -170, -72, -22, 56, 146, 56, 39, -148, 35, -57, 88, -36, 134, 61, 5, -15, 80, -26, -111, 102, -168, 76, -42, -3, -38, -89, 26, -32, -22, -116, -56, -98, -17, -35, -114, -154, -36, 53, 83, -112, -13, 34, 163, 12, 25, 176]
4841A76n9j59P9p1j15L11j60p2j15J30J87l0l4j59J38j53J43J07j93j10K26K5
4863I2l33L25Qp8q3J99p8j41Q2L7p1J1J43j47P1R0j13R7pj48J12Rjl42J57J3J5
4890h1M0m8M3J9Qm0o4J18m3K18o5j08o0M6k3Qq4J61R7k45K97k13j92J00J90k2
4916E7K1q7L7j08K31r4P8L9j73Q6J1j05LJ00j56n3J33r3k9J38r4q5J33L9j28J34
4942C5j50J50j26K95k40Q1K9j32M9kQ3j84J47P4k82j0K92k23J17N9k18J50M7K6
4966F7P9m1j21Mo3J14j03j13J82k0OJ42j12j75J50m5j2L3K44j89lP9j21J%P2j51
4993i6n5J33m1j7M3j4L2J68r8l9m1J4J6j09J12KP3j20K49j05n1n7J2j0J08n2%
5020E7l8r4P2j6j04J93Rl6j45K28j32j26K29k29K79k84J48J47j67K36k43j06k7
$$ y = [176, 117, -42, 37, -34, -149, 162, 2, -70, -185, -55, 132, 102, 68, -91, 47, -106, 37, 144, -49, -159, 67, 92, -241, 84, 92, 14, -69, 130, 52, -89, -7, 30, -41, -30, 113, -34, 37, 127, 14, 111, 104, -44, 68, 77, 76, -266, -109, -96, -81, -41, -89, -46, -27, -19, -59, -123, -5, -48, 170, 105, -3, -63, -17, -40, -32, -116, 45, 142, -103, 194, -19, -211, -111, 79, 57, 78, -9, 28, -80, 151, 57, 135, 174, 1, 87, 98, -7, -4, 96, -60, -113, 20, -73, -102, 36, -58, -143, -10, 29, -99, 35, -115, 35, -91, 204, -36, 45, 74, -58, -9, -11, 72, -112, 35, 109, -173, -183, 109, -114, 3, 62, -156, -6, 41, 67, 146, 105, -16, -12, -75, 39, -64, -177, 5, -15, -9, 133, 21, -154, -4, -49, -61, -28, 216, 27, 24, 103, -18, -17, -17, 55, -96, -151, -18, -59, -76, -33, -47, -15, 153, 55, 16, -25, -11, 5, -104, 8, 10, 83, -37, 212, 107, 56, -1, 11, 1, 109, 57, 57, 19, -75, -3, -19, -123, 70, 79, 43, -102, 126, -6, -132, 97, -132, 147, -137, 11, 158, -9, 227, -16, -122, -149]
5043a49K42j53L8j76K24l8L9Lj7j22k6K02M4o3J35j39k7p3kK14j65oJ8j49K03
5068E7p9Q1r8N8o2Q5r3j1L4O4M2J07j45j39Q1j31L27J0n4j00q3j02J26j44O7K35
5094A33k14J43j36p0L1P4n5J74J5j39J54m8p7j72PJ81Q0J51k20J02j47N4P9l8
5118F2k7k1R0k18l5K65k1j4K5J33q1j82oo6J15j03K93k72p8P6J83j67M5J12q6
5143B2N8o7m8j1o7M2J30r8J5K21m51M3K21Q8j74K7m5r4n9K74J52j63J56q6k74
5168a88l5K27Q3o7j24K19o1k75J60J44k01k2Q5L05l06J17j20M4O2Q4l7k8J1p5
5192BL2n2jP0P6j30q0Q8k24J61J38j47J17j9l6k4j4Jm1J14R2l9k9p9N3j67J14
5219b4J64p1q8J98k03k7l5J5J80o0m2k4j06P8o0K13k5o9J49k39l6M4J4KJ54l9
$$ y = [-149, 93, -60, -22, -198, 26, -12, 27, 30, 13, -109, -135, 67, 111, 48, 183, 44, 17, -56, -58, 156, -9, -15, 3, -146, 57, -22, 59, -39, 19, -43, 42, -51, -62, -28, 36, 78, 185, 40, -99, -18, -149, 178, 188, 134, 34, -49, -151, -25, -169, -102, 133, -81, 62, -74, -144, -113, -39, -94, 80, 95, -44, 110, 62, -15, -187, -180, 1, 81, 232, 12, 114, -33, 21, 100, 62, 35, 14, 104, -114, -149, 116, 95, 81, 106, 239, 158, -24, -30, -96, 19, -84, 209, -63, -141, -65, 118, -49, -4, 108, 22, 80, 13, -35, -46, -113, -71, 59, -39, -24, 197, -254, -211, 10, 98, -76, -49, -94, -188, -247, 27, 179, 16, 172, 86, -188, -223, 4, 87, 20, -104, 115, 54, -221, -61, 83, -118, -140, -55, 250, -56, 61, -59, -15, 47, 131, 94, 66, 77, 2, 34, -18, -19, 51, 127, -3, -83, 5, -219, -58, 80, -67, 50, 31, -5, -29, -43, -42, -83, 31, 123, 84, 55, -24, 29, -138, -24, 140, 69, -19, 179, -24, -51, -86, -71, 109, 49, 7, -17, -123, -45, -105, 108, 83, 14, 163, -76, -112, -68, -54, -52, 102, 63]
5245F3k05K4J71L3j66n5J83j7J31j04j32j4J01J7j2J34j74k5n2N7o2J18r4O7j07
5270a20K9M1Q1j52L50j91j22P3j1r3J65O1j05K49k94o8P9r8J70O1j40j52L77k53
5294f3k1K12j42l1pN5j5j65L47j57M8Q9l8o3n7O2j28J36j78J67k12n6J89P5j6
5319C1j45J32J11j22p4Q9o6O7L9J5j61R3r6N5q7J8R4pMJ58l11K75j08l7MJ88r0
5346F9k5r5R1j47J26L4j81J51j31J15j15R6N5J05j88%r3P1K14j86J14J03Lk55
5370f9k3M7OR5p6j86R3K28j7j67K29k39L0O9Mk17K09n4P1j80J94Q2m4l8j50m6
5396a49J79m6K9k7j8Q6k8k04l7K88J96l87K8K26j68p7J5J60n5P3j05q5O6K7n9
5421g2J21o5K8N1Q2j50p6J98k38n4L04j37K5N1q1Q5j47K39j14Q2k21J23j08O3
$$ y = [63, -142, -118, 53, 86, -80, -135, 48, 31, 162, 58, -74, -88, 13, 30, 18, 152, -22, -47, -99, -42, -104, 14, -80, -13, -120, -91, -50, 31, -121, 229, 38, -84, -11, -22, -115, 50, 111, 6, 255, -39, -107, -28, -126, 44, 105, -35, -187, 190, -63, -84, 128, -14, -45, -52, 3, -12, -177, 170, 13, 61, 150, 112, 49, -8, 54, -74, 62, -116, 51, -161, -217, -28, 47, 31, -114, 18, 129, 7, -67, 22, -44, 23, 62, 77, -84, 9, -87, -32, -119, -101, -7, -14, -10, 148, -163, 112, 4, -33, -29, 159, 69, 44, -51, 40, -107, 19, 53, -128, 23, -108, 7, -108, -12, 43, 148, -40, -40, -133, -62, 152, -34, 80, 183, 186, -69, -92, -45, -39, 56, -20, -206, -113, 115, 98, -69, 160, -79, -49, 20, 24, -193, 16, -38, 33, -147, 47, 129, 85, 47, -103, -149, 30, -16, 13, -14, -32, 54, 26, -178, -215, 73, 269, -118, -90, 136, -32, -109, -94, 66, 11, 84, -21, -106, -40, -13, -72, 49, -16, 12, 63, 145, -5, -81, 117, -121, -175, 129, -8, 17, 68, -13, 72, -75, 164, 50, 132, -89, 34, -74, -11]
5445a1M6Pp2o9N5N2q4J03O1j93K57j47q8R9j31K3J16P8j91P6k23K52M7O8j72K8
5471a3J35r9j76Q5J70o7j6j21R8k2o0M2m6J07kl6L6j55J91j43Q1K7q1J0O6J3R
5498C3j17K08j68o6k2J9Q0o2j07R0J26jr9J96j16K8k10J24Q7PL1K2j34J56j32
5523b7O1K8l3J07j63R2j16m4J85QQ6k05o5J01j89k5J56N7l8O7O4j19Jq1J9Q1l0
5550b2r4K02j82J05p2J09j80pP2J39Rj5p6L5l8p9J01K5J42j84K27j68q5P5J14
5575A53k27rM7n7J50O7j85R0k8j6R1j46P7L2Q8j34P2n1lL0j5j87K51K1k46J38
5601CP0j52M4N8L8l7j64M4R0L5%J01j20j50J33p4K17j8n5k41J3J92l2o5R9m1J31
5628A19j87R2K5M9j36K44j79K5n8Q4j13R3J07Q9j13j55j36M5j08K31K0j38L04
$$ y = [-11, 35, 42, -30, -99, -44, 8, -76, 27, 88, -105, 152, 5, -83, 16, -115, -92, 24, 102, -89, -13, -236, 16, 63, 131, -41, -13, 122, 23, -153, -68, 102, 35, 19, -102, -4, -26, -86, -44, -90, 17, 15, -21, 15, -140, 51, -92, -11, 16, -65, -55, 11, 24, 33, -84, 124, -44, -110, -132, -113, -33, -95, -202, -112, 14, 13, -86, 110, -6, 22, -188, -64, 23, 30, 61, 83, -51, 105, -27, 34, 62, 29, 136, -27, 65, -51, -95, 90, 98, 184, -21, -86, 15, -174, -199, -43, 14, -24, 43, 107, -12, -11, -92, -73, 8, -22, -116, 86, -96, 9, -63, 46, -134, -141, -69, 70, 79, 64, -12, 23, -15, -94, 7, 32, 174, -10, 217, 49, -36, 39, 153, -74, -83, -36, -93, 57, 124, -61, 29, 1, -15, 76, -70, 7, 39, 127, -7, 65, 14, 11, 41, 26, -161, 90, 111, -135, 3, 73, -79, -35, 23, 61, 24, -140, -96, -6, 29, 29, 130, 10, -140, -7, -81, 136, 118, 63, -178, -165, 27, -5, -70, 29, -12, 119, -68, 24, 49, 98, -38, 206, 27, 52, -6, 78, -35, 58, 165, 254, 141, -14, -150, -105, -213, 18, 38, -100, 204]
5651B04k66K2O4ql0Q0l8j4o7P3M6j13nP2J10j61j02K48k10m8k5K51o9j65J13O1
5677B3l9j42L13k13J13j8O8l4o7j02J19R2p1O8j94O3J6L6k5J20j84p6J15Q5j1
5702E5j07J49J0m9J13j20k05J35J15j43Q5j70l7P4KK7O9n7R5k0p5j99K09J10n3
5727A3j02K92j93q5J78q6k13K00mJ54j22j9qj54J01N3n8R1j86K73p3k76J62K7
5751c5J89j1k8k40J69n9j00K9K85j66p5j53J85j34J1J69J39j29M4k19J58n7o1
5774h9J72p1j25K5J16jk11K86r8pK18j76jj42P7J12k1j08J15j01j5RR1j83mK53
5800A21m2J16k29j02K12M4j9o6K1oj43K00n9n3k17K70j66R0P3m1rL6j6Q3k14J9
5826i7M1O5O9j85R8j54J24J18r0NJ7M3p6Q8l8j96J52J76q5k39K92n5N0m3j17J4
$$ y = [204, -62, -40, 24, 16, -14, 66, 28, 14, -53, 20, 66, -47, -52, 20, 130, -31, -133, 115, -95, -143, -168, 83, 14, -151, -38, 23, -16, -158, 155, -58, 55, 37, 105, 71, 4, -98, 21, 113, 42, 110, -84, -21, -5, 31, 6, 126, -58, -134, -19, 66, 55, -52, 97, 107, 58, 171, 51, -154, -19, 96, -47, 38, -132, -169, -95, -93, -66, 3, -54, 41, 21, -54, -253, -44, 66, 13, -89, 203, 10, -75, 103, 17, -196, 4, 0, 154, 32, 13, 5, -149, -48, 5, -53, 38, -148, 125, 52, -224, -62, -35, 154, 143, 115, -125, 44, -15, -115, -86, 199, 33, -42, -195, -10, -144, -133, 36, 175, 46, 90, -129, 29, -28, -89, 83, 12, -113, -88, 28, 27, -184, 102, 4, -3, 215, 39, 38, -104, -27, 85, 64, -44, 71, -30, -45, -36, 55, -128, -132, 121, 79, 195, -34, -136, 76, 120, 101, 35, 56, 50, -93, 107, 48, -5, -222, 48, -118, -28, 45, 4, -5, 31, 15, 98, -116, -97, -56, 9, 78, -107, -9, -163, -39, 79, -11, -6, 11, 54, -22, 66, 28, -168, -16, 160, 75, -164, 128, 73, 123, 80, -37, -23]
5852b3n3P8J12j0k22J18J49k34J73N0p4K5J9o9J42j23j87J39m8P9O0N5k27nK91
5877B15k05K8m6j39N7J34%k10R7J89Rj61J39q1j87Q0J13J4p4Q1o3mJ21nl0k6j8
5904B8p5J48k33J33J57k48L7j17J42O9j22N8J20k16j4J82J9j39q6K04q7J91l8
5927A13j58O4R6k37Q9J4J3o9J8K00j55Q6q4m1o0M7J46n6k01J70j71K90j12j01
5951i9J73j85J22m6j28K24j11Nk5J24J14k81J67O7j14j0rM4N8j10J20r8J39K1
5975A62k73j14K55PJ19j29j8n1r8J34P7n6Q7j31N0N7j13o7J63K5k12K24n1j5m3
6000a1K7j7j94J58j66K85l36K38M6NL5n2q6K01l1j16K05j2k16Q0k3j06qO4m3J06
6026C3j22L6K07j19M7j21k32n3L30k8l8J21o8q0J27n0o1Q1rN4q5j8K7J0j19J34
$$ y = [-23, -76, 2, 114, 104, -118, 0, 149, -85, 88, 138, 64, 89, 108, 39, 181, 58, -129, 10, -38, 41, 101, 156, -71, -76, 215, 10, 38, -8, -147, -90, 44, 44, -166, -69, 120, 129, -32, 107, 26, -161, -81, 32, 46, -28, 53, -10, -14, 107, 102, 72, 46, 28, -47, 101, -132, 1, 158, -90, -53, -170, -28, 41, -81, -23, 97, -119, -133, 49, 68, -71, -157, 47, -40, 151, 113, -45, 19, 115, -122, -33, -19, -6, -75, -57, 143, -12, 74, -10, -51, -111, -64, 82, 26, -175, -5, -176, 114, 2, -99, 74, -111, 11, -35, -163, 61, -50, -45, -70, 54, 168, -113, 54, 121, 7, -3, -12, 32, 90, -20, 100, 2, 141, 162, -111, -225, 30, 37, 156, 27, 9, -42, -140, -6, 71, 15, 102, -29, 21, 78, -35, -102, 61, 86, -126, 98, 47, 32, -11, 16, -1, -195, -37, -203, 82, -254, -16, 30, 35, 70, 18, -68, 133, 102, -14, 191, 179, -37, 43, 20, -86, -94, -30, -73, 33, -89, -53, 154, 35, 82, -39, -271, -324, 6, -22, -60, 61, -7, -87, 40, -10, -71, 10, 1, 55, -30, -48, -21, -11, -130, 4]
6052DO7l7j51R5j5M7J5K2l8K11k61J07K2j61J45Q8q8m9P9r9Kj7n2J23q1N7P3q9
6080A9PP9J16q0p9j82J85j97J2N1Q9K6J0mL1l20K00k5N6N7lP3j41J3k6M2J72k31
6108e0J36Oj68Q2N1J7j6j43O0PK16l75R3J02m4L1m5l7R2N9J38j22k42K78j81R5
6134D0n7Q1j62j2P1J1P5k20K27j1q3J64j81Om5J01j38L62l76R8O2l4J20k4k85
6159b10K11J63j74j9m8O5j65O0J95l2m1J85k23KM0R2o1j17J07o3M3M5J75l95J65
6184@j53J19l5P6M1j48J98j07P9m8l6J77n6r6l3p9J59j77J30r7Q5J27k12k8O2
6209e2L13k55L2m1K8q1QJ26j30K2r1K70k11J12Q2j71J15j40J99j14j35L1Q0M0
6233C7j7o3N6q9J31j12J11j11J15L3K1M3q4k3j18M8O0k8L5M7l95K43P5j43j5J34
$$ y = [4, 71, 34, -117, -22, -37, 10, 25, 47, 9, 220, -41, 66, 88, -73, 72, 160, 72, 23, 102, 3, 5, -12, -64, 59, -22, 35, 108, 19, 26, 105, 221, 141, 62, -120, 65, -132, -120, -69, 20, 46, 56, 52, 83, -237, -37, -62, -6, 51, 48, 121, -20, -7, -33, 9, 181, -50, 86, 92, -76, 6, 57, 74, 58, -85, -25, -18, 198, -177, -84, 18, -26, 5, -40, -77, 15, 74, 212, 90, -152, 126, -55, 40, -17, 64, -98, -110, -39, -28, 47, -173, 54, 43, -40, 124, -57, -51, -96, 5, -133, 229, -147, -49, 13, -21, 99, 75, -210, 1, 164, -10, -29, -77, -12, -177, -117, 78, 46, 5, 190, -33, -31, 9, 101, 40, -77, 30, -33, 10, 55, 230, -165, 0, -153, -34, -69, 7, 48, -100, 98, -9, 70, 22, -14, 163, 107, 11, -22, -101, 58, -119, 11, -86, -1, 126, -86, -114, -52, 261, 6, 38, -3, 25, -56, -48, 78, -52, -30, -121, 149, -62, 50, 132, -39, 76, -64, 135, 21, -114, -83, -3, 37, 20, -43, 13, -76, 55, -57, 54, -57, 58, 91, 112, 155, 71, 48, -70, -22, 38, 10, 45, 92, -303, -60, 15, -128, -143, -9]
6259ilK7J65k15O8p7K72k26j9J2O0J03l32J58J05k2k03J61k13J63J07j05j02K83
6283A58j52Q4j72J01P3l1j01k0j02K5J97j48Q5j04J54M9k30J72n2j69J19O5j44
6306a43K30j4p8l6J38%r1j3R1L7j29R8k18Q3Q1j5o8m2K97k39k5J03R0k08o2K90
6332A57k82R5O9l2p0o3J73Q6k00J04MQ7N2p1j16J48j62J78j38j19K00o3K1o2L3
6357B9R9j01p7K01r1K4r8J46mj40l4Q4j10oo6J64L0j07mK50l46J36J28k12O5O1
6383B1N5k48J48J04M5k46J21k7K39k56k2M7r1N9J02o7j1J09j42J20R9n2l4j10
6407c7J23o7R5Lj84J68j42p0J41L4R9k92J35J82l07K44k38K16k67J03J30o5N1
6430E5j08R7p4J9K8j44J37K8m1o2N8m0R0j62J64j09Q6r2m3J38j21J33j35L6P2
$$ y = [-9, -12, 15, 180, -35, 33, -44, 228, 2, -17, -5, 55, 158, -174, -16, 89, 67, -136, 25, -188, -25, 82, -23, -125, 158, 6, 90, -82, 19, 92, 61, -40, -60, -162, -137, 60, -88, -3, -107, 47, 96, -134, 38, -14, -183, -64, 1, -143, 87, 73, -5, -41, 97, 97, 6, -7, 84, 121, -8, 90, -128, -45, 36, 21, -47, -89, 208, -31, -56, 47, 137, -71, -133, 157, -125, -30, 39, 7, -63, -126, 47, 133, -67, 37, 41, 128, 180, 109, -7, 141, -21, 157, 19, -100, 100, 37, 58, -4, 29, 128, 27, -50, 151, 60, 84, -14, 132, 128, -12, -46, 38, -72, -78, -144, 20, 50, -57, -61, 189, -157, -21, 107, -105, -40, 21, 76, -172, -24, 80, 125, -121, 0, -27, 212, -44, -66, -19, -110, -51, 51, -16, -27, 82, -60, 60, 159, 107, 73, -37, 86, 19, 114, 117, -67, 101, -41, -111, 30, 64, 163, -129, 6, 188, -119, 125, -113, 103, -164, -61, 69, 4, 55, -53, 44, -30, -11, 17, -127, 10, 38, -3, -65, -7, -47, 43, -119, 45, -64, 22, -70, -113, 25, -96, 37, -98, -62, 10]
6455A0j95J56J70k65K29j13J13L2j3j30o8Q2J33j51j8j52J64m2P9O7j2J8r6P2
6479G0j44k8J57j25nJ54o0M6jJ36j94j12M7n0J50O4j42p0K15m4q2J68j05j14M4
6504b5J15n9j06Q7K1j29K11p3r5J16j55QJ22N0nj48J88j76N6o9J03q5P3L0r6L7
6530dj84K59K7j38j2J63j06J36j79j7K5j29J33M2R9q2k0O3j64J06O2j45m5J06
6554dJ7J09J44l52Rj27J02L0N8k4O4n8J08j66Q1q4K73j95o9O7Q4j82K28j89l7
6579a13J67k9n8J25J66k76k4rJ54k0j93O1k01K78o5l8j00J99r9L18k33o2Q1j35
6603a06L47l42L4J51l9J1o7j65R8J28M7p1m6Q9k5j09LJ9j02M9K06n4j44J06Q8
6628A06j91O7P6k15K09k0M4j25J24l9m4n7l3K52k22ko4K13j38n4J22J9Rp0J77
$$ y = [10, -185, -29, 141, -124, 105, -8, 105, 137, 124, -6, -74, 8, 141, -10, -28, -180, -16, -58, 21, 88, 76, 94, -2, 70, -74, -102, 55, -70, -75, 79, 19, 65, 64, 200, 6, -106, -59, -109, 41, 105, -37, -107, 108, 64, -18, 150, 45, -69, -25, 90, 31, -75, 12, 33, -96, 115, 42, -53, 63, -92, -84, 38, 88, 83, -65, 123, -53, 3, -66, 37, -48, 25, 55, -41, -4, -188, 71, 98, -40, -52, 111, 5, 141, -38, -55, -30, -159, -26, 16, 115, 33, 13, 76, -88, 18, 80, -65, -110, -4, 13, 122, 266, -86, -77, -204, -102, -72, -14, -38, 26, -32, 76, -90, -9, -93, 180, -15, -84, -17, 67, -115, 113, -76, -113, 54, 25, -33, 92, 258, -18, -42, -51, 103, 83, -110, -49, -250, 28, -37, -75, -175, 24, -75, 243, 10, -52, 29, -106, 241, -101, -67, 84, 45, 56, -11, -176, -78, 50, 97, 26, -20, 69, 44, -65, -62, -43, -145, -96, 110, 56, -88, 18, 106, -85, -18, 58, -157, 52, 32, 76, -49, 75, 36, -8, -65, -98, 154, -68, -70, -134, 79, -59, -113, 9, 28, 37, -33, 144]
6653A44j16L3n4j4j3O3p9l5Qk5jJ42k5j58J5J00j05K64k49R6N3j79j15K38Jj03
6679a14N1Pq1J74j80J76o6p4j30K33J12j96M5k1M2O7k4j29O4M4r2P9J8J01O8k8
6705A46j57J10j21l4N2Np0K48p0J1r0k29J18l8J58O3p8J22p9k64K03J40k37J88
6729I7j01J11k58L66k19L1j7J30n2k84K06o2k4J21K4j15J18r4LO0j62J72J8K5
6753I4j43M8j31J37j68J72M7L0J4j01L10k88j78L21k15n8M5mj4J63j32J96j99
6776e4m7J96k45K09o2L8J11p1l8k02K24l18K08R4m1j3K10k21n5R6j50J22j38J07
6800d0j2J00p6O2m8L5j07J35K7j49O5k5r7K04L3J52l10J26j58K56j51J53j92j78
6824a95K68k5p9J1j5j72L0J83Q6j22O9pj33K10n7m9R4l32J60K18k47Q4K46l01
$$ y = [144, 28, 61, 7, -7, -20, 43, -36, -71, -63, -88, -89, 53, 28, -130, -115, -15, -120, 144, -105, -9, 44, -135, -250, -12, -11, -114, -63, -56, -137, 37, -143, 33, -33, -107, -237, -4, 108, -88, -43, -64, -22, 45, 21, -108, -44, 0, -92, -13, 5, 106, 174, 146, -11, 99, -22, -56, -4, 1, -69, 179, 109, 120, 30, -199, -81, -119, 39, 102, 24, 146, 67, -197, 6, 146, -91, 97, -4, 107, -151, 215, -4, 27, 10, 140, 88, -196, 10, -52, -76, 45, 69, -46, 72, -22, -19, 41, -121, 51, 69, 94, -49, -1, -132, 5, -163, 9, 56, 86, 100, -1, 309, 21, -157, 164, -51, -109, -64, -68, -82, 81, -51, 145, -54, -101, 95, -150, 59, -3, 35, 146, 75, 37, -165, 59, -259, -51, 43, 2, -11, 199, -22, -77, 19, -131, -9, -147, -40, -52, 48, -28, 34, -14, 21, -86, 49, 76, -73, -8, -33, -130, 74, 107, 259, -51, 75, -83, 173, 22, 175, -17, -195, 73, 48, -31, -20, -35, -207, -177, 6, 92, -30, 39, 32, -101, 109, 52, 3, 97, -235, -75, 143, -104, -20, 226, -75]
6848g5J71j9l4j57J10P7j21J9J03Qj97Q9O2L2n7p6J42r4m9j16L06j34q8J01K5
6873B8r3J00Mj62J12k5o7J71o9k0L9r3J71j73pq5J48mL3p2J06o5O9j6j26L8L6
6900b2l2q2J15l8O3N6j23J17L9p5r5OK9J01n1L7l24K73j63Q6L0j44J17J66k20
6925a34J38J06nj67K8q0J23J14k18K62j67O0n8m2%P7J19k62n9J51p9Q3r2Q7P9
6950F4J11k13J31j2J32k82J8J33j35N5l4N6o4k9J01J3o4L8n5o4M9m0O6r3P0K08
6976A60j07o9l5J39k24K74l90J72J70j49p8J34j1ro2Q2R5m7L9n6k17K84L7k51
7000a19J58l9O5j10O2j1k16K35Rr2J19MK15l37o4K77j65r6J24n4K38k55L2N9m9
7025a0K8J48k83P5N3O6n7j74J17ll9N5J47O4j83q0Jo0K04o9l5P8q2j16K47j13
$$ y = [-75, 96, 77, 43, -114, -4, 73, -48, -29, 74, 82, -115, -26, 36, 68, 11, -65, 77, -17, -66, -182, 124, -10, -98, 3, 28, -65, 35, 39, -123, -11, -36, -103, 68, -1, -21, 18, -75, 96, -77, -84, -169, -21, -25, 8, -64, 42, -23, 46, 30, -96, -58, -22, -54, -136, -21, -59, 4, 60, -63, 54, 93, 18, -77, -71, -42, 59, 8, 45, -279, -6, -169, -83, -53, -197, -80, 86, -134, 4, 110, 105, -62, -34, -114, 9, 123, -95, 167, 0, 60, 2, -40, -40, 37, 156, -106, -165, -14, -93, -10, -102, -15, 64, 175, -38, 93, 81, 213, -69, -51, 82, -53, 2, -32, 24, -40, -69, 32, 45, -19, 19, -36, -100, -51, -91, -25, -118, -48, 160, 53, -16, -51, 88, -136, 138, -252, -80, 90, -59, -137, -3, -14, -23, -85, -3, 92, 45, 84, 28, -189, 95, 132, -119, 39, 0, 65, -45, 17, 6, -210, 25, 34, -58, 61, 65, 280, -57, -121, 156, -9, -105, 19, -35, 203, -52, -20, 39, -10, 18, 166, -117, -42, 11, 77, 20, -154, -37, -40, -79, -24, 123, 187, 4, -76, -75, -135, 69, 0, -35, 43, -39, -155, 92, -21]
7051b1J02j93J72j9J09q3j17J42k02R8o6l8K13r5J3j3L3j2q9J76o0j5j47K35j43
7076b0KP6k56K14K2o3j4j9N7L5k0K6j00K41j15jk11O8Q8Q0j15J55k1k46J43P0
7102G6l2j68J28Mn8O6j45O5K4M2M1m2j06M2K7o7J39p6j21L9O1K6J81q0j3r7J23
7129G9j26p4J46j65O6J41No3kR3j42J47j04j4lJ92k08M4j2p1Jk1J68j22Kj17n5
7156b15K59q2M6n4P3j23Q9p3K2OJ00j12o1L2J31k0N6j0J5J13k94l5K00n4j09j9
7182a19L2J69j9L6j64J29j99M4M6m0J20J9m6J19p0M3j7Lj46Nj84L18Jj4j80J35
7208B1k11K41J89p0j97J54m0j05J22q2L2o2k0J9R5j22J52k69J61o4LN2J42n4J15
7233B02j72l9J2J88k53O8k4N5o2Nk3J61j05J61j15p5j09J6J66L9p4k7J19j90r2
$$ y = [-21, 81, -112, 60, 41, 150, 67, -50, 92, -110, -12, -78, -116, 97, 2, 15, 2, 35, 23, -66, 110, 50, 35, -112, 123, -20, -18, 58, -198, 16, 38, -25, -39, -58, -1, 34, 14, 40, -60, 181, 66, 65, -146, -78, 10, 90, -25, 130, 109, -137, 6, 76, 44, -124, 4, 8, -50, 16, -129, -64, -40, 2, 43, 1, -105, -63, -36, -103, 36, -40, -161, -122, -61, -35, 146, 66, 53, -44, 79, -47, -121, 25, -140, -74, 67, 72, 9, 7, 100, -42, 105, 1, -13, -16, 176, -32, 12, 0, -71, -70, -91, 77, -45, -43, -160, -215, 44, -38, 8, -46, 27, -96, -7, -80, -58, -52, 48, -64, -125, -93, 38, 18, 74, 64, 79, 192, -102, -137, 63, 9, -100, -119, -87, 82, 63, 99, -65, 64, -135, -91, -45, -85, 35, 54, 8, 127, 57, 100, 83, 86, -60, -55, -239, 79, 80, 66, -114, 21, -190, 51, 240, 170, -27, 127, 87, -18, 104, 22, 54, -8, -28, -9, 86, -36, 116, -153, 8, -56, -53, -1, 141, 87, 202, 30, -9, 3, 191, -62, 6, -18, 37, -25, -20, -43, 118, 13, 174, 59, -16, -125, -109, 57, 96, 22, -5, 114, -76, -168]
7258a68L31k23N2J75n7n4n6k8R2m3R9Pn1k7k39K15r8J31j71N0L6J8L8j75J97m4
7284GJ44j70p8J23n0M9j67K01j91O9M5J2kJ39j40L8J6k08Q2Ln1J24rj12p2J33
7310f5L9n3L5rK5n4J65j18K10r7q0k5l6K48j66n6P4j46N2j27J47RnJ25L8j41K4
7337A3M0k62K58k18jK68m9k10K36j89K48j33p9K24k34J02p1N9K05k08KO8k04J54
7361A9K18l59j02K41r8M9J5j9J3J11m9j3J46k03m6J56j10J36Nk2j4j68Q7j03R6
7386a4P8Q2r2n8J6J87k79j52J78J08J8j58L2K47j81or5j48K41P0j32Q4j95R8J8
7411e3R8n3J18k9j59J42j46J56j59O3J59l32J82p5O8J02j02M0j71J40K9p5J31
7434G4p1m7N5k22K33k02L17j16K9n3R9j91J49R3j15l2M7l2j05K02j00l0n4K71
$$ y = [-168, 163, -60, -8, 167, 110, 56, 0, -28, 64, 21, 120, 127, 76, 49, -190, 25, -73, 58, -113, -63, -27, -9, 29, -146, 51, 7, 151, -19, -97, 26, -24, 25, -142, 59, -132, -63, -18, -6, -8, 131, -9, 29, 45, -163, -81, -78, -129, -5, -14, -126, -198, -65, -26, -79, -44, -53, -28, -82, 83, -35, 175, 78, -2, -27, -63, 185, 19, -37, 37, -109, -57, -184, -37, -28, -33, 92, 130, -11, 13, 53, -209, 49, -169, -170, 98, 49, -161, 75, -114, 134, 1, -78, 146, -88, 14, -57, 2, 207, -1, 1, 69, -135, 19, 237, -122, -224, 17, -81, -32, -17, -36, -23, 88, 39, 26, 172, -31, -77, 79, -31, 105, 110, 88, 74, -94, -7, -110, -14, 64, 146, 54, -4, 12, 199, -80, -232, -54, 54, 72, -86, -54, 193, 12, 6, -89, -237, 4, 74, -58, 26, -169, -71, -53, 45, -8, 110, 81, -78, 64, -82, 74, -85, -22, 137, -195, -13, -88, -20, 82, -20, 20, -151, -11, 18, -57, 74, 3, -44, 11, -211, 22, -180, 137, 21, 50, -3, 96, -95, 54, 147, 32, 0, 47, 15, -90, 112, 12, -18, -72, 199]
7458A99j82q7J10j11J40j07n3J4j9J05N5Llj48j01P5R2M3J42p7P8N6j50j14l1
7483g1J69j94J13J26m7Q6j08n9k5N9q8K3l8J3N1l9L1j28O3J46j9j80J26J4J0J5
7509D9o7mQ8j17R9r2O9m8k41L61k1r2R8j13O6j35M3K16j71J42k1j10k5Q1j17J35
7535G3q3qN4J53j23RL8j17j26J11l9P4l7Q1j67j2K25j81k7J57O7K4k68K38q9j50
7561a23J79k5ko0J31r7j41K23K1j60%L4R2j11J00j89j7K27j64J67j33j8J2M5M6
7586C7J84l17L8LP7q8o1R6n3K0J74j14k3J73k92R9J87j43j19M2J56nk08P5J52
7611I0p5j10m6O7N4J49k02P3L2k7J27j16r4JK07k47J41O9r1R5j95QP2R5q1Kq6
7638h8J46l8m8J44j08Nk1p6L9k5J03J6J1L1j65K26k59P9jN3k8P5m6J4k18K04J3
$$ y = [199, 17, -70, 40, -71, 69, -38, -91, -77, -96, 9, 64, 67, 64, -84, -185, -110, -18, 25, 167, 90, 168, 224, 74, -40, -71, 98, -96, 17, 143, 96, 182, 74, 15, -10, 49, -39, -16, -54, -41, 10, -29, 2, -126, -63, 83, 64, -116, 10, 24, 34, 49, -18, -22, 66, -51, 48, -44, 25, -23, -264, 97, 76, -16, 82, -31, 35, -100, -57, 159, -12, 130, 109, -1, -26, 55, -62, 73, -10, -18, 36, 189, 66, 75, 113, -4, -130, -19, -58, 16, -21, 60, -107, -119, 106, -75, -102, 55, 122, 146, -122, 116, 27, -123, 56, 31, 29, -31, 100, 3, -138, 85, 106, -54, -54, -20, 72, -39, 61, -128, -145, 82, -82, 85, -48, -66, -54, -9, 37, 221, -96, -58, -55, 22, -66, -127, -31, -84, -64, 110, -4, -27, 146, -146, -47, 140, -3, -122, -80, 76, 71, -137, -62, 90, 15, -95, -141, -74, -20, 129, -73, 0, 32, 5, 132, 16, -78, -77, 130, -117, 24, 93, 2, 97, -98, -90, -18, 77, -4, -2, -88, 58, 20, -28, 116, 8, 13, -8, -84, -45, -70, 33, 49, 60, 91, -74, 152, -107, -28, -29, 24, -4, 71, 25, 39, -179, 25, 38]
7665C8k68J89J4J0N7N4nm7j81J22r8Q8n7Q1k0K04j93J68j64L9j06k5P4M4k3k4
7691b9M8j63JK07L8j42O1pM6M0j85J51k9m2J76n4k40K25ljk09J23l6j12K54m0
7717G8j21nO4j3L1J40j00k9J35j85%J7j18J50olp7k0J32j63K25Lk02Q8K88l50
7743d1J4m3Q7o0K12j60j27P4J1K15L7k29k8J52j18m6K6JJ1r3K51j31J9rR1j50
7769c4N9j13K5K5J15n0Qj21J79m0j40J84k9M5r8r9J68o0J76r4p9j08l8Q0q2P5
7795d6m0k4o1J21l6M8m3p5K04j9m2O2r9J55k16J45J66r9k75J45K0j77K74mp3J02
7821A13p6j08J39j15J47M6o7n6J0j8j19L4J46m5L5j44l0k7K27r7j68K93k24L05
7845B01j48Qr7J14j56K26j90M7L8l8K4o0j24K25j95Q1kP3n5p8J7o7N5P7P7k5j30
$$ y = [38, -230, -41, -27, -17, 40, 94, 89, 42, -139, -17, -115, -27, -84, -3, -23, 181, -12, 156, -8, 31, -75, -100, -26, 18, -5, -29, 19, -144, -143, 64, 102, -40, 21, 14, 60, 100, -85, 66, 37, -5, 171, 117, -123, 102, 99, 98, -111, 12, -24, -136, 118, 78, -43, -48, 16, 3, 34, 174, 74, 45, 180, -5, -5, 12, -106, 44, 38, 35, -42, -62, 70, -93, 132, 135, -67, 21, 309, -41, -27, -70, 17, -43, 169, 9, -118, -44, -33, 182, 219, -10, -38, 114, -4, -50, -24, -23, -12, -105, 146, 15, 34, 25, 116, -34, 25, -88, -63, -38, 77, 27, 35, -86, 93, 53, -87, 97, 68, 113, 15, -84, 84, 24, 200, 106, 27, -81, -119, -39, -121, -46, -86, -110, -171, -50, -86, -38, -81, -156, 48, 29, -13, 49, -50, 105, -111, 34, 200, 101, -174, -29, -9, -186, 88, 84, 11, 113, 37, -71, 68, -47, 100, 146, 79, 23, 33, 15, -104, -70, 76, 31, 66, -78, -108, -135, 92, -5, -173, 120, -104, 201, 53, 61, -36, 78, -78, 148, -42, 5, 43, 5, 29, -31, -155, 70, -125, -44, -46, 27, -28, -106, -89, -156, -101, -24, 53, 28, -102]
7872a02k2K8J16J13k21J29K05k19mO1m2m8o8l7J09J68n1k30J35Q8k00K8L3Q8j08
7897e1j00P0J31%l9L7q1n2R1n7J72mk15P8M0N6K8j11Q8j31j44O7J91Q8k78K35
7923A09O0N5l57N0J54j35P0o2JQ9k1q8m3J51m4r7K7LL00j66k18K65j37J45k9N2
7949A34j94J92j28Q8j08J84k01J7J15l48K62j56K02j27O5O7j57J93r2j38J05K2
7971cq1R6J3K2q2J80j12r8N8l8N9m1J96K1j55q8J95k19N6J65k30N5J40jq3m8n8
7998h1Jk2J14rj3O9j44o1K04r0K3J04%j43O0Qk1j35J55N1j13rQ6Q0j72O9m8N5
8026A8o9K02j47j04R4r7J74j63J08L1N0j93J05k00L05o4J35p1j03j6J15nq1pr3
8051g6K33k52j3J07Rl3l2K5N2j72K13M7j41N1J30j06j64J63K6j09L6l8P6m8J36
$$ y = [-102, -124, -96, 20, 133, -88, 41, 246, 27, 23, 84, 42, -6, -74, -111, -2, 166, 115, -115, 20, 108, -92, -64, -31, 57, -51, -151, -81, 50, 50, 11, 48, -33, -85, 6, -51, 121, 117, -98, -20, 20, 76, 104, -7, 81, -50, -194, -127, 64, 152, -126, 109, 169, 224, -133, -83, 71, -64, 6, -56, -55, 34, 13, -75, -118, 33, -11, -108, -81, -78, 222, 56, -162, 103, -34, 111, 82, 134, -60, 132, 4, 92, -16, 168, -33, -16, 99, -249, 13, -143, 59, -68, -3, 64, -93, 100, 8, -130, -25, -3, -84, 12, 25, 47, -35, 145, 33, -65, -7, -45, 14, -27, 169, 190, 35, -53, 142, -77, -21, 144, -86, -31, 109, 108, 25, -23, -81, -80, -102, 12, 3, -10, 59, -85, -146, 58, -32, -9, 95, 95, -48, 12, 20, -1, -136, 19, 70, -43, -52, 34, 114, -58, 11, -37, 18, -51, 151, 4, -100, -6, -103, 71, -92, 16, 47, 97, -96, 9, -191, 114, 50, 185, 114, 11, -5, 110, 105, 24, 17, -76, 157, -95, -108, -1, 8, -25, -57, -32, 20, -152, 61, 108, -33, 18, 148, 42, -122, 41, 67, -42, -6, -44, 32, -16, 120]
8076A20j98J87o6J6n7m6l5M4K17k51L9jJ11r1J1o7R3j24kJ10O9p4qnr0O3N2o1
8104d4J0M7q0L2J68p4o7j23J91k28L24k29PO0Q5k12J42j1k03K34r7K13r4j9r3
8129f1K8k5K20j70j22J89p6k6Nj3K06k46J27O8j51L7m3J48N4j31M8N3k51O3J81
8154A12m3j04J40j9J47k38j7O3k15J74J25j35o2J63m4p9n3PJ3j26L07n1p6p5J24
8179C8Om6r5J29J27j79j05J96k6n5N2q7
$$ y = [120, -78, 109, 43, 59, 2, -44, -79, -35, 182, -69, -30, -31, 80, -11, 0, -67, 26, -98, -100, 10, 79, 5, -3, -8, -98, -35, 17, -44, -34, 13, -67, -35, 133, 59, -8, -131, 60, -168, 156, -73, -66, -6, 79, -133, 9, -2, -205, 29, -68, 145, 51, 32, -61, -33, -58, 162, -8, -130, 59, -17, -43, -38, -51, 155, -91, 36, 104, -47, -10, -53, 95, 149, 18, 66, 119, -132, -69, 112, 69, -35, 105, 86, 233, -5, -22, 41, -174, 0, 125, -10, -72, 91, 47, -32, -85, -78, -65, -191, 116, 65, -11, -86, 38, 44, -2, -97, 32, 159, -20, -125, 71, 45, -10, 42, -45]
8191d5
$$ Imaginary data points
##PAGE= N=2
##DATA TABLE= (X++(I..I)), XYDATA
0@%%%%%%%%%%Qj6J6j8K6l2M0n6O5p3R0j14J36j60J91k23K57k98L46l95M51n17
32b76N89o68P55q53R60j075J204j347J500j666J850k050K270k510K770l056L369
49A766l712M089m504M965n477O047o687P410q239R198j0317J1649j3265J5269
63H192j7835K1260k6083L3418m6050P3658k40104J70481L38793m34176Q9053K77073
75B47680k97594k59079L65323O4634k32627J33173J73169k43043p4189J57947
85C5394n1825r2708J62779O3554j19035l5861M1216m0787k9800M4093P6426R341
97F2787o6343j4208M6575p7098o4622J47258P5943j41198J8267J17303j50842
108d6178j13130K00366M5218j66393R9962J35429k09833j03391J98127L686j29893
$$ y = [0, 0, 0, 0, 0, 0, 0, 0, 0, 0, 0, 8, -8, 8, -10, 16, -16, 24, -32, 33, -40, 50, -64, 72, -88, 103, -120, 137, -161, 185, -210, 241, -276, 313, -355, 400, -453, 507, -568, 636, -711, 789, -877, 973, -1077, 1193, -1317, 1453, -1603, 1766, -1946, 2143, -2361, 2604, -2873, 3174, -3513, 3897, -4342, 4856, -5461, 6188, -7077, 8192, -9643, 11617, -14466, 18952, -27098, 46560, -193544, -23063, 315730, -118446, -29393, 247680, -49914, -308993, 56330, 120964, -111663, 21510, 194679, -48364, -122553, 35394, -16431, -109139, 53640, 117194, -1841, -37702, 3514, -37273, -67073, -22980, 53446, 62787, -3556, -17764, 28811, -48287, -112909, 34349, 110292, -30906, -12639, 104664, -46178, -159308, 41058, 86276, -80117, 19845, 155274, -54559, -157950, 40177, 43863, -86030]
119h6030J31455Q9440j83194m4408J36602m3284p7481J14882M4811j06234R462
130a3979O2141q4682n2906J08695M8379p4984L231N4889o6811p5796Q0700P5173
142F4050o4071k0153P7422l1266j00611M2532P5860m7118j0257P2152l5185q2012
154e8657M2918M2130m9605J1637O0015l6577m5745L8752Q263m3289J4715M2484
166B7041r906k0699O382L547j2477j0463J2060K1794q391j3405K1312o533m5508
179c5246J7244M3564l0074q903N4885k9167o8859N1531M4860o6000O665P6790
191E7290m6676o1651O3917J5524o7922L3752N6387n8948k2864N7872k3306m4468
203d1093N3894J9328n8007J2336M5604l5595k4571L8567J992k6091J6389J2937
$$ y = [-86030, 45425, 134865, -48329, -92737, 43865, 581, -76900, 37982, 82793, -23441, -13979, 48162, -36520, -89426, 19269, 67648, -7336, -4105, 50784, -16027, -91823, -11123, 64050, -21, -20174, 57248, 25982, -74629, -32097, 43763, -3355, -13612, 58540, 23355, -58657, -15739, 26391, -23214, -11577, 48438, 11861, -33884, 4868, 13131, -30158, -15443, 27041, 17135, -3564, 2818, 6365, -6112, -16575, -4515, 17279, 8888, -4517, 16795, 10262, -35246, -18002, 25562, -4512, -13415, 41470, 12303, -56556, -5025, 39835, -26165, -19500, 57290, 10614, -51037, 12880, 28404, -39518, -5766, 50621, -8327, -31191, 26681, 3375, -41093, 12801, 32129, -25878, -13542, 32062, -3533, -28104, 10463, 12455, -13636, 2753, 15690]
215A5690j7103k637L282n532R213N170j1750N338N946j8630J519J8166j1902m673
229g903K3395j2007k4710K6255J1625l4354J0209L6057k8724k5415L8944N202
241A8574l9754J4410K9843k7275j2673L0064o883k5336K0002J2725k5236L946
253g593K4763j5955j8218K1374P889k0897L434J9551r416j5352Q536P849p421
266a456j613O065k47m853j643J140J921J765j51q57p69J68J393k08k087K748L932
283E248m931m571P266K944j0555j360J1506j636j1334N475Q132q377n104R081
297A784K182n981J664K929m111M28M092k234j249M781j853p319K603O255k281
312A690m654J928K761k344l411J610M926l77n264R66N950j973n345M075M643n226
$$ y = [15690, -1413, -4050, -768, -6300, 2913, 8083, -3667, 1671, 7617, -11013, -9494, 8672, -3230, -7903, 15492, 3485, -21225, 5030, 16655, -17699, -7490, 28567, -157, -25572, 13372, 18574, -21180, -6770, 23073, -4202, -16875, 13189, 6306, -19030, 972, 13697, -11539, -7593, 17170, 1215, -17003, 4371, 12260, -8637, -5203, 14348, 4932, -10420, -1884, 5965, -1456, -3069, 2996, 2749, -2104, -3747, -2607, -686, 1079, 928, 71, -698, -530, 863, 655, -1432, 1316, 5248, 317, -4254, 3012, 5956, -4599, -5959, 5547, 3911, -7423, -1948, 6184, -2193, -7297, 1784, 3966, -2015, -351, 2578, -1533, -1105, 2987, 753, -496, 4285, 2432, -4887, -2284, 3971, 1690, -2964, -1036, 1725, -619, -4030, -2420, 2506, 2129, -3135, -2169, 3781, 1808, -3537, 538, 5181, -45]
328d5l234N330J397m182J10R68k925J163L782l079k675M798K64p063K262Q620
344E491k632p410M663N507o342m046P390L221o796j803M617n70m760K248L560
359B338l295j869L591q45l393M200K110o313J096Q219l696p472O454N402q808
374b281k499R008m50p456J865L952k792j959J396R60N85r97j238K726M13l260
390b027K567J883n240K685O950p787m475J1890l089j4921J1941J2866j8996n224
404a0977K1346p579j9140J7820J1518k0573K386J7892j5650j0358K1776o34j7529
417i702J3609Q976k1655j137J9173p456j0320J2920K248j1572J523L312l400K922
431e59J831j565N918k285j1146O173P116j1083M379J4980j3255q881J7393q808
$$ y = [-45, -3279, 2051, 3448, -734, -624, 344, -2581, -1418, 2364, -715, -3390, 1408, 1672, -5391, -3129, 5491, 2859, -4551, 112, 5619, -723, -4769, 2621, 5842, -954, -2757, 1860, 1290, -3470, -1222, 2338, -957, -2826, 765, -80, -3473, 727, 2837, -3476, -2380, 5839, 2143, -5329, 1125, 6527, -2281, -4780, 4228, 3778, -3678, -1813, 2139, -653, -2612, -1216, -256, 329, -668, -1906, 820, 1233, -2027, 540, 2423, -2817, -132, 6818, -969, -5444, 6446, 3357, -11564, 377, 13243, -5753, -10977, 10369, 2790, -16350, 1470, 12988, -7585, -5199, 12693, -2957, -13315, 8461, 7827, -9702, 3907, 12883, -8772, -9909, 9264, 1808, -8512, 4408, 6656, -4916, -3393, -81, -3481, -559, 1272, -293, 5625, 3340, -7806, -1633, 5483, -5600, -1221, 13759, 504, -8377, 9016, 208]
445B08k0713K3434J6564k7500J242K4904k3853k0570L3670P909k7380J4599J9317
458B1831l0120r357K6596p830j4087K6157O631k9306k85J5691j2776o156K1698
471H687N575j5451l273N780m465q869N816J7031K169j3364P06L264j6789p84K6040
486A2073p29j7017J5095L347l2700K195L0056j3637j0937L4803k147m3470O956
499a6112K6389j9265l251L5466m146l0537P171R207j9966J403K6575L249j4120
512B063L0k48j5818p317K1637J9289j4274j0749J8030q586l5314J7198L7146k1976
526A111j1311M1693j5205n6750K5852L8542l8145J451N6330k9759n4056M1353
538A106J7757n5103K0350O3109l4695l9856L9964j750n1044K4822N0049k2304
$$ y = [208, -20505, 2929, 19493, -8007, -6765, 18139, -5714, -26284, 7386, 15295, -12085, 2514, 21831, -8289, -17646, 8950, 1120, -12967, 13190, 19821, -9485, -9770, 5921, -6855, -13011, 8687, 14262, -1189, -4462, 1318, -3147, -12016, -6200, 10831, 13000, -364, 342, 3606, -13183, -13967, 12073, 11344, -5673, 9422, 12769, -19931, -17736, 12320, -1317, -12254, 22549, 20402, -23068, -16112, 10277, -8988, -12239, 23227, 19081, -11456, -4285, 4922, -15044, -13641, 12934, 16183, 2063, 2093, 1845, -13973, -21290, 347, 19636, 5362, -5387, 12643, 4057, -31257, -14059, 23087, 1111, -10200, 31493, 16288, -40462, -14610, 23932, -14213, -12762, 43568, 13809, -40247, 1106, 18863, -36240, -15890, 47219, 12524, -27332, 12632, 10882, -40162, -15340, 34709, 12405]
550A2405k2189K3285m832l3036M924K7092K670q682Q707O152k5998k3215K5479
563g238K3400k0143M254L2921k9152m4030L6800K4161m5402J5170O0170l8222
575A2689n1459M4410R368n6010L2203O0611m7312l4486N0164j1291n5606L8289
587h430M6059m1106j0254M5217k2559m9896K8641L4482k4307l172L2540j3271
599A3944l9923R364K6500j4269q429L2585O214m0094n718K7392j5204j7189M3399
612A8572J7323m8414n450L7079k5475k9207M8628K1429m6699L770L5857l6125
624h712l0814M6601J7053l6565J1477K8118l4376k4204L5402R469k7515J3726
636c40K8313k3407k7096J9644J2138k1884N414L2449j0702l3857J2433J8986k5169
$$ y = [12405, -9784, 13501, 8669, -24367, -19443, 7649, 10319, 1637, 10344, 16496, -9502, -32717, -7238, 16162, -3981, 273, 33194, 4042, -39988, -3188, 20973, -24429, -9259, 50911, 12689, -38770, 5640, 15008, -41002, -8799, 51812, 4500, -29986, 20178, 8887, -46719, -8430, 37629, -3477, -13731, 31486, 8927, -40969, -12328, 22154, -2153, -5325, 27215, 13944, -25979, -16615, 9885, -4384, -12813, 19772, 25986, -14108, -19826, 7566, -7638, -24827, 18572, 35895, -12519, -17969, 19110, -6365, -35572, 13056, 34485, -12214, -8444, 27413, -8712, -39526, 7075, 24128, -12437, -960, 27158, -7218, -31422, 3980, 13449, -14066, -340, 27973, 4566, -22530, -2886, 9252, -12632, -7218, 25231, 14529, -19328, -6895, 12091, -13078]
649a3078m250L7726m172l3557J7310J6989l6356k467M3981q974l0738K6893J1297
662B0604m2068L165L9055j7241k1355L1870N324l6888M820K4362j6765p955K7015
675A3943l48k4692N230J2244j2162l200J7806K044j4367K04Q986o758r380J0459
689IJ2340j0958r468J2282O35j7092O508J8104j2322j0534J9045N4k2316R109
703d604J7299j6975m998K3875o433k3257J3747J3910k0427j523K2941p562j8726
716a2733J2268Q709j6367N90J7412n567j2126Q684M365j0707J736J1071m286q078
730e029O517M206r285j402R740j349r264M637P386q008n231R477J858r208K557
745b398Q426n593n321O853J481p005L013O349n659m127O060P88o916K119O139
$$ y = [-13078, -17328, 20398, 16226, -17331, -21, 16968, -19388, -21855, 22126, 13152, -17586, 9307, 20604, -21464, -18299, 20756, 3515, -17840, 14030, 19354, -17534, -12714, 11648, -5117, -13072, 13943, 13595, -11097, -5867, 6377, -5785, -8985, 8821, 10865, -3502, -3298, 5688, -1070, -10450, 9, 12349, 1391, -8077, 4205, 4840, -12252, -5744, 12360, 38, -10496, 8549, 8603, -13713, -4604, 12695, -4280, -9278, 14597, 8164, -15093, -1346, 12564, -7863, -9386, 13555, 5993, -12733, -465, 8244, -8123, -7533, 9879, 4312, -7814, 870, 5235, -5472, -3736, 7335, 3049, -5029, 1488, 5694, -3591, -4993, 4747, 3398, -5866, -1229, 6157, -1851, -7082, 2395, 4253, -4955, -2398, 6028, 435, -4886, 1967, 3448, -3557, -544, 5805, 146, -3981, 2079, 2867, -4049, -1930, 4209]
760D209l926m674M678K192n269M0N585l79n123J844L688l352j612M292L65l891
776a333J213K694l867j357M777o18m285K371K882m620j741N494K64l761J767K528
792B408k662j470K359N77j178P46M14r42l07n69k85J174M78j358Q9M66r40K93
810g07Q89r78L33K395j094k452K057J579k813k14L510q33l135J534R94k393m18
827a746K130J04j077N14q7r02J89R86J38J66L67M2r51m56P48R42r43m39J600j75
847A150k696J87K059o29j904J717J134j570o96J290J64l30P3P31N74q67j043P87
865A31N50q42M59R19j816m52K205j618k443L237J837m530O69M790k954l825N153
882A470J860n287J089M214l202k085L840q24l585K649K203l627l32K676j212k092
$$ y = [4209, 283, -4391, 287, 2479, -2790, -2750, 2835, 2456, -2667, -823, 2865, -487, -2099, 2193, 2558, -1333, -120, 2574, -1293, -2650, 2127, 1509, -2776, -405, 2477, -2143, -3884, 1610, 1874, -1887, -120, 2408, -254, -1724, 635, 1212, 34, 780, 1194, 252, -55, -624, -909, 265, 743, -615, -526, -60, -1000, -707, 182, -796, -463, 1932, 838, -1614, 443, 2022, -791, -1005, 2505, 1672, -1463, 71, 1065, -1328, -1746, 384, 488, -589, -75, -162, -1064, -875, 111, 249, 415, 782, 824, -127, -583, 165, 1107, 164, -275, 1325, 1150, -1546, -1359, 700, 71, -1833, -116, 1018, -552, -1248, 42, 206, -124, -51, 680, 1254, 387, -656, 131, 681, -161, 298, 1217, -599, -1051, 1154, -464, -2907, 330, 2167, -2363, -1694, 3096, 142, -3683, 1470, 3330, -1957, -868, 3346, 144, -1941, 1899, 1075, -2510, 139, 2342, -1285, -1617, 1059, -153, -2245]
898b245J684J401j066n87Q68J479j236k450K318K818k981j750M503j176m975L038
914c57L337n156r6O168m048m496O298K31p323M386P485o828l784Q004j389p768
930e336M824O205n894k229O037k102o225L017L842k849l80M066j966n328J685
945b633M814k418k277O098J598p953o41O530l666m157Q216L216r180l40N675o080
961c198k985R842O79p654M376L367j0112j003J0388j388m668O967J362j0133j845
976f005O768M92j841L527J700l895m907P7K902M5K52O388K24j0128k90O592n887
993c986j447J4437q7j5106N572P985j6400k075K1547k974j4878J2671L905k2578
1007a3414K048K0621p811q450J7548j618k1422O164J2868j1841n37J8885l423
$$ y = [-2245, -561, 840, -226, -813, 55, 1534, 298, -2152, 166, 2984, 3, -1747, 2756, 1580, -3395, -357, 2980, -2176, -2272, 3896, -152, -4648, 1650, 1881, -5442, -1056, 6429, -399, -4183, 3821, 2432, -5336, -512, 5693, -201, -2430, 3607, 1505, -4720, -1703, 2139, -710, -1090, 2976, 1010, -4318, -2633, 2181, -237, -2514, 3584, 5182, -2771, -3412, 3118, -548, -4705, 3511, 6727, -2453, -2793, 2882, -3198, -6183, 3659, 4338, -3316, 1060, 4427, -5685, -6688, 3700, 2312, -2356, 4611, 5973, -4160, -6005, 763, 1255, -586, 2941, 4641, 746, -4161, -4084, -1182, -1137, -885, 5503, 5727, -4401, -4691, 1901, -3986, -5433, 9004, 8917, -6189, -617, 7368, -9032, -11107, 10440, 7466, -7412, 5259, 9164, -13414, -11366, 9255, 1444, -7006, 10542, 8924, -12498, -6334, 6534, -5307, -5844, 13041, 9618]
1020I618j6425L501M716q485K354J2352J58p614k083N18k593l115N131R776j256
1035F553q346K840K78j2297L064J8687l863j1583J1880J200k3030L411K1825r314
1049A305r976K1353N1k7650L996J8539j2266m309K3852k309k3586N981J2042j5465
1063h442k015K2585k72j7376N646O607j6792l378K0418L473j3889M377P574j4935
1077f419p964J6166N288j0977O235J0890j4617j2838J3603N950j1133O815J4489
1090A5488j3026j5058J0885N984j2683M148J7141n591j4941N565N149j1848M85
1103h302J8051M23j4484L718O775j3311m433J8757J870j4886P796J0312j9877
1116g591q684K2459J287j7666J2808J3714k3290q717K3302l058j7748J7196J3107
$$ y = [9618, -6807, -3306, 1410, -7075, -4721, 7631, 7789, 175, -1908, -1390, -3983, -7098, -1967, 7809, 6553, -1793, 1047, 1325, -10972, -7908, 10779, 6916, -4667, 7213, 8413, -14617, -11206, 10619, 1305, -8671, 12682, 12733, -14917, -10921, 7618, -4648, -8957, 14895, 12586, -11000, -5019, 7023, -8442, -10457, 12128, 11856, -5520, 126, 6733, -10059, -13437, 6981, 10454, -3435, 942, 8516, -6419, -14383, 1783, 7071, -3906, 2329, 13219, -1398, -14236, -633, 5317, -5816, 999, 15488, 2462, -12596, -1711, 4273, -8410, -4262, 12879, 7288, -7653, -2088, 3061, -8787, -8302, 9749, 10172, -4312, -594, 6181, -7130, -11563, 7194, 9064, -5822, 1974, 12286, -7591, -16275, 6184, 7471, -10195, 2613, 16327, -6963, -15680, 7622, 4564, -13184, 4012, 17119]
1129A7119k2293m500J8274r182j3274J9154Q258j8575O26J2376j1525q358J5056
1142C156M140j0800L268O745q188o056O411M273k266Q44K534k326n801j20O042
1157A856j72m451N643L703j0611k777J0491l062r215J2183P064j6395j409J5458
1171H306q103j1486J5896O128j7439K966J4170j2652r232J7195J183j5200Q306
1184C8J0048j5361m366J6363l070j2496J0268P684j3378k010J1838m064p823Q768
1198B439M144r118m96O311l320l706N038J771m673l9L220j568l281K518L308k047
1214E01k709K634K488m507j789O455K49o595K563N730o015l917P680N37q048L598
1230a145O522p737l056R247j242q593O389N767r419j195J0328l577q157P422M646
$$ y = [17119, -5174, -9674, 8600, -582, -13856, 5298, 13556, -5019, -4393, 7983, -3542, -11900, 3156, 7296, -3504, -236, 6509, -1679, -7735, -1324, 2949, 683, 1527, 4061, 1735, -4066, -4186, 1856, 1684, -2767, 2876, 6579, -4032, -6809, 3682, 620, -8595, 3588, 10652, -5743, -7152, 8306, 203, -11283, 4613, 10741, -6698, -3732, 10438, -2214, -11446, 5749, 6932, -8268, 38, 10086, -5275, -9641, 6722, 3652, -8844, 1424, 9108, -4270, -6280, 5558, 1494, -6329, 2439, 6583, -2535, -3031, 3280, -40, -3746, 1292, 3063, -1610, -1649, 1571, 3, -3278, -760, 2548, 501, -2208, 426, 2914, -1593, -3382, 3073, 3322, -3273, -710, 5020, -995, -4912, 2768, 3305, -4743, -1145, 5377, -2360, -5416, 3831, 2589, -6004, 385, 6152, -3267, -4462, 5866, 2289, -5868, 1554, 6200]
1245F200r433k37Q340m349n552O949J624p597K249N711n315k517O356n06m939
1260c016K959L158m148j002L541n56j491R85L48q14q4p32M34J348j018j540K001
1277C73K59k674J255K753k437p02L164j777k696L787J051m526J591M204m084k745
1293c204M993k92m681K657L284m120r01L822j356k454L125L54k895J995J998l492
1309a167j05L306j512k136K647J82k464J091R50k229J023J641k282j25K590j581
1325a71k321L289J054k971Q47K377k259j131K382m96j446J442K35k145R98J374
1341A058k234k5K552j112j697J466Q04j309r3R02kK53J71q09L45N28j248k48J698
1360A000k30j474K32P51j015Q9N69K24k56K27m35k84Q33M21n90M0O95j32j241
$$ y = [6200, -3233, -3470, 4870, 521, -5031, 1918, 3542, -4055, -1806, 3905, -1410, -3927, 2429, 1923, -3016, -57, 3101, -1047, -2049, 1492, 936, -555, 430, 778, -36, -120, -852, -418, 930, -88, -1628, 373, 632, -2042, -787, 1966, -471, -1173, 1991, 214, -2482, 1305, 2356, -2170, -579, 3625, -459, -3204, 1789, 1497, -3184, -527, 2757, -1363, -2264, 1558, 202, -2252, 873, 1227, -1668, 327, 2325, -1167, -1272, 2034, 522, -1614, 1033, 1215, -1249, -158, 792, -1437, -414, 1227, -1055, -1180, 1410, -171, -2492, 797, 1851, -1120, -273, 2104, -155, -1286, 1096, 600, -846, 596, 831, -1314, -316, 1058, -1176, -1201, 1351, 239, -1458, 8, 812, -497, -590, 312, 310, 563, 734, -75, 270, 798, -450, -698, 1000, 770, -704, -472, 279, -736, -647, -78, 146, -110, 117, -318, -602, 231, 652, 62, 102, 797, 665, -576]
1379e76M31R55j59j314J35J329o23j623R23J272j284q9J360p25o11J114m3j279
1397h07J439R08k346L96K219j576k212K368J242k580n16K228l06j432L02R86m36
1414a23m06L54Q17J35r12k8M80m59K22J057p29j100J624k15k746R17K955k113
1432b70j980L504L89m027Q84L496j859k042L311L30l016J163J495k651J63L426
1448B316j044l271K429J058l959r5M473o29l382K301K128l609j809M057P35k435
1464g36J606J658l349j189K858o18j984L482J098m624O0L513l030k509N202K208
1480C646m675j91K931k695k202L679J878k147L06J220k479j707J829J284o81N81
1496E77J783j776l805N65L848j288j733M279J275o468p38N785k316l737O879K833
$$ y = [-576, -145, 810, 651, -663, -528, 801, 178, -1445, -522, 750, -534, -623, 737, 12, -599, 515, 472, -807, 632, 1540, -806, -410, 1809, 233, -1979, 389, 1631, -949, -1465, 763, 457, -975, -673, 313, -123, -529, -175, 642, 777, -135, -163, 317, -142, 80, 1137, 408, -692, 932, 717, -2029, -1112, 1843, -270, -2250, 1254, 1643, -2384, -1500, 1996, 137, -1905, 1406, 1736, -1280, -117, 1378, -1273, -1110, 2316, 1272, -1999, 430, 1488, -2471, -2566, 1907, 1278, -2104, 197, 2325, -1284, -3093, 964, 1699, -736, 870, 2528, -821, -2010, 848, 230, -1754, 1728, 2826, -1798, -1738, 1775, -1255, -3764, 1438, 3646, -1029, -1220, 1711, -984, -3186, 493, 2371, 224, 530, 1750, -729, -2436, -607, 677, -4, 577, 2360, 584, -3221, -2656, 1192, -96, -1829, 2450, 3725, -2743, -3481, 2304, -12, -3749, 3130, 5963]
1512E963q063l04N396n382l029R436P97q787L724N360r790k416J1442j076p696
1527d425O653M397j1026j744R267j735m567O918J877q461m67N101l506j966O655
1542B971J882n708j383K762k127k583M137M933k565m161J754J754m800q46P594
1557C614Q11o208K526L074q022k156R412P1o608N979L499j1123j334J0808l500
1572H43o672R932M319j2828j071R782m727n876J0174L953j0760l56O897n779m487
1587f656R306K585p767J754N267o943m644Q516L400o402J402N141m850n881M999
1602g73L886l841j48M741j649n820J067L238k067o6M868n43n806J095L516l679
1618a981j576P256J138p337Q09N323n100m375Q065L607p866k01O208n104m913
$$ y = [5963, -2100, -2404, 2992, -2390, -5419, 4017, 4814, -3973, -249, 5111, -4679, -7095, 4347, 3271, -4425, 2228, 6625, -4401, -6145, 3122, 1387, -3180, 3738, 5615, -2846, -3313, 1788, -1718, -3684, 2971, 4853, -855, -2238, 524, -1603, -4186, -49, 4884, 2319, -1842, -88, 1666, -3134, -3980, 3614, 4425, -1783, 743, 3817, -4205, -6361, 3051, 3122, -3486, 2493, 5992, -5131, -6465, 4343, 843, -5829, 4103, 8422, -4406, -5477, 4305, -422, -6298, 3876, 7829, -2931, -3287, 3610, -2169, -6656, 2650, 5235, -2532, -778, 4489, -2454, -7098, 1418, 4818, -1584, -182, 4959, 109, -5772, -773, 3113, -728, -876, 3865, 2216, -3604, -2537, 701, -1366, -1432, 3436, 2893, -2913, -1818, 1698, -1981, -3557, 3699, 4837, -2500, -1691, 3632, -1468, -5843, 2222, 5829, -2037, -2238, 3970, -1134, -6047]
1633f047P244K855o921K250N847o707m292Q116M77p239N167O220q275m249Q683
1648C129q11p252M866N581o420k541N576j951m415M710L039m792J75L693l023
1663d36k824L869K069l302j26K746o25l277J55L033j02k564J259K491l048k476
1679c158L531J574m017J244L820l322k573N193r83n096M518M151o861j185P272
1694D108k794o550N975L967p689j52P007l560m996N855J712n877K158M508m667
1709i95k141N636m79m950L008L313m345j592M143j17l354J121J967j225j378J187
1725b01Q23r02m91Q93J77p80J48J541j024j328J890P70k756J91L018j734k685
1742b450L221J486m283j73M137j277l186L072J468l326J99K670j506j498K865
$$ y = [-6047, 1197, 4052, -2869, -619, 5228, -1479, -5771, 2345, 2822, -4417, 750, 6970, -1305, -5554, 3129, 2318, -4934, -68, 5513, -907, -3448, 2128, 177, -4238, 472, 3511, -1281, -1106, 2587, -436, -3260, 609, 2678, -624, -750, 1996, 1371, -1906, -1751, 1282, 1180, -1384, -125, 2366, -682, -3158, 373, 1947, -2070, -826, 2994, -328, -2901, 2292, 1309, -3787, 731, 4882, -1979, -3164, 4108, 1314, -5236, 739, 4706, -2983, -3135, 3872, 312, -4684, 1171, 2883, -2994, -836, 3672, -995, -3136, 2500, 2021, -2929, 79, 3392, -953, -2545, 1598, 1481, -1873, -752, 1215, -10, -1388, -201, 622, -280, -771, 122, 299, -481, -333, 1208, 184, -1144, 746, 1516, -1240, -1049, 1969, 235, -2450, 771, 2257, -2026, -2199, 1938, 661, -2525, 547, 2015, -1311, -1112, 1558, 52, -1446, 1419]
1757A419J9l030J384K236k813j030L390j80l362J113K722k382j347K250O06j885
1773h90O36J073q65m58J052l67m78J089k21j140O09P53r83n72Q46J87m76j45K2
1792c28L24L17q90j00J618l86j555J071J272j573o31J699l60j045N98L08j033
1809f94O80N38j737N08J990j553j173K012M85j917K29J906r37q93Q96n8l88O54
1827E48o09q66J362L45j969O08J593j243r46J430J12r16M07K91l80P12J19j206
1845f08Q35J018j456o77J680m2j439N24Q03q21j50J13k72M78K67p08j54J335o29
1864I7q28J004N33o35l36M87k29J03o7n04L42N94r27l84J108l6j153M56R23m28
1884A20m22K09K92L85k99o20M50N77n93l53Q38n02n93L77J35l57M15Q4j081O75
$$ y = [1419, 1438, -1592, -208, 2028, -785, -1815, 1575, 1395, -1967, -854, 1868, -514, -1861, 389, 995, -890, -254, 819, -46, -504, 548, 181, -297, 792, 571, -569, 40, 793, -190, -762, 84, 271, -205, -350, -328, -4, 313, -577, -677, 941, 555, -1000, 71, 1343, -230, -861, 838, 478, -567, 31, 339, -694, -14, 524, -1213, -705, 1285, -268, -1441, 571, 1056, -861, -632, 1274, 337, -556, 340, 282, -106, 548, -61, -927, 435, 780, -1189, -581, 1012, -231, -1177, 253, 365, -551, -144, 147, -233, 479, 598, -608, 227, 1245, -211, -888, 792, 750, -689, -165, 638, -183, -333, -220, -492, -14, 253, -455, -609, 726, 97, -731, 273, 806, 171, -165, 322, 93, 196, 129, -375, -33, 561, -366, -750, 358, 322, -831, -375, 548, 120, -302, -93, 199, 584, 285, -335, 115, 692, 99, -254, 584, 82, -511, -134, 1, -356, 59, 143, -938, -263]
1904b63J290j657l09J897J5k027P86J561j475o68J485Q5j038K78L01n69L50l3
1922Io95M22Q56o63m76N24m2L4j72r3N77O22j215k15J346m09j546J462R55j503
1942b22m99J221p14o76J388m09r38J504m4j738O20J705j389p40K167Nk108L87
1960d80J164p61l73Q86j64m11J77n76l04O62L10j16K76l4j14m10n32Q50J135r02
1980B83o97J609l23k457O97J937j156n32J976r45k056J507P13k043J204K602k425
1997a06j509K861o56k948K089K817k473q66J986j080j919J239J399n16j9L56q99
2014b44o95L98K26J44O07O68k33j500p38J765K56j747J611K365k973k202K810
2031E18L76l158K148L276l320j724K902j163k818L451K185l735M47L261l105l002
$$ y = [-263, 1027, -630, -939, 958, 973, -1054, -268, 1293, -182, -850, 635, 720, -318, -40, 261, -308, 42, 9, -686, -264, 592, -71, -547, -23, -65, -31, -203, -296, 281, 903, -312, -527, 819, 410, -1136, 326, 1281, -222, -721, 500, -214, -890, 498, 89, -849, 655, 611, -1127, -507, 1198, -191, -931, 1236, 1241, -867, -480, 684, -77, -450, 436, 272, -139, 38, -538, -842, -180, 130, 14, 290, 256, 142, -268, -800, 50, 1185, 283, -414, 1195, 872, -1585, -888, 1049, -107, -639, 1337, 392, -1664, -157, 556, -1487, -283, 2319, -106, -1615, 1246, 590, -2358, -269, 2548, 75, -791, 1195, 115, -1804, -565, 834, 318, 299, 655, -244, -939, -541, -315, -171, 436, 1104, 871, -629, -1367, 398, 654, -1093, 518, 2883, -90, -2292, 518, 894, -2264, -116, 3160, -160, -1884, 1018, -145, -2963, 488, 2673, -1062, -615, 2646, -459, -3461]
2047c461M051J782l505R73L216k718l312K490J553j828K86K455j212k385O88J304
2063C77j148K55K477j17k952O30J462k039j077M181O02m093P39K849l291k184
2079c329M383J189l517P31K615k778j941L243P61k299J663J958l327j615L157
2094H94N1k524J797K581k398k799K368R30k688N80L576r87l388J779J494k870
2110a604K61L641j337k577K812N83m383J214M098k515k215L807J47m789J161L780
2126B084k508j504L624j66l193Q72J838j802k12K595n05j785P14O32j424j38J598
2143G20L36j544j77J219k79j840Q25K491j350j832J969O66k671N80K837j979j441
2160a470L011l40l619K393K204l696j17L980j651l503L032K027l915K70L472j839
$$ y = [-3461, 590, 2372, -1133, -160, 3056, 338, -2974, -484, 1069, -759, -473, 1982, 770, -1615, -927, 377, -771, -516, 1961, 1844, -1108, -478, 984, -1055, -2132, 2049, 2651, -1442, -703, 2146, -1145, -3329, 1054, 2243, -1274, -543, 2072, -706, -2647, 596, 1357, -942, 721, 2679, -648, -2263, 894, 945, -1579, 218, 2799, 401, -2398, -30, 900, -1788, -1208, 2368, 1381, -2007, -228, 1266, -1604, -1343, 2298, 961, -1616, 1196, 1779, -2604, -1390, 2708, 193, -2022, 1785, 1932, -2857, -1696, 2084, -424, -1928, 1696, 1530, -1663, -791, 1047, -755, -967, 1628, 1123, -662, 52, 684, -740, -878, 720, 1056, -488, -665, 554, 275, -1565, -740, 1751, 401, -1431, 538, 1204, -1467, -887, 1950, -29, -1470, 1541, 1201, -2418, -25, 2179, -1517, -1634, 2346, 695, -2808, 224, 2251, -1664, -1394, 2078, 239]
2176B39k204K684P13k831J044J794j771o80K189n89k036J402J152j615o39J321
2192A73L46j029k35J367n8j465M34J400o74j150J229P35j596l9J184p31q16J648
2210G23O6j934N55J858j761r62K297K28k365O54K125j413j472J803J014k047J75
2227d56J648r87j371J590K85j755P14J597j544j110J733M12k174Q99K195j736
2243f0j307J729P84k086O15J465j019o86J046j94j159R18M42j147M06N57p71l39
2261h06Q47K88l35r7J7M74Pq48J64J236o84j063J308M21j735L9J628r21r86J631
2281E85k39j407J031M82j459P61J562j518r54K231j39j931J063J050j322l06J040
2298E30m95n94P34j55p13P46J01r17N56Q84j099nJ059n77l19P85j89n71P11j71
$$ y = [239, -1965, 719, 1432, -1399, -355, 1439, -332, -1012, 1177, 588, -1448, -46, 1106, -509, -1148, 173, 519, -510, -745, 622, 564, -901, -467, 933, 259, -891, 338, 1073, -523, -562, 622, -109, -925, 723, 789, -1145, -590, 1268, -493, -1455, 842, 1070, -1295, -641, 1484, 71, -1401, 402, 1416, -631, -456, 1192, 205, -1166, 424, 709, -1046, -332, 1265, -279, -1389, 344, 756, -1418, -519, 1676, -60, -1367, 362, 1146, -940, -325, 1140, 121, -565, 481, 287, -872, 46, 488, -659, -253, 304, -467, -806, 41, 329, -6, -103, -86, 388, 395, -453, -289, 947, 263, -800, 508, 929, -806, -767, 861, -60, -1046, 585, 346, -1061, -30, 452, -1007, -246, 1316, -202, -1156, 1075, 936, -995, 68, 1118, -204, -510, 530, 35, -559, 175, 20, -693, 53, 154, -763, -207, 677, -422, -427, 632, 55, -264, 521, 332, -239, 472, 301]
2318C01p02O20L57j251J08R68m37q16R54K85p32K38K94l88J35M84o44R0O59l89
2338A34m33N11K68o30j23K61RP1j48l0K07j64l82O6O58j53n40L56L59k21o0j24
2360a08L19N2l37j44O17j65o43K84K24r0j46K01m60m7P72n79j10Q92j24r03N82
2381H7N72o87m51Q31O8n94Q4J55l71M21j13n01N63K86q32m0J036m84m63Q27n5
2402C39m53M05K7p88P17M21j335K46J266o35j131J038N09j422L88J033q39l46
2420e60P68k95l60Q76o3p06N42N67r89j12O51r7k80K70l01R5K5l12m0P56l63n68
2442d96P65J45q98J87Q12n39j40Q25p03l43P38l31p46J061M34j409J08J062p82
2461b50o09J092J59n39K08J6n49N67K73n64L49O96p39n72N30j16l62O08k2k41
$$ y = [301, -401, 219, 576, -675, -567, 401, -36, -852, 102, 387, -345, -107, 187, -201, -66, 418, -226, -136, 523, 134, -299, 212, 480, -150, -273, -12, -3, 68, -80, -110, 97, -67, -449, -383, 275, 122, -418, -62, 297, 76, 16, -108, 211, 263, -74, -218, 399, 234, -409, -125, 99, 9, -137, 64, -396, -443, 329, -250, -360, 532, 408, -495, 87, 659, -28, -479, 352, 420, -174, -90, 65, -306, 115, 2, -499, 64, 350, -482, -522, 514, 30, -433, 394, 339, -114, 291, 318, -470, 247, 668, -667, -421, 845, 210, -921, 117, 626, -796, -408, 625, -214, -560, 208, -87, -447, 429, 366, -340, 202, 769, -220, -332, 319, 222, -58, 212, -89, 6, 31, -281, -321, 435, 72, -496, 269, 414, -484, -297, 515, -24, -164, 661, -42, -385, 353, 22, -724, 337, 771, -638, -530, 532, -250, -859, 233, 392, -147, 61, 77, -472, 95, 368, -196, 153, 849, 110, -462, 68, -48, -410, 198, 176, -65]
2481f5L70n15o33Q24M37r09M06J067r30o18R33l51m00P85K72q45L99K49j303L10
2501e17J437j053p34J609j90j829Q40J078j194L10J310r88o70Q25k23q96J239
2518C54Q53j481j98J335r65j040J169N72n85J02n9k93J53m73lQ71L00q27L74L27
2538D86j025P1J010k19l01Q04p12j413J102P84j497M13J923j206j559J400O34
2555F95j627N69J508o12r31P32l2j050N74J028o99l89P21k78j184K48J065j94
2573A44q13J026P84j851k36J543L7j327J094P17j448l55J171n12o16J083M71j463
2591e51Q5J055j087o14J450L72j047q1P71k75p64N62O80J1n28n4M65o16l63P81
2611B52K14p98L46P54j487k27J582m14j471J559Q01j902n8K289j471j438K257
$$ y = [-65, 305, -210, -843, -19, 418, -491, -85, 982, 52, -566, 367, 16, -384, 401, 673, -172, 227, 476, -827, -517, 920, -133, -867, 742, 552, -1277, -437, 641, -553, -243, 1067, 79, -591, 234, 11, -885, 354, 1207, -274, -472, 863, -102, -1142, 27, 599, 14, 116, 57, -236, -83, -556, -559, 312, 612, -215, 159, 486, -539, -468, 542, 323, 22, 826, 114, -1299, -197, 587, -910, -497, 1426, 220, -1339, 61, 695, -932, -363, 1145, 533, -398, 334, 302, -748, -174, 854, 155, -234, 487, 209, -975, -727, 338, 144, -669, 357, 1141, -710, -946, 597, 634, -693, 401, 1118, -330, -685, 486, -26, -642, 441, 912, -551, -466, 589, -498, -1112, 338, 710, -337, -418, 353, 78, -686, -124, 556, 567, 39, -15, 450, -166, -529, 252, 466, -332, 14, 768, -719, -946, 636, 222, -1249, 310, 1111, -791, -849, 1440, -31, -1469, 788]
2628G88P32k508M65J894j902o05K155n02j728J509N59k021N10J979j499p61J549
2645F14R0j348N38P73n78j47K50n7l6K54o07J78N60q77J03N77l83m23Q53m00o18
2666f84J079j5j125M91J453j397o70J790p6k182J189J264j696r9J473p58j080
2683a043J332K17j574Q27J443j516o13J841l12j666J006J337j533l75J164q9j281
2700h35O09P40p41k70N96r3o29M06N33m76r8N98J08p97J85P40n35k78M48L97p85
2721a77m15P21J59o06J84M75l78j95K2M15m75J76N59j33p56O17K00p20J8J116
2741H07m22j221J121N06j627R8J701r08j100J550J79j686O94J068r54l87J547
2758I66p16j062J067L13j137K31J194o03p09M36J68o33O24j93m9K84k09m04M50
$$ y = [788, 1520, -988, -523, 1371, -531, -1136, 1019, 517, -1211, 298, 857, -1164, -654, 1325, -174, -935, 614, 704, -644, -106, 667, 89, -58, 192, 135, 99, 353, -254, -76, 484, -393, -290, 287, -96, -519, 334, -66, -684, 395, 380, -745, -254, 1199, -198, -868, 922, 846, -1336, -147, 1117, -579, -678, 795, 37, -1043, 289, 506, -1068, -241, 1202, -314, -927, 914, 602, -1064, -58, 1279, -254, -629, 535, 446, -835, -226, 514, -227, -497, 99, 6, -623, -217, 316, -160, -258, 340, 448, -349, -164, 576, 41, -237, 211, 608, -177, -592, 129, 288, -318, -134, 341, -37, -232, -210, 205, -270, -94, 465, 332, -424, 193, 393, -327, -309, 807, 385, -836, 285, 791, -836, -738, 963, 55, -1045, 505, 684, -1002, -308, 760, -194, -581, 966, 250, -812, 255, 568, -569, -338, 856, 253, -456, -20, 148, -485, 139, -54, -103, 181, -28, -432, 18]
2777A8L11p75L51O65m94n25R11l18m95P09n1q21M09O65r68n28J398l96j087J189
2797A68L81j153K22R35o32k35O63k01l64O27J37r62L63M89n23l8M63l67l50M18
2817D1l6k51L85n4j85K90n4m47L48J91k55m28O82k21K8KM6m7n9J30n05K04L16
$$ y = [18, 329, -446, -95, 570, 76, -449, 462, 144, -351, 358, 307, -514, -105, 560, -408, -936, 462, 66, -1021, 168, 549, -604, -382, 553, -79, -314, 349, 148, -216, 411, 548, -414, -51, 438, -85, -123, 340, -27, -377, 41, 5, -246, 139, 85, -100, 190, 136, -311, 37, 228, -27, -455, 227, 6, 34, 36, 82, 35, -24, 106, -399, -195, 121]
$$ [...]
8191F
##END NTUPLES=NMR FID
##END=
