##TITLE=1H_2FN2907
 CDCl3, 8 sc, 
 30.7.2019
##JCAMPDX= 6.0         $$ Bruker NMR JCAMP-DX V2.0
##DATA TYPE= NMR FID
##DATA CLASS= NTUPLES
##ORIGIN= UXNMR, Bruker Analytische Messtechnik GmbH
##OWNER= root
$$ XWIN-NMR		Version 3.5
$$ Tue Jul 30 14:31:26 2019 Russian Standard Time (UT+4h)  she@DPX200
##.OBSERVE FREQUENCY= 200.13155
##.OBSERVE NUCLEUS= ^1H
##.DELAY= (6, 6)
##.ACQUISITION MODE= SIMULTANEOUS
##.ACQUISITION SCHEME= undefined
##.AVERAGES= 8
##.DIGITISER RES= 18
##SPECTROMETER/DATA SYSTEM= spect
##.PULSE SEQUENCE= zg30
##.SOLVENT NAME= CDCl3
##.SHIFT REFERENCE= (INTERNAL, CDCl3, 0, 15.7039)
##AUDIT TRAIL= $$ (NUMBER, WHEN, WHO, WHERE, WHAT)
$$ ##TITLE= Audit trail, XWIN-NMR		Version 3.5
$$ ##JCAMPDX= 5.01
$$ ##ORIGIN= Bruker BioSpin GmbH
$$ ##OWNER= she
$$ F:/spectra/data/she/nmr/H-F/1/audita.txt
$$ ##AUDIT TRAIL=  $$ (NUMBER, WHEN, WHO, WHERE, WHAT)
(   1,<2019-07-30 14:30:34.15 +0400>,<she>,<DPX200>,
      <created by zg, POWCHK disabled, PULCHK disabled
       configuration hash MD5:
       00 E9 B6 7A A2 85 ED C7 34 08 36 98 17 FE 4E 26
       data hash MD5: 16K
       8A CD A7 19 5B DE F0 14 36 89 22 F4 04 DE 46 EA>)
$$ ##END=
$$ 
$$ hash MD5
$$ 50 59 E9 89 28 EE DA AD F5 07 48 34 D6 3E 2A B9
##$RELAX= 
##$RELAX= 
##$RELAX= 
##$RELAX= 
##$RELAX= 
##$RELAX= 
$$ Bruker specific parameters
$$ --------------------------
##$DU= <F:/spectra>
##$EXPNO= 1
##$NAME= <H-F>
##$PROCNO= 1
##$TYPE= <nmr>
##$USER= <she>
##$AMP= (0..31)
100 100 100 100 100 100 100 100 100 100 100 100 100 100 100 100 100 100 
100 100 100 100 100 100 100 100 100 100 100 100 100 100 
##$AQSEQ= 0
##$AQ_mod= 1
##$AUNM= <au_zg>
##$AUTOPOS= <>
##$BF1= 200.13
##$BF2= 200.13
##$BF3= 200.13
##$BF4= 200.13
##$BF5= 200.13
##$BF6= 200.13
##$BF7= 200.13
##$BF8= 200.13
##$BYTORDA= 1
##$CFDGTYP= 0
##$CFRGTYP= 5
##$CHEMSTR= <none>
##$CNST= (0..31)
1 1 145 1 1 1 1 1 1 1 1 1 1 1 1 1 1 1 1 1 1 1 1 1 1 1 1 1 1 1 1 1 
##$CPDPRG= <>
##$CPDPRG1= <>
##$CPDPRG2= <>
##$CPDPRG3= <>
##$CPDPRG4= <mlev>
##$CPDPRG5= <mlev>
##$CPDPRG6= <mlev>
##$CPDPRG7= <mlev>
##$CPDPRG8= <mlev>
##$CPDPRGB= <>
##$CPDPRGT= <>
##$D= (0..31)
0 1.2 0 0 0 0 0 0 0 0 0 0.03 0 0 0 0 0 0 0 0 0 0 0 0 0 0 0 0 0 0 0 0 
##$DATE= 1564482633
##$DBL= (0..7)
120 120 120 120 120 120 120 120 
##$DBP= (0..7)
150 150 150 150 150 150 150 150 
##$DBP07= 0
##$DBPNAM0= <>
##$DBPNAM1= <>
##$DBPNAM2= <>
##$DBPNAM3= <>
##$DBPNAM4= <>
##$DBPNAM5= <>
##$DBPNAM6= <>
##$DBPNAM7= <>
##$DBPOAL= (0..7)
0.5 0.5 0.5 0.5 0.5 0.5 0.5 0.5 
##$DBPOFFS= (0..7)
0 0 0 0 0 0 0 0 
##$DE= 6
##$DECBNUC= <off>
##$DECIM= 24
##$DECNUC= <off>
##$DECSTAT= 4
##$DIGMOD= 1
##$DIGTYP= 9
##$DL= (0..7)
0 120 120 120 120 120 120 120 
##$DP= (0..7)
150 150 150 150 150 150 150 150 
##$DP07= 0
##$DPNAME0= <>
##$DPNAME1= <>
##$DPNAME2= <>
##$DPNAME3= <>
##$DPNAME4= <>
##$DPNAME5= <>
##$DPNAME6= <>
##$DPNAME7= <>
##$DPOAL= (0..7)
0.5 0.5 0.5 0.5 0.5 0.5 0.5 0.5 
##$DPOFFS= (0..7)
0 0 0 0 0 0 0 0 
##$DQDMODE= 0
##$DR= 18
##$DS= 0
##$DSLIST= <SSSSSSSSSSSSSSS>
##$DSPFIRM= 0
$$ [...]
##$SUBNAM2= <"">
##$SUBNAM3= <"">
##$SUBNAM4= <"">
##$SUBNAM5= <"">
##$SUBNAM6= <"">
##$SUBNAM7= <"">
##$SUBNAM8= <"">
##$SUBNAM9= <"">
##$SW= 24.9336996594482
##$SWIBOX= (0..15)
0 0 2 0 0 0 0 0 0 0 0 0 0 0 0 0 
##$SW_h= 4990.01996007984
##$TD= 16384
##$TD0= 1
##$TE= 0
##$TE2= 300
##$TE3= 300
##$TEG= 300
##$TL= (0..7)
0 120 120 120 120 120 120 120 
##$TP= (0..7)
150 150 150 150 150 150 150 150 
##$TP07= 0
##$TPNAME0= <>
##$TPNAME1= <>
##$TPNAME2= <>
##$TPNAME3= <>
##$TPNAME4= <>
##$TPNAME5= <>
##$TPNAME6= <>
##$TPNAME7= <>
##$TPOAL= (0..7)
0.5 0.5 0.5 0.5 0.5 0.5 0.5 0.5 
##$TPOFFS= (0..7)
0 0 0 0 0 0 0 0 
##$TUNHIN= 0
##$TUNHOUT= 0
##$TUNXOUT= 0
##$USERA1= <user>
##$USERA2= <user>
##$USERA3= <user>
##$USERA4= <user>
##$USERA5= <user>
##$V9= 5
##$VALIST= <valist>
##$VCLIST= <CCCCCCCCCCCCCCC>
##$VD= 0
##$VDLIST= <DDDDDDDDDDDDDDD>
##$VPLIST= <PPPPPPPPPPPPPPP>
##$VTLIST= <TTTTTTTTTTTTTTT>
##$WBST= 1024
##$WBSW= 4
##$XGAIN= (0..3)
0 0 0 0 
##$XL= 0
##$YL= 0
##$YMAX_a= 83107
##$YMIN_a= -71174
##$ZGOPTNS= <>
##$ZL1= 120
##$ZL2= 120
##$ZL3= 120
##$ZL4= 120
##$ABSF1= 10
##$ABSF2= 0
##$ABSG= 5
##$ABSL= 3
##$ALPHA= 0
##$AQORDER= 0
##$ASSFAC= 0
##$ASSFACI= 0
##$ASSFACX= 0
##$ASSWID= 0
##$AUNMP= <proc_1d>
##$AZFE= 0.1
##$AZFW= 0.1
##$BCFW= 1
##$BC_mod= 2
##$BYTORDP= 1
##$COROFFS= 0
##$CY= 11.3945322036743
##$DATMOD= 1
##$DC= 2
##$DFILT= <>
##$DTYPP= 0
##$F1P= 20.1537800932815
##$F2P= 0.134698688090026
##$FCOR= 0.5
##$FTSIZE= 0
##$FT_mod= 4
##$GAMMA= 1
##$GB= 0.15
##$INTBC= 1
##$INTSCL= 1
##$ISEN= 128
##$LB= 0.24
##$LEV0= 0
##$LPBIN= 0
##$MAXI= 10000
##$MC2= 0
##$MEAN= 0
##$ME_mod= 0
##$MI= 1.114404
##$NCOEF= 0
##$NC_proc= 0
##$NLEV= 6
##$NOISF1= 3.799351
##$NOISF2= 2.8
##$NSP= 1
##$NTH_PI= 0
##$NZP= 0
##$OFFSET= 15.70392
##$PC= 1
##$PHC0= -9377.848
##$PHC1= 14.80097
##$PH_mod= 1
##$PKNL= yes
##$PPARMOD= 0
##$PSCAL= 0
##$PSIGN= 0
##$REVERSE= no
##$SF= 200.130013532006
##$SI= 16384
##$SIGF1= 3
##$SIGF2= 2
##$SINO= 400
##$SIOLD= 16384
##$SREGLST= <1H.CDCl3>
##$SSB= 0
##$STSI= 0
##$STSR= 0
##$SW_p= 3612.71676300578
##$SYMM= 0
##$S_DEV= 0
##$TDeff= 0
##$TDoff= 0
##$TI= <>
##$TILT= no
##$TM1= 0
##$TM2= 0
##$TOPLEV= 0
##$USERP1= <user>
##$USERP2= <user>
##$USERP3= <user>
##$USERP4= <user>
##$USERP5= <user>
##$WDW= 1
##$XDIM= 8192
##$YMAX_p= 0
##$YMIN_p= 0
$$ End of Bruker specific parameters
$$ ---------------------------------
##NTUPLES= NMR FID
##VAR_NAME=  TIME,          FID/REAL,        FID/IMAG
##SYMBOL=    X,             R,               I
##VAR_TYPE=  INDEPENDENT,   DEPENDENT,       DEPENDENT
##VAR_FORM=  AFFN,          ASDF,            ASDF
##VAR_DIM=   8192,          8192,            8192
##UNITS=     SECONDS,       ARBITRARY UNITS, ARBITRARY UNITS
##FACTOR=    0.0002004,     1,               1
##FIRST=     0,             0,               0
##LAST=      1.6414764,     0,               0
##MIN=       0,             -71174,          0
##MAX=       1.6414764,     83107,           0
$$ Real data points
##PAGE= N=1
##DATA TABLE= (X++(R..R)), XYDATA
0@%%%%%%%%%%qJ6j6J6j6K4l2L8m6M9n7P2q3R2j06J22j42J65j85K09k37K66k98
33a57L34l74M16m64N15n72O36p05P78q61R57j058J171j301J448j615J808k035
51a079K304k632L038l558M257n244O755r390J5266n1069K1331R6136q2893o4243
65g1021N7424N6933n9259k6108N3721J1623o3209M539O5708j688o7887k140N6422
78A5058J4572l8949j8769J4547K1065O421j4127k0863R121K4616n606k0444J2363
91i95J2753k5486p008M5354O629o2493j1443P4470J8272p6255k1418P0881J8124
104D1385o0900o589N2833r254m8552K5348N0011l5505n2881L8186N4076l2600
116A5558m8650K3649L7003j4766j9890J0441L457j0357Q992J3332j3254j4130
$$ plain form
0 0 0 0 0 0 0 0 0 0 0 0 -8 8 -8 8 -8 16 -16 22 -24 25 -32 40 -43 49 -57 65 -77 88 -97 112 -125 141 -157
33 -157 177 -197 219 -245 270 -302 334 -371 407 -454 503 -555 616 -685 763 -852 956 -1079
51 -1079 1225 -1407 1631 -1927 2330 -2914 3841 -5549 9717 -41352 -20021 76115 -6778 -71021
65 -71021 -13597 43336 -15923 -42031 11690 23313 -39896 -35357 30351 28663 -39224 -41364 15058
78 15058 29630 -9319 -28088 -13541 7524 13945 -182 -21045 -11924 12692 7086 -13358 -995
91 -995 11758 -13728 -20736 24618 31247 -31246 -42689 31781 50053 -26202 -47620 23261 41385
104 41385 -19515 -26104 26729 17475 -31077 -5729 44282 8777 -44104 -5918 48158 15558
116 15558 -33092 -9443 27560 12794 -7096 3345 6802 -3555 5437 18769 5515 -8615
128h615J0798J0342l565k6l053j4586O544K9819n361m0735J660M4771Q79m1801
142a2929Q48L4067q454k6443K0194K1304l3314k0976M2579K2392m6002k4514M2273
155A1025K1925l5031j5194K6071L203k0571Q889J7873j9477j9100K3696J9546
167B2855k2756j8404J6608J1792j0170k099M473r658l100J8992L740k4462n713
180a7902K3718N137j9273j296J2762o485p850J5607N253k3929n592K8192O619
193A4961k8031o615K3593L280j7462K840J1863j0912q811J8189P741k2605q134
206b0103K2715P437j9241m799J3930p02q931P454N539j3843m364J7832M213j8266
220a1129l620J5659J339j0910L109O454q492l031J4016J677j7106p43J7790N21
$$ plain form
128 -8615 2183 12525 8960 8934 5881 -8705 -2161 27658 22297 -18438 -16778 27993 28872 -12929
142 -12929 -12081 21986 13532 -12911 7283 28587 -4727 -25703 16876 39268 -6734 -31248 11025
155 11025 32950 -2081 -17275 8796 11999 -8572 317 18190 -1287 -20387 3309 22855
167 22855 99 -18305 -1697 10095 -75 -2174 2299 -7359 -10459 8533 12273 -12189 -17902
180 -17902 5816 10953 -8320 -9616 3146 -3339 -11189 4418 9671 -14258 -19850 8342 14961
193 14961 -13070 -19685 3908 7188 -10274 -7434 4429 -6483 -15294 2895 10636 -11969 -20103
206 -20103 2612 10049 -9192 -13991 -61 -763 -9694 -2240 3299 -10544 -14908 2924 7137 -11129
220 -11129 -14749 910 2249 -8661 -5552 902 -7590 -10621 3395 5072 -12034 -12777 5013 5534
234E534j5226J814J1797n060p268R978M780j4044k600J7320K309j7393j026J6096
248G011j37j2390L319R445o641o296J0585M878j2510l674J3257L222j1647j546
262c124R177o16n952L789L606o524j832Q739Q08r146P0Q289j327o211L223L974
278F943n520j961P917M91r520M20J0040j139r423K056P955l457o043M992M436
293H187o581l188P476K343p734j592O957O31n679K51M012j528k655K400J299l178
309A421n19K993o21k621J200J488k499p56L239o51m308J250M259k425m557K806
325c01L812m100l584M463K672n604k214N414J279n724r20N007r3m832O63L961
341a01j578l754J991L014k233k657J908J920j598j113J049Q3o35P04M07j134l87
$$ plain form
234 5534 -9692 -7878 3919 -1141 -8409 1569 6349 -7695 -10295 7025 9334 -8059 -9085 7011
248 7011 6874 -5516 -2197 7248 607 -5689 4896 9774 -2736 -6410 6847 10069 -1578 -3124
262 -3124 6053 5437 -515 3274 6880 356 -1476 7263 8071 -1075 -1005 7284 5957 -254 2969 6943
278 6943 1423 -538 7379 7870 -1650 -1230 8810 7671 -1752 304 8259 4802 -1241 3751 8187
293 8187 1606 -1582 5894 8237 503 -1089 5868 6499 820 1071 5083 3555 900 3300 4599 1421
309 1421 902 3895 3274 653 1853 3341 842 86 3325 2674 -1634 -384 3875 1450 -3107 -301
325 -301 3511 -589 -4173 290 2962 -2642 -4856 558 1837 -3887 -4807 200 107 -4725 -4062 -101
341 -101 -1679 -5433 -3442 -428 -2661 -5318 -3410 -1490 -3088 -4201 -3152 -3069 -3704 -3000 -2593 -3727 -4114
358d114J475J35j181K92R04j005l81J866L25k564l62L107O92l035n71K638M71
375a308j922K4J532o25j204J371J437j576j603J578J892q45j747L15J333N39m77
392a286o76P9P61M55k17o5J18j98K15J141M15j542o23K133J548j715j607J744
410F80J691r18q48J046L49q39P01J560q02j831J106K315n39k030L16J705J4p22
428B954J27J38m53N18R41o20j291M33J330j40j028k74L72K33K36L0j019m96J136
447C127Q02j118j188P13P08m16m25J55m44l59R14N46j404j039J301J082j225j192
465E38Q63O02p24j35N64o40r08J044R50j338j332J030J175r75j076N47K36n35
483a14J56K57r24o61J131N24j432q38J011L62r72j89M34q03m81J370K71k182o52
$$ plain form
358 -4114 -2639 -2504 -3685 -3393 -2489 -3494 -3875 -2009 -1684 -4248 -4610 -1503 -811 -3846 -4417 -1779 -1308
375 -1308 -3230 -3206 -1674 -2299 -3503 -2132 -695 -2271 -3874 -2296 -404 -1249 -2996 -2681 -1348 -809 -1286
392 -1286 -1962 -1883 -1122 -667 -884 -949 -831 -1029 -814 327 742 -800 -1423 710 2258 543 -1064 680
410 680 2371 1453 605 1651 2000 1161 1862 3422 2620 789 1895 4210 3671 1641 1957 3662 3676 2954
428 2954 3081 3219 2766 3284 4225 3605 2314 2747 4077 3937 2909 2635 3007 3240 3476 3506 2487 1991 3127
447 3127 3929 2811 1623 2336 3044 2628 2203 2358 1914 1555 2469 3015 1611 572 1873 2955 1730 538
465 538 1401 2003 1279 1144 1708 1068 160 1204 2154 816 -516 514 1689 714 -362 185 421 -114
483 -114 42 299 -625 -1286 -155 369 -1063 -1901 -890 -528 -1500 -1689 -1255 -2058 -2539 -1169 -898 -3080 -3732
502c732K276O12k548n67K134L4j885M95J531j438j557K372J643k989j740L096
518b263K004k964j643K624R88k053J60K041j162j841K153K283k491k238K499K346
534D43j944j411J499N39r48J072R50k081j004L071J439l039j379K822J042k040
550i69K22J540j523j221L228J490m023j711M470K053l909j696L373P88k377Q91
566F26K078k298j917L723K358l951k579L952K450k868j325K140o5j350K047J251
582D272l279j454M240J839l920j724L390P93k244P88J456k571j198M274J422n286
598G98j771N203J541m346q30L050q48k198K674J630m632j890N556J817n816j814
614a876M747P90l771Q27K415l244j986N056J826o568k235O538J964o047j243M734
$$ plain form
502 -3732 -1456 -844 -3392 -3959 -1825 -1791 -3676 -3181 -1650 -3088 -4645 -2273 -630 -3619 -5359 -2263
518 -2263 -259 -3223 -4866 -2242 -1254 -3307 -3147 -1106 -2268 -4109 -1956 327 -2164 -4402 -1903 443
534 443 -1501 -2912 -1413 -874 -1822 -750 200 -1881 -2885 186 1625 -1414 -2793 29 1071 -969
550 -969 -747 793 -730 -1951 1277 2767 -1256 -2967 1503 3556 -353 -2049 1324 2112 -265 626
566 626 2704 406 -1511 2212 4570 619 -1960 1992 4442 1574 249 2389 2324 974 3021 4272
582 4272 993 -461 3779 5618 1698 -26 3364 4157 1913 2701 4157 1586 388 4662 6084 798
598 798 -973 4230 5771 1425 595 3645 2797 599 3273 4903 271 -1619 3937 5754 -62 -1876
614 -1876 2871 3661 -110 717 3132 -112 -2098 2958 4784 -1784 -4019 2519 4483 -1564 -2807 1927
630A927p11l645K691K965n130k927O356L196o944l269O107K386m788r29L363j470
646h22k534L456K407n351k605N660K621n172k084L558M19k170J757J006m384o81
662d919O111P51o902r85O282L73m981R85L302l254k109N632J674p692j645Q573
678A196J792q161j353O822L19n116J937L732m134k789O269K789p149k517P017
693F54K322n568r04L938o92k248L327J351n089p64O364P76o118n0N129q14l332
710a718K815J899m876n92O854J87p865K76P901n96o783J735N217l456l374N460
726C084K300p293j471Q468J137q427m74P423n21n796K092M383m078l018N884K326
742F019p042j792P217J360o370l48M880j114l313L021J901m632j192N821O53o108
$$ plain form
630 1927 1216 -2429 262 3227 -1903 -4830 1526 4722 -2222 -5491 616 3002 -1786 -2715 648 -822
646 -822 -3356 100 2507 -2844 -5449 211 2832 -2340 -4424 -866 -447 -2617 -860 146 -4238 -4919
662 -4919 1192 1943 -4959 -5944 338 711 -4270 -3285 17 -3237 -5346 286 1960 -5732 -7377 1196
678 1196 2988 -5173 -6526 296 615 -4501 -2564 1168 -2966 -5755 514 3303 -3846 -6363 654
693 654 2976 -2592 -3496 442 -250 -2498 829 2180 -2909 -3673 2691 3467 -2651 -2701 2428 1614 -1718
710 -1718 1097 2996 -1880 -2472 4382 4569 -3296 -3020 4881 4285 -2498 -763 4454 998 -2376 3084
726 3084 5384 -1909 -3380 5088 6225 -2202 -2676 4747 4226 -1570 522 4905 827 -2191 3693 6019
742 6019 -1023 -2815 4402 5762 -608 -956 3924 2810 -503 2518 4419 -213 -1405 4416 5069 -1039
758a039k8N124p68l809K058K040l788p55N319l46o506Q53O514j597n899K253M278
775C904l610k872M948J169o503l45P339n54p734R16O949j872n916K830M227m334
791a458k857N423J647o406r90O473K34o019M33M822j519l337K487J928l611q03
807c553M411j65m659R03M153j622l143K502J903l558n59M675p97n181J548N523
823B381k417n138L184M266l844l304M873J963n537r80O140N1o222P43O001j474
839F86n190K353M139l010k951L685J959m025r21M250J28l774P64L287j517k198
855b335K417J288k765k14L335o20l178J602L082k229k387L184J754l611q24M176
871B675R5m187Q42M275j613l823K394L402k975k613L447K034l736j184L844K99
$$ plain form
758 -1039 -1067 4057 3289 -520 1538 3578 -210 -965 4354 4008 -2498 -1645 4869 3272 -2627 -374 3904
775 3904 294 -2578 2370 3539 -2964 -3309 4030 3476 -4258 -3342 3607 1735 -4181 -1351 2876 -1458
791 -1458 -4315 1108 2755 -3651 -4641 1832 2066 -3953 -3520 1302 -217 -3554 -1067 861 -2750 -3553
807 -3553 858 693 -3966 -3063 1090 -532 -3675 -1173 730 -2828 -3387 1288 491 -4690 -3142 2381
823 2381 -36 -5174 -1990 2276 -1568 -4872 1 1964 -3573 -4553 1587 1638 -4584 -3841 2160 686
839 686 -4504 -2151 1988 -1022 -3973 -288 1671 -2354 -3275 975 1103 -2671 -1907 1380 -137 -2335
855 -2335 82 1370 -1395 -1609 1726 1106 -2072 -470 2612 383 -2004 1180 2934 -677 -1501 2675
871 2675 2770 -1417 -575 3700 2087 -1736 658 4060 1085 -1528 1919 3953 217 -967 2877 3176
887C176l543M42L293j339k753K012K127k509j547K699P98k683mK431q27k148J608
904A233J683k375j331K927P50l128k44K981m47k781J209K345k073j997K719J578
920C049l184j301L263Q68l226l29K771m61k438J264J856j947j775K382J382k691
936e17j145K420N44k074j5J480q81j245J409R07j987q61K043N42j972k87J406
953b33l89j083R35O73j750n15K074M60k348l33K053L6j663K73J270r58p93J553
971g38O25k081m97K225N41j906m40J559R3j003N43N97j015l76J584M41j610n45
989b003J504N33j065j59O01l05q0R38o0j316j4J703J38j436k62J238n5n35N07
1008a28K28j023M3J526O3j688j60J708K79j111k36P47l5j99N20K13j040q7J425
$$ plain form
887 3176 -367 75 3368 2029 -724 1288 3415 906 -641 2058 2856 173 169 2600 1773 -375 1233
904 1233 2916 541 -790 2137 2887 -241 -485 2496 2049 -732 477 2822 749 -1248 1471 3049
920 3049 -135 -1436 1827 2695 -531 -860 1911 1450 -988 276 2132 185 -1590 792 2174 -517
936 -517 -1662 758 1302 -772 -787 693 -188 -1433 -24 883 -1104 -1965 78 620 -1352 -1639 -233
953 -233 -622 -1705 -770 -97 -1847 -2362 -288 172 -2176 -2509 -456 -420 -2083 -1810 -540 -1498 -2291 -738
971 -738 -113 -2194 -2691 -466 75 -1831 -2271 -712 -619 -1622 -1079 -482 -1497 -1873 -289 152 -1458 -2003
989 -2003 -499 34 -1031 -1190 -589 -894 -974 -36 -96 -1412 -1426 277 415 -1021 -1283 -45 -100 -635 -128
1008 -128 100 -923 -880 646 709 -979 -1139 569 848 -263 -499 248 213 14 534 747 -293 -380 1045
1027A045L99j333m81J096N55n32j52J38j38P7P58q9r26j10J050M22p68l95L42
1046I58L33m0J03j89n56J75P94R7r79k73O95M16l66m09p2M9K28K11k74n89P1O44
1068A027J06o20l05J89J98J53r2m13l70L73O18l82p06P2O39M1m83o0N8j10J02
1089C5K85k35n77N9P88L3p68k27M25K62k28j76j52j2J03K81k01l62p5J99J89j48
1111e02k83o7Q7K67p3m53j42L02L57k86l89O5K91k9j93J02p2k55K39L59k09n33
1133a417J62N33N9m27r2K83J20m2m7K8L5M4J90L5j57m6J93L09r7j77j42L04L71
1156B2j37l58R6M05K5k45L4K33J7j36K00J00k92p1M64J67m58j86M27L36l40k22
1178H1K20J73j43J17j0j35M1K57P2l18n2K40J33j21L8j3j76K20K79j23m42J85
$$ plain form
1027 1045 1444 111 -370 726 1281 749 597 735 597 674 1432 1343 417 307 1357 1779 1011 616 958
1046 958 1291 1251 1354 1165 609 784 1578 1675 696 423 1118 1534 1168 759 687 736 964 1175 901 312 383 1027
1068 1027 1133 513 208 397 595 748 656 243 -127 246 864 482 -224 -152 487 528 45 -15 43 -67 35
1089 35 320 85 -492 -433 355 388 -380 -607 -182 80 -148 -324 -476 -488 -385 -104 -305 -667 -742 -543 -354 -502
1111 -502 -785 -852 -765 -498 -571 -1024 -1166 -864 -507 -793 -1182 -1117 -826 -855 -1048 -946 -1018 -1273 -1034 -675 -884 -1417
1133 -1417 -1255 -722 -663 -1090 -1182 -899 -779 -821 -868 -840 -805 -761 -571 -536 -693 -739 -546 -237 -334 -511 -653 -349 22
1156 22 -115 -473 -377 28 53 -192 -158 75 92 -44 156 256 -36 -107 357 524 66 -120 307 643 303 81
1178 81 301 474 331 448 438 303 344 601 673 355 303 543 676 555 593 580 404 624 903 780 338 523
1200E23N34k7n40Q3L99q2k76K63J31l50p6N46J6o49q5N61J81o11k01M00O6k79
1222E27J76Ol09j67N42po14j64L76K26l42j67J15k46J04K42j56n55J28N51j03
1243A63o07k9L85j65j05K05n2n62K03P11k28q98J47P88j16n70L4L63k83o0N06
1264a70j63p29J59R29k28q47J27O28j25l93L29Pn18J46P47k65r17K47Q93q8q06
1285a037J78L55j86j12N25j61q07K39J005k86r06K38Q73j73n44K17K60m38R3P93
1305A26k31r21K96J114l03q65L34O28k68k57N80K5q36L68J049m07j012K89J107
1324H16j63p76L37L87n21L1Q14k20r36L48J049k66j006L07P25l17l01M77r2o90
1344CL59R10m47j088M89R93m89n81L67L00o50P1R25n00r44N68J093o12j040N83
$$ plain form
1200 523 1057 1030 490 573 972 890 614 877 1008 658 582 1128 1144 495 410 971 1152 541 340 740 806 527
1222 527 703 709 400 233 775 768 154 -10 366 592 250 83 198 -48 56 298 142 -413 -285 266 163
1243 163 -444 -473 -88 -253 -358 -153 -205 -767 -564 147 -81 -979 -832 -44 -160 -730 -696 -333 -616 -676 -170
1264 -170 -333 -1062 -903 26 -202 -1049 -922 -294 -419 -812 -483 -476 -994 -848 -101 -366 -1283 -1036 -143 -231 -1037
1285 -1037 -859 -504 -690 -802 -277 -438 -1245 -1006 -1 -287 -1193 -955 -82 -255 -799 -582 -322 -760 -667 126
1305 126 -105 -1026 -730 384 81 -784 -450 178 -90 -347 233 258 -578 -210 839 432 -580 -291 816
1324 816 653 -123 214 601 80 111 925 705 -231 117 1166 900 -106 201 926 609 308 785 693 3
1344 3 362 1272 825 -263 226 1219 730 149 516 816 166 237 1162 662 -282 286 1379 767 -273 310
1364C10P66n62m60O67J0q21K33J051m47j155M73J146n59r37O20M52o12j14P43
1383H04l69q86N23J008p63r39O31P32p20m16P03r2q26L97Q36n90j069O94J055
1402G13r04p47P01N06q97j71R20k15j087M47J111o48j116Q12Q12p31n54P56J72
1421a20q70K36Q52m44r10O90Q39p53o77Q19M02q17m6P93k44p51M70R02p49p24
1441a102Q51N68p76m25Q88J47q77K30Q14m45q15O28P76p36n11P91L47q66n6Q71
1461C02j97q41N03P92o71o15Q44M88q17k72R65Nq94K01R67n05p24P61N49q02m10
1482c71R08K68r08lR26j65q44M25P03m61o59P55M15q17k09Q31P4q50K40P06l75
1503E89o86N95M29o87k49P21P2q12R1Q44k81q29L89P27n72n87P22L19p75k51Q51
$$ plain form
1364 310 1076 514 54 721 731 -90 143 1194 747 -408 65 1211 652 -285 335 787 175 61 804
1383 804 435 -451 72 1080 317 -622 9 741 21 -395 308 216 -610 -213 623 33 -1036 -342 713
1402 713 -191 -938 -237 269 -628 -799 121 -94 -1181 -734 377 -271 -1387 -575 237 -494 -1048 -292 -120
1421 -120 -990 -754 98 -346 -1256 -566 273 -480 -1157 -338 64 -753 -799 -6 -250 -1001 -531 371 -378 -1102
1441 -1102 -251 317 -459 -884 4 151 -726 -496 318 -127 -942 -314 462 -274 -785 6 353 -513 -569 302
1461 302 105 -736 -233 559 -112 -727 117 605 -212 -484 481 486 -408 -207 760 255 -469 292 841 39 -371
1482 -371 537 805 -103 -106 820 655 -189 236 939 478 -181 574 989 172 -37 794 868 18 258 964 589
1503 589 -97 498 927 240 -9 712 784 -28 63 907 626 -203 186 913 341 -246 476 795 20 -231 620
1524F20J1r29K07P80l18o49L41N10n26k89N65O1o47R2O15j29o97K80M98l77l09
1545b90M90J0n91J18O49k04p49L54N79m19m73M32L61o67j17O31qp59J61P75k92
1566ip73L79N36l35m75M48K23n27q0N11L0o52J52N71j89n11L27K42k99o8L90p6
1588a85n02L07M33k35m95L67N32n16k47M86O7m82J12N95k66n77L39O09l14m36
1608d08L02L53l06k06M17L3m87J62M60j31m63J74N22k03l11K38N8j91O2K27j89
1629A13k89L46K90k55k85K05J83k53J7L19j49l17K97L44l50l04L09L75l14k48
1649C4K58J75k99l5L35j36l69K69L64k46k95J68K32l8k57J01l7o3J13J34j41k62
1671EK27J23j77j09J77n7j77J56J15j78k22K74K21l66k22J75K85l05q7K38o3k51
$$ plain form
1524 620 631 -298 -91 689 371 -278 63 573 47 -242 323 384 -263 -171 444 315 -382 -102 396 19 -290
1545 -290 200 210 -381 -263 386 182 -567 -213 366 -53 -526 -94 267 -400 -517 114 106 -653 -492 283 -9
1566 -9 -782 -403 133 -202 -677 -229 -6 -533 -613 -102 -72 -724 -572 -1 -190 -701 -374 -132 -431 -499 -109 -185
1588 -185 -687 -380 53 -182 -677 -310 222 -294 -541 -55 12 -470 -358 237 -29 -606 -267 342 28 -408
1608 -408 -106 247 -59 -265 152 185 -302 -140 320 189 -274 -100 422 219 -92 146 204 13 75 302 113
1629 113 -176 170 460 205 -80 125 308 55 72 391 242 -75 222 566 216 -88 221 596 282 34
1649 34 292 467 168 133 468 332 -37 232 596 350 55 223 455 417 160 261 224 161 274 408 267 5
1671 5 232 355 178 69 246 189 12 168 283 105 -117 157 378 12 -210 -35 250 -55 -142 96 33 -218
1693b18Q5L44k73k82J90K27j38j67Q5J85j61k3RL3l4l0Q9r1p9P2P3j17O6Nl3l9
1719b22N7P7k25l5K48Q7k30q5J92J4k05Q0J44q6j44J36J54j22k14J07K22j35r6
1742b81L1N4O7q9P8n7m2R5J43j86l4J18K6p8N7J1q0J9J21M5r6m0K02J2j43pJ53
1769I9j2o9O3O7p6l6R3O7j55o3J69J20j11r6Q9L0mJ9N1j09pN1L6o8j6R4J2j11
1797A27K5L8j7l1O0J4q4k2J55lj03qJ21n2p6J6R6j19l2J23q3K0q4J35n1m5p0R8
1825A48Ln7N4o1K3J8k3k4l5l3N3k6Jk8N5r8j6J03j9j23L7L8L1q5n2M9J9o9Q7j39
1855a69L2J5Q3j59p2J03Q6p6j1j1k4M8k6P5m3j29J32N8j23m4O9K9j7RJ2l6J0O3
1883a16Q6p1j13R9J33j26o7K2O8o5M9L9r8rQ0J07j52l6J40K2n5j8M0m6k8J17M2
$$ plain form
1693 -218 -133 211 -62 -344 -154 73 -65 -232 -147 38 -123 -146 -137 -104 -138 -168 -79 -170 -249 -177 -104 -221 -155 -150 -183 -222
1719 -222 -165 -88 -313 -348 -100 -13 -243 -328 -136 -122 -327 -247 -103 -189 -333 -197 -43 -165 -379 -272 -50 -185 -281
1742 -281 -250 -196 -129 -218 -140 -197 -239 -144 -1 -187 -221 -103 -77 -155 -98 -87 -167 -148 -27 18 -78 -118 84 96 -47 -54 99
1769 99 87 18 81 148 72 36 129 196 41 -22 147 267 156 60 149 179 175 194 245 136 129 180 216 148 132 226 238 127
1797 127 152 190 173 142 202 216 132 110 265 262 159 151 272 220 144 160 256 137 105 228 145 165 81 216 165 120 50 148
1825 148 151 94 148 87 110 128 105 81 46 13 66 40 41 13 68 -30 -46 57 38 -85 -48 -10 21 -64 -116 -67 -48 -117 -30 -169
1855 -169 -137 -122 -39 -198 -270 -167 -81 -157 -168 -179 -203 -155 -181 -106 -149 -278 -146 -88 -211 -255 -186 -157 -174 -165 -153 -189 -179 -116
1883 -116 -30 -101 -214 -115 18 -108 -175 -153 -85 -150 -101 -62 -160 -169 -89 18 -134 -170 -30 -8 -63 -81 -41 -87 -115 2 44
1910D4j45J7J28N8r6o2P1K3j0L2P7j21J8R9L1j09k7J32M1j38N4K4K4K7P1o5j31
1937F7P5J29o2n9L9O5l5m5Q0j5q8l1J72L1k60m1J88j4j14K4J32p6r2J38m8j13
1963D7KJ44n3r3K6O5Pp2k8L0o8m0J10L5j30j6J19j8j16M4J4m1k2O8n7p3j4K05
1991G5j01j38P4J08r8o9Q8N2j27J2J47j04o3m5J90k3j92Q4j2j6o0Q7Q3k45J28
2016a65O2k8j37L9J04n4q6O3R7j74R4J02j14o5J29J2n3k7P2Q7j12r6K33k7j76
2041b20J09J77r3j64J03J74k07K1J34L3j11p6K27r3j91K17J02j52k1J38Pr6j8
2064@J28kj42Q5J16o5l7M5Q1j70m7K15nj58K2J81m2j67N2J66n3j79J53J13k48
2089D2%K31m4k20J04J47q8j81J36J29j95m2K11L7j94K4J50qj67M2O1j19k4J16
$$ plain form
1910 44 -101 -84 44 102 6 -56 15 38 28 60 137 16 34 133 164 55 28 160 201 63 117 141 165 192 263 198 67
1937 67 142 271 209 150 189 254 219 174 254 239 151 120 292 323 63 22 210 196 82 106 238 162 70 208 160 47
1963 47 49 193 140 47 73 138 145 73 45 75 7 -33 77 112 -18 -34 85 67 -49 -5 9 -32 -54 14 -43 -116 -130 75
1991 75 -26 -164 -90 18 -80 -149 -61 -9 -136 -124 23 -81 -144 -189 1 -22 -214 -130 -142 -158 -218 -131 -48 -293 -165
2016 -165 -103 -131 -268 -229 -125 -179 -265 -202 -105 -279 -185 -83 -197 -262 -133 -121 -174 -201 -129 -42 -154 -250 -17 -44 -220
2041 -220 -111 66 -27 -191 -88 86 -121 -100 34 67 -44 -120 107 14 -177 40 142 -10 -31 107 114 18 0
2064 0 128 126 -16 69 185 120 83 128 209 39 -8 207 202 44 66 247 205 38 90 256 203 24 177 290 42
2089 42 42 273 229 9 113 260 172 -9 127 256 61 19 230 267 73 97 247 239 72 114 175 56 32 148
2113A48R6k18p2K51j09j31M1J48j06j25R9P1k00J01J04j03j33M8J68j35j79J25
2135a11J65j65o7J90j05j60K7L05j35k19R2J93j57j09J86Rj56RJ86p2j90N9K05
2158b0o5j82J15J77k36k0J58pj97K9K32j5k70Q7J85o4j12J26L2j54MJ73m2k42
2182c08J10K27p5j91J41R6j39l9J60o9j21M2K32j30j06O9K12j44j23J78K0r4o
2205e8K29j51j23J11K37j34q7K1J26q4K4M8n2j00K2K16l2k20J65J23j27o1M7O8
2229B08j27J03Q0j29p8J00J20j06k18J54J72j62r2J36Qj75R7J78j62k02J41J94
2251B40j80l5J05M6q9n9J40o8j15L9K38j42j99J58M3o5kM7Lj24M3P3p6j68K10
2276F3M4j05q7J01M8j01j6Q8j17k8O9P1j34j33J91o1Lp0N4M8r2LQ7n3j83J24J56
$$ plain form
2113 148 244 26 -46 205 96 -35 6 154 48 -77 22 93 -107 -6 98 -5 -138 -90 78 -57 -236 -111
2135 -111 54 -111 -178 12 -93 -253 -226 79 -56 -275 -183 10 -147 -256 -70 -61 -217 -208 -22 -94 -284 -225 -20
2158 -20 -85 -267 -152 25 -211 -231 -73 -80 -277 -248 -16 -31 -301 -214 -29 -93 -205 -79 -47 -201 -197 -24 -66 -308
2182 -308 -198 29 -46 -237 -96 0 -139 -178 -18 -87 -208 -166 66 -64 -170 -101 111 -33 -156 22 42 -52 -58
2205 -58 171 20 -103 8 245 111 24 45 171 87 111 159 107 7 29 245 213 -7 158 281 154 93 140 208
2229 208 81 184 264 135 57 157 277 171 -47 107 279 117 25 161 169 -6 91 269 107 -95 46 240
2251 240 60 25 130 176 87 28 168 100 -15 24 262 120 -79 79 122 57 55 102 105 -19 24 97 21 -147 63
2276 63 107 2 -85 16 64 -37 -53 35 -82 -110 -41 30 -104 -237 -46 -107 -104 -174 -120 -72 -164 -161 -74 -127 -310 -186 -30
2303c0j32p2J27Op5j9R7k1j13Q4Q7o1j31J07O1j04j5J16k3r7Q1Q4j01j01J45R5
2329er9o5J03P6j10%O2K6r3K8J11j01q5J69l3k9r8N4P6p9L0Q7m1k5o4J78q6k9
2357d2N3L1p0l3J51l0q3J00M7p0q8J58L1n1p4N3J12o7p0Q8np7J11Lj5q5N6Q9p6
2386A47q4J23L3j47L0P1k9p9P2Q6o7o3L1J12j60J8M6m7o7O2M1k8p4N3K1o8m2J20
2414A11p1j10J17N4q7q8Q3P0j56J7J23n5p7k7J40n4n7k0J42j20k2K8Rq0J1J49
2440C0q5K7k5N1q1j6M2n0m6LJ6J05j56J11j7rq5R6Oq9K0R4nj38L6N7K3j43M6N3
2470a29L2q5J8R0j15K3j1N9k8J9M4ok7o5O9n3P1N9n1p2J45mOm0L4L0k3j4O8j9
2500B5j44J58K3Pj75Q1J99j19j04N8J28m7o9M9N9o4o8J18K9j57O7Q2m0J8j02J2
$$ plain form
2303 -30 -162 -234 -107 -101 -176 -195 -98 -119 -232 -148 -61 -122 -253 -146 -85 -189 -204 -88 -111 -208 -127 -43 -144 -245 -100 -5
2329 -5 -104 -169 -66 10 -100 -100 -38 -12 -105 -77 34 -67 -152 17 -16 -45 -143 -89 -13 -92 -62 25 -16 -41 -105 73 -13 -42
2357 -42 11 42 -28 -61 90 60 -23 77 124 54 -34 124 155 104 30 83 195 128 58 146 141 64 175 178 163 78 134 223 147
2386 147 63 186 219 72 102 173 144 65 137 223 156 93 124 236 76 94 140 93 26 88 129 101 27 80 101 33 -9 111
2414 111 40 -70 47 101 14 -74 9 79 -77 -60 63 8 -69 -96 44 -10 -67 -87 55 -65 -87 -59 -50 -130 -119 30
2440 30 -55 -28 -53 -2 -83 -99 -57 -107 -153 -150 -134 -29 -185 -74 -91 -100 -185 -89 -83 -172 -152 -58 -63 -201 -165 -108 -85 -228 -182 -129
2470 -129 -97 -182 -164 -74 -189 -166 -177 -118 -146 -127 -83 -89 -116 -181 -112 -165 -94 -35 -86 -158 -13 -17 -11 -51 -17 13 -10 -24 44 25
2500 25 -119 39 62 69 -106 -25 174 55 -49 9 137 90 21 70 129 65 -3 115 144 -13 54 136 96 114 12 24
2526B4O1LJ4k5L8J7N5m1m8N8K5j15R4M9p0q1R1J03q9j28J42M9n7q7R5k3k2K3O8
2555B23k4j40M5P1j8o1k7L5K5r1P5l8n1J5N2K6j08N1L1n7J2Pm9k0P6p4k4l6K6
2584d8K5m5j6NJ8p6Q9N7j11q3J42L9r8o5P8L0p1KJ0K3o2L9M5l6o1J26lr4k6LJ5
2615a49K3PJ3n9M4M4p3K0l1J11j5o6l4R1l1k0k8J11n4n9P8O9j46j1J58q8k8k7
2643a50J00m3k6O6Q1n0r8J02Q7q4m3J3O9J4o0P8n0k8Q8M2l6o8Q6K3o9P3M2n5k1
2672H3L8L4r2l5J54J2q3rJ13r3q1J34k7Oj27J05Qn3K5oJ15j08%J01j13m6R2l1
2700A16m4K8P9l7q2n0J33m2q0J04K1q8l5J43l2j13M0L6j3o0O5L8p9m4N0J9o9K
2728FN9K3j53OJ51K0j80M3M3r9n4J20N2j46J7J02k6p0m1J07j9j28J5O6j29K5J53
$$ plain form
2526 24 85 88 102 77 115 132 187 146 98 156 181 66 160 209 139 58 149 252 163 35 177 226 169 82 177 154 132 155 223
2555 223 199 59 104 175 157 96 69 104 129 38 113 75 24 39 91 117 9 60 91 34 46 53 4 -16 60 -14 -38 -74 -48
2584 -48 -23 -68 -84 -79 -61 -137 -48 9 -102 -185 -43 -4 -102 -167 -89 -59 -130 -128 -118 -95 -157 -118 -73 -109 -170 -44 -47 -141 -167 -164 -149
2615 -149 -126 -119 -106 -165 -121 -77 -150 -130 -161 -50 -65 -131 -165 -74 -105 -125 -153 -42 -96 -155 -77 -8 -154 -165 -7 -95 -123 -150
2643 -150 -50 -93 -119 -53 28 -22 -120 -18 69 -15 -58 -45 24 38 -22 56 6 -22 66 108 72 4 90 113 44 117 159 104 83
2672 83 121 155 63 28 182 194 111 102 215 122 41 175 148 154 27 132 140 87 112 106 221 113 113 214 101 55 147 116
2700 116 72 100 179 142 60 10 143 101 21 125 146 58 23 166 134 21 61 97 84 24 89 127 48 4 54 73 4 6
2728 6 65 88 -65 -59 92 112 -68 -25 18 -81 -135 -15 37 -109 -92 10 -16 -86 -127 -20 -39 -167 -152 -86 -215 -190 -37
2755c7l8j24N1K1Mj62J70O7j05j8M9J15k21L9J13r2k5O1J38r8q9J47k6q3j1J76
2781B2o7q0qJ31j22N4L5K4k8j12R2N2j18R8Q1q3o2K7J31j29RQ7l9n5J0J07p3p0
2809h6J07K9j00l3J27K4k7k9J34q4o4J10M1n8r0Q3R7j58k7J58jj36J9J34j01k0
2835D9M3J36p5j56J38R8j34K1L5lj17O7N9j0pJ7Qr1%J13p0o2N9N5j17j27J68J12
2863B09j62n9J22l6l8k4J01Mj37R5N0q0m9O8P4j29p1J25l4j05M0R8K3j35J0P5
2889C5j17J6J2Q5m9k4M4Mq6O1K0k9q5Q6m2o2M5M4m3r8M1M2Qn3J5P3j00%R8J7j37
2920a79j0J53q7p8Q4O2j12k3O7J43j54K6L3M7q6o6J51l9m1PP9j05O3R9k8l4j8
2947d6J1Ro9J02QL4j02J03k0j5m6L8Lm6N6P8j19j4Q2Pk3k7L9J1m2n7J37k5j17
$$ plain form
2755 -37 -75 -199 -148 -127 -123 -285 -115 -48 -153 -171 -122 -7 -228 -189 -76 -168 -193 -132 6 -92 -181 -34 -60 -143 -154 22
2781 22 -45 -125 -133 -2 -124 -70 -35 -11 -39 -151 -59 -7 -125 -27 54 -29 -91 -64 67 -62 -53 34 -5 -60 -50 57 -16 -86
2809 -86 21 50 -50 -83 44 68 41 12 146 62 -2 108 149 91 1 84 181 23 -4 154 153 17 36 170 69 49
2835 49 92 228 153 -3 135 233 99 120 155 152 35 102 161 151 144 161 169 78 78 191 121 59 118 173 56 -71 97 209
2863 209 47 -12 110 74 36 12 113 117 -20 75 125 45 -4 64 138 9 -62 63 29 -76 -36 62 85 -50 -40 35
2889 35 -82 -66 -54 31 -18 -42 2 6 -80 -19 1 -28 -113 -27 -69 -131 -86 -42 -85 -183 -142 -100 -92 -145 -130 -57 -157 -157 -59 -42 -179
2920 -179 -189 -36 -123 -201 -117 -55 -167 -190 -123 20 -134 -108 -75 -28 -114 -180 -29 -68 -109 -102 -23 -128 -65 34 6 -28 -46
2947 -46 -35 -26 -95 7 15 49 -53 50 30 15 -31 7 10 -36 20 98 -21 -35 47 54 31 4 43 54 12 -45 92 67 -50
2976e0J09Q7o1n2N0K3m2j2P3l8k1p5J37j8p9O3K0pl5L0K7p2J4O9k2k3j4L7J1p7
3006E2Q5Q0j55j5J09p2o8M5Q0n1j0jK8p1n0J07p0oj3J20p2m3J4L1J9j25RJ35q0
3035A2pJ4j1o4l4J15q3n4J51l0L7q1O5Oj09NJ0J0o5mJ14m7o0P2M3j23QN5K2k9
3065f2o9Q1qp1O1J10j16k7J2P2p1mN9l3J0j4K8n4m9M2M9p8L5k6O3k7O6m7l7n6
3095a61M3J06k4n1Q6n2O7p0N0j6j11J24P4l4r4QJ02m2m9N9J0k4L1M9n6j2K1L3
3123F7j0l1K0N2l6l5J9L6o6P2O4j22NQ3j7L3o9%L1j2j05J06j0o7J18N7q6q2N1
3152F6J8K7q5O9Ro2jO7j01L5O8p0jJ1J4j4j2Q2n8j7j7O9N0j23QON1k1l7K9l0l7
3184gN3j7n4o1J02%l2J2m4L2n7P1L2q5J2l2L4J5j05R3j1Ll8L0Nk1N5q4qL3l5M1
$$ plain form
2976 -50 59 146 85 33 83 106 64 52 125 87 66 -9 128 110 31 94 114 107 72 102 129 57 71 140 118 95 81 118 129 52
3006 52 137 217 62 47 156 84 16 61 141 90 80 79 107 36 -14 93 23 17 4 124 52 9 23 54 73 -52 -43 92 12
3035 12 5 19 8 -56 -90 25 -58 -112 39 9 46 -35 30 36 -73 -68 -58 -48 -113 -117 -3 -50 -110 -38 5 -118 -110 -55 -33 -62
3065 -62 -131 -50 -58 -129 -68 42 -74 -101 -89 -17 -88 -92 -33 -66 -56 -70 -42 -96 -145 -103 -54 -132 -97 -123 -60 -87 -21 -68 -105 -161
3095 -161 -118 -12 -36 -87 -1 -53 14 -56 -6 -22 -133 -9 65 31 -63 -55 47 5 -44 15 25 1 32 81 25 13 34 67
3123 67 57 26 46 98 62 27 46 82 16 88 152 30 35 118 101 134 65 65 96 84 -21 85 75 8 126 183 97 15 66
3152 66 84 111 26 95 104 42 41 108 7 42 110 40 39 50 64 50 38 120 62 45 28 97 147 24 32 38 89 68 31 60 30 -7
3184 -7 46 29 -25 -86 16 16 -16 -4 -48 -16 -73 -2 30 -55 -43 -75 -41 -26 -131 -38 -49 -46 -84 -54 -49 -70 -15 -99 -107 -74 -109 -68
3216f8m1%K5k1qK1O1j8j6l2N4j10K1J01O1j09L7k6Q0j23Q9o6jM5jmo3LN3j2Jj4
3248h1oK7J5Q2n7m2KlP3l3j7M8m9pJ3O9j1J8k4l5J0j7P0m2J4n0Q4l9M4N3ml7k0
3281D8K6m6J3K2J8M4m1k6O7lp0P7n2jn2L2O8l8lLK2n8J03o0lj1P7l7q2L5j4mJ4
3314F8M2p1j5l8J8M5l3OL1J3q1L8J3K7k1N1l3r1M2L3l3m3K6l0M7K5j5J8m4j6M0
3345A9j9o1O8n2l7J7lO2m3l7L4L5m4l4k7N9K2o4J54q5n1j8J7K7m5M5R4r9PJ6l3
3376g6m4N9K9o9L8M3n0qk7%K2j8O5n3M5p0l1J19k8m8O7lrM2l5M0m7Q4K6p9P0r3
3408c9P2Jo7K4J0J7J9k4n5P0Nj2nOM0Rr2L0R7o3k1Q6m3o2Kl6N3k1N3M3l1l6L8
3441F8jmJ7l0M9r4O0Rj6n5P5rmk4LQ2j42M9Q2o0MqN0p3qJ1m6j2m1R8K0o0j7R6
$$ plain form
3216 -68 -109 -109 -84 -105 -113 -92 -31 -49 -65 -97 -43 -153 -132 -31 30 -79 -42 -68 12 -111 -22 -88 -89 -44 -45 -49 -112 -109 -56 -68 -67 -81
3248 -81 -87 -60 -45 37 -20 -62 -60 -63 10 -23 -40 8 -41 -48 -35 34 23 41 17 -18 -8 -25 45 3 17 -33 51 12 56 109 105 68 48
3281 48 74 28 41 63 81 125 84 58 125 122 52 129 77 76 24 56 124 86 83 86 108 50 153 93 90 79 156 119 37 72 58 54 68
3314 68 110 39 24 -14 4 49 16 22 53 66 -15 23 36 63 42 93 60 -31 11 44 11 -32 -6 -36 11 36 21 39 -5 -21 19
3345 19 0 -61 7 -45 -82 -65 -68 -6 -49 -86 -52 -17 -61 -95 -122 -63 -41 -105 49 -36 -87 -105 -88 -61 -106 -61 33 -66 -59 -43 -76
3376 -76 -120 -61 -32 -101 -63 -20 -70 -78 -105 -105 -83 -101 -36 -89 -44 -114 -145 -26 -54 -102 -35 -38 -47 -5 -40 0 -47 37 63 -16 54 -39
3408 -39 33 34 -33 -9 1 18 37 13 -42 28 33 21 16 22 62 71 -21 9 106 43 22 108 65 3 5 -31 22 1 54 97 66 30 68
3441 68 67 63 80 50 99 5 65 74 58 3 78 69 65 41 44 126 -16 33 115 55 59 51 101 28 20 31 -15 -27 -68 30 50 -10 -27 69
3475F9n4j9OnL1k8ORl6L2%l7N3p7Q3l0k9J6omm4R3l1l6l0P3qm0PqOo0R7j5p7P1
3511b2J6N4q4Lj6o5J1Q0j04P9kP3o9J2J9l4N1j04O4o9Q6l9j7N9r8N1O0k4l0p0
3541a29J19p7rJ17r7j4Q9o9N2j9mK6j4lMO9j0o1N3k1l4jP0l2J0J9K9n6L3k8O8
3572H0j07N5k7O3q1P3M1r7K3L6qK6n1M7j5m7K7K6mk0J8j1l1J1J5Q7r1J0j1k5N2
3603F4pM0o1P1n9j3j6k4R8J8p1J5lj0q0J19k6n4M1qN8r1j4PM2m6J0O0j2k6l3K
3635ilj2Q9l7m8J7K9j0o1L4L2J4q6O2l4r6P4Rk6M4K3o5J7J2K9k2j2o5M7j7L1L4
3667fj9%n6R6k6j5J1J1RJ3j4m5l2J7L5p5Q6l1k7K0nO6l8N3j14M9K3q3P9M1n4L7
3699Fn7R0o0K6j5qRk9K9L9q2J1L2r%m5P3k7j1k7L7L1j4L1l9j3O5L3k3n1J1j0k6
$$ plain form
3475 69 15 -4 2 -3 28 0 6 15 -21 11 11 -26 27 -50 33 3 -26 -10 -16 -20 -64 29 -2 -38 -68 5 -3 -43 -36 -44 -38 -98 -1 -16 -93 -22
3511 -22 -6 48 -36 -33 -49 -114 -103 -23 -127 -48 -50 23 -46 -34 -15 -49 2 -102 -38 -107 -21 -60 -77 -18 -116 -65 -5 -29 -59 -129
3541 -129 -10 -87 -96 21 -76 -90 -1 -70 -18 -37 -41 -15 -29 -32 -28 41 31 -30 23 2 -32 -33 37 5 15 34 63 7 40 12 80
3572 80 -27 28 1 64 -17 56 97 0 23 59 51 77 26 73 58 11 38 64 60 40 58 47 16 27 42 129 38 48 37 12 64
3603 64 57 97 36 107 48 35 19 -5 93 111 40 55 52 42 -38 81 55 1 42 34 92 1 -13 -6 36 -10 0 60 48 22 -11 -9
3635 -9 -12 -24 65 28 -20 -3 26 16 -45 -11 21 35 -51 11 -23 -119 -45 -36 -62 -18 5 -60 -43 -31 -2 -24 -36 -101 -54 -71 -40 -6
3667 -6 -25 -25 -81 15 -11 -26 -15 -4 5 18 4 -41 -73 -56 -21 -96 -10 -41 -68 -48 -53 13 -25 28 -86 -37 -14 -97 -18 23 -31 6
3699 6 -51 39 -21 5 -10 -18 -9 -38 -9 30 -52 -41 -9 -18 -18 -63 10 -17 -28 -55 -18 13 -1 30 -9 -22 43 76 53 2 13 3 -23
3732b3R3n0k2J0L4J1ppl7J06m1j8J4J5j8j0nN4r0N3KKp9M8K7j9m0P5j8l9O6q3
3764DR8j9p5K2N5q7j5L5J0JJ0k2n6M5j6J0rLK1J0l2k7P5o5L8K3nn8N8m9j7O1J1
3797C8J6k2k7k6RM6m3O4j13L5qJ3j2kj9k2k7oN7M1r4L3j3Q0k7k2Pmj8L0m3K2J7
3830d0k0M4q3k1J00q3R3N3r1lL2KRj8k5L0l9PMJ8o2R5o5J24j8p1%qNPQ9p4J6J6
3864B3Jl3O3k7n1Nj8J13j8l4l8J2NlK8kL8l0OjL9n4N6n0J2jM8j16M4k8M4lK7j8
3898C9Nn2P5l0K5OOkk6j8L3k0J2Ok0L7p2Q1j04N7JOmn3K3L1%rj6L2J0o5P6n0O
3933B6n8O0M5p7L0L2p1L6k8Rk1J1j8k9mN0k2J4j1l9Q4l3K5o1Q6q6L3lN9n4p1N7
3965b9O7j17O5j3k8j6N1jOo2M8l7O0jm9MM8j1J3j1q5M6qrJ4L4p5N1j9K6M3k5J7
$$ plain form
3732 -23 70 20 -2 8 42 53 46 39 2 108 67 49 63 78 60 50 45 99 9 62 64 66 -13 35 62 43 3 78 60 21 87 4
3764 4 102 83 8 30 85 -2 -17 18 28 29 39 17 -39 6 -10 0 -9 -6 15 25 -7 -34 41 -24 14 37 32 -26 32 -17 -34 27 38
3797 38 54 32 5 -21 -12 34 -9 55 -58 -23 -31 -18 -30 -32 -51 -73 -100 -106 -49 -8 -102 -69 -82 -2 -29 -51 -44 -48 -66 -36 -79 -57 -40
3830 -40 -60 -16 -99 -120 -20 -103 -10 43 -48 -51 -19 -17 -8 -26 -51 -21 -60 -53 -49 -31 -93 2 -63 61 43 -28 -28 -36 -31 -24 65 -9 7 23
3864 23 24 -9 54 27 -24 -19 -37 76 58 24 -14 -2 3 0 28 26 64 34 40 39 78 24 80 30 42 41 89 -27 17 -11 33 30 57 39
3898 39 44 -8 67 37 62 68 74 72 46 28 61 41 53 59 39 76 4 85 -19 38 39 45 41 -12 11 42 42 33 17 49 59 -6 70 20 26
3933 26 -32 28 73 -4 26 58 -13 23 -5 4 -17 -6 -24 -53 -57 -7 -29 -15 -26 -65 19 -14 11 -50 36 -50 -17 -20 39 -15 -86 -29
3965 -29 38 -79 -14 -27 -55 -71 -20 -21 -15 -77 -29 -66 -6 -7 -56 -52 -4 -15 -2 -13 -98 -52 -60 -69 -55 -21 -96 -45 -64 -38 5 -20 -3
3998cn6J9lL6nqL0l9N7r0P7k0rn6Q7p9J8J4P5o5O2m1Q1j14P8l7O4o5J8K9j5k9
4030A1J02l3k8p3rJ09k6pn0%L6L9L5j24L9L9Jj4K5M4j12k8K6Q4Kpk7kl7M4pm3
4062IJ2NmJ1mMK7L0m7m9K2L2%O3j15Q7l3j0m8K0l5N9m2L3k4L2o3M3K6j1k0m2J0
4095b2M5l2j7K9m3M4K8n8k1N7ll7K1o3M7l1N5l4J3K2j7j9o7R8n5nmK5RN1q7N2
4127a9%J7j8n5Pj5JM7j9M1N2m0k9j4j7M4Nn0M8K7p7N3KJK2m6LkK2Qo4J6K3K7k9
4162b8M7o1L6kL7k6Nk7L7n0Q0n8J5P5n6L6j8jok6m0J24r3lQ1m0J1L8j8m2k8M3
4194D2K5J3l7%O0p3N7n5J2k7m0P7l0k4L8Qm4L8K9qk2j0l5M8p0J7Q7l7l9%M7k2
4226B5M0k8m1nK9N1n9L9n2L7k7k5M8k2j2n5jR2k6J5l7M0n2N4k9p1j5P8j3j9M0
$$ plain form
3998 -3 -59 -40 -43 -7 -12 -20 10 -29 28 -62 15 -5 -14 -70 17 -62 -44 -30 45 -20 42 1 82 -32 46 9 73 8 26 55 40 11
4030 11 113 80 52 -21 -30 79 53 46 -4 -4 32 71 106 -18 21 60 61 47 72 116 4 -24 2 86 88 81 54 52 15 59 52 9
4062 9 21 26 22 33 29 33 60 90 43 -6 16 48 48 111 -4 83 50 40 -8 12 -23 36 -6 27 3 35 -28 15 41 30 10 -32 -22
4095 -22 23 -9 -26 3 -40 4 32 -26 -47 10 7 -30 -9 -72 -25 -56 -1 -35 -22 0 -17 -36 -103 -5 -60 -65 -69 -44 -35 16 -71 -19
4127 -19 -19 -2 -20 -75 -68 -83 -82 -35 -54 -13 39 -1 -30 -44 -61 -17 -12 -62 -14 13 -64 -11 -9 -8 14 -32 -29 -31 -9 -1 -65 -49 -26 1 -28
4162 -28 19 -42 -6 -8 29 3 8 -19 18 -32 48 -10 5 80 24 60 42 41 35 9 -31 93 0 -3 78 38 49 87 69 27 -1 42
4194 42 67 80 43 43 103 30 87 32 44 17 -23 54 24 0 38 46 2 40 69 61 39 29 -6 42 -28 -11 76 39 0 0 47 25
4226 25 65 37 -4 -9 20 71 12 51 -1 36 9 -16 32 10 -2 -57 -58 34 8 23 -14 26 -26 28 -1 -72 -87 -9 -22 -41 -1
4257aPrl8j3K4m4K3ML7q9P1o0N2n5L4P3j13P0l8K2N0l3L8r4J03q8R4o8N2q%L3
4289C6p1K8J9n9L5l8N9m9j6O4k6N6o0M4PnK7n7k9K5m1O1j8M9j8Lmq7N0QJ1K9m8
4322a5L9Rk5o5Q8J0n0k3K8K3l8N1nL2J2k7Rm0L2p4N3k2MJ2J8J1k1LM6l6n4Q2r9
4355c2O7l9N6O2j10P1m1m6K8J11r5J5l6LMm9N2L7l1KK9m5l0L2J5L5j09J08k2o7
4385b5oJ31p9l0J0N1p4l1P7l1k0m2N4M6k8N9j0m8k9pM5k6K1k4j3L6o9N5km4O9
4416A6r6j4J2O5K1n3K0oj0J3Ol1l3Q2j7j0Lk5lj4R1n1r8R6O6j01L5pK8L1j03P4
4448a3j7J9o5KK7J8L5r7L0J3j5K6RM4o7M2J3rPMl9N0k8OK5m1P1n2P6o8l2L3L3
4481D0pm1K7JJ6k5M2j3l2M1nk6%q7J02o6M3M0Po3P6p8L4l7J9PP2m9mj8M1K1l2
$$ plain form
4257 -1 6 -3 -41 -54 -30 -74 -51 -47 -10 -99 -28 -88 -36 -91 -57 16 -97 -27 -65 -43 7 -26 12 -82 21 -67 27 -41 11 3 3 36
4289 36 -35 -7 12 -47 -12 -50 9 -40 -56 8 -18 38 -22 22 29 24 51 -6 -35 -10 -51 10 -8 41 23 26 22 -65 -15 -7 4 33 -15
4322 -15 24 33 8 -57 31 41 -9 -32 -4 19 -19 32 27 59 71 44 53 13 45 -29 24 2 6 18 36 47 26 29 75 39 -15 67 -32
4355 -32 35 -4 52 114 4 75 34 -12 16 127 32 47 11 14 18 -31 21 58 27 29 58 13 -17 15 30 65 -44 64 42 -25
4385 -25 -31 100 21 -9 1 52 -22 -53 24 -7 -27 -69 -15 31 3 62 52 4 -25 -32 13 -13 8 -16 -29 7 -62 -7 -9 -53 16
4416 16 -80 -94 -82 -17 4 -49 -29 -35 -45 -32 -26 -57 -90 -8 -25 -35 -32 -57 -60 -74 17 -34 -132 -36 30 -71 -36 -43 -15 16 -87 -13
4448 -13 -30 -11 -76 -74 -47 -29 6 -91 -61 -48 -63 -37 -28 16 -51 -9 4 -5 2 6 -33 17 -11 -5 20 -21 50 -2 74 6 -26 7 40
4481 40 33 -8 19 20 36 11 53 40 8 49 44 18 18 -69 33 -33 10 50 57 -6 70 -8 26 -11 8 15 87 38 34 16 57 78 46
4514D6n4J9L6j4j8L0m1j6O4l6pM8m6Q1k9k3mp0P8Lm1n6J02kj4jp7M5k9oNL1l0
4547b6m8P9p7P0n3nRO2k6J7q7R7o1k8M1J6jn0O3l9N5l8j0J4J9l6%l3J21r7J1m0
4579h1Q7q2j2N6J9k1L9l2L0k5L1m4K3l4k9R1l2nm5L4k0K2P0j18J12m9K0k7K7j5
4609a0K0Mn6K4J4J1oo2J01Qn8N2l7n5oJ36k9k9J7j8q7P8K6l2K1k3K6NN4n5LL3
4641G0m2l2O9j9K1K1o5J5L7Pr4O3j4P4m3j2M8q8M1N4n9k4l7k9N0m7J16p0K0m4
4671a3lR6q0M7o3O2l2J2K7m5J2J0l1M3m8K0Lk0M6%l7L2j9jk2n4L7oL4J9n0j1L
4704c2K0Ko5K4J2L6ql9Pj2K3LJ4j4o3P4MJ9j11j1J04o5RJ8pKL5q3N3L4k2M9o5
4737e5M3O1j07L4Rj5J8k4M0k6l5P1j22O2R5l3p3K0L0j1J7mr5Q6rN2n1JN5j02P0
$$ plain form
4514 46 -8 11 47 33 15 45 4 -12 52 16 9 57 11 92 63 40 36 -34 44 47 6 -50 52 50 36 35 -42 3 -26 -32 -27 4 -26
4547 -26 -74 5 -72 -2 -55 -60 -51 11 -15 2 -85 12 -49 -77 -36 -20 -21 -71 -8 -47 8 -30 -40 -26 -7 -43 -43 -76 45 -52 -41 -81
4579 -81 6 -76 -88 -32 -13 -34 5 -27 3 -22 9 -35 -12 -46 -75 16 -16 -21 -66 -32 -52 -30 40 -78 34 -15 5 -22 5 -10
4609 -10 10 14 -42 -18 -4 7 1 -61 40 48 -10 42 5 -50 -56 80 51 22 39 21 -66 12 38 6 27 4 30 35 89 34 37 70
4641 70 28 -4 65 46 67 88 23 38 75 82 -12 51 37 111 68 56 104 16 57 111 52 28 -9 -38 12 -35 81 11 31 -13
4671 -13 -16 80 0 47 -16 46 14 26 53 8 20 30 -1 42 -6 14 17 -3 43 43 6 38 19 18 -4 -58 -21 -27 7 26 -24 -35 -32
4704 -32 -12 -10 -75 -51 -39 -3 -11 -50 -43 -55 -32 -29 -15 -29 -92 -18 -14 5 -106 -117 -13 -78 -69 -51 -58 -56 -21 -104 -51 -17 -39 10 -55
4737 -55 -12 49 -58 -24 -15 -30 -12 -36 4 -22 -57 14 -108 -46 49 16 -57 -37 -7 -18 -1 -5 -100 -14 -23 29 -22 -21 34 -68 2
4768BJJ5J9q7R1k8lnk2K7m9N3J6j7PL3pK7j4o4l1N7j7j3rJ0k0O1M8m8K3j7K3p4
4802a2L7j0L0L0o8L9l7Q1o7J4M8K1r6jl3O7j2j4K8k8J6k6OPjQk1k5JJ1M1l4K6
4835B6Oj7n6J6L4m2l6J07o0j6L6JmL0r6L3M1l7rM6Ln3L4lj2pL7l1n3J01l3K7o8
4868e5K7O3q4k6O5L7j33J05qJ9L7m6l5J1l5j0N5l7j0N2jn1M1j1j2O3j00K9oj8
4898g4O7l7J2m2J82q1q2K3OM4Om3O8m9j5K4q0N9k0L7N0%q0j8K9j0O3RrK2l6k0
4930EPJ0n2M4L1mrJ8Njm7K0rJ5MK9l4K5j4k4%M3l7k6J5L4n6P2j00MJ30o8j6L0
4964D4n2P4n3NL8m7k0K3M5j15O6NJ4k6L5j1J8j8l2p6J51p4rL6k8l9K0N1j3o3N6
4995EK0J6o1jOQK2K3N2n2j01N8n8N0J8k8R7j07o3O0qL3K2p0N6m3K2K6j0J8m6M4
$$ plain form
4768 2 3 18 37 -50 41 13 10 5 -17 10 -39 14 30 13 20 53 46 73 59 -5 -36 21 4 -9 -18 -8 -28 33 81 33 56 39 62 -12
4802 -12 25 15 45 75 7 46 9 90 23 37 85 106 10 9 -24 43 31 17 45 17 33 7 13 20 19 27 6 -19 -18 -7 34 0 26
4835 26 32 15 -41 -25 9 -33 -69 38 -22 -38 -2 -1 -5 25 -71 -38 3 -34 -43 3 6 -47 -13 -16 -28 -35 2 -29 -82 19 -14 13 -55
4868 -55 -28 35 -49 -75 -10 27 -106 -1 -9 10 47 1 -34 -23 -58 -68 -13 -50 -60 -8 -9 -60 -19 -30 -42 21 -79 -50 -56 -74
4898 -74 -7 -44 -32 -74 108 27 -55 -32 -26 18 24 -19 49 0 -15 9 -71 -12 -32 5 55 55 -25 -43 -14 -24 39 48 39 61 25 5
4930 5 12 22 -30 14 45 41 32 50 55 54 7 27 18 33 37 66 32 57 43 19 19 62 25 -1 14 48 -8 64 -36 -32 98 30 14 44
4964 44 -8 66 13 18 56 9 -11 12 57 -58 8 13 27 1 36 25 43 25 -7 -83 68 -6 -15 21 -7 -46 -26 25 12 -51 5
4995 5 25 41 -20 -21 -15 -7 15 38 90 38 -63 -5 -63 -13 5 -23 74 -33 -96 -36 -44 -11 11 -59 -3 -46 -24 2 -8 10 -36 8
5027Hj4m0K1nL8m2K7J7l1k2LO8K7o6LLj03Q9m0l7O6O4j04J3JL8L1p3NJ9j7M9j8
5060b2NM9j01N8k2L1K1m8lN3m2Q5o7N2o1KN6l3k5KO7m4J5l9K9k2KJ3J4P5n5j1
5092C4L8p0J3M8o0j4M6m4M7k6j8M9n0K2K7K3j7j4R7j25qO8p5j3M3K5n0M5l2o6
5122e7O6J4ONk4M3M1q7m0J2O3n6J4J3oO2o6QK3j3M4l5k1j0l1K7K5R3m3q9J4r3
5154i8P4M8l3P6p9RK6K3j00L4K4Lqp1P6Jq9O3m3k3P4m5K9m1N6k2J1q9O0J3J5n9
5186h5O9j8n0Q2l3m8J03j9l2J0K2J2k0Pj2Q0m1j05L1MK1J3pk6j5N0Pl7P0l4Lj2
5218a0L7J3pk7l4N8l2o6M5O5q2N2j6N5j14M4P4n1J3M1o0K7k5ml1M9J8J5k5j9M4
5249D7j8K9m7P4j25P2k5L8l9J8j1M5Nj8J9l9L0j3mpJj0J8kml4L0l5j4K6Ol9pO4
$$ plain form
5027 8 -6 -46 -25 -30 8 -34 -7 10 -21 -43 -40 28 55 -11 -8 -5 -108 -19 -59 -96 -30 34 -70 -57 -56 -18 13 -60 -55 -36 -53 -4 -22
5060 -22 -17 32 -69 -11 -33 -2 19 -29 -32 21 -21 64 -3 49 -12 -10 46 13 -12 -10 57 13 28 -11 18 -4 -2 11 25 100 45 34
5092 34 72 2 15 63 3 -11 35 -9 38 12 -6 43 -7 15 42 65 48 34 131 6 -2 66 -9 -22 21 46 -4 41 9 -57
5122 -57 9 23 29 34 10 53 94 7 -33 -21 42 -14 0 13 7 69 3 11 34 21 65 30 9 -1 -32 -5 20 113 70 -19 -5 -98
5154 -98 -24 24 -9 67 -12 -3 23 46 -54 -20 4 7 -1 -72 4 5 -84 -21 -64 -87 -13 -58 -29 -70 -14 -36 -25 -114 -54 -41 -26 -85
5186 -85 -16 -34 -84 -2 -35 -83 20 1 -31 -21 1 13 -7 0 -12 68 27 -78 -47 -43 -22 -9 -16 -42 -57 -7 0 -37 33 -1 2 -10
5218 -10 27 40 33 6 -28 30 -2 -68 -23 42 -40 12 -4 51 -63 -19 55 4 17 58 -2 25 0 -4 -35 14 32 47 22 3 47
5249 47 29 58 11 85 -40 32 7 45 6 24 13 58 63 45 64 25 55 42 38 31 32 22 40 38 34 0 30 -5 -19 7 13 -26 -33 31
5283C1pm2Q%j5L0L0j8m3M2o4N6M5j00M9M6n1j1M7J1k5Pk6M5m7J1k5lK8k1j6k4
5315e2L4nM5j3k9M8mk5j5Njm9N2M3q4O7J1p5L3n6M2jj5rPk5P1qm0RpL3n8M4m2
5350f9L3l3M8MPM3o5j7P2k0k4J6J7n7M0K3J3J1k9m1KN6J5j9l2K7Pl8k1O2j7M5
5382E9k8p8R3m0oK4k6L7m4K0J7k1J7J0k9K4M0l0K5p5N0J2l1n1k4N1rN1rJ0r5M9
5414gL6K2l1j2L7Jm7J4P9n6j2K7j0q6N7M4n4%Q6n5m2J3k9M9k0M9o2L4l9L3ln4
5446c8J03q1N3l7k0L9k2O5o8O8j02M0k4K3j9kJlNl1R1l3Nk5Qm3P2l4n1J04n5l1
5478d2K7k5k8N8M4o8O8r1Q4l1K0o5K8l4K8L6q3J04m3K8l3j7J4j9P8q3k8P9o4j0
5508f8R1l8NM3j4mj3L2l0N2p1qJ1oN5p3P8r9R5o8KjJ0N8K6q5N1Rr3J5Q1l2JL7
$$ plain form
5283 31 24 -18 -10 -10 -25 5 35 17 -26 16 -48 8 53 -47 2 48 -3 -14 33 44 19 26 0 45 -2 9 -16 -19 9 -12 -28 -52
5315 -52 -18 -23 22 9 -20 28 24 -1 -16 -11 -12 -61 -9 34 -50 17 28 -47 -14 -70 -28 -29 -44 -53 -46 -71 0 -8 -48 -39 -46 -13 -71 -27 -69
5350 -69 -36 -69 -21 -17 -10 33 -32 -49 23 3 -21 -5 12 -45 -5 18 31 42 13 -28 -26 30 45 26 -6 21 28 -10 -31 31 14 59
5382 59 31 -47 46 6 0 24 -2 35 -9 11 28 7 24 34 5 29 69 39 64 -11 39 51 20 -31 -55 -4 -13 38 29 39 -56 -7
5414 -7 29 51 20 8 45 46 -1 13 92 36 24 51 41 -45 12 56 2 2 88 33 -9 4 -25 24 4 53 -9 25 -14 19 16 -38
5446 -38 65 -16 37 0 -20 19 -3 62 -6 62 -40 0 -24 -1 -20 -22 -21 -24 -19 -50 41 8 13 -12 -4 -47 25 -9 -60 44 -11 -42
5478 -42 -15 -40 -68 -10 34 -34 34 -57 27 -4 16 -49 -21 -55 -27 9 -74 30 -13 15 -18 -35 -21 -40 38 -45 -73 6 -58 -68
5508 -68 23 -15 -10 33 19 15 2 34 4 56 -15 -23 -12 -18 37 -36 42 -57 38 -30 -28 -29 -19 39 65 -20 31 40 -53 -38 43 11 12 49
5542D9l3L3k1O6j58J02n7j6O0L3q6LK8k2K3R1q9J8l6L5Jkkm8J14p0Kk1K2j4J2
5573A7L2k6kpNl8L7k8ok6j5Q3N1m0o5nJ6j9N0K4j6Rn3O0J6q4O5l7J6oM1p2K7L7
5607D1ok9l4P0kj21J00J5l0L9k1m9PL3m1J3j5ORM7o4M6n0KJ7J3M2l4jm4K2k3O0
5640A8o8O2m0M7o1J2J7j0L9n6kK2n1j0M6L6p1koP2qj1rK5%mk0J6L1o5j5qO8J3
5674Gk8m7Q0qNn1K9K6K2n8L5n6J1N2n7R1r1L3j2M9p3M3N7q6K7K6k0MO2o7L4Ml0
5707A3j4N1q1M4L8J2o3O9Jm6p9J68j00l8N0l1L3n2k6J00j1J9K4jl9o3RN7K8o6
5737FJ0l4Q3j00M6n5K7%m%O8q8L3Ql0J8J0j6l5N5oo7J12m6l8Q2o6O5k7n4j8N7
5769dl9J8M6p0M4j4L0%p4P0m0mQj2n5Q9l3L4K9k6l3L3l8O0J3k3k8Kk4K4jQL0j0
$$ plain form
5542 49 16 49 28 94 -64 38 -19 -35 25 58 -28 -25 3 -19 4 95 6 24 -12 23 24 22 20 -28 86 16 18 -3 19 5 17
5573 17 49 23 21 14 19 -19 18 -10 -16 -42 -57 26 77 37 -28 -33 -17 -36 14 38 22 31 -22 38 54 -30 35 -2 14 8 49 -23 4 41
5607 41 35 6 -28 42 40 -81 19 34 4 43 22 -27 -20 13 -28 -15 -30 -24 -15 32 -32 14 -36 -34 -17 -4 38 4 3 -41 -19 -42 18
5640 18 -50 12 -28 19 -42 -30 -13 -23 16 -40 -42 -20 -71 -81 -35 1 -70 -72 -78 -6 -14 -25 -34 -9 -9 -13 -33 -17 14 -51 -66 -74 -6 7
5674 7 -21 -68 12 4 9 -42 -13 13 35 -23 12 -44 -33 19 -38 53 -38 -5 -17 32 -41 2 59 -27 0 26 6 10 72 5 39 43 13
5707 13 -1 50 -31 13 51 63 0 69 70 24 -55 113 13 -25 25 -6 27 -25 -51 49 38 57 81 80 41 -22 -13 44 72 6
5737 6 16 -18 65 -35 11 -44 -17 -17 -21 -21 47 -41 -8 0 -30 -12 -2 -18 -53 2 -4 -71 41 -5 -43 39 -27 38 11 -43 -61 -4
5769 -4 -43 -25 21 -49 -5 -19 11 11 -63 7 -33 -37 -29 -41 -96 -7 -40 -6 23 -3 -36 -3 -41 19 32 9 -19 -17 -41 -17 -18 -10 20 10
5803A0k5joL5JJ8r1L8Nm3K9K8j9L5Kk4m3m7M1J17oq5N9m6J3l6P1o1L4mk5N0K3
5836D7l1K2l7J1k7l1Q5o2Om1OO6o3N1k3O1o3j1M0N9q2k5L7QJ8m0M1M5j01M8L6
5867E0n9N2p2J5J0M6J2l2l7M3k4M9j5o4O4k2K0oL0m8K1m6%j0jM0J2O3n6rKn1L0
5900Gj6L0K9n6Q3j44J00L2k5n1Rqk6J12o4p5Q3Ro1L9KJ9m2p4N1JJ2kPJ3Pk9OJ1
5934a1lK2M3r0K0J3l7o4L6J07o0J2j9J6j5L4k1Mm9K3L2J3k3pn9N6k5QM4m5M0j3
5966a8K1k9j7jk7P4m2%j2P8K3o2j4N7k9j8L7Oo6PK2OJ2l6JK0kQl5J4rP0om5K3
6001A1M8o8M5qm4jN8K5n7K3n3J1pN1J6l7L7l9k8jM7j7j5l2P6j0j9j5L2JJ6o1O
6034iqk3R9o3P5l7l3l2PJ2O9l7L3n4J7J3m1Q8p6N7jp9O1J1l5k1O3l2L1l2n1K0
$$ plain form
5803 10 -15 -16 -22 13 14 32 -59 -21 -16 -59 -30 -2 -21 14 16 -8 -51 -98 -57 60 54 -31 28 -18 -5 -41 30 -31 3 -1 -26 24 47
5836 47 16 38 1 12 -15 -46 39 -23 -17 -58 -52 14 -49 2 -21 40 -23 -34 6 65 -17 -42 -5 3 21 -19 22 67 -34 14 50
5867 50 -9 43 -29 -14 -4 42 54 22 -15 28 4 53 38 -26 38 16 36 30 60 12 33 -13 -13 -23 -24 16 28 91 35 26 28 -23 7
5900 7 -9 21 50 -6 77 -67 33 65 40 -11 -2 -10 -36 76 12 -63 20 29 -32 7 9 28 -14 -88 -37 -36 -24 -26 -19 -6 1 -28 -22 -11
5934 -11 -14 8 51 -39 -19 -6 -43 -107 -71 36 -24 -12 -31 -15 -30 4 -17 -13 -62 -39 -7 6 -17 -24 -83 -27 -52 -44 0 -45 -5 -18
5966 -18 3 -26 -43 -44 -71 3 -39 -39 -51 27 50 -12 -26 31 2 -16 21 27 -39 -32 -10 -4 8 -28 -27 -7 -9 -1 -36 -22 -31 39 33 -12 11
6001 11 59 -9 36 28 -16 -17 41 66 9 32 -21 -10 -17 34 50 13 50 11 -17 -18 29 12 -3 -35 41 31 12 -3 29 30 46 -15 -9
6034 -9 -17 -40 59 -4 71 34 1 -31 -24 -12 57 20 53 -1 16 29 -12 76 0 57 56 -23 38 49 14 -7 56 24 55 23 -28 -8
6066hk8k0J15k2po1kQ4n0J8l5K6qqL5J6k2ko2L3LorJ5kk9N0J2o9J0R5n9K6j02
6100g3O1L0m4J2m7M5k0KN9p6K6J2O1j26O9NL8l3j9J3pP5n6o3J00n6qLMJ0Kl3J6
6133a8N5k6L3Rn8K3l6pL9j5j8J8N9jn0j7Nk1L6p4N6j3J8L8j3LJ0l8Jk9L9o9N9
6166bK3ml2M1j5l5M2o7P7K2o6J4k1M9rj7%R0r6J8M4j7k6lQo2J17Lp1l0K5L0k5
6199Elk2M4K2l9J3rN5o4P7k8q4O7mM1l1k8qL4Lj6k7%j3m9J62r1q3O6K4M6n5mM4
6233D5n6Oj4Q2n4lJ0Ln3j9O3qL4p3K6k3l1L8m5P5kKn0J12n4qK9j07N9j2pN5j5
6266Ej5M1nr9R2j1p9J46q1J3O4l6q8Q5m1K5n1K3K0m6L0q2M3K6L2M0j10L0j1PK3
6297a0ok4L7J7n8O0o5M5oOK1qM6q6K8l4P6m8L0J3J0k8l6K3jLn6M3P0Lm7K9KJ2
$$ plain form
6066 -8 -36 -56 59 37 30 -31 -33 51 1 19 -16 10 2 -6 29 45 23 21 -41 -8 -5 -11 -20 -5 -7 -36 14 26 -43 -33 62 3 29 -73
6100 -73 -12 18 -26 -14 -61 -16 -36 -34 25 -51 -25 -13 48 -78 -9 -4 34 1 -18 -5 -12 63 7 -56 44 -12 -20 -17 -13 -3 -1 -34 -18
6133 -18 37 11 44 53 -5 18 -18 -25 14 -1 -19 -1 58 57 7 -10 -5 -26 10 -64 -8 -21 -3 35 22 25 35 -3 -2 -31 8 -61 -2
6166 -2 21 17 -15 26 11 -24 18 -49 28 50 -16 -2 -23 26 17 0 0 90 -6 12 56 39 13 10 18 -44 73 76 5 -25 0 30 5
6199 5 2 -20 24 46 7 20 11 66 2 79 51 -33 34 30 71 40 12 4 38 41 25 -2 -2 -15 -64 98 7 -76 -10 14 60 5 1 45
6233 45 -11 -5 -19 63 9 6 16 19 -34 -53 10 2 36 -37 -11 -34 -65 -27 -72 3 1 3 -47 65 11 3 32 -75 -16 -28 -35 20 5
6266 5 -10 31 26 -73 19 8 -71 75 -6 7 71 35 -53 32 -9 16 -35 -12 8 -38 -8 -90 -47 -21 11 51 -59 -29 -40 -33 -10
6297 -10 -16 -40 -3 14 -44 16 -49 -4 -10 -4 17 9 55 -31 -3 -37 39 -9 21 34 44 16 -20 3 2 5 -51 -8 62 65 18 47 49 61
6331F1l8M2n9L3k2M6l4m2N1j0KOk7L5n6P3j07P5k8NJ4m4N3n8P5ML4p3jqJ1RLp6
6365e1J3J01o1M6l7j4m5O9J6j4Qo5L9m4L9K0o1L4mj8Oj2OL2k5l7P8k6L5l3L4m9
6397b0k8O7l0M6l8K3j0k9K0k6q4M4O1rj5n2J16l9k1jj4RJ1Lm7jO7n4M9o7P7k2
6429a4Km9K7J4pL2M4j9pk8j6k4O3Rjk5rMm5K0L8j8L3kk8pq9P6L2k1k3Nj5K1m7
6464g4Q0j0K8Rq2QK3OL7l4nrL0j3K4l9l0L9N7p7O0J2l2J8p7R1q3L8J0n6J3Q0m7
6497erN2J2J4j7l8K3j2M1jj2o4nK9m5O9L2k5k2j5Kj1N6n5M8k6ol0NL5m8J2lj9
6531c8Q6l6m7O6n5L7K7q1K9P5pJp7JJ1jL6m4N6m6nj2L4j4K4K1k1L4j22P0kK9p0
6564d1oQk7L7K1l9K6K4l2K3p2M8j0K9j7L9ql8NK5l3J4kJ6k6J5l0L9ln1R3k7j5
$$ plain form
6331 61 23 65 6 39 17 63 29 -13 38 28 30 36 9 44 -12 61 -46 29 1 6 20 -24 29 -29 46 50 84 11 10 2 13 22 25 -51
6365 -51 -38 63 2 48 11 -3 -48 21 37 23 31 -34 5 -39 0 20 -41 -7 -11 -29 -23 -35 -29 3 -22 -59 19 -7 28 -5 29 -20
6397 -20 -48 19 -11 35 -3 20 10 -19 1 -25 -109 -65 -4 -13 -28 -80 36 -3 -24 -25 -39 -30 -19 -16 -63 -64 3 -51 -2 -69 8 -14
6429 -14 -12 -61 -34 -20 -27 5 49 30 23 -5 -21 -45 18 27 26 1 -8 -4 -49 -29 9 -9 24 22 -6 -13 -102 -26 6 -15 -38 -33 -48 -27 -74
6464 -74 6 -4 24 33 -49 -41 -18 -12 25 -9 -14 -23 7 -6 18 -21 -51 -12 45 -32 28 40 8 26 -51 40 -43 -5 5 -51 -38 42 -5
6497 -5 -14 38 50 64 47 9 32 20 61 60 48 -16 -21 8 -37 32 64 39 17 2 4 -7 49 -6 42 16 10 -20 -15 20 -28 -16 -19 -38
6531 -38 48 12 -35 31 -24 13 40 -41 -12 63 56 57 -20 -19 -8 -9 27 -17 39 -7 -12 -24 10 -4 20 41 20 54 -68 2 0 29 -41
6564 -41 -47 -39 -66 -29 -8 -47 -21 3 -29 -6 -78 -30 -40 -11 -28 11 3 -35 -30 -5 -38 -24 -26 -10 -36 -21 -51 -12 -15 -66 27 0 -15
6597a5J2l5jK5P7o0l3N7j08N0Kl7K8O0l1K6qPM1l8j8L0m4k4K8j2J7L1J3q9N5J
6629Gj8Q2l6m1OJM6m3l2O2J1j6k6k8O4k6ol9l0QL8M3%m6k0M6N3j8pj1l6L0j3N3
6663E8m4k5P8l8J5j0J9k8l1K0mJK3l1K2J1po2O6Qnj02O2N2l6n7R5no1K8k1OP8
6696G5q9J2j8K0L6o7J5Nl2mN8k2l8j5Q0m7O0k1l3j2O3n1l3lQ6j2kpkL2j1n5j4
6729d6j4M3k5J12r4N3l9K3q6L5K2k4N1l9O7l4j1n4P1n1L0k5L3%n0N1n8N4Lo4J4
6760e2N7j5Pqj9J7l3N5k1j0k2j6L6J5k6J9J3m7K2N4n0L6l8l2O9Km7P3p8J4M5n
6792A5j1oN3J2Rp1k3M6j2J1j1k5O7n8K0jk7J0l1k3M0llN0LK9nm6J2K2l3L6n5M3
6826C4J1k6L3J0q8L5M6J7r4l0K9L4NK2l0m6j5J37q8k9O5n0j4L3j2R5n3Mk2l3N5
$$ plain form
6597 -15 -3 -38 -39 -14 63 3 -30 27 -81 -31 -29 -66 -38 22 -9 17 9 16 57 19 1 31 -13 -37 -9 -21 -4 27 40 -49 6 7
6629 7 -11 71 35 -6 0 1 47 4 -28 34 45 29 3 -25 39 13 7 -32 -62 -54 -16 27 27 -19 -39 7 60 42 35 24 -12 18 5 58
6663 58 14 -11 67 29 44 34 53 25 -6 14 10 11 34 3 25 36 29 -33 33 41 36 -66 -4 48 12 -45 50 45 -16 12 -9 -3 75
6696 75 -14 -2 -20 0 36 -31 -16 -11 -43 -47 11 -11 -49 -64 16 -31 29 8 -25 -37 26 -25 -58 -61 25 13 11 4 2 34 23 -32 -46
6729 -46 -60 -17 -42 70 -24 29 -10 13 -73 -38 -16 -40 11 -28 39 5 -6 -60 11 -40 -10 -35 -2 -2 -52 -1 -59 -5 -2 -66 -52
6760 -52 5 -10 -3 -11 -30 -13 -46 9 -12 -22 -44 -60 -24 -9 -35 -16 -3 -50 -28 26 -24 12 -26 -58 11 13 -34 39 -39 -25 20 15
6792 15 4 -2 51 63 72 1 -22 24 12 23 12 -13 54 -4 16 15 -12 -2 -33 -56 -16 -19 -22 28 31 60 55 9 21 43 10 46 -9 34
6826 34 45 19 52 62 -26 9 55 72 -22 -52 -23 11 16 38 8 -38 -53 84 -4 -33 32 -18 -32 1 -11 84 31 35 13 -20 35
6857C5J6p5N8o2K0O3o3L9k5o8M9j5J4rN2l5n8Q3p1Ol2O2pL5Jn3LM3k2M5l7qK7
6890A1n8M3n4K7O3j10Q7J2Jn4k2L9K7l9K9j0j0N0q9O8j3j0L7J3n1qKMK0nk1L4
6922A3k6j2j4J2%K1J9pqj6l4R6j4n5L2M0o8KJ6rK2%oK6j31J33l2j6J1j1n7Q1k0
6955a2LJ8j9O3o1J2M7k4m7L1J7J2No7O0J1l4M7k3N0o0k8M8j2J9q9M7k3M4k4r%
6987BrJ06j02M4J2k0l9jrJ1j1P3j01L6k5P8k7l0M3Jk3k6L9k4%K6%m4J4l3L5JJ5
7020A2j7m8L8K4j5j6L5k1l4Q9j8Qm0K5j2q9M4O5r3J6K3n8M0M8m6N8k3Lm2M4nJ6
7052A1j5p0R6n2l4L0R6p8j5kN2J6o7L5j7L2q7Q4mj01J11L0r0QQ0o7J8j5k3L7q
7083iJ5m6P4l5k6J1L1m1K3Pk8O8j3l6K1j8K8k9K0n4P1o4M5k6N6n3M8m9m8K5M1
$$ plain form
6857 35 51 -24 34 -28 -8 55 -8 31 6 -62 -13 -28 -14 -23 29 -6 -64 19 -52 -46 -78 -16 -23 12 13 -40 -37 6 -16 29 -8 -16 11
6890 11 -47 -4 -58 -31 32 -78 9 21 22 -32 -54 -15 12 -27 2 -8 -18 32 -57 11 -2 -12 25 38 -13 -21 -19 -15 5 0 -21 13
6922 13 -13 -25 -39 -27 -27 -6 13 6 -2 -18 -52 44 30 -25 7 47 -21 -19 -3 -12 10 10 4 30 -101 32 0 -16 -5 -16 -73 8 -12
6955 -12 -9 9 -10 53 -8 4 51 27 -20 11 28 40 45 -22 38 49 15 62 39 89 29 1 49 37 56 -33 14 -9 35 11 2 2
6987 2 -7 99 -3 41 53 33 -6 -7 -16 -5 -16 57 -44 -8 -33 45 18 -12 31 32 9 -17 22 -2 -2 24 24 -20 -6 -39 -4 -3 12
7020 12 -5 -53 -15 9 -6 -22 13 -8 -42 47 29 37 -3 22 10 -79 -35 30 -63 -47 -24 -82 -42 6 -40 18 -5 -2 -44 0 -5 11
7052 11 -4 -74 22 -30 -64 -34 62 -16 -31 -33 19 35 -32 3 -14 18 -69 15 11 -90 21 51 -39 -31 49 -18 0 -15 -38 -1 -9
7083 -9 6 -40 34 -1 -27 -16 15 -26 -3 4 -24 44 31 -5 16 -2 26 -3 17 -37 34 -30 15 -11 45 -8 40 -9 -57 -32 9
7114Ij6J5n7O9k1K5J1o9N6lMM3p1j3M2M5j9o7N0o0J1J1M9mOkm6lQj2K7J5r6R7
7148C4l4P4l9M9l8p0KOM4m1P5n9M9m3k1lR5j13L2k4M4L4m5kk8L3m2J%K8M1n8K3
7181DM0q0kk0N1oK6m0M5rj00M3R6o9M4j2JL7j3n9k7K1rL6%J7o8O7n2l9P3Jl9J3
7215b9N8n8mO4q1L2K6mm1O9k2p0J20p5l3j6L9M2J6m1N9nl9j3O7n4N9r8L3K8m6
7246a7Q7m7M0m4Or3R1lk1N3j2Jj7l9K8Om5M0M6n2RJ3n3Q2l0rj8pM6l0j6M5J0J1
7280F1j0Jn0k7N0lm6J2LM6k3m0j3M1M4ql7J7j7N4r1L9O6rm3J3J0rN4m9k2l2OK3
7314A1l3J2K8j8j1k7J4j1j5J9l4OJ3J2L0LOpl4N5p0mO9j5K5k0QLk6m6L7M5N9j07
7348b3Mm1M6K0rpLl4M3O1r5m6O5M7ml5M1l0m5J1PO7m2Jm8K9l1P8l8k4K0Rk6K6
$$ plain form
7114 9 -7 8 -49 20 -1 24 35 -34 22 19 23 66 -5 -18 24 69 50 -17 33 -27 -16 -5 44 40 46 44 -2 -5 3 -9 18 33 -63 34
7148 34 0 74 35 84 46 -24 -22 -16 28 -13 62 3 52 9 -12 -15 80 -33 -1 -25 19 53 8 6 -22 11 -31 -30 -30 -2 39 -19 4
7181 4 44 -36 -38 -58 -7 -13 13 -27 18 9 -91 -48 48 -21 23 11 12 49 36 -23 -50 -29 -38 -2 -2 15 -53 14 -38 -77 -4 -3 -42 -29
7215 -29 29 -29 -33 31 -50 -18 8 4 -37 32 10 -60 60 -15 -48 -64 -25 17 33 -8 51 46 7 -6 61 7 66 -32 1 29 -17
7246 -17 70 23 63 19 25 -68 23 20 -1 52 40 41 24 -15 13 19 -26 14 60 8 17 30 -23 59 29 20 2 -5 41 11 -5 40 50 61
7280 61 51 52 2 -25 25 22 -24 -12 -9 37 14 -26 -39 2 46 38 1 18 1 55 -36 3 69 60 17 30 40 31 85 36 14 -18 -12 11
7314 11 -22 -10 18 0 -11 -38 -24 -35 -50 -31 -65 -59 -46 -34 -4 -1 5 -2 -36 19 -51 -55 14 -1 24 4 12 15 -11 -57 -20 25 84 -23
7348 -23 -19 -60 -14 6 -3 -10 -7 -41 2 63 -32 -78 -13 34 30 -5 36 6 -39 -28 -21 46 4 5 -43 -14 -45 33 -5 -29 -9 0 -26 0
7382@L2j01J9O1j8m9N3k3N0k6mQ1kr6jP0q3L8L5K1m2k2K3j3m5K9N6k7k8K5j6k7
7414c0L8l3J26o8m5J9l3JK4O1j6q3J1P5ppj1l1OKM2j4m9P6k5Km1N6n1mK9L0k3
7447B7j4qk8O0m8j8j1k7P4Qp7M7K1ok1L8M2j0q5M8j0L4n0mJ4p1Q5joM5m4L4l1
7480GK2m9j9N8M8m2o1M2n0J3L3p1P8M0J3l8k8P1r2M8m9kK7Nj1L5j36J13J5nm6
7511c1l8N5P4p8K7nK3l0M9m2k0nO6n3Rj8ll0RK2K6k2q5J19m9jj0M2M7p4M5l5M3
7544B7q1K2L5o4L9O3m1j6P6p2k6L8J4nOn4L7N8m2j7KPm5J5N3k1M4j01Q2n9K5o
7576gL1q3O7%k3l0M1J7L1j9j4j9J5qL8K6p6M2qO6l6j4q7L5K1j2J1O2r6R4n5j7
7608gK3k5N1o2K7K8Rl3K1p7pJ8M3l8j6N2Mp4N6K0n8J5Nj5P4m0L5m6l3L1M5K1q8
$$ plain form
7382 0 32 -69 -50 11 -7 -56 -3 -26 24 -2 -6 75 73 -23 -24 46 -37 1 36 57 15 -7 16 3 -42 -13 43 16 -12 13 -3 -30
7414 -30 8 -25 101 33 -12 7 -26 -25 -1 60 44 -39 -28 47 40 33 22 -9 -3 -1 41 27 -22 54 29 31 -10 46 -5 -9 20 50 27
7447 27 13 5 -23 37 -11 -29 -40 -67 7 15 -62 -15 6 0 -21 17 59 49 -36 12 2 36 -14 -18 -4 -75 10 9 3 48 4 38 7
7480 7 29 -20 -39 19 67 25 -36 6 -44 -31 2 -69 9 49 62 24 -4 67 -25 23 -26 -28 -1 4 -7 28 -108 5 20 15 -31
7511 -31 -69 -14 60 -18 9 4 27 -3 46 4 -16 -21 45 -8 1 -17 -20 -50 -41 -19 7 -15 -100 19 -30 -31 -41 1 48 -26 19 -16 27
7544 27 -54 -32 3 -61 -22 41 0 -16 60 -12 -38 0 14 9 15 -39 -2 56 14 -3 -1 6 -39 -24 29 8 52 -49 33 -26 -1 -7
7576 -7 24 -59 8 8 -15 -45 -4 13 44 25 11 -8 7 -1 37 63 -13 29 21 87 51 37 -50 -15 6 -6 5 67 -29 65 10 -7
7608 -7 16 -9 42 -20 7 35 44 11 32 -45 -52 -34 9 -29 -45 7 11 -63 -7 13 -45 -30 -25 -40 34 -6 29 -17 -50 -19 26 47 -41
7641d1n4J17k6j0M8p3N1L2q2L0J8k5J0l7N6m0K5k4M8m3O3m3n6N2J0oK5m9K5Pj2
7672dk5N2j2qJrK0j4NK9j2m4K1K0pn2Q9n1QOrl6M4o0J9N1n2lJ5L3p8J01lo2J8
7707iK4j1MPj9pN6ql7J8j4q5P6k6M7k4O5o6J3J8j7J3l7Q4q6lJ4OM8m4j4N5n6L4
7741A9m3K9oJ3J0%j3J2m8M0op3O1J3k5J04n7l7O1o3K3j1mL2l6mN3m4Rl4%NnnR6
7776F6Rm9j1jl3L2j05Q9k8L6N1k8j6k3m9M2N4L0o0k7Nl2N7k5P0r0NP8n9J5l8Q
7808b7L2Jn3K3jLM6l5j2O9k0J0J3p4L7j9l2M3k5L2N1q3K8LK6j3k4l4M3O5l6j0
7840B7l3K2j9QLk6K4k1M0L9p3j1MJ4m3L4j7L8J0q0K3l0N9K4K1p8N2j5RQ0l1l2
7872B2n1J0l0P1p3qL1L5pK7J1o5Rn0N6kJ9n6M4L7j5K0m6J9J6ML1l4l8RO4m4J2
$$ plain form
7641 -41 -95 22 -4 -14 34 -39 12 44 -38 -8 10 -15 -5 -42 14 -26 -1 -25 23 -20 43 0 -56 -4 6 0 25 -24 1 8 -4
7672 -4 -29 23 11 3 4 -5 15 1 6 35 23 -21 0 20 13 -39 50 -1 7 13 4 -32 12 -48 -29 22 -30 -33 -18 15 -63 38 35 -27 -9
7707 -9 15 4 8 15 -4 -11 45 37 0 18 4 -81 -5 -31 16 -8 57 -9 4 22 5 18 -19 65 -21 -24 -10 -4 44 0 -14 41 -15 19
7741 19 -24 5 -1 12 22 22 9 21 -27 13 7 -66 -5 8 -17 87 30 -7 54 -9 14 3 -1 31 -5 -9 44 0 9 -25 -25 -20 -25 -30 66
7776 66 75 26 15 14 -19 13 -92 -3 -31 5 56 28 12 -11 -60 -18 36 66 6 -21 -16 -48 9 -16 54 -36 -31 47 -12 3 -35 -27
7808 -27 5 6 -47 -24 -25 -22 24 -11 -23 46 26 36 49 -25 12 -7 -39 4 -21 11 62 -21 7 10 36 23 -1 -35 8 73 37 27
7840 27 -6 16 -3 5 8 -18 6 -15 25 64 -9 -20 -16 -2 -45 -11 -28 10 20 -60 -37 -67 -8 16 37 -41 11 -4 5 85 54 22
7872 22 -29 -19 -49 22 -51 -59 -28 7 0 27 38 -27 -18 -68 -12 -14 5 -51 -7 30 15 35 -11 8 24 28 59 25 -13 -4 60 16 28
7905B8oj6Q0q6K1k4QP3p8P0l0m6M6j00Q7o3Lj3Q0J8l0J5l2J9k5j3rQK4J6k1j5
7937a1j7Pk3K8j0N2o9M9j7J8k1l6K6J0l9M3l4O3K1o7J8j0k5Q8o1j6N4J9K2o5N7
7968E4q4M4j2J0l1L5k0Jl4M2j8k1P7J4k9l4qj7K5m7P9k1k6L1k7L0k7O8m1k1M3
7999C5Pl6L0j2L2m6qM0M0o8KK5j13Q9l6ML3m2m2M7Lj0L1k0K6n5K1J3Mj2JO8p8
8032b7M2RK2l2M4q0R8p5o0Q7J7m9K5l1K8ro2N6L8k4l5J1M2rn3M1l3M5K5j1K4n5
8064Io2N6o3M0L4Kn0L3k6M0j0J0Rm2K0J0%N5k7m9J7J2NMj08J12o2L6Pm0J8k2r
8097d1M6J5Qj1N4j3l4Jj5l0m5K0J8L5r3P7k2L0o1J21j02L2M8m7j9L8K5m1L5m4
8127a5JQmL8l2J8o2Pj4L3j3j0N5l8M3m1M6J2r1O5j7qN4n5l2J7P8jj03O0J7k8J3
$$ plain form
7905 28 22 6 86 0 21 -3 5 78 0 70 40 -6 40 -60 27 -36 -33 -46 34 52 22 37 5 24 -1 -14 -23 -15 9 25 4 -11
7937 -11 -28 -21 -44 -16 -26 26 -43 6 -11 7 -14 -50 -24 -14 -53 -10 -44 19 40 -27 -9 -19 -44 44 -17 -33 21 40 62 -3 54
7968 54 -30 14 2 12 -19 16 -4 -3 -37 5 -13 -34 43 57 28 -6 -14 -31 -6 -53 26 5 -21 10 -17 13 -14 54 13 -8 35
7999 35 42 6 36 24 56 10 2 42 82 14 16 41 -72 17 -19 -15 18 -24 -66 -19 -16 -26 5 -15 11 -44 -23 -10 -6 -18 -17 51 -27
8032 -27 15 24 46 14 58 -22 76 1 -59 28 45 -4 21 -10 18 9 -53 3 41 17 -18 -7 35 26 -27 14 -19 26 51 40 64 9
8064 9 -53 3 -60 -20 14 16 -34 -1 -27 13 3 13 22 -20 0 10 10 65 38 -11 6 18 23 27 -81 31 -31 5 12 -28 -10 -32 -41
8097 -41 5 20 28 17 71 58 24 25 10 -20 -65 -45 -27 8 -85 -8 -30 0 -61 60 -42 -10 38 -9 -28 10 35 -6 29 -15
8127 -15 -14 -6 -10 28 -4 14 -48 -41 -55 -22 -35 -45 10 -28 15 -26 20 32 -59 6 -11 -19 35 -20 -52 -35 43 42 -61 -1 16 -12 1
8160AM2j4j2K3J8j04M9L2p0J5L3j5l1j0O9j1n0J7O2j17L2P0o5N1no0J5M7j5n8
8190f1J25
$$ plain form
8160 1 43 29 17 40 58 -46 3 35 -35 -20 13 -2 -33 -43 26 15 -35 -18 44 -73 -41 29 -36 15 10 -50 -35 12 -3 -61
8190 -61 64
8191F4
$$ Imaginary data points
##PAGE= N=2
##DATA TABLE= (X++(I..I)), XYDATA
0@%%%%%%%%%%%%%%%%%%%%LpRj3J6j6J6j6J6j9K3k5K7k8L3l9M1m3M8n6O2o6P3q2
44d3Q9j00J13j25J41j62J88k19K57l11L89n02O83j006J689l639J7845O7820p6729
63F378p7552O8542O2897n7976m0726N5406J8820n8201j702O4788l931o7849Q45
76c0261O3423Q710m8698j7129K6924K0954l432j8039j4869J1467K3994o507k3380
89f843P881J6621j8070r343L5049N948n4377q655O9536J4904p6695k0549P4247
102B9654K0706o6101j3204N6311j105n0128J7604M8771l1493n1489L7795N3913
114E1234l6196n2417K8232M3519j8990k8896J1856J1162j0137L487J1594j2372
126B076j4255J2495J2830p682o063k79p326N116K2240o754l6291L371M3469k41
$$ plain form
0 0 0 0 0 0 0 0 0 0 0 0 0 0 0 0 0 0 0 0 0 0 3 -4 5 -8 8 -8 8 -8 8 -11 12 -13 14 -14 19 -20 21 -22 26 -30 32 -34 39 -43
44 -43 46 -54 59 -66 75 -87 101 -118 139 -172 217 -285 398 -608 1081 -2558 15287 83107 6378
63 6378 -71174 -2632 60265 2289 -38437 16969 35789 -22412 -24114 40674 36743 -31106 -30261
76 -30261 33162 41872 -6826 -23955 2969 23923 20491 2452 -12417 -950 23044 16537 -6843
89 -6843 1038 17659 -411 -9754 25295 31243 -23134 -31789 37747 52651 -24044 -44593 29654
102 29654 50360 -15741 -28945 27366 26261 -23867 -6263 42508 11015 -40474 -2679 51234
114 51234 15038 -37379 -9147 34372 15382 -13514 -1658 9504 -633 2854 14448 2076
126 2076 -12179 316 13146 5464 -599 -878 -8204 -3088 19152 12398 -23893 -20522 22947 22706
140B2706m4306j125L7965m153l0311J3724K3084k7137k0880L8338K1287m5258
152a6066k4034M4772K3680l9227j9336L0301R509k2889K780J8692j4738j8372
164b4928K2397J9518k3971j9494K0187J5664j3200p360P058l685l373J4912L310
177G035k2253m740K4786N895k1734l676J6265k151r906J1144O268j9983m990K6688
191H648O224k8526o826K6322N498k0466m76J4599o741r825J4860Q181k0692p827
205a7047K3297Q170k1275o279J6865K409j1044M157P156j0689m616J6502M334
218A1940j8276l843J7431K953j3184Q74Q759n555m450J1766K265j5667j125J8007
232A1895R75j6739O33J3724l119r442P647N870j2115l387J5955K422j7649j804
$$ plain form
140 22706 -21600 -22725 15240 11087 -19224 -5500 17584 -9553 -30433 7905 29192 -16066
152 -16066 -40100 4672 28352 -10875 -30211 90 9599 -13290 -10510 8182 -6556 -24928
164 -24928 -2531 16987 -6984 -26478 -6291 9373 -3827 -11187 -4129 -7814 -11187 3725 7035
177 7035 -15218 -19958 4828 10723 -11011 -14687 1578 -573 -10479 665 6933 -13050 -18040 8648
191 8648 14872 -13654 -20480 5842 11340 -9126 -9602 4997 -1744 -11569 3291 11472 -9220 -17047
205 -17047 6250 14420 -6855 -13134 3731 6140 -4904 -747 6409 -4280 -8896 7606 11940
218 11940 -6336 -10179 7252 10205 -2979 -2105 6654 1099 -3351 8415 10680 -4987 -6112 11895
232 11895 12870 -3869 -3236 10488 7369 -2073 5574 11444 -671 -4058 11897 14319 -3330 -5134
246e134J6968N73j4395J570J0822n095p772Q675N314j1924m371J3162L385j2902
260a124k492J0247M94p732K031M513n313k817P712J069r159n36Q695o96p539K112
276e35M901m458k930O695R06q975QR780r25r914J519Q618k889p107M117N091n929
293b027l916P025K579p842k032P277J063o496l22M699j015l630J947J947k959
308c702j052K963j57k909Q39J905j968j199K871p8l839Q92M243j793m540K548
324d976M169l355l635M245L037m969k298N536J864n568j042N466O07m850N69M459
340g41j027l677J965L438j979k695K299K412j647j327J461P55p72N58P14r35l13
357a511J601L44j288J99J274o18n70J587M85k282j39K982N85l057n43L009O77
$$ plain form
246 -5134 11834 12407 -1988 -418 10404 5309 -2463 6212 11526 -398 -4769 8393 11778 -1124
260 -1124 -3616 6631 7125 -607 1424 5937 624 -2193 5519 6588 -2571 -3107 5588 4892 -2647 -535
276 -535 4366 -92 -3022 3673 4579 -4396 -4388 5392 4467 -5447 -3928 4690 1801 -5306 -1189 3902 -2027
293 -2027 -5943 1082 3661 -4181 -6213 1064 2127 -4369 -4691 8 -1007 -4637 -2690 -743 -3702
308 -3702 -4754 -1791 -1948 -4857 -4018 -2113 -4081 -5280 -2409 -2487 -6326 -5434 -1191 -2984 -7524 -4976
324 -4976 -807 -4162 -7797 -3552 -515 -5484 -7782 -2246 -382 -5950 -6992 -1526 -919 -5769 -5200 -741
340 -741 -1768 -5445 -3480 -42 -2021 -4716 -2417 -5 -1652 -2979 -1518 -763 -1535 -977 -263 -1198 -1511
357 -1511 90 434 -854 -655 619 1 -569 1018 1503 -779 -918 2064 2649 -408 -951 2058 2735
374B735k272j63J843l42j285J140J356j443j376J691J792j121j684O09J670K38
390C388r41m90L22Q58K89n03j92J24J16J09O82R7j311m69J807J132j926j556J718
409C254J640j316j335Q81N32r44O6J027p93j782R32K011r97k398L20J849k82j393
427A272j53L31m97K34N25q15j297M01J286m33j470j54N94J78k38j88p67m39R85
446f45O52j185j135Q08Q80o40n99K26j44l35O61N30j346q59J397J045j345j176
464c210R30Q60p11n27N53k80o99P74Q57j237j135J153J199r98j204P53N83n12
482b851r1M01n74m65J000O61j251p35J260O46q48l47P38k14l88J142N02j710l20
501c444K355O81k314m72K385N64j904L72J837q76j426K144J694k527j617L259
$$ plain form
374 2735 463 300 2143 1801 516 1656 3012 1569 193 1884 3676 2555 871 1480 3150 3388
390 3388 2447 1957 2279 3137 3426 2923 2731 2855 2971 3080 3762 3859 2548 2079 3886 5018 3092 1536 3254
409 3254 4894 3578 2243 3124 3656 2712 2778 3805 3012 1230 2162 4173 3176 778 1098 2947 2665 1272
427 1272 1119 1450 953 1187 1712 897 -400 1 1287 854 -616 -770 -176 2 -236 -424 -1191 -1630 -645
446 -645 7 -1178 -2313 -1505 -625 -1265 -1864 -1638 -1782 -2117 -1456 -926 -2272 -3131 -1734 -689 -2034 -3210
464 -3210 -2280 -1420 -2131 -2658 -2105 -2385 -3084 -2310 -1453 -2690 -3825 -2672 -1473 -2471 -3675 -2922 -2339 -2851
482 -2851 -2942 -2541 -3115 -3580 -2580 -1919 -3170 -3905 -2645 -1999 -2847 -3194 -2456 -2670 -3058 -1916 -1414 -3124 -3444
501 -3444 -1089 -408 -2722 -3194 -809 -245 -2149 -1777 60 -816 -2242 -98 1596 -931 -2548 711
517G11K054l059j639K940J427k189l04K082m74j898J812K110k328k174K666K353
533D090k248j771J730J074j134K58R41j587r71K683J262l148j346K897J259k307
549A682m38J708q27j294K363J260l567j668M374J933m290j938L649J254k822m
565A375K044j531j873L080J984l960k516M120K443l497k096K486O17j634R11J163
581C116k836j513L891J584m326j995L650J269k891k55J671j812j352L369J133
596B703m960j740N229J634m987j399L536L2k736J669J762l808j843N224J742n931
612c873j876N303J382m372o3L003j949k206M158J863n917j998O736K130o497j683
628e859N429L49m003J664L215l962k840N923L109o831l180O615K992n464j825
$$ plain form
517 711 2765 -294 -1933 1007 2434 245 -59 2023 1549 -349 1463 3573 1245 -929 1737 4090
533 4090 1842 71 1801 2875 1741 1999 2940 1353 382 3065 4327 1179 -167 2730 3989 1682
549 1682 1244 2952 2125 831 3194 4454 887 -781 3593 5526 1236 -702 2947 4201 1379 1375
565 1375 3419 1888 15 3095 5079 1119 -1397 2723 5166 1669 -427 2059 2676 1042 1953 3116
581 3116 280 -1233 2658 4242 -84 -2079 1571 2840 -51 -306 1365 -447 -1799 1570 2703
596 2703 -2257 -3997 1232 2866 -2121 -3520 16 48 -2688 -1019 743 -3065 -4908 316 2058 -3873
612 -3873 -5749 -446 936 -3436 -3499 -496 -2445 -4651 -493 1370 -4547 -6545 191 2321 -4176 -5859
628 -5859 -430 -81 -4084 -2420 795 -3167 -6007 -84 3025 -3806 -6986 -371 2621 -2843 -4668
643d668M099j46k870K555K437m498k420N602K813n571k310M333J512k861P33J460
659B00l012o45N373P56o581q30O817R11n633K21M315j968k577M591J831o620j416
676d267Q345J860q419j554P696J012n940Q68M452k936l038N367K827o807k562
691c096P231K545o301j758M854J81k971K026J704m261r69N868O90o311n07N629
707D554l08m197J668K516l888j135N891K19p549R6P920m26p504J099N937k607
723B286m314M435K766o518j865P914J241q571r25P975J05o871J227N121l177l720
739b891N041K536o651k062P224J500o967r59N646m37m215K034K551m009j596N291
755B036Q56o121n21N667k88m728J257K886k921j441M518K5o013N72O559j259o297
$$ plain form
643 -4668 -569 -715 -3585 -1030 1407 -3091 -5511 91 2904 -2667 -4977 -644 868 -1993 -1260 200
659 200 -2812 -3457 1916 2672 -3909 -4739 2078 2989 -2644 -2423 1892 -76 -2653 1938 3769 -2851 -4267
676 -4267 4078 5938 -2481 -4035 3661 4673 -1267 -399 4053 1117 -1921 3446 6273 -534 -3096
691 -3096 4135 6680 379 -1379 3475 3656 685 2711 4415 154 -815 5053 5743 -568 -1075 4554
707 4554 4246 49 1717 4233 345 -790 5101 5320 -2229 -2133 5787 5361 -2143 -1044 4893 2286
723 2286 -2028 2407 5173 -1345 -3210 4704 5945 -2626 -3551 4424 4529 -2342 -1115 4006 829 -2891
739 -2891 2150 4686 -1965 -4027 3197 4697 -2270 -3229 2417 1980 -2235 -201 2350 -1659 -3255 2036
755 2036 2892 -3229 -3750 1917 1629 -3099 -1842 1044 -1877 -3318 1200 1225 -4788 -4216 2343 1084 -5213
772e213J702N166k787l736M222K056n854p66P037j16p693P57P535j355o519K300
788c264N121l465l458M917K324n989j173O555N73o253J72N569r02m080J999K756
804A402l073j243M172L09m575O13M559j261l685K191K584l083j082M192q3n013
820c076J269N512j943n382K709M913l473l856M515K665n218j446O009N61o236
835b477M53O183j126n501J942M745k587l581L430K487l813j332M182M84l858L12
851e7L580j155k667J952J737k511p26L048k37l176J078L136j918k772K722J961
867C995l358j332L817M44m270L80M154j194m156J964L526k692l154L242K283l738
883h9j679L724P62l808OL345r83l026J583K442k366j871K612J108k753m96K556
$$ plain form
772 -5213 -3511 1655 -1132 -4868 -646 1410 -4444 -5210 1827 1711 -5982 -5225 2310 955 -5564 -3264
788 -3264 1857 -1608 -5066 -149 2175 -3814 -4987 1568 2141 -4112 -3940 1629 727 -3353 -1354 1402
804 1402 -1671 -2914 1258 1567 -3008 -2395 2164 903 -2782 -591 1993 -1090 -2172 2020 1937 -3076
820 -3076 -1807 3705 1762 -3620 -911 4002 529 -3327 1188 3853 -1365 -2811 3198 3759 -2477
835 -2477 -2024 4159 3033 -2468 -526 4219 1632 -1949 1481 3968 155 -1177 3005 3489 -369 -57
851 -57 3523 2368 -299 1653 3390 879 153 3201 2964 -212 866 4002 2084 -688 2034 3995
867 3995 637 -695 3122 3566 -704 -324 3830 2636 -1520 444 3970 1278 -1876 1366 3649 -89
883 -89 -1768 1956 2718 -1090 -1084 2261 1278 -1748 -165 2277 -89 -1960 652 1760 -993 -1489 1067
900A067m53k312J147J936k103j518K624J088l137n76L057r4k874O72K562j645
916e59k197K356J789l064j443L241J071l416n36L044j96k644Q70K169j667j875
932c057K222J559k606j294K474R08k211l45J759l58j349J141J055j725q14K059
948e82O45j952l73J700J8j190O88Q91j340m60J977N38k294l46K378L31j890J75
966a086J452n61q95J331P32j800n45K244O59k060n16J818M05j256J64Q52o48m97
984b07J323M79j669m28J726M69j325k95Q68j0m17O99M3j251Q9J521R0j488j73
1003D4J262J52p47K29L13o97n7J231P8j669j17J703L20j444k78R50J64n91L23
1022A169K22q25j44J249J51j315n14J180N02p92l55K84m1q1M99j49r78o7J014
$$ plain form
900 1067 614 -1698 -551 1385 -718 -2236 388 1476 -1661 -2237 820 726 -2148 -1476 1086 -559
916 -559 -2756 -400 1389 -1675 -3118 123 1194 -2222 -2758 286 90 -2554 -1684 485 -1182 -3057
932 -3057 -835 724 -1882 -3176 -702 206 -2005 -2350 -591 -949 -2298 -1157 -102 -1827 -2641 -582
948 -582 63 -1889 -2262 -562 -544 -1734 -1046 -155 -1495 -1955 22 560 -1734 -2080 298 629 -1261 -1086
966 -1086 366 -195 -1090 241 973 -827 -1372 872 1531 -529 -1045 773 1178 -78 86 938 290 -207
984 -207 1116 1595 -74 -502 1224 1693 368 73 941 931 514 1213 1256 5 94 1615 1705 217 44
1003 44 1306 1458 711 940 1253 556 499 1730 1808 139 22 1725 2045 601 323 1273 1437 846 1169
1022 1169 1391 566 422 1671 1822 507 -7 1173 1675 883 528 812 771 690 1189 1040 62 -5 1009
1041A009K26j021m72N46L75k62j84j57l82J59O29j51q79k01P61L47o22n04J97
1060e86J59J31kk88n02J53P28m3p30j01L05L02j17j42k52j75M41M26l94o73K10
1081a150O98l0m92r1J70M9P4K36k74l96J26O61J8o52k10O00J99k12k88K2L7J83
1103g22K15k13l41J27L59J33k14k73J12K29K13l7l03j43M45L43k57l50K06M23
1123d8r2j08M5M4q2K61K56j33m04K11O31q0m16r4N09J98k05j24P8O1J81O2k0j58
1147E73M7J63J86q9k46m5K86K75l14l22J50M19o8m54P1K78Oj84K8J49k64j26L70
1170H89J28m58k30M58K23l44l35K91J54k38K2M8j37K1J45P3l79k9K43M0j76j37
1192B72Q8n2N3J54j62l87J11M81j58n25l1M87p8m24J02K02k89j53M14m8o38q9
$$ plain form
1041 1009 1235 214 -258 288 663 401 217 60 -322 -163 466 315 -564 -765 -4 343 -279 -783 -586
1060 -586 -427 -296 -298 -586 -1088 -935 -207 -250 -980 -1081 -776 -474 -591 -733 -985 -1160 -719 -293 -687 -1360 -1150
1081 -1150 -452 -482 -974 -1065 -895 -846 -772 -536 -810 -1206 -1080 -419 -401 -1053 -1263 -663 -464 -676 -964 -942 -905 -722
1103 -722 -507 -720 -1061 -934 -575 -442 -656 -929 -817 -588 -375 -412 -715 -858 -413 -70 -327 -677 -471 -48
1123 -48 -140 -248 -203 -159 -241 20 276 143 -261 -50 581 501 85 -9 500 698 493 369 447 508 689 751 731 573
1147 573 620 783 969 880 634 589 875 1150 836 514 664 1083 1015 561 632 910 916 732 760 909 645 519 889
1170 889 1017 559 329 787 1010 666 331 622 776 538 560 608 471 492 637 710 331 302 545 585 409 272
1192 272 360 308 361 515 353 -34 77 558 400 -125 -156 331 253 -171 -69 133 -156 -309 105 57 -581 -670
1214f70O31J14p07j92N10O5l90j4J44k72l2K90N5m80k11N22J10k67j59J66l6n9
1236h82L13k26l79J92N58j18o11N7N17p5k35K85k6k85N9O54j76q18K65Q44r8o46
1258h31J3N26p1j71L49j03n52J90Q69j81q50J08Q09n7n54K38K23l84J01O65k87
1279E0p58L36R12j30q29J23P08j86l05L85J0o11K94R40l13r55K38R77j33o37J99
1300C15L92l09n4O06j48r09N00R78l27r72K41Q51l07m54M75L4o92K60R05m03j090
1321a08L90J021k89q48K25N41m12k49O48j15r00J96J064l71j041K73Q17l25m75
1340D2L18O8n42J58P68m47r31M09J031n60q29M58M61n90j13P28l17r35N13J089
1360G79o77j029N31Q86n03o46M82K45p22R2R29m00j131N36J043m69j037M86P17
$$ plain form
1214 -670 -39 75 -632 -824 -314 -249 -639 -653 -509 -781 -813 -523 -468 -948 -1159 -637 -527 -794 -953 -787 -823 -882
1236 -882 -569 -795 -1174 -982 -424 -542 -1153 -1096 -579 -654 -889 -604 -630 -915 -856 -202 -378 -1196 -931 -87 -185 -831
1258 -831 -818 -292 -363 -534 -185 -288 -840 -650 219 38 -812 -704 105 48 -506 -268 -45 -429 -328 337 50
1279 50 -708 -372 540 410 -419 -296 412 226 -79 306 316 -295 -1 939 626 -329 -91 886 753 116 315
1300 315 707 398 344 950 802 -107 393 1371 1044 72 313 1164 857 403 878 912 220 480 1385 982 -108
1321 -108 282 1303 1014 166 391 932 520 271 919 804 -96 100 1164 793 -248 25 842 517 42
1340 42 360 428 -114 44 812 365 -566 -157 874 314 -515 -57 404 -186 -299 429 112 -823 -310 779
1360 779 102 -927 -396 490 -13 -659 -177 68 -654 -562 367 -33 -1164 -628 415 -54 -1091 -605 112
1379A12o23l22O57j57p65L69R25o10q96N84Q33p23n02O90J91p58J22Q85m64j004
1399a456P33J054p52r66Q13P55q23l80Q44J19r43L67J015n21j039P69Q77p04o46
1418h84Q46L29p60J04P32l17p87N93Q95p41o82P80N57p98k04P95o8q76N12Q54
1438H80o48q53Q41P56q97m79Q30L52r26O5Q73l72q20O02Q11p31o37Q17N02r37
1458B9j26Q42k2q84M20P65n22p05P47N75q55l96Q99J02r09K38P84l35q53O07P01
1479A102p21o38Q72L80r15k51R29n9q55K19P73m88p03N86M67p45l41P85J36q55
1499c22J07P34l47p03M93M80o20l73P57J47q38m8P96j23q67L58P26n68o00O84
1519a27M69q33k39Q55P6r49J79P49j49q04L38O05m95l19N17J84o63l2O74j11p07
$$ plain form
1379 112 -511 -833 -176 -333 -1098 -729 196 -414 -1310 -726 107 -616 -1118 -428 -237 -995 -873 12 -452 -1456
1399 -1456 -723 331 -421 -1387 -574 181 -642 -1022 -178 -59 -1002 -635 380 -141 -1180 -411 466 -238 -884
1418 -884 -38 291 -469 -365 367 50 -737 -144 751 10 -672 108 665 -133 -337 458 390 -486 26 880
1438 880 232 -621 220 976 79 -400 430 782 -144 -79 794 422 -398 204 1015 284 -353 464 966 29
1458 29 -97 745 723 -161 259 1024 502 -203 544 1119 264 -132 767 869 -40 198 982 647 -206 401 1102
1479 1102 381 -257 615 995 80 -171 758 699 -156 63 836 348 -355 231 698 -47 -388 397 533 -322
1499 -322 -215 519 172 -531 -38 442 -178 -551 206 353 -485 -533 263 140 -727 -369 357 -211 -811 -127
1519 -127 342 -491 -730 125 201 -748 -569 180 31 -773 -435 170 -325 -644 -127 57 -606 -638 36 -75 -782
1540g82K68N85l20l73L80K71o00NO23j60p05L41N80l18n89M64M81o43j40O25M8
1561D1p14J04Q11k65o83K77P08m17m39M25L74m78q6N05m1n23Q4O85k23n25K35
1582a45M95k76k22L65M8l83P8O33k73n36L73M72l89l06M36J01m36k2N69j14o32
1603a64L40N53l52m83K53M99l91k62L68R2m07o0O05j68m78J24N21k42l09J41J62
1624C42j98pK13j04k32J73K99k11k87K06K39l14n2K56j03l32K50M09l15m73L36
1645I5L97l45l04K57K25l53q4L17j18l19J06M23k21l69J81K77j32k44P8J50k05
1666a88M8J98k57j78J83J64j68j63J93m9p7O0J40j56k11K89J21k94j97L06K18
1687a8k75j49K50M1k50R5K31j50k19K07K51j46k55J22K77j41j78J74j9o5N0J15
$$ plain form
1540 -782 -514 71 -249 -622 -242 29 -571 -566 57 -103 -808 -467 113 -205 -794 -330 151 -492 -632 -7 41
1561 41 -673 -569 242 -23 -706 -429 279 -138 -577 -152 222 -256 -342 163 122 -401 -317 368 145 -380 -145
1582 -145 350 74 -148 217 265 -118 -40 593 320 -216 157 629 240 -66 370 471 35 13 582 468 -164
1603 -164 176 729 377 -106 147 646 255 -7 361 453 46 -14 591 423 -55 69 590 348 39 180 342
1624 342 144 137 350 246 14 187 486 275 -12 194 433 119 67 323 220 -112 138 547 232 -241 95
1645 95 492 147 -157 100 325 -28 -112 205 87 -232 -126 297 76 -293 -112 165 33 -211 -133 17 -188
1666 -188 -140 58 -199 -377 -194 -30 -198 -361 -168 -217 -294 -234 -94 -250 -461 -172 -51 -345 -542 -236 -18
1687 -18 -293 -442 -192 -151 -401 -306 -75 -225 -444 -237 14 -132 -387 -265 12 -129 -307 -133 -152 -217 -167 -52
1709e2m9j65J70R8r5j30J31Pl5J04M4j70NJ80R0k48r3K07O9j79N5J31o0r9P3J28
1735A17p6k10J59K01q1j81J21J26p6OO5k0rQ4l2Qp7R7J09j81J6J04Nq3Q3M2j12
1762B05J5P5P9k02l5J58Nj38L8O3p0q9J02R1p7j76J70J33j79j62J49Q4m9q0m2
1787F8J5NO4l7j27M5LL6p3K4J4o1L5jO6j87J58k4N6j66rJ13j7m9M9M9q5OK6Lj82
1818a83L8J34k8j28kJ25K1j15L7o5L7p7J40q0j08M4O6m4j4q0N6l1O5njl8L7R3
1846a06j19o8O5J05m4n4Q2o4J8P7L2j05%P7Q9q3p9M1M4R3m8L8l3m4J17O0p6n5
1874d0R9P5j07k6N1k0L8L3M7p9m6J01P6r4n2j8O2J7O9m6j17L8J72k3j25l2O2Q5
1902B00j6K5k7j2q3J39O0j84K4R9K9j19m0J01pm3rR3j25O9O0O2j75l2N8L0n2l7
$$ plain form
1709 -52 -101 -266 -96 2 -93 -223 -92 -85 -120 -16 28 -142 -137 43 133 -115 -208 -1 68 -111 -56 75 15 -84 -11 117
1735 117 41 -169 -10 191 110 -71 50 176 100 106 171 151 142 226 194 202 125 222 331 150 166 270 275 192 275 317 205
1762 205 220 295 374 172 137 295 300 162 200 263 193 104 206 297 220 44 214 347 168 6 155 239 190 110 68
1787 68 83 88 152 115 -12 33 36 72 -1 23 37 -24 11 10 76 -111 47 23 79 -87 -96 17 0 -49 0 49 -36 -30 -4 -1 -183
1818 -183 -145 -11 -39 -167 -169 -44 -23 -138 -101 -166 -129 -206 -66 -146 -254 -210 -144 -188 -202 -282 -226 -257 -192 -197 -198 -236 -199 -106
1846 -106 -225 -293 -228 -123 -167 -221 -139 -203 -185 -108 -76 -181 -181 -104 -15 -98 -177 -136 -92 1 -47 -9 -42 -86 31 91 15 -40
1874 -40 59 134 27 1 52 32 70 103 150 71 25 126 202 108 56 38 100 117 186 140 23 61 233 210 85 53 115 200
1902 200 184 209 182 170 87 226 286 102 126 225 254 135 95 196 189 146 137 230 105 174 234 296 121 89 147 177 125 88
1930H8J07n1j0l9M9r5n2J44M3k02Q5L8p8J9L2J3j69O0J25l8j43r4K02k1k05J32
1956f0L5n6p7N4P4j40o1J82n8o0n1J33jq4J5P9j59k7J56K0j29L2J12qq5OO9l6
1984a25k4J18q3j22R7J03k3j49P9J25k6k40J38J21j81OJ49o5k9k0J88m3j84j6
2008b06K35m9q0N4N9j52J4J21L4j21nJ70q3n5N2O0o9P2Q9kj78Q1J33n5r6J09O6
2035A98j42L5J47Mj37J08J14j13k18J89P5n1j45J98J23k45j06K64j0k10L0K30
2057C38j52j44J11Q1j11p8J92J4j53k5K01j87n8J23kr6r6J91K7j67K4J69r2j67
2081e7J00J65j77j35J94R8k17m4K10n4k15R2J71n5j95J15R7j66j23K29J6j43p4
2104a68J75K9k57J30P0k9j52J33N0j80JJ86r4j43M5J68q7j56J13K8j23KK07k7
$$ plain form
1930 88 195 144 134 95 144 49 -3 141 184 -18 67 105 27 46 78 91 -78 -18 107 69 -74 -168 34 13 -192 -60
1956 -60 -25 -81 -158 -104 -30 -170 -231 -49 -107 -167 -218 -85 -86 -170 -155 -76 -235 -262 -106 -86 -215 -183 -71 -79 -164 -158 -89 -125
1984 -125 -149 -31 -114 -236 -139 -36 -59 -208 -129 -4 -30 -270 -132 -11 -192 -186 -37 -102 -131 -151 37 -6 -190 -206
2008 -206 29 -20 -100 -46 13 -139 -125 -4 30 -91 -96 74 -9 -64 -12 48 -21 51 140 138 -40 41 174 119 23 132 198
2035 198 56 91 238 242 105 213 327 214 -4 185 260 209 64 262 385 140 34 298 288 78 108 338
2057 338 186 42 153 234 123 45 237 251 98 73 274 87 29 152 150 54 -42 149 176 9 33 202 110 -57
2081 -57 43 208 31 -104 90 188 -29 -73 137 83 -132 -40 131 76 -119 -4 93 -73 -196 33 49 -94 -168
2104 -168 7 36 -221 -91 -21 -50 -202 -69 -19 -199 -198 -12 -106 -249 -204 -36 -123 -279 -166 -138 -261 -259 -52 -79
2128g9k41K9L47j81j08L4Q3k1r0J28M6k06k4L17m8k18K8K55j44j10J85N6j81L3
2152a10K20r2j80J05J50l4k72J53J35q1l3R7K4k10O3K54p3k08N7J69l2j48O7R4
2176A15j45M6Q5K4j97J10K14r3j64J3K24r8p4J00N3k05O3J81p5k01J17J75nj72
2200I1Q8Q9j16J2N7kj77J01J57q6k08J52P6j07pN6L1j87M8K04j65j58K00M1q0
2225A10j92J72O8j32k6J59r9j87J37J58j65j29R2Q4k5q9J12k5j51O5J54j03k31
2248b43J57J58j75j27J90O5j37l8J34j09n4M5J04r3j25J30J33r3j26J33m1q3q
2271b03J62m7j56N7J51j66q6J38J03j62J1P3m2q9J16J61j88n8P2J72j24p6P8J3
2295i0p0O2O9o7j26J01J63r4m9N1J13q2m9J12op4J2J52r3q5R4O2j8j41L3M7K7
$$ plain form
2128 -79 -320 -291 56 -125 -233 -199 -116 -137 -227 -99 -53 -259 -283 34 -14 -232 -204 51 -93 -203 -18 38 -143 -110
2152 -110 110 18 -162 -57 93 59 -213 -60 75 -6 -39 58 82 -128 -65 189 116 -92 -35 134 102 -46 21 115
2176 115 -30 16 101 125 -72 38 252 159 -5 8 232 134 60 160 213 8 71 252 177 -24 93 268 263 91
2200 91 179 268 152 164 221 219 42 143 300 214 6 158 234 127 120 176 207 20 68 272 107 -51 149 190 110
2225 110 -82 90 158 26 0 159 60 -127 10 168 3 -126 -34 50 25 -64 48 23 -128 -63 91 -12 -243
2248 -243 -86 72 -103 -230 -40 25 -112 -150 -16 -125 -179 -134 -30 -123 -248 -118 15 -78 -204 -71 -112 -195 -203
2271 -203 -41 -88 -244 -187 -36 -202 -288 -150 -47 -209 -198 -125 -167 -256 -140 21 -167 -225 -153 19 -105 -181 -103 -90
2295 -90 -160 -98 -29 -96 -222 -121 42 -52 -101 -50 63 -19 -68 44 38 -36 -24 128 35 -50 44 106 88 -53 -20 27 54
2322E4JO9p9jP7K5o8j03J25O1q9J6J12j08k5N3Q6j54p2J36J21j76K6N9P5j39k9
2349E3J59n1j06O9R6r3q7J06O0Kr5M7M6j17O9rm0o8N3J30q7j27J08J3ok7O6p1
2377I3j09J45K8j21j11J31L1l7q4L1N6j23JJ49j9j50Q5J5n8n3O2j6l5j9J2N9p7
2404a14M5l5Lq0J52j1j24%J40o8o7M9j7l5q4J24R7j43k2J26j4j04K1M9K7j04J12
2431g7RJ0j39P2N3nq4R2p6k5O4M7j5j10J01L2p6M0L2j3j22J25N2on9M5Ql5m3J65
2461F2jj40lR7O7j56L1R6jq9Q3l6M6n3N1P1m1l5N7L6k6l8J8Q8o0kl0M0M0l8lo6
2493F5P5J0L7j11R4j2j27N8Q3Mj01QJ51l5j15J3Q4q3m7O5K1m1p2P5N0m3q3J16
2521A39L6r1j15J05p9R5k0kl1O7L6j06l8O0N1o5pL7o1p9J06K7l7j29J06Jk6r8
$$ plain form
2322 54 55 124 45 44 121 146 78 -25 100 161 72 88 200 92 67 120 206 52 -20 116 237 61 87 146 221 82 53
2349 53 212 161 55 124 220 127 40 146 206 208 113 160 206 89 158 149 109 41 94 224 137 10 118 131 125 98 164 93
2377 93 -16 129 157 36 -75 56 87 50 -34 -3 53 -70 -69 80 61 -89 -4 11 -47 -100 -38 -54 -89 -108 -96 -37 -114
2404 -114 -69 -104 -101 -181 -29 -40 -164 -164 -24 -92 -159 -110 -127 -162 -246 -122 -25 -168 -190 -64 -78 -182 -161 -112 -85 -189 -77
2431 -77 -68 -58 -197 -125 -72 -77 -161 -69 -145 -170 -106 -59 -74 -184 -83 -51 -127 -87 -55 -68 -190 -65 -13 -19 -78 -33 -25 -60 -103 62
2461 62 61 -79 -82 15 82 -74 -43 53 52 -37 46 10 56 3 54 125 84 49 106 142 116 78 96 184 124 122 92 132 172 134 131 65
2493 65 140 150 187 76 170 158 31 89 172 176 75 83 234 199 84 97 181 98 51 116 137 96 24 99 149 106 23 139
2521 139 175 84 -31 74 -5 90 70 68 37 104 140 34 -4 56 107 42 35 72 11 -68 38 65 28 -101 5 6 -20 -118
2549a18P5K1j05M2Q7n6j12L8J44l3k10J25L5J0m6p2P5r3K9O0l7o9%Q5L0p9L4n2
2577a92L4J9K4k3m1O6Q0r2j08J06M3p8K4L1J2K%R0j31r6J33P4r3m2Q8L6l7j3M2
2606d2K7m8L2P9m5j18R0k3L4lk8l8l4J38k0nm2K0R0qj07J29n1oM9M4m0r2R3Q2
2636A57o3j27J54L8n2k7M8M4n6L3K2j0l7R9J2m3j16Q9J8qk7qk5K3N1k1rj11R1
2665A39Qm7j1N6K8j27O6K1q2LP7J2j36K5P9m7l9O0K6q3o4R5M2j78LJ05mn5k4O8
2695A6m8m1P5np8K8L8k2k4k9M8K2j26P8M7l9m7J29q5q3k9J16o5q2J30N2o7r6R4
2724i3j6q1j0P5K9j62J53N2o3r1M9M3o4m5J36lp2j0J49o1q7K8O3jj52J44j2q8
2752a90P4J11L9j76Q7J00p4j06J47J9o4J0Q2kj16J01R5j59k3J00Q5q6j04J32j2
$$ plain form
2549 -118 -43 -22 -127 -85 2 -54 -166 -128 16 -17 -227 -102 -67 -57 -103 -175 -100 -193 -164 -104 -141 -210 -210 -125 -95 -174 -140 -192
2577 -192 -158 -139 -115 -138 -179 -113 -33 -125 -233 -127 -84 -162 -138 -107 -95 -93 -93 -3 -134 -230 -97 -23 -116 -158 -70 -34 -71 -84 -42
2606 -42 -15 -63 -31 48 3 -115 -25 -48 -14 -17 -45 -83 -117 21 1 -4 -46 -26 64 56 -51 78 27 21 70 114 74 -18 75 157
2636 157 94 -33 121 159 107 80 128 172 116 149 171 161 124 223 235 192 76 165 183 175 148 140 115 138 189 168 159 48 139
2665 139 147 100 89 145 173 46 112 133 51 54 131 143 7 32 111 64 25 85 111 28 -36 59 101 -77 -74 31 27 -28 -52 16
2695 16 -32 -73 2 -3 -81 -53 -15 -37 -61 -90 -42 -20 -146 -68 -21 -60 -107 22 -63 -146 -175 -59 -124 -206 -76 -24 -91 -187 -93
2724 -93 -109 -190 -200 -125 -96 -258 -105 -53 -116 -207 -158 -115 -179 -224 -88 -91 -163 -173 -24 -85 -172 -144 -81 -82 -234 -90 -102 -190
2752 -190 -116 -5 34 -142 -55 45 -29 -135 12 31 -33 -23 59 57 -59 42 137 -22 -45 55 140 54 -50 82 70
2777G0j13J5R9K4j35N8J37j39n3Q9J17j24m9J70m2m5l4M9K4m8K6O6p6o5P3Q9p8
2804A05k3Q6K6j71R0Q3j53RJ47j6r9JO4No4L3O7p3j54J70Q1j98J3N5J10j49p1
2831b6J47p0m6R1M2r8j20J14J03j95l9J64k5j12NL0l3nJ3J07j54k6J30j5j17J
2857a34Q2K7k8n7N5l7n0J03O7j30m2J13k9o5JJ45j01n3Q1J28j43j36K10l5j35
2882a63K3J03n2q2kQ5p4PO5L3r6l0J62k8j27N8J40j30oK8N4o5n6J19q0j5M6P0
2910a3m7k1N2lo5L5Q7nr3L8J08p5j2l7J06np7J02Ln2oP9O8r4l2P2k6m9N7jm2J
2942E3LM4k3N2J9j3q8L1O4p7n4J34J5j11oJ15pj9n5N8q9J2K6N7r6l1O8K4p8k2
2972FR4l6L1q5M1N9p7J1J00j10l6R3P3j55L9K8k0q1P5M2r6L0O5j3q7n3J50q6L3
$$ plain form
2777 70 -43 -28 71 95 -40 18 155 16 -37 52 169 45 -4 166 124 79 45 94 118 70 96 162 86 21 94 183 105
2804 105 82 168 194 23 113 196 43 52 199 183 84 85 149 154 90 123 190 117 -37 133 214 16 29 84 194 45 -26
2831 -26 121 51 5 96 138 40 -80 34 137 -58 -97 67 42 -70 -65 -35 -68 -73 -60 47 -107 -133 -3 -18 -135 -134
2857 -134 -52 -25 -53 -110 -55 -92 -142 -39 28 -102 -144 -31 -60 -125 -124 21 -80 -133 -52 76 -67 -203 7 -28 -163
2882 -163 -140 -37 -89 -171 -173 -88 -162 -155 -90 -57 -153 -183 -21 -49 -176 -118 22 -108 -114 -86 -32 -97 -153 -34 -114 -129 -83 -13
2910 -13 -60 -81 -29 -32 -97 -62 25 20 -73 -35 73 -2 -14 -51 55 50 -27 75 78 26 20 99 167 73 41 113 87 38 95 94 52 53
2942 53 56 100 77 129 148 135 47 78 142 65 11 145 160 49 43 158 151 132 77 135 46 58 84 141 45 14 82 106 28 6
2972 6 100 64 95 10 51 110 33 44 144 34 -2 91 164 9 48 76 56 -25 50 92 -4 26 91 78 -9 -62 88 2 35
3001C5n1N1l4m4M5M7p9p2O0j2J2q6J69r2j03P9J7q7k3J16J9j17QQ4l2o2K6P9q2
3030a29j9K9P8j06k1P5L7l2JO8J5j24kK6N8m0K5L0k4q1J31m6n1N3j8O1r9P4j8
3059d9j5JqM7k6o5J30q1K8M2l7J6j23J60L1o8rN8lk1o2R5O9j68J06n6n6M2K9P5
3089H2k9J8L3j0j03P5L9o8k5R3L8pk6j1N8o6m7O3l4K4J5J7J0n7J2Mj2l1N6l1l3
3120D7K0P1k0j11J4P3n5n3O8n0mK1P5n6j6J4Kk0l8N5J3l6M7Np7k3P2mno9N3J10
3152A23j04m0p3R1l0qO2rl8p4O6K7p9K1N8j1L4o4m2K8O7K5j31Qj1K4J5q9M3m5
3182a56O5nL1o3j9R9Kmj22Q2J6k8p5J34n9r3J01K2K4j7L2Kq4M4l2Q8j02J3R1p9
3212i2k0P9M8j4k8j0mJ5M7J2k3l9R8k0o1N2L8J4r2rJ1O3o9LJ04q9j8K3M6m0KJ29
$$ plain form
3001 35 -16 35 1 -43 2 49 -30 -102 -42 -54 -42 -128 41 -51 -154 -75 -58 -145 -168 -52 -33 -150 -142 -58 -90 -152 -126 -47 -129
3030 -129 -148 -119 -41 -147 -168 -93 -56 -88 -87 -19 -4 -128 -130 -104 -46 -86 -61 -31 -55 -136 -5 -51 -102 -49 -67 -6 -105 -31 -49
3059 -49 -64 -63 -71 -24 -50 -115 15 -66 -38 4 -33 -17 -140 20 51 -17 -26 32 29 8 -54 41 110 -58 48 -8 -64 -22 7 82
3089 82 53 71 104 94 -9 66 105 37 12 105 143 136 110 99 157 91 44 107 73 97 112 129 139 82 94 98 86 55 111 80 47
3120 47 67 138 118 7 21 94 39 -14 54 4 0 21 96 40 24 38 40 20 -18 37 50 14 61 66 -11 -34 38 34 29 -40 13 123
3152 123 19 -21 -94 -3 -33 -41 21 12 -26 -100 -34 -7 -86 -65 -7 -18 16 -48 -90 -62 5 30 -101 -93 -104 -80 -65 -154 -111 -156
3182 -156 -91 -96 -65 -128 -147 -48 -46 -50 -172 -90 -74 -102 -177 -43 -102 -195 -94 -72 -48 -65 -33 -31 -115 -71 -103 -15 -117 -104 -13 -92
3212 -92 -112 -33 15 1 -27 -37 -41 -26 21 33 10 -29 69 49 -12 40 78 92 0 -9 2 65 -4 -1 103 14 -4 19 65 25 27 156
3244A56l5p0k2J4K5l9kl2O5l1qJK3J7l0Q4k4nJ4l5LK5nk4nL2O5k4n8pO4p6L4l4
3278E6L2rK6J9k0p9N9k1jpKk4K1P5j53L0K6j1R3j66M7L1jk2m6N5o7k1L9L9q5N2
3310c1L0K4r4J1k6m1O0J9j7n9P6J0N8j11NL9K1q9N7PK0j4K8j00k5P8m2L6j2M2
3340d0L3k2p2K8L5k9O2lm7k3Qj9LK4kJj8pO5l5Nn7N6j2k8N8L2%p2N8j4j6R1j11
3374f8P0p5J17n1l0K1L5m2L1PM7q%K1no5m4J35qo8j6Q6n0n4J13J7p5mM2N5p7k3
3406C4K9j6kLR3p5oLQ1j25J8N7k0o1K7K4J6l6L2o9P2o7K9kmj8L8M8j28N5l2J05
3438A03o1k8LO2m9M0p5M9q8R1j9n5L4L4k3q4R1J3j28J1J29j12JNM8l2PPqm8%O6
3470a6k3o5KO0K5m0L5Mk5m6J13p7q8L2N4M4j34J54o9QJ8%m2n2N4J8J9n2K0l2J15
$$ plain form
3244 156 121 51 29 43 68 29 27 -5 60 29 21 22 45 62 32 116 92 87 101 66 69 94 89 65 60 92 157 133 75 68 132 56 90 56
3278 56 88 79 105 124 104 25 84 63 62 55 57 33 54 129 -24 6 32 21 114 -52 -5 26 25 3 -43 12 -55 -76 -37 2 -83 -31
3310 -31 -1 23 -71 -60 -86 -127 -67 -48 -65 -124 -48 -38 20 -91 -86 -47 -26 -115 -58 -51 -31 -45 -17 -117 -142 -64 -106 -70 -82 -40
3340 -40 -7 -29 -101 -73 -38 -67 -5 -8 -55 -78 -70 -89 -86 -62 -64 -63 -81 -88 -23 -58 -53 -110 -54 -66 -94 -36 -4 -4 -76 -18 -32 -48 43 -68
3374 -68 2 -73 44 -7 -37 -16 19 -23 8 15 62 54 54 75 70 5 -39 96 88 20 4 90 40 -14 99 116 41 37 79 134 57 34
3406 34 63 47 45 48 141 66 60 63 144 19 37 94 74 13 40 64 80 44 76 7 79 12 41 39 35 17 55 103 -25 30 -2 103
3438 103 42 14 17 79 30 70 -5 44 -44 47 28 -27 7 41 18 -66 25 38 -90 -79 50 -62 -61 -56 -8 -40 -33 -26 -34 -82 -82 -16
3470 -16 -39 -104 -102 -42 -17 -57 -22 -18 -43 -89 24 -53 -141 -109 -55 -11 -145 9 -60 -52 -34 -34 -76 -128 -74 -56 -37 -89 -69 -101 14
3501A4r6N5L0j26J30Lm3J9L3j14Q8p6O4M1o9J5QJ1L1n7N9l1l7rR1m0k4J5rK7L1
3532C4K7m6J5n0J2J2m5K4O6k1K1J7j7m2M5m6K0k1N5n7O8j7n4K0K7jK7j2M4p0k
3563C3L4l4l3J16om6KM1p2NM2j9oo1J14j12L4K2Pq5N0JK0l9nP3r0MO0l0j5l3l
3596c1O2lj9NJ0p4OP8k9o5JL4m6M7qj9m1R5J7q4n1N9ML4pK4m2j6K0O7n6l4L2j8
3630d8Nq6J50m1o1N5k8k4JN9k1Km9Q0J5j01O7K4K2o2J1j2K6K2q4O8L1n6L4l8K
3661c7j5Q0p7j5qL6Kj7J6J3K8k1L0J5j3m7N2o8J3NO5M2o9N4q3j9O3Jk6k1N8J8
3693E5l3ON7o3Mm6K2M9r2O6L5j6l9j7N0Kl5M1J2n4OL4KKj0O5n6rJ3J3m5kk4qM4
3728B9J2m5N4j5k8Q3p5l4M4J5l2J0J4j5L0p2K3L8j42J45l2j6L2M7m6j0j3pn8K0
$$ plain form
3501 14 -82 -27 3 -123 7 10 -33 -14 19 -95 -7 -83 -19 22 -47 -32 -24 -13 18 -39 20 -11 -48 -57 34 -6 -30 -15 -24 3 34
3532 34 61 15 30 -20 -8 4 -41 -17 49 28 49 66 49 7 52 6 26 5 60 3 71 54 0 20 47 46 73 61 105 35 33
3563 33 67 33 0 116 110 64 66 107 35 40 82 63 57 -4 110 -2 32 54 61 -24 26 27 47 8 3 76 -14 -10 50 20 5 -28 -31
3596 -31 31 28 9 14 24 -50 -44 34 5 -60 -59 -25 -71 -24 -32 -51 -92 3 20 -64 -115 -56 -52 -18 -25 -1 -43 -59 -39 28 -28 -62 -30 -48
3630 -48 -43 -129 21 -20 -81 -26 -54 -78 -77 -18 -39 -37 -86 -6 9 -92 -25 -1 21 -41 -30 -42 -16 6 -78 -10 21 -35 -1 -39 -37
3661 -37 -52 28 -49 -64 -72 -36 -34 -51 -35 -22 6 -15 15 30 17 -30 22 -46 -33 -28 37 79 10 64 -19 -38 25 26 0 -21 37 55
3693 55 22 28 85 22 26 -20 2 51 -41 25 60 44 5 -12 38 40 5 46 58 4 10 44 46 48 38 103 47 38 51 64 19 17 -7 -15 29
3728 29 41 -4 50 35 7 90 15 -19 25 40 8 18 32 17 47 -25 -2 36 -106 39 7 -9 23 70 24 14 1 -6 -64 -44
3758d4M6k9JK3J9j5K8k9nn9j0O5O1o1j0q3Q7m3kJl8PM5j3K6m7QN2l5l7Q6o4O7
3791br5NO7k9n6J9J2L2OJ8k7M2o8L0L0k0km0O4l0j4M4m1%K5l7R9n3J5Nj3JM6L3
3825F6o9JMj7N3Jl7M2l2J5qk0K3J7ok9P0j17%O0J5k5P9q4nlMkL8j4N0j0r6P8o
3860C6j1m2P5m0K0l7M3j2J7qm1J8p0R0K9j0r1Q7J8r1P2M4k6Pnl1L7p6l6K4OJ7
3892A3m4L5QN1k3m3L3J6k4jl1M1k6K7m5L4j4qj2J6n3l5R9n6N0n9M8k5k5J1J5k5
3924e2m8L0QL4j7j5k8J2Q4m8k7k4M3k6K7j2O0l7k7L8O2q2j5L7l5J7jM4k4n6mK1
3956f1J3L5j9M2l6l5M8K7q0J50q8rn4J5P5l0K2m0K0l4l4L6Q2q9L3Q6k9m2nk5O7
3987D1m2K5Lj7K7j4K4p7O4L8j5O2n1j8P2r9rJ8K2k5j4j4m7O4M9o1O2N7n5j3NP
$$ plain form
3758 -44 2 -27 -26 -3 16 1 29 0 -5 -64 -74 -9 52 -9 -19 -102 -15 -58 -60 -59 -97 -90 -45 -58 -32 -79 -71 -19 -54 -91 -5 -69 -2
3791 -2 -97 -92 -25 -54 -110 -91 -79 -47 -41 -23 -50 -8 -76 -46 -16 -36 -38 -78 -14 -44 -58 -14 -55 -55 -30 -67 32 -21 -6 -1 -14 -13 33 66
3825 66 -3 -2 2 -15 38 39 2 44 12 27 19 -1 22 39 33 4 74 -43 -43 17 32 7 86 2 -3 -6 -2 -4 34 20 70 60 -36 42 36
3860 36 25 -17 58 18 38 1 44 32 49 41 0 18 -52 38 67 57 -34 53 71 -20 52 96 70 77 72 41 78 2 -34 -10 -4 13
3892 13 -31 4 12 63 40 -3 30 46 22 21 -10 31 5 32 -13 21 7 -1 -13 3 -50 -85 14 -42 8 -51 -3 -28 -53 -42 -27 -52
3924 -52 -100 -70 -62 -28 -45 -60 -88 -76 8 -40 -67 -91 -48 -74 -47 -59 1 -36 -63 -25 37 -45 -60 -23 -58 -41 -42 2 -22 -78 -82 -61
3956 -61 -48 -13 -32 10 -26 -61 -13 14 -66 84 -4 -13 -67 -52 23 -7 15 -25 -5 -39 -73 -37 45 -44 -11 75 46 4 -1 -26 41
3987 41 -1 24 27 10 37 23 47 -30 34 72 57 119 68 50 122 23 14 32 54 29 15 1 -46 18 67 6 68 125 70 57 62 69
4019F9l4J7l0N7j8k2k9jJ2L7m6K0q1KL9K0J2k1L9j9K3m7K4J4o8O4M4p6J1J9p3
4050d2L8j8M4jm6O6l1j6l4R7q9J0J7k0n4P0l1j0N2m6M5k9L1n5K4l5j5j7L5nNL3
4082b7n8k6P6m5N4j3k1j1L7k3j7QJ0k9Q6j16O6k8O1j4J1o5M4m2J14m8oj0nM4n1
4113d4M7q6P9r3L2L4lnP0K9m5K4J4n0L2n2M2o5M1k4J02p1p5J38p0k4k7P7J3Ll8
4144EK6j2K8l2N5r7N5n8N6l0J1P0l6J8o3ljO2J5k2M6l9k5K7K6p5N7k1J8k1nOk2
4177A9q1N6K5K5j9L1O8j07Nn2jK2L1m4j1K6q9O5O9k6jMl8l1J5J1jQJ5o9j1K5N7
4210dm6M9r3Q0kk2K1L0j0J5k7J9l4Qj3J1Ok2J5J8p7J7O3l6j4N0m8J0Q2j02L1n4
4242g9K8k7j4P9n0K7k5K9J9o7L0oJ5Q1j18M4M6J7m4o4O1Rp9J07p0O0m8O9p9NJ8
$$ plain form
4019 69 35 52 22 79 61 39 10 9 21 58 12 32 -49 -47 -8 12 24 3 42 23 46 -1 23 37 -31 33 77 1 12 31 -42
4050 -42 -4 -22 22 21 -25 41 10 -6 -40 57 -32 -22 -5 -25 -79 -9 -40 -50 2 -44 1 -28 3 -52 -28 -63 -78 -95 -60 -65 -60 -27
4082 -27 -85 -111 -35 -80 -26 -39 -60 -71 -34 -57 -74 -66 -56 -85 1 -115 -49 -77 -16 -30 -19 -84 -40 -82 32 -16 -22 -32 -37 7 -44
4113 -44 3 -83 -4 -97 -65 -31 -34 -39 31 60 15 39 53 3 35 -17 25 -40 1 -23 79 8 -67 71 1 -23 -50 27 40 43 5
4144 5 31 19 47 15 70 -27 28 -30 26 -4 7 77 41 59 -4 -7 -8 54 69 47 93 54 29 56 82 7 64 43 61 40 35 41 19
4177 19 -62 -6 19 44 25 56 124 17 22 -30 -31 -9 22 -22 -33 -7 -96 -31 38 12 11 15 -23 -54 -39 -28 -29 -21 -6 -75 -86 -61 -4
4210 -4 -50 -1 -94 -14 -16 -38 -17 13 3 18 -9 10 -24 -16 -29 -18 -12 -34 -19 -1 -78 -61 2 -34 -48 2 -46 -36 46 -56 -25 -79
4242 -79 -51 -78 -92 -13 -63 -36 -61 -32 -13 -80 -50 -56 -41 40 -78 -34 12 29 -15 -79 -18 -9 -88 19 -51 9 -39 30 -49 -44 -26
4273b6k4P1k5mPJ8m8L5L7Ok8k0L1j6l9M5l2L8J2j6M0J6r5P5ro7O4o5O5k3j3pL1
4306C4j1L4qo3L2m8M4k3K9o9Q1K0Mkl6j1L7p9N6kJ6L6p1J2O9j07P6j3p8P5J5m0
4338IN8J5jn2k0n2M1J25q5n5L3j2KM9o8l9N3njPnjj2pJ5J3Ppn9M6m2P2p2N1k6
4373b5jK4o0N2L3j1p6O8o0L0m4MN6J7j10K4L6M7jm9N4q7M3O5j5l9Pl3L1lJ6o3
4405g0N5m1K7k9N2m4N6j0om2O5k6k5qJ8J4l5K3M4k3j5N2p6L2J2L5k6m2pO5q4N2
4437gk3l1J06p2N6J3j7j2m3Q4k8M3rk2j0L1k6K1J6K3q1K5l7N2O5j16N3n5Q2n3
4467B8Pk2K6j6J3nL2m4k2O9o6K4K3np3P6j6k5L5k0m5N8J0m8No8R6Qm6P1n3OJ5
4500B8QRm2L5m3M6o8jN0kJ2n1J0M1o2K7m2K0lK6jK4j4n8M0K7m1J3jk2j0L2n8m
$$ plain form
4273 -26 -50 21 -4 -8 -1 17 -31 4 41 47 19 -1 30 14 -25 20 -12 26 38 22 62 78 -17 58 49 -18 46 -19 46 23 10 3 34
4306 34 23 57 49 -14 18 -30 14 -9 20 -49 32 52 56 54 18 7 44 -35 21 19 35 71 0 12 81 -26 50 37 -41 34 49 9
4338 9 67 82 81 29 9 -43 -2 123 38 -17 16 4 6 55 -13 -52 1 -4 -5 2 -3 -4 -16 -23 -8 5 12 5 -54 -8 -50 22 -50 1 -25
4373 -25 -26 -2 -62 -10 23 12 -64 4 -56 -26 -70 -66 -10 7 -103 -79 -43 4 3 -46 8 -79 -36 29 14 -25 -18 -51 -20 -23 -7 -70
4405 -70 -15 -56 -29 -58 -6 -50 6 -4 -10 -52 13 -13 -38 -46 -28 -14 -49 -26 18 -5 -20 32 -44 -12 0 35 9 -33 -40 25 -59 -7
4437 -7 -30 -61 45 -27 29 42 25 13 -30 54 26 69 60 38 28 59 33 54 70 93 12 37 0 52 117 1 54 -1 81 28
4467 28 35 13 39 23 36 31 63 19 -3 66 0 24 47 42 -31 45 29 4 39 19 -26 32 42 -6 -1 -69 27 35 -11 60 7 13 28
4500 28 36 45 3 38 -5 41 -27 -28 22 20 32 -19 -9 32 -30 -3 -45 -25 -28 -2 -3 21 7 -51 -11 16 -25 -12 -13 -35 -45 -13 -71 -75
4534g5%O5rl1Ok2M1J7o3m2J8K4K6k2M9j0l5j8K2K0L6q5Q5M3q3L5rm8P3n3O2r8
4566h1N2J0L7p2O0k5O8q4O8N0j19K6mJ5k1Q1q8J7pQ3o8qK1LL4p3N6j6k6P1j02
4597d2R4j08J5M3M4o8PM3jl0O0k7K8Pn8O7j04M6jk4rL1N7j8ln6Q4j07L8N5Mn1
4629A6K8M7p0J8M9J1n3j0LK7m9J2j8j1m3Q7p4J27j18n1Q1j0l6M0m4k5J21o7l8
4658e0M7J0n6k9L7J8N0Pl9l4M9kl4k3K9N8q7N4k3K9m5Nk2LQ3l8m1oj3j3k5N3J7
4691c1M6r2M6K7j2l4%L7l0m3Q5j9l9O5M2r5L4K1K7r3RK6l5O8Jk2r2J16k3J5l0
4722b5K0j6M5ll0j3L3J6l4l1J05p8M8rk6K7l0K7OpLRm5N1m3K5k0k8P4m3K8j0j
4755B5j7k4K0J8N4jOl8pM8k9l2J1O4m8l1K0K5j0l1KJ6n2K6K5j0n9O1l7K3k0l1
$$ plain form
4534 -75 -75 -10 -19 -50 -44 -66 -25 -8 -71 -113 -95 -71 -45 -67 -18 -28 -63 -81 -59 -39 -3 -88 -3 40 -43 -8 -17 -65 8 -45 17 -81
4566 -81 -29 -19 18 -54 6 -19 49 -35 33 83 -36 -10 -14 1 -20 61 -27 -10 -17 66 -2 -10 11 14 48 -25 31 15 -11 60 -42
4597 -42 52 -56 -41 2 46 -22 -15 28 27 -3 57 30 58 65 7 74 -30 16 15 -9 -18 13 70 52 49 -7 77 -30 8 63 67 16
4629 16 44 91 21 39 88 99 46 36 39 66 17 29 11 0 -43 44 -30 97 -21 -72 9 -1 -37 3 -41 -66 55 -12 -50
4658 -50 -3 7 -49 -78 -41 -23 27 34 -5 -39 10 8 -26 -49 -20 38 -49 5 -18 11 -34 -29 -51 -48 35 -3 -44 -50 -63 -76 -101 -48 -31
4691 -31 15 -77 -31 -4 -16 -50 -50 -13 -43 -86 -1 -20 -59 6 48 -47 -13 8 35 -58 -49 -23 -58 10 11 -11 -103 13 -10 5 -25
4722 -25 -5 -21 24 21 -9 -22 11 27 -7 -38 67 -11 37 28 2 29 -1 26 32 25 28 37 -8 43 0 25 5 -23 51 8 36 26 25
4755 25 8 -16 4 22 76 75 81 43 36 84 55 23 34 98 50 19 39 64 54 23 25 41 -11 15 40 30 -29 32 -5 18 -2 -33
4787c3N2J3L2m1o3P7K1k5l6N2p6J5L2n3J14rk7Mj7m1k0P3n6M7K9p5J0m1O5m8k9
4818e4k4O7JLL5n5k6N7m4O4o9%%K2jJ0pm4O3pPqm1pJ17l6q3JQL2MJN9Lj42K3J4
4855e7P4jJ1q1N9q4J19j8m4O2n6J0J9j5k5j7L2OL8qm6J9J9m2pjlK8jn2M1O4n4
4888a1RJ5pK6k7M3j1n5J10p3N1m4n6N2k9j7L4mr8P7M1k0k9P9o4K2J9J0L1pL3R
4920A09q4J0j3k9L5pMk3J00j01O0n2k9P0o9N6j2Qn7R3l8K1n2N4p7M1ko4L0N5R
4951D6j0r9M5M3m0J6j2L1n7K6k1N0k7J7L0m1%o2J08r0N3pn5N5j3mkn5j5O6N4n1
4983b1N9k4n7J7p9R9m4J1jk8j4j1L1l9J39o0j3j6j5N6m3J3N0j8j0k6l1O9j37J32
5013a1Ln2P3m9j2J7qJ9l7J14o7o2MJ04L7r1P2r8N5nk1K8L3J5r5M3O9o9PmLM5r1
$$ plain form
4787 -33 19 32 64 23 -40 37 58 33 -3 49 -27 -12 20 -33 81 72 45 49 32 -9 -29 44 -12 35 64 -11 -1 -42 23 -25 -54
4818 -54 -78 -11 -10 -7 28 -27 -53 4 -40 24 -45 -45 -45 -23 -24 -14 -21 -65 -2 -9 -2 -10 -51 -58 59 23 -60 -59 -51 -19 -15 -14 45 48 -94 -71 -57
4855 -57 17 16 27 -54 5 -79 40 22 -22 40 -16 -6 13 -2 -27 -44 -12 -6 32 24 -22 -3 16 -26 -33 -34 -37 -9 -10 -62 -21 43 -11
4888 -11 -2 13 6 32 5 48 37 -18 92 19 70 26 -30 22 -7 -24 10 6 -92 -15 26 6 -23 56 -8 14 33 43 74 67 100 109
4920 109 25 35 22 -7 28 21 25 2 102 1 61 9 -20 50 -19 37 25 33 -24 69 31 52 0 54 -23 18 16 -48 -18 37 46
4951 46 36 -63 -18 25 -15 1 -11 20 -37 -11 -32 18 -9 8 38 -3 -3 -65 43 -47 6 -1 -56 -1 -14 -18 -20 -75 -90 -24 30 -21
4983 -21 38 14 -43 -26 -105 -6 -50 -39 -40 -68 -82 -93 -62 -101 38 -22 -35 -51 -66 -10 -53 -40 10 -8 -18 -44 -75 -6 -143 -11
5013 -11 -8 -60 13 -36 -48 -31 -39 -20 -57 57 -10 -72 -68 36 73 -18 54 -44 11 6 -15 13 46 61 -34 9 78 9 16 12 15 60 -31
5046c1L9L3rn6K4l7L7N3k6K6o2L0k4J0N8k6m6j4J9L4m0M8k5orL5J7j2j5om2M0
5078A7l6K7kJ6M9m6k2P7r1N1J3k0l0O5j2l3N7l1k9r7R7QL2Ll5j7j6O2n5N0qr2
5110d8O3O4j39K0L4l3LJ12r9N8p1K3p0O2M1r1M8QJ2o4K0N5k0J3Lk1J4pL8r9R6
5141B5l8n7M1L3m7MK6oK4Mp4Pm9K5M5Jl8N7l1J2K0m0L2n3J14q6L4m9R8k8m2P5
5173C9p2k4K8L0n4K4M0o8pN4j6j8L3qmJ6K3k0pj9K4lQJ1k5K0J9Ol6Q1p9J6j3j8
5207a9Q1Jo6Nk8L0J0j9J9Kj2O3p9P6r6M4L8L1l5n5M1m5N4N1n3jqjoM1k7kM2o4
5241A3P4m6n4M9k2rN4p5M9K5p3J2JL0m8MM3J7m3J9jml2K1Qk1n7J04n2l7Q5or8
5274g0J2L9Kj3rM2o7O8J6k4L3K2j09L3l6N4N0m3Kk7L9l9j2RJ1j2K9k9Nl7M5o3
$$ plain form
5046 -31 8 41 32 -24 0 -37 0 53 27 53 -9 21 -3 7 65 39 -7 -21 -2 32 -8 40 15 9 0 35 52 40 25 19 -23 17
5078 17 -19 8 6 22 71 25 3 80 -11 40 53 33 3 68 56 23 80 49 20 -77 20 28 60 63 28 11 -5 57 2 52 44 -48
5110 -48 15 79 -60 -40 -6 -39 -36 76 -23 35 -36 -13 -83 -21 20 -71 -23 -15 -3 -67 -47 8 -12 1 4 -17 -3 -10 28 -71 25
5141 25 -13 -70 -29 4 -43 -39 -13 -19 5 9 -65 -58 -107 -82 -37 -36 -74 -17 -48 -36 -16 -56 -24 -77 37 -49 -15 -64 34 6 -36 39
5173 39 -33 -57 -29 1 -53 -29 11 -57 -64 -10 -26 -44 -11 -19 -23 -7 16 -4 -11 -30 -6 -9 -1 10 -15 5 24 30 -6 75 -4 12 -1 -19
5207 -19 62 63 -3 2 -26 4 14 -5 14 16 4 67 -12 64 -32 12 50 81 46 -9 32 -13 41 92 39 38 30 29 23 64 37 35 77 13
5241 13 87 41 -13 36 14 5 59 -16 33 58 -15 -3 -2 28 -20 -16 27 44 1 20 19 15 -17 4 12 -9 -66 38 -14 -51 34 28 -70
5274 -70 -58 -19 -17 -30 -39 3 -64 4 20 -4 29 51 -58 -25 -61 -7 43 0 2 -25 14 -25 -37 -28 -17 -29 0 -29 -24 -61 -16 -79
5306g9O9o3K4K6K4k8pL7q1Q1j9k4N4j1o2K1L3pN6o2l9N7M7p7M7n1L8J5p1L8K3
5337Ik5mO2o7K9J0L1r9J34p2M5Oq2N5k0l1M3k5L2K7m6L7QNl6jNl4K9l0M4j9J1
5370C1j7M9q9mR6o5K0MK2m6OR9q7K1oM1p2N0k2n6P6j6l7J6Pk0K9rK3l8J1Q%K0
5404D5l7m4J23o7n2O1kp1P4M0o3L4j9Mk4k4q5Q2J1QR9j44K6J5j2Qk3k8RL3k4L1
5436a6knm0MN2l6n0N2K5L6n7K5l8J6MM6k0n1J9j6K2J6K6p0RK5P1q9m1J09roRj9
5470Ak5oMK5L3n4P5l9m9j3O6kj8J3n6Q8p9M3J4Lm7J3k6M0K7qp9N5Ml6J2N9o0K7
5504El9R2l4nK6%m7L4k8NjJ0J3J2kM3k6r3J02k8m4M0J1m3L5oK7k3l8J4M8q6J9
5537gM6k0K1j3l0k8LK2l7L4Kk1N4j4k2pj0L9n6L8J7o7J06q7K4M3L5m3J1p5M6J5
$$ plain form
5306 -79 -10 -73 -49 -23 1 -27 -34 3 -78 3 -16 -40 14 3 -59 -38 -5 -12 44 -18 -57 0 47 -30 17 -34 4 19 -52 -14 9
5337 9 -16 -20 42 -25 4 14 45 -54 80 8 53 59 -23 32 12 -19 24 -1 31 58 12 49 57 62 26 25 30 -4 25 -5 39 20 31
5370 31 14 63 -26 -30 66 1 21 25 47 1 7 106 19 40 34 75 3 53 31 -25 51 35 -2 14 21 1 30 21 44 6 17 25 25 45
5404 45 8 -36 87 20 -32 29 27 -44 30 70 7 41 22 26 2 -22 -107 -25 -14 -6 93 -51 -25 -10 -22 -14 -37 -65 -56 -23 -47 -16
5436 -16 -18 -23 -63 -59 -7 -43 -93 -41 -16 20 -37 -12 -50 -34 -30 16 -4 -55 -36 -52 -30 -14 12 -58 -49 -24 47 -42 -83 26 17 11 20 1
5470 1 -24 -30 -26 -1 32 -22 53 14 -35 -48 18 16 -2 11 -45 43 -36 7 21 24 -23 -10 -36 4 31 23 -56 -1 3 -33 -21 38 -22 5
5504 5 -34 58 24 19 45 45 -2 32 4 9 8 18 31 43 41 84 58 -35 67 39 -5 35 46 3 38 32 59 36 -2 12 60 -26 -7
5537 -7 39 19 40 27 -3 -31 -28 -6 -43 -9 -7 -28 26 12 -10 -17 -27 12 -44 -6 11 -56 50 -37 -13 30 65 22 33 -42 4 19
5569A9l8K0j5Rm6Q5l8L8prJ6l1n3N8Nk3J1l6J4K8p5N0j1mJ2Rm0JK7j0MmK8mp2
5604h2rN2L5o0L0MNl3Q0l3J4n1Kk0N2k8L6k4pP4o4ML5nm2K0l5j8R8k7K3j9M4q0
5638b9mL1K8qk2Rn2M1J5j9K8l3k5k1K3R1p5K4l4P3k7%%j1P1r2L5J8q3N5mL2o4
$$ plain form
5569 19 -19 1 -14 -5 -51 34 -4 34 27 18 34 3 -50 8 13 -10 1 -35 -21 7 -68 -18 -29 -33 -21 -12 -52 -51 -24 -34 -30 -34 -6 -10 -82
5604 -82 -91 -39 -4 -64 -34 -30 -25 -58 22 -11 3 -48 -46 -66 -14 -42 -6 -30 -37 37 -27 -23 12 7 -35 -15 -50 -68 30 3 26 7 51 -29
5638 -29 -33 -2 26 18 -4 5 -47 -6 9 -10 18 -15 -40 -61 -38 53 -22 2 -32 41 14 14 14 3 74 -18 17 35 -48 7 3 35 -29
$$ [...]
8191b
##END NTUPLES=NMR FID
##END=
