##TITLE=1H_2BnP3105
 CDCl3
 8 sc, 
 31.05.2022
##JCAMPDX= 6.0         $$ Bruker NMR JCAMP-DX V2.0
##DATA TYPE= NMR FID
##DATA CLASS= NTUPLES
##ORIGIN= UXNMR, Bruker Analytische Messtechnik GmbH
##OWNER= root
$$ XWIN-NMR		Version 3.5
$$ Wed Jun  1 14:00:15 2022 Russian Standard Time (UT+4h)  she@DPX200
##.OBSERVE FREQUENCY= 200.13095
##.OBSERVE NUCLEUS= ^1H
##.DELAY= (6, 6)
##.ACQUISITION MODE= SIMULTANEOUS
##.ACQUISITION SCHEME= undefined
##.AVERAGES= 8
##.DIGITISER RES= 18
##SPECTROMETER/DATA SYSTEM= spect
##.PULSE SEQUENCE= zg30
##.SOLVENT NAME= CDCl3
##.SHIFT REFERENCE= (INTERNAL, CDCl3, 0, 15.7039)
##AUDIT TRAIL= $$ (NUMBER, WHEN, WHO, WHERE, WHAT)
$$ ##TITLE= Audit trail, XWIN-NMR		Version 3.5
$$ ##JCAMPDX= 5.01
$$ ##ORIGIN= Bruker BioSpin GmbH
$$ ##OWNER= she
$$ F:/spectra/data/she/nmr/H-F/1/audita.txt
$$ ##AUDIT TRAIL=  $$ (NUMBER, WHEN, WHO, WHERE, WHAT)
(   1,<2022-06-01 13:58:51.21 +0400>,<she>,<DPX200>,
      <created by zg, POWCHK disabled, PULCHK disabled
       configuration hash MD5:
       00 E9 B6 7A A2 85 ED C7 34 08 36 98 17 FE 4E 26
       data hash MD5: 16K
       9E F2 12 E6 E7 A8 A6 2D CF 53 87 F3 B8 F6 BA 51>)
$$ ##END=
$$ 
$$ hash MD5
$$ 5E D7 FE FD 55 97 94 4B 2F 70 FC 55 E5 BE 88 F2
##$RELAX= 
##$RELAX= 
##$RELAX= 
##$RELAX= 
##$RELAX= 
##$RELAX= 
$$ Bruker specific parameters
$$ --------------------------
##$DU= <F:/spectra>
##$EXPNO= 1
##$NAME= <H-F>
##$PROCNO= 1
##$TYPE= <nmr>
##$USER= <she>
##$AMP= (0..31)
100 100 100 100 100 100 100 100 100 100 100 100 100 100 100 100 100 100 
100 100 100 100 100 100 100 100 100 100 100 100 100 100 
##$AQSEQ= 0
##$AQ_mod= 1
##$AUNM= <au_zg>
##$AUTOPOS= <>
##$BF1= 200.13
##$BF2= 200.13
##$BF3= 200.13
##$BF4= 200.13
##$BF5= 200.13
##$BF6= 200.13
##$BF7= 200.13
##$BF8= 200.13
##$BYTORDA= 1
##$CFDGTYP= 0
##$CFRGTYP= 5
##$CHEMSTR= <none>
##$CNST= (0..31)
1 1 145 1 1 1 1 1 1 1 1 1 1 1 1 1 1 1 1 1 1 1 1 1 1 1 1 1 1 1 1 1 
##$CPDPRG= <>
##$CPDPRG1= <>
##$CPDPRG2= <>
##$CPDPRG3= <>
##$CPDPRG4= <mlev>
##$CPDPRG5= <mlev>
##$CPDPRG6= <mlev>
##$CPDPRG7= <mlev>
##$CPDPRG8= <mlev>
##$CPDPRGB= <>
##$CPDPRGT= <>
##$D= (0..31)
0 1.2 0 0 0 0 0 0 0 0.06 0 0.03 0 0 0 0 0.0002 0 0 0 0 0 0 0 0 0 0 0 0 
0 0 0 
##$DATE= 1654077530
##$DBL= (0..7)
120 120 120 120 120 120 120 120 
##$DBP= (0..7)
150 150 150 150 150 150 150 150 
##$DBP07= 0
##$DBPNAM0= <>
##$DBPNAM1= <>
##$DBPNAM2= <>
##$DBPNAM3= <>
##$DBPNAM4= <>
##$DBPNAM5= <>
##$DBPNAM6= <>
##$DBPNAM7= <>
##$DBPOAL= (0..7)
0.5 0.5 0.5 0.5 0.5 0.5 0.5 0.5 
##$DBPOFFS= (0..7)
0 0 0 0 0 0 0 0 
##$DE= 6
##$DECBNUC= <off>
##$DECIM= 24
##$DECNUC= <off>
##$DECSTAT= 4
##$DIGMOD= 1
##$DIGTYP= 9
##$DL= (0..7)
0 120 120 120 120 120 120 120 
##$DP= (0..7)
150 150 150 150 150 150 150 150 
##$DP07= 0
##$DPNAME0= <>
##$DPNAME1= <>
##$DPNAME2= <>
##$DPNAME3= <>
##$DPNAME4= <>
##$DPNAME5= <>
##$DPNAME6= <>
##$DPNAME7= <>
##$DPOAL= (0..7)
0.5 0.5 0.5 0.5 0.5 0.5 0.5 0.5 
##$DPOFFS= (0..7)
0 0 0 0 0 0 0 0 
##$DQDMODE= 0
##$DR= 18
##$DS= 0
##$DSLIST= <SSSSSSSSSSSSSSS>
$$ [...]
##$SUBNAM2= <"">
##$SUBNAM3= <"">
##$SUBNAM4= <"">
##$SUBNAM5= <"">
##$SUBNAM6= <"">
##$SUBNAM7= <"">
##$SUBNAM8= <"">
##$SUBNAM9= <"">
##$SW= 29.956405228329
##$SWIBOX= (0..15)
0 0 2 0 0 0 0 0 0 0 0 0 0 0 0 0 
##$SW_h= 5995.20383693045
##$TD= 16384
##$TD0= 1
##$TE= 0
##$TE2= 300
##$TE3= 300
##$TEG= 300
##$TL= (0..7)
0 120 120 120 120 120 120 120 
##$TP= (0..7)
150 150 150 150 150 150 150 150 
##$TP07= 0
##$TPNAME0= <>
##$TPNAME1= <>
##$TPNAME2= <>
##$TPNAME3= <>
##$TPNAME4= <>
##$TPNAME5= <>
##$TPNAME6= <>
##$TPNAME7= <>
##$TPOAL= (0..7)
0.5 0.5 0.5 0.5 0.5 0.5 0.5 0.5 
##$TPOFFS= (0..7)
0 0 0 0 0 0 0 0 
##$TUNHIN= 0
##$TUNHOUT= 0
##$TUNXOUT= 0
##$USERA1= <user>
##$USERA2= <user>
##$USERA3= <user>
##$USERA4= <user>
##$USERA5= <user>
##$V9= 5
##$VALIST= <valist>
##$VCLIST= <CCCCCCCCCCCCCCC>
##$VD= 0
##$VDLIST= <DDDDDDDDDDDDDDD>
##$VPLIST= <PPPPPPPPPPPPPPP>
##$VTLIST= <TTTTTTTTTTTTTTT>
##$WBST= 1024
##$WBSW= 4
##$XGAIN= (0..3)
0 0 0 0 
##$XL= 0
##$YL= 0
##$YMAX_a= 473108
##$YMIN_a= -402758
##$ZGOPTNS= <>
##$ZL1= 120
##$ZL2= 120
##$ZL3= 120
##$ZL4= 120
##$ABSF1= 10
##$ABSF2= 0
##$ABSG= 5
##$ABSL= 3
##$ALPHA= 0
##$AQORDER= 0
##$ASSFAC= 0
##$ASSFACI= 0
##$ASSFACX= 0
##$ASSWID= 0
##$AUNMP= <proc_1d>
##$AZFE= 0.1
##$AZFW= 0.1
##$BCFW= 1
##$BC_mod= 2
##$BYTORDP= 1
##$COROFFS= 0
##$CY= 11.3945322036743
##$DATMOD= 1
##$DC= 2
##$DFILT= <>
##$DTYPP= 0
##$F1P= 2.36226072786647
##$F2P= -0.459571619588291
##$FCOR= 0.5
##$FTSIZE= 0
##$FT_mod= 4
##$GAMMA= 1
##$GB= 0.15
##$INTBC= 1
##$INTSCL= 1
##$ISEN= 128
##$LB= 0.24
##$LEV0= 0
##$LPBIN= 0
##$MAXI= 10000
##$MC2= 0
##$MEAN= 0
##$ME_mod= 0
##$MI= 1.114404
##$NCOEF= 0
##$NC_proc= 0
##$NLEV= 6
##$NOISF1= 3.799351
##$NOISF2= 2.8
##$NSP= 1
##$NTH_PI= 0
##$NZP= 0
##$OFFSET= 15.70392
##$PC= 1
##$PHC0= -17859.7
##$PHC1= 16.60074
##$PH_mod= 1
##$PKNL= yes
##$PPARMOD= 0
##$PSCAL= 0
##$PSIGN= 0
##$REVERSE= no
##$SF= 200.130013532006
##$SI= 16384
##$SIGF1= 3
##$SIGF2= 2
##$SINO= 400
##$SIOLD= 16384
##$SREGLST= <1H.CDCl3>
##$SSB= 0
##$STSI= 0
##$STSR= 0
##$SW_p= 3612.71676300578
##$SYMM= 0
##$S_DEV= 0
##$TDeff= 0
##$TDoff= 0
##$TI= <>
##$TILT= no
##$TM1= 0
##$TM2= 0
##$TOPLEV= 0
##$USERP1= <user>
##$USERP2= <user>
##$USERP3= <user>
##$USERP4= <user>
##$USERP5= <user>
##$WDW= 1
##$XDIM= 8192
##$YMAX_p= 0
##$YMIN_p= 0
$$ End of Bruker specific parameters
$$ ---------------------------------
##NTUPLES= NMR FID
##VAR_NAME=  TIME,          FID/REAL,        FID/IMAG
##SYMBOL=    X,             R,               I
##VAR_TYPE=  INDEPENDENT,   DEPENDENT,       DEPENDENT
##VAR_FORM=  AFFN,          ASDF,            ASDF
##VAR_DIM=   8192,          8192,            8192
##UNITS=     SECONDS,       ARBITRARY UNITS, ARBITRARY UNITS
##FACTOR=    0.0001668,     1,               1
##FIRST=     0,             0,               0
##LAST=      1.3662588,     0,               0
##MIN=       0,             -402758,         0
##MAX=       1.3662588,     473108,          0
$$ Real data points
##PAGE= N=1
##DATA TABLE= (X++(R..R)), XYDATA
$$ [...]
2078a644j06N49Q51R80N67N80J10l57n49p33n39l49j37J74L1J81k56l72n81k59
$$ -1644 -1750 -1201 -350 630 1197 1777 1887 1530 981 248 -291 -640 -777 -603 -572 -391 -647 -1019 -1600 -1859
2098a859k5N39L88J224J374R37P14q4q0j137j434j233j027j009j6L13M66P76R69
$$ -1859 -1884 -1345 -957 267 1641 2578 3292 3208 3128 1991 557 -676 -1703 -2712 -2728 -2415 -1949 -1173 -204
2117b04M52k3M01j68l8R0K1K11M31J51j54p84p32j047r40r29J14Q13J445J368
$$ -204 248 225 626 458 420 510 531 742 1173 1324 1170 386 -346 -1393 -2333 -3262 -3148 -2335 -890 478
2137D78J642J502N29Q5r00j437j425j339r71p40j56L15K86N19N46Q9j9J10O74
$$ 478 2120 3622 4151 4236 3336 1899 474 -865 -1836 -2576 -2732 -2417 -2131 -1612 -1066 -977 -996 -886 -212
2156b12L65R74Q79R04N46J7n34j100j653j878j353j036k11P37J261J763J558J534
$$ -212 153 1127 2006 2910 3456 3473 2939 1839 186 -1692 -3045 -4081 -4292 -3555 -2294 -531 1027 2561
2174B561P53j03l02j180r40r24l11n01j39j38k38k14j43l09m28N98K27J267J454
$$ 2561 3314 3211 2909 1729 789 -135 -446 -947 -1086 -1224 -1462 -1676 -1819 -2128 -2556 -1958 -1731 -464 990
2193I90J462J355R03Q7q78j157k278j693j770j146k19L85O93J333J434J207O77
$$ 990 2452 3807 4710 4797 3919 2762 484 -1209 -2979 -4125 -4344 -3959 -3266 -1933 -499 708 1385
2210A385L30K02n59J34o1J56k33l36j66q02p47q61o38n65J73M93J103J134J648
$$ 1385 1715 1917 1358 1492 1431 1587 1354 1018 852 50 -697 -1558 -2196 -2761 -2588 -2095 -992 142 1790
2229A790R14R55M58l17j126j454j456j523j071p13K85J08N55J207N85P34O14O00
$$ 1790 2704 3659 4117 3800 2674 1220 -236 -1759 -2830 -3543 -3258 -3150 -2595 -1388 -803 -69 545 1145
2247A145J35O96J27K09j1k56o42p18q99r18p79q65q8M2M55R56J113J179R23P79
$$ 1145 1280 1976 2103 2312 2301 2045 1403 685 -214 -1132 -1911 -2776 -2864 -2822 -2367 -1411 -298 881 1804 2583
2267B583J94m37o13j001j146r08p91p9j73M08M93M75J036N87N92O12j11J56O2
$$ 2583 2777 2340 1727 726 -420 -1328 -2119 -2198 -2371 -1963 -1470 -995 41 628 1220 1832 1721 1877 1939
2286A939k1k94k23l71q04n24q11o09n00l38K8N81N05R88J260P93R19M70j13j055
$$ 1939 1918 1624 1401 1030 226 -298 -1109 -1718 -2218 -2556 -2528 -1947 -1442 -454 806 1599 2518 2988 2875 1820
2306A820r61r05r97q17k95K64M05Q27M26Q13K67j13K21ll09j89l5K47J72k47j62
$$ 1820 859 -46 -1043 -1860 -2155 -1891 -1486 -659 -233 580 847 734 955 952 643 454 419 666 838 591 429
2327D29l35r44r57q01o22J92Q08J252J335J535J053M03r1o82j100j261j287o48
$$ 429 94 -850 -1807 -2608 -3230 -3038 -2230 -978 357 1892 2945 3348 3257 2575 1475 214 -1073 -1721
2345a721k12J78M45Q06O70J66j68j37k34n24J46j0L83R17O94L70M9p19j001j228
$$ -1721 -1933 -1755 -1310 -504 166 332 164 27 -207 -731 -585 -595 -212 705 1399 1769 1818 1099 98 -1130
2365a130j111o03J27N19J063J496J473J059L22l43o45j375j079q50o14R6M50Q17
$$ -1130 -2241 -2844 -2717 -2198 -1135 361 1834 2893 3215 2872 2227 852 -227 -1077 -1691 -1595 -1145 -328
2383c28N50K68j27m57o87o87n74n7Q48J351R46J054O31j14q61j190j320j248o20
$$ -328 222 490 363 -94 -781 -1468 -2042 -2099 -1251 100 1046 2100 2731 2617 1756 566 -754 -2002 -2622
2402b622j36O94J475J150J002M84k03o51r10j080o36m78M29M98O95P49N73O7l45
$$ -2622 -2758 -2064 -589 561 1563 2047 1844 1193 283 -797 -1433 -1911 -1482 -984 -289 460 1033 1100 755
2421G55q72r64q32n7K55J072J220J072Q30K73m76o89j416q97r32j65M66Q61P03
$$ 755 -117 -1081 -1913 -1970 -1715 -643 577 1649 2479 2752 2276 1587 171 -726 -1658 -1823 -1357 -496 207
2440B07R85N37k62n44j189p81o83l04J38Q01Q57J095O65L87l09n29q55r85o16
$$ 207 1192 1729 1467 923 -266 -1047 -1730 -2034 -1896 -1095 -238 857 1522 1909 1600 1071 216 -769 -1385
2459a385o6M48Q39Q53O62M97j07p40j118q17q54k99N98M86J111O21Q69j5k97q72
$$ -1385 -1451 -1003 -164 689 1351 1848 1741 1001 -117 -934 -1788 -2087 -1489 -1003 108 729 1598 1583 1286 414
2479D14r19o93p54j02M92P59R13R60M97L20k89n99o94n41m18j54L50O54N51M43
$$ 414 -505 -1198 -1952 -2054 -1562 -803 110 1070 1567 1887 1598 999 305 -236 -654 -808 -458 196 747 1190
2499A190k71l80q28j004l52l59J09O23J025R67O57K84j36j58q41o26m26p33J09
$$ 1190 919 539 -289 -1293 -1645 -2004 -1895 -1272 -247 720 1377 1661 1525 1367 526 -100 -526 -1259 -1150
2518a150R7L80M51P85K45L63p9k62k77n49j56k2J22j53L73L49k77l89n94m78k14
$$ -1150 -1053 -673 -222 563 808 1171 1092 830 553 4 -152 -174 -52 -205 168 517 240 -149 -743 -1221 -1435
2539a435k51J68K65Q20J173N87M79L16k76k43p72p70n78n51k45j72L05J29P96
$$ -1435 -1686 -1518 -1253 -433 740 1327 1806 2122 1846 1603 831 61 -517 -1068 -1313 -1485 -1180 -1051 -255
2558b55M19M59K44l18j99om75J38o4K68J8K18j12n40j81p37j83k18K95N42O00
$$ -255 164 623 867 549 350 344 -131 7 -57 211 229 447 335 -205 -386 -1123 -1306 -1524 -1229 -687 -87
2579h7Q72R46O78K52j7p66q03r99j277p43n42J05N02Q57O71O45L13o7n7m68mN
$$ -87 785 1731 2409 2661 2644 1878 1075 76 -1201 -1944 -2486 -2381 -1879 -1022 -351 294 607 540 483 15 11 16
2601A6j25M33P17J8L89n59n65p84r61o86l67K15Q28J070J309J013J031K38n25
$$ 16 -109 324 1041 1059 1448 889 324 -460 -1421 -2107 -2474 -2259 -1431 -361 948 1961 2992 3230 2705
2620B705j269j410j367q86m14RO67Q57J110N02L36k88k27n80k94K34L86P77P97
$$ 2705 1436 26 -1341 -2227 -2641 -2632 -1965 -1108 2 504 840 552 325 -255 -549 -315 71 848 1645
2639A645P98K33l23j034j344j467j323p55K14O82J460J513J583P41M37l29j181
$$ 1645 2443 2676 2353 1319 -25 -1492 -2815 -3570 -3356 -2674 -1214 299 1882 2623 3060 2731 1550
2656A550j293j334r72l43M75O34J147O57P83j24o12o75q42j03J84N70J228J090
$$ 1550 257 -1077 -2049 -2392 -1917 -1283 -136 521 1304 1180 568 -107 -949 -1052 -868 -298 930 2020
2674B020R63K22n33j067j669j796j422r03M68M86J673J696J366J053M52o28q43
$$ 2020 2983 3205 2672 1605 -64 -1860 -3282 -4185 -3717 -3231 -1558 138 1504 2557 3009 2381 1538
2691A538j505q70n41L00L25Q35O87N63n3p27o85j131o32k46M76R41J457J341N44
$$ 1538 33 -837 -1378 -1078 -753 82 769 1332 1279 552 -133 -1264 -1896 -2142 -1666 -725 732 2073 2617
2710B617J25k10j129j479j648j344j04K45Q35J205J469J037M04N42o97q75p65
$$ 2617 2742 2532 1403 -76 -1724 -3068 -3172 -2927 -2092 -887 582 1619 2023 2565 1868 993 228
2727B28n04k93M10J90N56O32J51k67r84j023q79q47P1L67J181J371J158O32L02
$$ 228 -276 -569 -159 31 587 1219 1370 1103 119 -904 -1783 -2630 -2559 -2192 -1011 360 1518 2150 2452
2746B452l45r30j242j175o67l09K61N18R50R45N73L15P4m11m37o81l06j6L50L53
$$ 2452 2107 1177 -65 -1240 -1907 -2216 -1955 -1437 -487 458 1031 1346 1420 1009 572 -109 -415 -431 -81 272
2766B72L39L30j78m44n41j055l03o50J97K31R20J281Q92M57L74l48l68p86r50
$$ 272 611 941 763 319 -222 -1277 -1580 -2230 -2033 -1802 -882 399 1291 1748 2122 1774 1406 620 -330
2785c30k79l88n8M57L58K50L94P4M9k23j23k95l90O3O5N49K58K32j26p9m50l63
$$ -330 -609 -997 -1055 -598 -240 10 404 478 527 304 181 -114 -504 -441 -376 173 431 663 537 458 8 -355
2807c55n05n31K26Q1L65O73Q29M81M71k45l92k32m16k51m89l01j10O8J50J15J39
$$ -355 -860 -1391 -1165 -1084 -719 -46 783 1264 1735 1490 1098 866 450 199 -290 -591 -701 -633 -483 -368 -229
2828b29L20M0j23l98q9k73J59N7M46L25K69K67q4j51j10q19j45l01K5L33N36M01
$$ -229 91 131 8 -390 -479 -752 -593 -536 -90 235 504 771 687 536 426 -393 -538 -839 -814 -481 55 456
2850D56L29J80J69k17m68l61m67n18l8P6L09K50N72J51M4l8k86l35m24j30r7M69
$$ 456 785 965 1134 917 449 88 -379 -897 -935 -859 -550 -300 272 423 467 429 143 -192 -616 -746 -843 -374
2872c74N19O03L55N7o1k11q71k18l87n23J73N84K82L22K30J97k26l45l11n28m39
$$ -374 145 748 1103 1160 1099 888 17 -201 -588 -1111 -938 -354 -72 250 480 677 451 106 -205 -733 -1172
2893a172j68L31O03O63M02M01J69l66k91p53n63p9k73M66O64M68O82J90m42m26
$$ -1172 -1340 -1009 -406 257 659 1060 1229 863 572 -181 -744 -823 -1096 -630 34 502 1184 1374 932 506
2913E06o27m91l55p5R2M00M54M93J31j09r3m33m89l29q0O3O62L10Q24O52P6j06
$$ 506 -121 -612 -967 -1042 -950 -550 -96 397 528 419 326 -107 -596 -925 -1005 -942 -280 30 854 1506 1582 1476
2935A476o05l89n54q34k26M1M44L92N39K41j1j64k96m78j26k07J83L97L37M33
$$ 1476 871 482 -72 -906 -1132 -1091 -647 -255 284 525 514 350 54 -424 -550 -757 -574 -177 160 593
2955E93j71M03l95k80m28n50L9l3K19M59O51L38L59P6j43l19o77l35l58K3kjO9
$$ 593 422 825 430 150 -278 -828 -789 -822 -603 -144 507 845 1204 1280 1137 818 141 -194 -552 -529 -531 -532 -463
2978d63L79j41j19k00J82k09L4M71J63L70L89J59j95j68l5m99n73O6l59J24K99
$$ -463 -84 -225 -344 -544 -362 -571 -537 -66 97 467 856 1015 820 652 617 118 -455 -389 -748 -624 -325
2999c25R9M79R2J6K2l2j95J25k67OJ81k94J57j49l37l78j47O1M7J29M66O95N61
$$ -325 -226 253 345 361 383 351 156 281 14 20 201 -93 64 -85 -422 -800 -947 -886 -839 -710 -244 451 1012
3022A012J62K03p5l04l80l52l67k78j98k8J00J78q2M9J14j96K4N2L11J06L41L01
$$ 1012 1174 1377 1302 998 618 266 -101 -379 -577 -605 -505 -327 -409 -360 -246 -442 -418 -366 -55 51 392 693
3044F93J30o8m02n75l2o41r4M1QO48K79N66K37J55J47l20j92l39l89j53m5l14
$$ 693 823 755 353 -222 -254 -895 -989 -948 -940 -292 -13 553 790 945 1092 772 580 241 -148 -301 -346 -660
3066f60K82l5r0k0l5q7p3J51L17M02K36M66N00m6j5n32k14o55m40k77k89L01K07
$$ -660 -378 -413 -503 -523 -558 -645 -718 -567 -250 152 388 854 1354 1308 1293 761 547 -108 -548 -825 -1114 -813 -606
3089f06L69J70M26J43J9P0l92r1Pj52J35l29p9N0m29L08j31P8j78L18J8J81N38
$$ -606 -237 -67 359 502 521 591 199 108 115 -37 98 -231 -310 -260 -689 -381 -512 -434 -612 -294 -276 -95 443
3112D43M39J51J59N0m93j70n17n17n18J5j17k8L31L70J3M00K18J00J32ll06L91
$$ 443 882 1033 1192 1242 749 579 62 -455 -973 -958 -1075 -1103 -772 -402 -389 11 229 329 461 458 152 543
3134E43m00J4Mr5l45R6J19j91j9q4J2Q6L67O9L97M2L49m0k23m52m1q18j35l25
$$ 543 143 157 161 66 -279 -183 -64 -255 -274 -358 -346 -260 107 176 573 615 964 924 701 249 208 -610 -745 -1070
3158a070j35K8J57M22Q1P17K10L19P1k68n3k54p3j24K8K50j19Qn1l37O1p18J37
$$ -1070 -1205 -1177 -1020 -598 -517 200 410 729 800 532 479 225 152 28 56 306 187 195 144 -193 -132 -850 -713
3181g13k21N18K60L73J63J99P2J42l69n53m23j77m48J31J74L84O05J96L93j00
$$ -713 -934 -416 -156 217 380 579 651 793 424 -129 -552 -729 -1177 -1046 -872 -488 117 313 706 606
3201F06L65m07m10l5k66P6J65J40L5P5j25l32m02n03L1j09J62K79P27M82O59k05
$$ 606 971 564 154 119 -147 -71 94 234 269 344 219 -113 -515 -1018 -987 -1096 -934 -655 72 554 1213 1008
3223A008j57l4n91l69n20J02j62K37N13N76o9K99n9l40n62l55r2Q3L16L86J66
$$ 1008 851 817 226 -143 -663 -561 -723 -486 27 603 534 833 774 434 -128 -483 -575 -492 -176 210 376
3244C76K80j33l09l84n59l22j21N7L74O07N24N61N8M1k19m26j97l71k22m9M2K83
$$ 376 656 523 214 -170 -729 -1051 -1172 -1115 -741 -134 390 951 1009 1050 831 405 208 -163 -385 -434 -392 -109
3266a09L08L63j02k47oq27j40k23K23K68K12N16N45j94R8l81m63m99l39m2M33
$$ -109 199 562 460 213 207 -620 -760 -983 -760 -492 -280 236 781 587 685 304 -159 -658 -997 -1039 -606
3287f06K54P94J85M00J75m31l11m09m76Q0l72K80L21L16K65q6j99k65l59o06J17
$$ -606 -352 442 627 1027 1202 771 460 51 -425 -345 -717 -437 -116 200 465 379 180 -85 -444 -1050 -933
3308i33K4O9P80L65J26O37o6j45o78m62k68j56L45K94J83M35K55jl91m38m77k58
$$ -933 -909 -840 -60 305 431 1068 1002 857 179 -283 -551 -707 -362 -68 115 550 805 804 413 -25 -502 -760
3330g60l08L64K14K97L40K10K64k08l12l38k69j77l18J90M70M94M14K08J9j47
$$ -760 -1068 -704 -490 -193 147 357 621 413 101 -237 -506 -683 -1001 -811 -341 153 567 775 794 647
3350F47o12l24k23j93J63J81Q32K08L0L05m76n49m76j41n64J04L31O49J66L82
$$ 647 35 -289 -512 -705 -542 -361 471 679 709 1014 538 -11 -487 -628 -1192 -1088 -757 -108 58 440
3370D40K93k60k2j04l39k51m5L3K78lO96j96r2M1n66l45m66J04J05K65K10O19
$$ 440 733 473 451 347 8 -243 -288 -255 23 20 716 520 428 469 -97 -442 -908 -804 -699 -434 -224 395
3392C95L01k6j72k68k70o34k3j1K7R6L96K31K26J32J74k29k09K9j39P8Q2J13O8
$$ 395 696 670 498 230 -40 -674 -697 -708 -681 -585 -189 42 268 400 574 345 136 165 26 104 186 299 367
3415C67J01l77J43l00l88R9l79M3j12K48M22L12J71K33l0j64K8l88j56K9J40j23
$$ 367 468 91 234 -66 -454 -355 -734 -691 -803 -555 -133 179 350 583 553 389 417 29 -127 -98 42 -81
3437h1J11k05j8L29j47P7P8n1J43L7j25k4NN2j52j33N2l27Kl1j89k47N76j07K52
$$ -81 30 -175 -193 136 -11 66 144 93 236 273 148 124 129 181 29 -104 -52 -379 -377 -408 -597 -844 -268 -375 -123
3462a23K83J30J75K19J42k4n58ok06l6k71R3m45J30K83J90L5J22L7j46q3p9j04
$$ -123 160 290 465 684 826 802 244 238 32 -4 -275 -182 -627 -497 -214 -24 11 133 170 24 -59 -138 -242
3485b42Mj36O83j51q5k97J73m83K03k16J59L51j13K48O96J95k83J17k64k69j46
$$ -242 -238 -374 309 158 73 -224 -51 -534 -331 -547 -388 -37 -150 98 794 989 706 823 559 290 144
3506A44m19m48P6q0J94L64K78L4j7R1k26l1k21N8L64O5L37m2j9j21l78j75l65
$$ 144 -275 -723 -647 -727 -533 -169 109 143 126 217 -9 -40 -261 -203 161 226 563 521 502 381 3 -172 -537
3529e37q0M2R7M39J37K06N21r6o9k98j21m63j80l57Q6R6m8M24J6J73N7M1k7k30
$$ -537 -617 -575 -478 -39 98 304 825 729 660 362 241 -222 -402 -759 -673 -577 -625 -201 -185 -12 45 86 59 -171
3553a71o9L07J86L48K04K09k45l41n45j31m64Q3q3J11J55N73P5k9J97J60l58k2
$$ -171 -240 67 253 601 805 1014 769 428 -117 -248 -712 -629 -712 -601 -446 127 202 173 370 530 172 150
3575A50j10j47l6k93L27J48p5J71j15j18m5R6o0n2L15K53J84J15M3j96k50l70
$$ 150 40 -107 -143 -436 -109 39 -36 135 20 -98 -143 -47 -107 -159 156 409 593 708 751 555 305 -65
3597f5k64l01j17J57J07J72Q9J69O5K13j34J43j97K36j65l9K17L8j72mr2n6L0
$$ -65 -329 -630 -747 -590 -483 -311 -222 -53 12 225 91 234 37 273 108 69 286 324 152 148 56 0 30
3620C0l19J67K1q9P7L46M7Rq1k60j9j86j69m0K18p1j40Q1J64N9N9L8K98l3Q7J20
$$ 30 -289 -122 -101 -190 -113 233 280 289 208 -52 -71 -257 -426 -466 -248 -319 -459 -378 -214 -155 -96 -58 240 207 294 414
3646D14J27j06J02k63j65Ml26k17K29m4PoK02J47j34j64L24k7k08j44L50k71K38
$$ 414 541 435 537 274 109 113 -213 -430 -201 -245 -238 -244 -42 105 -29 -193 131 104 -104 -248 102 -169 69
3669F9J79k12J27k48J72k44m8K85J18J25L62n8l50K54m43n5k56j86Q1j98L25j25
$$ 69 248 36 163 -85 87 -157 -205 80 198 323 685 627 277 531 88 33 -223 -409 -328 -526 -201 -326
3691c26J77m9j23Q8J17k75K98q2j0M31K7J83J71k73l9k02n29K89J22j18J57J06
$$ -326 -149 -198 -321 -233 -116 -391 -93 -175 -185 246 273 456 627 354 315 113 -416 -127 -5 -123 34 140
3713A40J24O3l09Ol8r1k84Q7J6K80o4J08j1m6L15l46J92l68J35n5M0M06o2J69
$$ 140 264 327 18 24 -14 -105 -389 -302 -286 -6 -70 38 27 -19 296 -50 142 -226 -91 -146 -106 300 238 407
3737D07K07k56k11j74j89j99P5J5J93J24pK26q4j36k34j3k5O0%J5N4M19J66j47
$$ 407 614 358 147 -27 -216 -415 -340 -325 -132 -8 -15 211 127 -9 -243 -256 -281 -221 -221 -206 -152 267 433 286
3761B86M1k22k64N6j31O6N4m6M96r5J31l81O1k59j17k9O6k2Q6J68J31K63j48j47
$$ 286 327 105 -159 -103 -234 -168 -114 -160 336 241 372 -9 52 -207 -324 -353 -287 -309 -223 -55 76 339 191 44
3785D4j3k50o8l1J77P7K74j3J12J6K6o5j46p7j75k43L13J9M2J06P8j00l04J11
$$ 44 31 -219 -287 -318 -141 -64 210 197 309 325 351 286 140 63 -112 -355 -42 -23 19 125 203 103 -201 -90
3809i0k50j56J73K29j62K26J04L9K07nL1k66q8n1Q9O0j28J45R8kr2m1j64l8p7
$$ -90 -340 -496 -323 -94 -256 -30 74 113 320 315 346 80 -8 -59 30 90 -38 107 205 203 111 70 -94 -132 -209
3834b09k7K22l1j4j39J99K6k56j00j8Q7oJ5K43K29J32k55M62k75q2O7m2k02l7
$$ -209 -236 -14 -45 -59 -198 1 27 -229 -329 -347 -260 -266 -251 -8 221 353 98 560 285 203 270 228 26 -11
3858a1J32n8q5mj55j0n8Q5k36L50J0J10o2J89o8j56P6k00j03J52K3J6L21j05J72
$$ -11 121 63 -22 -26 -181 -191 -249 -164 -400 -50 -40 70 8 197 129 -27 49 -151 -254 -102 -79 -63 258 153 325
3883C25k17J02j28jJ52k6J05%J93j8n38n0j28k72j84K14J3M0M41J11Q9r1K15k71
$$ 325 108 210 82 81 233 207 312 312 505 487 -51 -101 -229 -501 -685 -471 -458 -418 23 134 223 132 347 76
3907G6J73k83k6k90K65M26m6L29m20O2k13m39l3J17J53m1L25P9L3K01r0j99l31
$$ 76 249 -34 -60 -350 -85 341 295 624 204 266 53 -386 -419 -302 -149 -190 135 214 247 448 358 159 -172
3930a72r9k94j82K00K18L09J78J94L29j18l36j03k44O2p4L09N1o7K61L0k26j99
$$ -172 -271 -565 -747 -547 -329 -20 158 352 681 563 227 124 -120 -58 -132 177 228 161 422 452 226 27
3952B7l05l04n0lQ6K27M85K93K10k51K7k11l87l56j32LK59K75K98K64J55J0m63
$$ 27 -278 -582 -632 -635 -549 -322 163 456 666 415 442 231 -156 -512 -644 -641 -382 -107 191 455 610 620 157
3975A57j38j17k62J9L68M2P4L94p5o9p8m21m25l44NJ28K66L85P16j00L15k98p7
$$ 157 19 -98 -360 -341 27 69 143 537 462 393 315 -106 -531 -875 -870 -742 -476 -91 625 525 840 542 465
3998D65m09l82N2q5J52J23K54Q0P5Pj39k65k16Q0k01L11Q0l8K66J36p4N2k56k98
$$ 465 56 -326 -274 -359 -207 -84 170 250 325 332 193 -72 -288 -208 -409 -98 -18 -56 210 346 272 324 68 -230
4022b30l55J37j23J37K03M79K1K18O8j52k79r4m5j35J81J61k79K43j64K42k68
$$ -230 -585 -448 -571 -434 -231 248 269 487 555 403 124 30 -15 -150 31 192 -87 156 -8 234 -34
4043c4j93j35J96j79Q2j5N9M05J56r1J58j08l24j15j70l2M8K44R7J39R4K6l64
$$ -34 -227 -362 -166 -345 -263 -278 -219 186 342 251 409 301 -23 -138 -308 -340 -292 -48 49 188 282 308 -56
4066e6K83m20J52k07J68KK01j04k02N5q6j0k07K11k10J57J07K05JM2O9j57M27
$$ -56 227 -193 -41 -248 -80 -78 123 19 -183 -128 -214 -224 -431 -220 -430 -273 -166 39 40 82 151 -6 421
4089D21k17J02j89Q2j32M3j54J27j59p1j6qJ02j54L09jJ1j51N6K9l07R3Ql8L56
$$ 421 204 306 117 199 67 110 -44 83 -76 -147 -163 -171 -69 -223 86 85 96 -55 1 30 -277 -184 -176 -214 142
4114A42KM2P6n6j48j40L5m5O1J09J56J52k38K23l11jo9l33%M0j93M79j33K28L71
$$ 142 144 186 262 206 58 -82 -47 -92 -31 78 234 386 148 371 60 59 -10 -343 -343 -303 -496 -17 -150 78 449
4139D49j00r0k24k71j40L14k45L10K35K58j6J50m36r4k33J37m60J08K39N1J89
$$ 449 349 259 35 -236 -376 -62 -307 3 238 496 480 630 194 100 -133 4 -456 -348 -109 -58 131
4160A31J23qQ2l93k0K8l47M6mJ00K38L15q8J80l3j07l50j56j73K15K02N4K85K35
$$ 131 254 246 328 -65 -85 -57 -404 -358 -362 -262 -24 291 203 383 350 243 -107 -263 -436 -221 -19 35 320 555
4184E55j03K76n86l13j29M0l25K36j1K45N31j00M3m03N5k80O6k66L7L42J97K11
$$ 555 452 728 142 -171 -300 -260 -585 -349 -360 -115 416 316 359 -44 11 -269 -203 -469 -432 -90 107 318
4206C18J69l6o7L0m06j78l93J00J91L4M53J05k4MPl29k88l12P9Q3L31J58R2J74
$$ 318 487 451 384 414 8 -170 -563 -463 -272 -238 215 320 296 300 307 -22 -310 -622 -543 -460 -129 29 121 295
4230B95q4l62J71q9j28M1j42L29J24M00k51K15l17J51m71K3k26R8q5L18J90P2
$$ 295 211 -151 20 -69 -197 -156 -298 31 155 555 304 519 202 353 -118 -95 -321 -223 -308 10 200 272
4252B72Q6l36K61l79j89J5P3k24M15K48l2k2J36l9l86q0M2k04Q2M78j17J32J60
$$ 272 358 22 283 -96 -285 -270 -197 -421 -6 242 210 188 324 285 -101 -181 -139 -343 -261 217 100 232 392
4275C92l46K31k48j99Oj67K4J55l5K2L26Q2j48O6j94r9k63K20K70j51L24K6J62
$$ 392 46 277 29 -170 -164 -331 -307 -152 -187 -165 161 243 95 161 -33 -132 -395 -175 95 -56 268 294 456
4298D56q8k41j81j78j5J39l8Q3K28k24J83L6j39J7k72m8R2J49j96N37n5j01J9
$$ 456 368 127 -54 -232 -247 -108 -146 -63 165 -59 124 160 21 38 -234 -282 -190 -41 -237 300 245 144 163
4321A63J10l33k42J04M8J68j9K97K55j38N8j52l23l19j18l1J60J89N7O7L90l22
$$ 163 273 -60 -302 -198 -150 18 -1 296 551 413 471 319 -4 -323 -441 -472 -312 -123 -66 1 391 69
4343F9k71K7j49P5n1N7K67P5l7L06j14m5k22o0k75jJ16o5M03K55r7J73pj64n00
$$ 69 -202 -175 -324 -249 -300 -243 24 99 62 368 254 209 -13 -73 -348 -349 -233 -298 105 360 263 436 429 265 -235
4368b35Jn1Nr9J98L14j03P9o6j08k9j26m0Q7J73J22J96j48L86j81k01k07j59l4
$$ -235 -234 -285 -280 -379 -181 133 30 109 43 -65 -94 -220 -260 -173 0 122 318 170 556 375 174 -33 -192 -226
4392b26q5j93L70K78L1N0J3K78l49l88k56Q9P5M1L75N0N0LJ10j38l58k21M5k3
$$ -226 -311 -504 -134 144 175 225 238 516 167 -221 -477 -388 -313 -272 103 153 203 206 316 178 -180 -401 -356 -379
4416c79R3L94J99K96r2P8k07l23j77k40M0j10K55J54J87j73K6L0j69j23Jk40L80
$$ -379 -286 108 307 603 511 589 382 59 -118 -358 -318 -428 -173 -19 168 -5 21 51 -118 -241 -240 -480 -100
4439a00JK80O0J69J0m9j39k87q0j11j5M0J51M74P4j65l0j01j16p5l45m4R5L73
$$ -100 -99 181 241 410 420 371 232 -55 -135 -246 -261 -221 -70 404 478 313 283 182 66 -9 -354 -398 -303 70
4463G0j34K47m4l5J81k09k77k0q1n7K29K59R5K02n5J30n13J86j41l76K05J2l4
$$ 70 -64 183 139 104 285 76 -201 -221 -302 -359 -130 129 224 426 371 501 -12 174 33 -343 -138 -126 -160
4486a60r2L93J80j62q4j59j46Q3l03M8L48k42L64n0P7K49j62j76k57K06k4QJ15
$$ -160 -252 141 321 159 75 -84 -230 -147 -450 -402 -54 -296 68 18 95 344 182 6 -251 -45 -69 -61 54
4509E4P7N2J20k6k87m0Jj68k2O8k00L56Q9j4o3J07m0j23j79K00Q4P6j79J68K22
$$ 54 131 183 303 277 -10 -50 -49 -217 -239 -171 -371 -15 74 60 -3 104 64 -59 -238 -38 46 122 -57 111 333
4534C33j38p3o6o1O7q6kk3Q2J95j59j24R3Nj73R9j68K8J43j19j24R1R1%m2K1K23
$$ 333 195 122 56 -5 62 -24 -26 -49 33 228 69 -55 38 43 -130 -31 -199 -171 -28 -147 -271 -180 -89 -89 -131 -110 113
4561A13JL8O5R5j56q6l7J56k08J29L0l49K69j7J09j18l54P6j16K98O2m5j34l8
$$ 113 114 152 217 312 156 70 33 189 -19 110 140 -209 60 43 152 34 -320 -244 -360 -62 0 -45 -179 -217
4585b17J91J05J31j84j28j71O4L06p9L3K0r3N1L58j34j39l11J68l9q9O2j11L32
$$ -217 -26 79 210 26 -102 -273 -209 97 18 51 71 -22 29 387 253 114 -197 -29 -68 -157 -95 -206 126
4608A26j13J68j24j10l1K0k28J02P0Q9K64l4j59O8J05o8k20k1m2k6L44j60M16
$$ 126 13 181 57 -53 -84 -64 -292 -190 -120 -31 233 199 40 108 213 145 -75 -96 -138 -164 180 20 436
4631D36k92M5k4O1l69j27l03K11J36j18N64k90K32j5k34P9Qk02K73k78J53j03
$$ 436 144 189 165 226 -143 -270 -573 -362 -226 -344 220 -70 162 147 -87 -8 0 -202 71 -207 -54 -157
4653a57M86K36m69J67p3j63j32N8l9J52k24J05J23M50l95mm37J53q3p8J06J16
$$ -157 329 565 96 263 190 27 -105 -47 -86 66 -158 -53 70 520 125 121 -316 -163 -246 -324 -218 -102
4675a02K74M7O9j34K78k73p4k93K57j93P5J7J68J60Mj60J97k84m69N7J39R8N6
$$ -102 172 219 288 154 432 159 85 -208 49 -144 -69 -52 116 276 280 120 317 33 -436 -379 -240 -142 -86
4698h6J15o1K21j30l0L3j06j62o8R0J24J7J31Q1NQ4k49J9k5j05J71l65J72K00
$$ -86 29 -32 189 59 29 62 -44 -206 -274 -184 -60 -43 88 169 174 258 9 28 3 -102 69 -296 -124 76
4722G6J3K59j80k39j7n2o2j4n5N0K55o8j12L82o8kj26J0q4%j27Q6J44J13j16R
$$ 76 89 348 168 -71 -88 -140 -202 -216 -271 -221 34 -34 -146 236 168 166 40 50 -34 -34 -161 -75 69 182 66 75
4748G5J63j12j11j4OK1o1qJ47q8OJ24m57M29j05J13j28l07J76J86O2K6p7L6r8
$$ 75 238 126 15 1 7 28 -33 -41 106 18 24 148 -309 120 15 128 0 -307 -131 55 117 143 66 102 4
4773DJ0J40k48Q5J79m14K65j24j07m4K23O2N5J0j56J0j14K29K6j76j28K32J19
$$ 4 14 154 -94 -9 170 -244 21 -103 -210 -254 -31 31 86 96 -60 -50 -164 65 91 -85 -213 19 138
4796A38L2j14k88L42j46J41O7p7l26J67K50l7N7o5J5k8j09j22K33k07j89L69j19
$$ 138 170 56 -232 110 -36 105 172 95 -231 -64 186 149 206 141 156 128 19 -103 130 -77 -266 103 -16
4819a6l2P6k69J46J7L0K8M4k8P1J90j72J17Lj04N3j06j79N4m8l4K03J90j11M1
$$ -16 -48 28 -241 -95 -78 -48 -20 24 -4 67 257 85 202 205 101 154 48 -131 -77 -125 -159 44 234 123 164
4844A64o5j06r0j32o1j76J39M59j67J38nn8J21j67r0j06K7N1K12J15q6L8L09m37
$$ 164 99 -7 -97 -229 -290 -466 -327 132 -35 103 98 40 161 -6 -96 -202 -175 -124 88 203 117 155 464 27
4868B7J30j60j61rJ9q1J51N0O8K71j91K9j50j05L8j95RJ27J88L07j70nnj29m6
$$ 27 157 -3 -164 -173 -154 -235 -84 -34 34 305 114 143 -7 -112 -74 -269 -260 -133 55 362 192 187 182 53 7
4893Gj1j17mL28k14J68M6j84J62K39n58q7o9K5j28K81J03K37r1K4j01n9k6j0k22
$$ 7 -4 -121 -125 203 -11 157 203 19 181 420 -138 -225 -294 -269 -397 -116 -13 224 133 157 56 -3 -29 -39 -261
4918b61K95QN3J5J41j8J20k56k34J99k26n0O5j9R2K63K24l07j63mL8k24j53K07
$$ -261 34 42 95 110 251 233 353 97 -137 62 -164 -214 -149 -168 -76 187 411 104 -59 -63 -25 -249 -402 -195
4942a95O3J33O1J41J89j71l01M13l61j14K2K39N4m0N3R9l27L14j98k05j60n7J74
$$ -195 -132 1 62 203 392 221 -80 333 -28 -142 -120 119 173 133 186 285 -42 272 74 -131 -291 -348 -174
4965a74J4M1J21K07o1j08o9j35K86l21L68k37L3P3K06J9J34ql48j03R9k68J60
$$ -174 -160 -119 2 209 148 40 -29 -164 122 -199 169 -68 -35 38 244 263 397 389 41 -62 37 -231 -71
4988g1j81J61j6qJ75j9O2j77l1o3J02m1J24j96M48l15R9J0j37M7q0J30k7j62J43
$$ -71 -252 -91 -107 -115 60 41 103 -74 -105 -168 -66 -107 17 -179 269 -46 53 63 -74 -27 -107 23 -4 -166 -23
5013b3J13M4l7R1p5N4k25mL4J8j05p1K74o7J18k23J67m0k12J67M7r3j4J08J27
$$ -23 90 134 97 188 113 167 -58 -62 -28 -10 -115 -186 88 21 139 -84 83 43 -169 -2 45 -48 -62 46 173
5038A73Q0k25O8J62p8l30J85pj46R3R6lm6m5R3k39L31l92Q0k6Qm3J68J61q7P1
$$ 173 253 28 96 258 180 -150 35 28 -118 -25 71 68 22 -23 70 -169 162 -230 -150 -176 -168 -211 -43 118 31 102
5064A02k21Q6O7j78K77j20j50Q8J93j08q3K36o7KR6k12K7j61J41o2J66k43K20
$$ 102 -119 -33 34 -144 133 13 -137 -49 144 36 -47 189 122 124 220 8 35 -126 15 -47 119 -124 96
5087I6J0l9J3j09k32J22J79K8J03j60L4J81lj42j3j75J4J8Q8j09k3K97j24J29
$$ 96 106 67 80 -29 -261 -139 40 68 171 11 45 226 223 81 68 -107 -93 -75 13 -96 -119 178 54 183
5111A83K4k98J95o9l33N5N3n4L37M6k77J83J18j21O3J28l08k27L25J61J1q2r2
$$ 183 207 -91 104 35 -298 -243 -190 -244 93 139 -138 45 163 42 105 233 -75 -302 23 184 195 113 21
5134B1n3K72j21l65L20k38J60q5R3J64k19J72j66J56j06n0j46K29j57L1P3O5J73
$$ 21 -32 240 119 -246 74 -164 -4 -89 4 168 -51 121 -45 111 5 -45 -191 38 -119 -88 -15 50 223
5157B23j01k5J20k03o5j44L12m4O2k1K2o8J54n6j50j99q7Nl4L36j66J23K25rk12
$$ 223 122 97 217 14 -51 -195 117 73 135 114 136 68 222 166 16 -183 -270 -265 -299 37 -129 -6 219 210 -2
5182bQ9q6o3j81K94j37J63J63k67R1J20k1n7q7J1l15K65N3J6O2j6J08j12j97K7
$$ -2 87 1 -62 -243 51 -86 77 240 -27 64 184 163 106 19 30 -285 -20 33 49 111 95 203 91 -106 -79
5207g9l04J91J27j6j7K02M1k10J56r7J29j82o1k53J64J53J93J1j76R9j48j6j71
$$ -79 -383 -192 -65 -81 -98 104 145 -65 91 -6 123 -59 -120 -373 -209 -56 137 148 -28 71 -77 -93 -264
5230b64K59n4k12K31Q9O1N9j58P9J25l67j1N3qJ17R0n3J17n7J16n1k8l39J01L5
$$ -264 -5 -59 -271 -40 49 110 169 11 90 215 -152 -163 -110 -118 -1 89 36 153 96 212 161 133 -206 -105 -70
5255g0J75k62k2R3Q8R9j05J7J95k00j70J29n9M03J2q4l2l30K41m00J92lp4M4K38
$$ -70 105 -157 -179 -86 2 101 -4 13 208 8 -162 -33 -92 311 323 239 207 -123 118 -282 -90 -93 -167 -123 115
5280A15M1m5M2J1k10N4J06k13j89L14P2j32N0J04J2J37l10q7N0J45p3k0J23J92
$$ 115 156 111 153 164 -46 8 114 -99 -288 26 98 -34 16 120 132 269 -41 -128 -78 67 -6 -26 97 289
5304B89j67%l8J69Ol24OK8J7J30o0m9p1J2l2Q0P0k17j08J94K00o5p7K32j39k83
$$ 289 122 122 84 253 259 -65 -59 -31 -14 116 56 7 -64 -52 -84 -4 66 -151 -259 -65 135 70 -7 225 86 -197
5330a97K20m4j18K07k87K44p8P8pJ35%j58q3q0R5j7L11j57j06P0n7m4n1Q8qj34
$$ -197 23 -21 -139 68 -219 25 -53 25 18 153 153 -5 -88 -168 -73 -90 221 64 -42 28 -29 -73 -124 -36 -44 -178
5356a78L54n9O4k03J92k24j04mK0J24q6K58j16J78q2r2M3j00j21R0k01J11j6K04
$$ -178 176 117 181 -22 170 -54 -158 -162 -142 -18 -104 154 38 216 134 42 85 -15 -136 -46 -247 -136 -152 52
5380E2J95l58J90r5j3n3QL0j44J36N6M5J01J58k72mJ12k62p0J21R7j12N3J93P
$$ 52 247 -111 79 -16 -29 -82 -74 -44 -188 -52 4 49 150 308 36 32 144 -118 -188 -67 30 -82 -29 164 171
5405A71k27rj21J5O1Mj82J15L54q6q8J67l03R9j67r2J48J56n8O2K51k6q9M9k0
$$ 171 -56 -65 -186 -171 -110 -106 -288 -173 181 95 7 174 -129 -30 -197 -289 -141 15 -43 19 270 244 155 204 184
5430A84k37O6j92N1J27k8J37k24J52K14m30K89k37q2J55o6P5J07L24l96n5K08
$$ 184 -53 13 -179 -128 -1 -29 108 -116 36 250 -180 109 -128 -210 -55 -121 -46 61 385 -11 -66 142
5452A42R8l46P4Jj11J43j%J95j14j57L8j20O7q3RR1J70J0k8j27N4m0q4j61J13
$$ 142 240 -106 -32 -31 -142 1 0 0 195 81 -76 -38 -158 -91 -174 -165 -74 96 106 78 -49 5 -35 -119 -280 -167
5478a67Q1J15NJ67j82K27n6l1p5RJ79k83j0k27K27J70n7j55J46o4q9m6K9J69j31
$$ -167 -86 29 34 201 19 246 190 159 84 93 272 -11 -21 -248 -21 149 92 -63 83 19 -70 -116 -87 82 -49
5503d9M8Qj47J21j2Q2j10KP7p6R1r3j0J16pJ01M5k85k1J48l7k29K47l16K56J18
$$ -49 -1 7 -140 -19 -31 51 -59 -57 20 -56 35 -58 -68 48 41 142 187 -98 -119 29 -8 -237 10 -306 -50 68
5529F8P4l6l33J18O2j1q6o2K87j49K29k65K67j48j14J16J66k20M7n3j2J61N9k00
$$ 68 142 106 -227 -109 -47 -58 -144 -206 81 -68 161 -104 163 15 -99 17 183 -37 10 -43 -55 106 165 -35
5553c5M1q9P9m9K5P2j00o9J20p4J67o5J43j19J29k74M0K2R0j0O9j00k15K72p3
$$ -35 6 -83 -4 -53 -28 44 -56 -125 -5 -79 88 23 166 47 176 -98 -58 -36 54 44 113 13 -202 70 -3
5578cm4N4oJ30J8j70J7k13K96r0j25K13k8Jp4L9k99K53J4m8J74L3j17J41m1J18
$$ -3 -47 7 1 131 149 -21 -4 -217 79 -11 -136 77 49 50 -24 15 -284 -31 -17 -65 109 142 25 166 125 243
5604B43j59q6N5r8oK12l39K66j90RQ2q4lR1J76l21J26n4J15p8J94J09l62J82R1
$$ 243 84 -2 53 -45 -51 161 -178 88 -102 -93 -11 -95 -98 -7 169 -152 -26 -80 35 -43 151 260 -102 80 171
5629A71j90m5l3M8Q8L2k17O4J29J23n7n7j16o3j3J25p3Q2J19m8J95j45o5k8N6
$$ 171 -19 -64 -97 -49 39 71 -146 -82 47 170 113 56 -60 -123 -136 -11 -84 -2 117 69 264 119 54 26 82
5654H2j29Pk42q5L20J98j14R4o9j70J67j56RQ9M5N2K3q3J05j81l4J09j32N4r4
$$ 82 -47 -40 -282 -367 -47 151 37 131 62 -108 59 -97 -88 1 46 98 121 38 143 -38 -72 37 -95 -41 -135
5679a35K22j53J03j48J72J00l7k0Q3j80j96L91j13k15N1J75L3M7Rp3k27O2n0N
$$ -135 87 -66 37 -111 61 161 124 104 187 7 -189 202 89 -126 -75 100 133 180 189 116 -111 -49 -99 -94
5703i4O7m7K32J3rj02O4l4j09j18j89K11J21M9M9P5p5J57l71K62r9j6k51J84K23
$$ -94 -27 -74 158 171 162 60 124 90 -19 -137 -326 -115 6 55 104 179 104 261 -110 152 53 37 -214 -30 193
5728A93k04j69K45J1p6j38J84kj70J32j15O9J44k92K15mk51j01J86J65j31P6p4
$$ 193 -11 -180 65 76 0 -138 46 44 -126 6 -109 -40 104 -188 27 23 -228 -329 -143 22 -109 -33 -107
5751a07J27M2J78k06K2or7J2M5O5j80K49Q9j77l2l9l64L31k12K29j15J73j23j53
$$ -107 20 62 240 34 56 50 -47 -35 10 75 -105 144 233 56 24 -15 -379 -48 -260 -31 -146 27 -96 -249
5775b49L17k16M5K41r1n7Jq8J75J66l45J25nJ70q0k6q0N5Q5r9k05K9K55k55J58
$$ -249 68 -148 -103 138 47 -10 -9 -97 78 244 -101 24 19 189 109 83 3 58 143 44 -161 -132 123 -132 26
5800B6j54J02qrP3j40J94k11J99K2k2m7N3j32Q0J43j42n3l7J10p0%P0k7j06J96
$$ 26 -128 -26 -34 -43 30 -110 84 -127 72 94 72 25 78 -54 26 169 27 -26 -63 47 -23 -23 47 20 -86 110
5826A10j59P4m9OK1p1N8m6L0p1J07Q9j70KR3Q7l16K28L4n7k63K07J8K15J12j47
$$ 110 -49 25 -24 -18 3 -68 -10 -56 -26 -97 10 99 -71 -69 24 111 -205 23 57 0 -263 -56 -38 177 289 142
5852A42J1j13L8j97K5k3m4O4J8j2K50J1j16l6O6j03j34Q0Q5J40p0O4n3j79R8N7
$$ 142 153 40 78 -119 -94 -117 -161 -97 -79 -91 159 170 54 18 84 -19 -153 -73 12 152 82 146 93 -86 12 69
5878F9j78o7K96p6n2K42j85N3j77L4J3m3j3j21Q6J20N6o6Lr3J98j7J8K3l08J65
$$ 69 -109 -176 120 44 -8 234 49 102 -75 -41 -28 -71 -84 -205 -119 1 57 -9 -6 -99 99 82 100 123 -185 -20
5904b0J38n3Nr4N8L8L1j59j4pj8L1L03k38L2p5Q7m6l5J53k78l8O2K39J06k87L11
$$ -20 118 65 70 -24 34 72 103 -56 -70 -77 -95 -64 239 1 33 -42 45 -1 -36 117 -161 -199 -137 102 208 -79 232
5931B32k58K97k65m5j75J40k5K09o9k62K64r0QJ02n6K2k3O8r5N8m9r0J32n2qJ88
$$ 232 -26 271 6 -39 -214 -74 -99 110 41 -221 43 -47 -39 63 7 29 6 74 -21 37 -12 -102 30 -22 -30 158
5957A58j97n1J89k39L92k41J46r6J56q6q5j36j8M5o4O4nL63l54K00m2j31j32P5
$$ 158 -39 -90 99 -140 252 11 157 61 217 131 46 -90 -108 -63 -127 -63 -68 295 -59 141 99 -32 -164 -89
5981h9l3J62mJ33j29L4o1n7L22l10J0P6j97J07l7m1Q1Q0l7j56J40O5k60N6J36
$$ -89 -122 40 36 169 40 74 13 -44 278 -32 -22 54 -143 -36 -73 -114 -33 47 10 -146 -6 59 -201 -145 -9
6006ij30r9K17J80j43P0k68J91k71K57p7j23J09O2Q8j10J95j20R7R3j87N8m2j36
$$ -9 -139 -238 -21 159 16 86 -182 9 -262 -5 -82 -205 -96 -34 54 -56 139 19 116 209 22 80 38 -98
6030i8N4L43m79J22k8j67L36O8j15j83J72K48k68q5J40no0K5Q9q7r8K32o8n5p1
$$ -98 -44 299 -180 -58 -86 -253 83 151 36 -147 25 273 5 -80 60 55 -5 20 109 22 -76 156 88 33 -38
6055c8Q6N9p8n4L0J37L1k60J32r4o7j15K91r3R3Q0k93K63j16o7O1j21J72r7rQ4
$$ -38 48 107 29 -25 5 142 173 -87 45 -49 -116 -231 60 -33 60 140 -153 110 -6 -73 -12 -133 39 -58 -67 17
6081A7m1n9J61n8p5j40J28MJ32j11j22L8L5R7n0K38k20J09j64r4J31k28M54k59
$$ 17 -24 -83 78 20 -55 -195 -67 -63 69 -42 -164 -126 -91 6 -44 194 -26 83 -81 -175 -44 -272 182 -77
6105g7J21j68J12j02K61k41J02M2j07R2p9R0o2j70K66jq7J67k86l4J63N2N5j91
$$ -77 44 -124 -12 -114 147 -94 8 50 -57 35 -44 46 -16 -186 80 79 -8 159 -127 -161 2 54 109 -82
6129h2J82N9M7j02j51P0j27l7L07k12K17k55J78Q9l15M4J47j75R3J2Q7J21l60
$$ -82 100 159 206 104 -47 23 -104 -141 166 -46 171 -84 94 183 -132 -88 59 -116 -23 -11 76 197 -163
6152a63L57l48K66k45J05o3K14l6Q1j17Km9j57K38p4j44n3L30o1k02J83j66L40
$$ -163 194 -154 112 -133 -28 -91 123 87 168 51 53 4 -153 85 11 -133 -186 144 83 -119 64 -102 238
6175B38k38j60J86r4J32q7J20k08J45j1J40kj2j19p0r1J82k83q7K82m5K51r1Q2
$$ 238 0 -160 26 -68 64 -23 97 -111 34 23 163 161 149 30 -40 -131 51 -232 -319 -37 -82 169 78 160
6199A60l6N6k91J04%j18r9K40Q0P2k5j10L3k15J17K6Mj43o6K05RPr3K08K9j52
$$ 160 124 180 -111 -7 -7 -125 -224 16 96 168 143 33 66 -149 -32 -6 -2 -145 -211 -6 3 10 -83 125 154 2
6225Bq8J33n9j44J47J02q7M4j07J04q7j52L36m04L66l04J10J33K9p7P7Q1j30k4
$$ 2 -86 47 -12 -156 -9 93 6 50 -57 47 -40 -192 144 -260 106 -198 -88 45 74 -3 74 155 25 1
6249Ao7R7j63K13n5J31K03j88j6j24J24j92J09r9J10n4j56J40j3J61k11nJ66j57
$$ 1 -66 31 -132 81 26 157 360 172 156 32 156 -36 73 -26 84 30 -126 14 1 162 -49 -54 112 -45
6273d5PJ40k42K2J44K17k7l58J79Q9p2l15L24mN3j80J36OM5k4J93l34m1J60r4
$$ -45 -38 102 -140 -118 26 243 216 -142 37 126 54 -261 63 59 112 -68 68 74 119 95 288 -46 -87 73 -21
6298b1p0j1R9L1Mk10J87k43KL66j98J42J2j62K41p1j51R5Rp0nmj12J79j44J43
$$ -21 -91 -102 -3 28 32 -178 9 -234 -232 134 -64 78 90 -72 169 98 -53 42 51 -19 -24 -28 -140 39 -105 38
6324C8j37Q9Rj05O8J86j71J47j96K0L31m20J06J8N5K9k26L0k2J52j08j04L87p8
$$ 38 -99 -10 -1 -106 -38 148 -23 124 -72 -52 279 -141 -35 -17 38 67 -159 -129 -151 1 -107 -211 176 98
6348I8n7lk4K21j32mo5j46L02k15Q1K6j63L97k18J35m62L39J1k84L0O4N4M9p8
$$ 98 41 38 14 235 103 99 34 -112 190 -25 56 82 -81 316 98 233 -229 110 121 -163 -133 -69 -15 34 -44
6373d4N3o9Nm0J04K3p7K33L2k25P9j8j47K3J1J15k9j66Q6J65L2j87j51jL03pk45
$$ -44 9 -60 -55 -95 9 32 -45 188 220 -5 74 56 -91 -68 -57 58 29 -137 -51 114 146 -41 -192 -193 110 103 -142
6400a42K55j41k4J17N2r3j61P0J69j55N8J78j11j15J87k6j16m3J62K1k85K53k2
$$ -142 113 -28 -52 65 117 24 -137 -67 102 -53 5 183 72 -43 144 118 2 -41 121 142 -143 110 88
6423H8m0Qj52K0J54l27K85j58j1K78j10o8J32oj51o5jO6M2P8m6Jp5L5J07l7k32
$$ 88 48 56 -96 -76 78 -249 36 -122 -133 145 35 -33 99 93 -58 -123 -124 -58 -16 62 16 17 -58 -23 84 47 -185
6450a85J69k6r8N5J02m2j8j43K95k23P7or0J42Q1j28Qk0J32j52J81j45n9k6P4
$$ -185 -16 -42 -140 -85 17 -25 -43 -186 109 -114 -37 -43 -133 9 90 -38 -30 -50 82 -70 111 -34 -93 -119 -45
6475d5M0j69K79J1K39l31j17K52j26j67L08k25o9J33M6j10r3K81k07j15J44m2
$$ -45 -5 -174 105 116 355 24 -93 159 33 -134 174 -51 -120 13 59 -51 -144 137 -70 -185 -41 -83
6497h3P9j42jK75m9N0J20k09o6r2R7J37l15L67k79l0K8K04j38j63J67J90k73N4
$$ -83 -4 -146 -147 128 79 129 249 40 -26 -118 -21 116 -199 168 -111 -141 -113 91 -47 -210 -43 147 -126 -72
6521g2j23M37k09J62k67P4Nl2Rj44J63j11O3J44o7o6q9J89l7m5J96j11j23k9J59
$$ -72 -195 242 33 195 -72 2 7 -25 -16 -160 3 -108 -45 99 32 -34 -123 66 29 -16 180 69 -54 -83 76
6546G6k34J74J78j38k14P3N1R1j04j22L26k52J72K73m56J69K32l43m4R9Kj04k1
$$ 76 -158 16 194 56 -158 -85 -34 57 -47 -169 157 -95 77 350 -106 63 295 -48 -92 7 9 -95 -116
6569a16K52n9J7j63K47l29K07k83K37j65J40j1J95j37Q6k07J26k0K41k96M3j53
$$ -116 136 77 94 -69 178 -151 56 -227 10 -155 -15 -26 169 32 118 -89 37 17 258 -38 5 -148
6591a48K06R6l23L95k03l13K94K40l63K19k17J07l12J26J59n0j61K36nk21K36
$$ -148 58 154 -169 226 23 -290 4 244 -119 100 -117 -10 -322 -196 -37 -87 -248 -12 -17 -238 -2
6612bj51J00N2j42L62k03J23p8J53o4j35J75l36J74M9j52P2nj80N8K19m1j91J42
$$ -2 -153 -53 -1 -143 219 16 139 61 214 150 15 190 -146 28 77 -75 -3 -8 -188 -130 89 48 -143 -1
6636am4J2k9r8J38o3j59L10J13l4r4nO5k48K68l04J49l9J08M0j92J78oqk4J8l0
$$ -1 -45 -33 -62 -160 -22 -85 -244 66 179 145 51 46 111 -137 131 -173 -24 -63 45 85 -107 71 65 57 33 51 21
6663B1j86o1Q9J53j51J69o1J37J04r8j79J12M7l17M59R4l44J59p0j5k6j76K61
$$ 21 -165 -226 -137 16 -135 34 -27 110 214 116 -63 49 96 -221 238 332 -12 147 77 62 36 -140 121
6686A21l52L72k6pnJ05k2k11J94m1k36Q9j42K14j00j23J38K21j1K7J02j75P8k59
$$ 121 -231 141 115 108 103 208 186 -25 169 128 -108 -19 -161 53 -47 -170 -32 189 178 205 307 132 210 -49
6710d9J23n9Q6j67K07j96j06O0P4o6J20L0j27J6j11K89n5k0m9K9k9j51J33L8P
$$ -49 74 15 101 -66 141 -55 -161 -101 -27 -93 27 57 -70 -54 -165 124 69 49 0 29 0 -151 -18 20 27
6735B7n8K14p1j64J72k35J90j84J59j06K1J80j29J7k27K72lq4M6m4j02K7O6K40
$$ 27 -31 183 112 -52 120 -115 75 -109 50 -56 -35 145 16 33 -194 78 75 -9 37 -7 -109 -82 -16 224
6759B24j1j32k3O1P3j75r4N2j65L05Q2j71k0K6N2l3Q5j17k9r0k8J82j70K63l28
$$ 224 213 81 58 119 192 17 -77 -25 -190 115 197 26 6 32 84 51 136 19 -10 -100 -128 54 -116 147 -181
6784a81J42p1O8m5OP7j13K06l8p2Q1Ln3J33j80O2p4J29m7K25l41K21l2lj52OJ68
$$ -181 -39 -110 -42 -87 -81 -4 -117 89 51 -21 60 63 10 143 -37 25 -49 80 33 258 -83 138 106 103 -49 -43 125
6811A25m23K01J09Q6OOk48R4r0J37j46j6J23j69K99n8J76p8j87l2K7j66L04L0
$$ 125 -298 -97 12 98 104 110 -138 -44 -134 3 -143 -159 -36 -205 94 36 212 134 -53 -85 -58 -224 80 110
6835A10j77K4N6j96L0J01j06PP7K6n1L2n9K00j04J53j07K0j47J48qj51J62m8K5
$$ 110 -67 -43 13 -183 -153 -52 -158 -151 -74 -48 -99 -67 -126 74 -30 123 16 36 -111 37 29 -122 40 -8 17
6860A7QK42m0l01n1L09j23n4o2O9n9O7l9q5J10Q3k35k6Q9k13K95q4O2K95l14M7
$$ 17 25 267 227 -74 -125 184 61 7 -55 14 -45 22 -17 -102 8 91 -144 -170 -81 -294 1 -83 -21 274 -40 7
6886Gj48J86j36Q8O4r5K11p5k04J89r3Q5k2j45K2j12K9M1K24oL0m2N3M0j26J24
$$ 7 -141 45 -91 -3 61 -34 177 102 -102 87 -6 79 57 -88 -66 -178 -149 -108 116 110 140 98 151 191 65 189
6912A89k29J91j7J31j35j30J53j12qm2Q4k45L09j76qp5J09J60j10j48O1j8P3j50
$$ 189 -40 151 134 265 130 0 153 41 33 -9 75 -170 139 -37 -45 -120 -11 149 39 -109 -48 -66 7 -143
6936a43J37l2K13q7o1m3j07L16l18J88l1n6J25K1L1j5k16P2K0J03p4O5o5m1N0
$$ -143 -6 -38 175 88 27 -16 -123 193 -125 63 32 -24 101 122 153 138 -78 -6 14 117 43 108 43 2 52
6961E2L1P5j03j23j59NK68j0PK9l0r1J30j06J73Lp7K5o5K5K51l30P3rL1q5L5k7
$$ 52 83 158 55 -68 -227 -222 46 36 43 72 42 -49 81 -25 148 151 74 99 34 59 310 -20 53 44 75 -10 25 -2
6989bnl9j86L02O2j56K7o4P3R5r2p8l8K6K92k38J75k82L03r8k17R4%N9k86L07
$$ -2 -7 -46 -232 70 132 -24 3 -61 12 107 15 -63 -101 -75 217 -21 154 -128 175 77 -140 -46 -46 13 -273 34
7015C4j19K02J9j48j4J3L6j84lR7p1M9K06j76J92j52J78j27r6M8J5p2J48Q7k15
$$ 34 -85 117 136 -12 -26 -13 23 -161 -164 -67 -138 -89 117 -59 133 -19 159 32 -64 -16 -1 -73 75 162 -53
7040e3L82k34q1l2JrO2k15K08m3M8J85k50j0O5j60rJ86j75K50Q3k98J55p3J03
$$ -53 329 95 14 -18 -17 -26 36 -179 29 -14 34 219 -31 -41 24 -136 -145 41 -134 116 199 -99 56 -17 86
7065H6k6L7j54J00Kj48K46O1j46j45J09k00R5L9J9K41j16j09O3o7K34l59K40l6
$$ 86 60 97 -57 43 45 -103 143 204 58 -87 22 -178 -83 -44 -25 216 100 -9 54 -13 221 -138 102 66
7089F6p8QJ34k20N5j30L21k69M1K10j98j87M58j86q4qJ47M6j11J4J33k26L6J37
$$ 66 -12 -4 130 -90 -35 -165 156 -113 -72 138 -60 -247 211 25 -59 -67 80 126 15 29 162 -64 -28 109
7113A09k02RN2m7J19q6k1J46k2M6q8o4J81M4j63N9lp8Qj9M5k6J08j80q9K63M4
$$ 109 -93 -84 -32 -79 40 -46 -67 79 57 103 15 -49 132 176 13 72 69 -9 -1 -20 25 -1 107 -73 -162 101 145
7140A45j31J71q6j81Q5M0r4l7j2J57j38J03l2j68L45j47R5j43k51M07j8q6j18
$$ 145 14 185 99 -82 3 43 -51 -88 -100 57 -81 22 -10 -178 167 20 115 -28 -279 128 110 24 -94
7163i4n8K53k73J82p8k48K54K2L0j19K93j95l1J09k33J32j5j10J3K04P7L9r3O5
$$ -94 -152 101 -172 10 -68 -316 -62 -40 -10 -129 164 -31 -62 47 -186 -54 -69 -179 -166 38 115 154 61 126
7187A26q6K8r9N5jK3j45m9J6J01J16k67K35r4JL0j05L57P3j79j86k24L85r0k00
$$ 126 40 68 -31 24 23 46 -99 -148 -132 -31 85 -182 53 -41 -40 -10 -115 242 315 136 -50 -274 111 21 -179
7212a79J42J67l02J53J80k73L94j66j50N9j36J01rk27J73K34j04j02Q1oj07J8
$$ -179 -37 130 -172 -19 161 -112 282 116 -34 25 -111 -10 -19 -246 -73 161 57 -45 36 30 -77 -59
7234e9J3O2J2K58k27r2J09j35k7j44J69J69l3j55k09L86j75N4k4Om3Q3j05J84
$$ -59 -46 16 28 286 59 -33 76 -59 -86 -230 -61 108 75 -80 -289 97 -78 -24 -48 -42 -85 -2 -107 77
7258G7k26K97k59J72J3j01O7RRQ8l39J35pJ15n7J19p8M1q3J46k6m9o0j11p3K49
$$ 77 -149 148 -111 61 74 -27 40 49 58 146 -193 -58 -65 50 -7 112 34 75 -8 138 112 63 3 -108 -181 68
7284F8q3oJ28l0j3Kj33j19J99o6j4J71O3j13J69o7j24O0k10J5J61m2J55J10k47
$$ 68 -15 -21 107 77 64 66 -67 -186 13 -53 -67 104 167 54 223 156 32 92 -118 -103 58 16 171 281 34
7309C4j16J28j5n0po2MK08k4q1nN1j15K63l92L02o3j44K26k82%J88P1n3k34L17
$$ 34 -82 46 31 -19 -26 -88 -84 124 100 19 14 65 -50 213 -179 123 60 -84 142 -140 -140 48 119 66 -168 149
7335A49k90K32l14K04Q3j35q7L4J82j8j0j81R4j18O2Q3J58o6k30L22L2k49L1N4
$$ 149 -141 91 -223 -19 64 -71 -158 -124 58 40 30 -151 -57 -175 -113 -30 128 62 -168 154 186 -63 -32 22
7359B2J04k31j19K69n0J47M3k18n8J59o5j22K15l14K80o3O1m7r1J5m9KM3Nj12
$$ 22 126 -105 -224 45 -5 142 185 -33 -91 68 3 -119 96 -218 62 -1 60 13 -78 -63 -112 -110 -67 -62 -174
7384a74j4Q0J90j29M1Q9j65P3p0k5J1n7L28l4k27%M5J4q9K62j58r0Q3O5o4j6k9
$$ -174 -188 -108 82 -47 -6 83 -82 -9 -79 -104 -93 -150 178 144 -83 -83 -38 -24 -113 149 -9 -99 -16 49 -15 -31 -60
7411f0N6r7P8N8l1J60p5m9J27k8J6l4j12J44k20R4J85k43m8J48j86K80j72p4J2
$$ -60 -4 -101 -23 35 4 164 89 40 167 139 155 121 9 153 -67 27 212 -31 -79 69 -117 163 -9 -83 -71
7436g1o3L5L28l90J41K5j17J19L7j27J31j25K90p0j05J3j71R5K3J30r0l52K77
$$ -71 -134 -99 229 -161 -20 5 -112 7 44 -83 48 -77 213 143 38 51 -120 -25 -2 128 38 -314 -37
7459c7L2j6JJ45j30RJ21m3j52j10J64O6o2j31K33l2r1p7n0J22P5k16NO2J05J18
$$ -37 -5 -21 -20 125 -5 4 125 82 -70 -180 -16 50 -12 -143 90 58 -33 -110 -160 -38 37 -179 -174 -112 -7 111
7485A11j48L6Jk1j22K01J09l07p1J51n7O6K0N7Q9m3l2R3k91K47p4J0n5P7J6l33
$$ 111 -37 -1 0 -21 -143 58 167 -140 -211 -60 -117 -51 -31 26 115 72 40 133 -158 89 15 25 -30 47 63 -270
7511b70J47L64K10m30M6Rr1Q4j36J26J33k77O0q3J73pL5L2k93mK08l5J17q4P9
$$ -270 -123 241 451 21 67 76 -15 69 -67 59 192 -85 -25 -108 65 58 93 125 -168 -172 36 1 118 34 113
7536A13j97J30R0k36q4J33J05l5j32J76l4p5j02N2L01l31q7K07M1o9j71LL07k5
$$ 113 -84 46 136 -100 -184 -51 54 19 -113 63 29 -46 -148 -96 205 -126 -213 -6 35 -34 -205 -202 105 80
7560H0j4l9n9o2K5K01K7j92R3j80O7k1J21l30L97o6j64L72j63p5M4n2j28p1J29
$$ 80 66 27 -32 -94 -69 132 159 -33 60 -120 -53 -74 47 -283 114 48 -116 256 93 18 62 10 -118 -189 -60
7585f0J97q3q0J8J81k66K48k71r9J23P7N0j93J82J55k44K65p4n0j31k1J06r7J1
$$ -60 137 54 -26 -8 173 -93 155 -116 -215 -92 -15 35 -158 24 179 -65 200 126 76 -55 -76 30 -67 -56
7609e6J35q2k1J66k02J19J4o9k9L4j43N7M6J33k3j74M3P1k8J62J83l77k2P9j11
$$ -56 79 -3 -24 142 -60 59 73 4 -25 9 -134 -77 -31 102 79 -95 -52 19 -9 153 336 -41 -63 16 -95
7634i5J60L2j64j31J77J67k09N6K04k58j53J20j81QJ99P0Qr4M8L2p0R8m3rL8j7
$$ -95 65 97 -67 -198 -21 146 -63 -7 197 -61 -214 -94 -275 -267 -68 2 10 -84 -36 -4 -74 24 -19 -28 10 -7
7660gj26J6L44k55J74j72p6J94Pj86n8J00J35r7n6L9R8o4Q6j69m9J29L1k0J2k2
$$ -7 -133 -117 227 -28 146 -26 -102 92 99 -87 -145 -45 90 -7 -63 -24 74 10 96 -73 -122 7 38 18 30 8
7686HR6J26j90n3J47K6j25j22O8L1q1j01K43jJ9m4j97K33j30K2Q7l6k16J25J33
$$ 8 104 230 40 -13 134 160 35 -87 -19 12 -69 -170 73 72 91 47 -150 83 -47 -25 62 26 -190 -65 68
7711F8Nm3j57R2J53k04k4K87j26%J6o0j96K52m6r7J05N4j45J97k07J88k13L9J8
$$ 68 73 30 -127 -35 118 -86 -110 177 51 51 67 7 -189 63 17 -80 25 79 -66 131 -76 112 -101 -62 -44
7736d4J84j18k6p2j94K38J30j16K63k09O1N4o1r3J47p2r1j3K60j98lp1K8OP7k52
$$ -44 140 22 -4 -76 -270 -32 98 -18 245 36 97 151 90 -3 144 72 -19 -32 228 30 27 -44 -16 -10 67 -185
7762a85J67N7q1n3J35O9k19N3M3L4oj10J5K07n2qr0J04j36K25k61lR6K3M8K7j55
$$ -185 -18 39 -42 -95 40 109 -110 -57 -14 20 14 -96 -81 126 74 66 -24 80 -56 169 -92 -95 1 24 72 99 -56
7789e6M6N5j96Q1M1%J07k00J49k13J68P3j22J02j1Nj3Q5L0j1j45LL62k24k48J25
$$ -56 -10 45 -151 -70 -29 -29 78 -122 27 -186 -18 55 -67 35 24 29 16 101 131 120 -25 -22 340 116 -132 -7
7815gJ05l5k90K06q5K1J63J72l12R4l4j80p1J16J38p9K22kj23Q1j41Q7k33J19
$$ -7 98 63 -227 -21 -106 -85 78 250 -62 32 -2 -182 -253 -137 1 -78 144 142 19 100 -41 46 -187 -68
7839f8r9K72q6J9j89J16qJ06o2j54J95r1m3K1J37n2N8j34j87L32K2k47J50l4L9
$$ -68 -167 105 19 38 -151 -35 -43 63 1 -153 42 -49 -92 -71 66 14 72 -62 -249 83 105 -142 8 -26 13
7864A3n7J29j10J71L2j70k40L15p2j1m4j4N6j02J54k7q4m7J72j49J25K0j05R5
$$ 13 -44 85 -25 146 178 8 -232 83 11 0 -44 -58 -2 -104 50 23 -61 -108 64 -85 40 60 -45 50
7888E0n6l24L13J00l1q8M4l2nL4n2k4J09q1j39J42M2RK5q7J54j55N3K15k51j2
$$ 50 -6 -330 -17 83 52 -36 8 -24 -29 5 -47 -71 38 -43 -182 -40 2 11 36 -51 103 -52 1 216 -35 -47
7914d7K2j66J55j37K22J51o9q0Mj65J87o5K8j20N5o9K22k04j32M34l91J82p4J01
$$ -47 -25 -191 -36 -173 49 200 131 51 55 -110 77 12 40 -80 -25 -94 128 -76 -208 226 -165 17 -57 44
7938D4p8K3j02R6K7J3n2L6n6l8J22j49J49p7L19l94K25p5k8K6p1Q2j39j10K53
$$ 44 -34 -11 -113 -17 10 23 -29 7 -49 -87 35 -114 35 -42 277 -117 108 33 5 31 -40 42 -97 -207 46
7963D6N0l41L77j99J38JJ29k42j07m4NJ11O1L3j59K65j06m5k6r3J2Q6J99o8j34
$$ 46 96 -245 132 -67 71 72 201 -41 -148 -192 -187 -76 -15 18 -141 124 18 -27 -53 -146 -134 -48 151 83 -51
7988e1K17j14M0m1k1l7P9P9k71j54K74M7j70P5j8N3Km1o1J94j1k68J34J92q9J33
$$ -51 166 52 92 51 30 -7 72 151 -120 -274 0 47 -123 -48 -66 -13 -11 -52 -113 81 70 -198 -64 128 39 172
8014A72j46j42J46j75J96j81R7K39k73J20R3k97M97n12Q5J10k07R0O7L6r0J05
$$ 172 26 -116 30 -145 51 -130 -33 206 -67 53 146 -151 346 -166 -81 29 -178 -88 -21 15 -75 30
8036C0RM7j25J71k75J53J54j71n0Q4J22o0k39J71rn2oK04j23n0J83k29k1J73k15
$$ 30 39 86 -39 132 -143 10 164 -7 -57 27 149 89 -150 21 12 -40 -46 158 35 -15 168 -61 -82 91 -124
8061a24J53j96J34j7J96j16J87j61M5k5j24k07L10j13j9L4MM1J17J62k75n6N2
$$ -124 29 -167 -33 -50 146 30 217 56 101 76 -48 -255 55 -58 -77 -43 -39 2 119 281 6 -50 2
8084Bj65r3J71J79kj41k6K5N7j1o1r7J29j22J04Q4J9J55l1k12J80j69pn8n4J47
$$ 2 -163 -256 -85 94 92 -49 -75 -50 7 -4 -65 -162 -33 -155 -51 33 52 207 176 -36 144 -25 -32 -90 -144 3
8110CJ75k13J44k8L8Ol69L14q3p5P3o5J51o9L2j65O8K31l9o9k03mL40l2k8j02
$$ 3 178 -35 109 81 119 125 -244 70 -13 -88 -15 -80 71 2 34 -131 -63 168 129 60 -143 -147 193 161 133 31
8136C1m4l2J15j27P5L7p1J1J33Lj39K61j61N2l72J12Q8k6J5j40J24k6K23j56K07
$$ 31 -13 -45 70 -57 18 55 -16 -5 128 131 -8 253 92 144 -228 -116 -28 -54 -39 -179 -55 -81 142 -14 193
8161A93N0m25J56K23l54J13J68n6l1l02O6O1R7l0O4r6M1j8M0K7m2J16j73j2O9
$$ 193 243 -182 -26 197 -157 -44 124 68 37 -265 -199 -138 -41 -71 -7 -103 -62 -80 -40 -13 -55 61 -112 -124 -55
8186e5K7J86k3J3k44
$$ -55 -28 158 135 148 -96
8191i6
$$ Imaginary data points
##PAGE= N=2
##DATA TABLE= (X++(I..I)), XYDATA
0@%%%%%%%Qj6J6j6K4l2L2m0M8n6P2q8J04j20J40j63J87k15K46k82L21l64M12m65
$$ 0 0 0 0 0 0 0 0 8 -8 8 -8 16 -16 16 -24 24 -32 40 -48 56 -64 76 -87 100 -115 131 -151 170 -194 218 -247
31b47N25n88O58p35Q20r14J013j126J249j382J532j696J878k080K306k561K850
$$ -247 278 -310 348 -387 433 -481 532 -594 655 -727 805 -891 987 -1093 1213 -1348 1502
48A502l181L560m007M539n182N985p015Q399j0361J3393j8762L1131j10427m9316
$$ 1502 -1679 1881 -2126 2413 -2769 3216 -3799 4600 -5761 7632 -11130 20001 -90426 -139742
62a39742J71021Q9894O6205l2990p8428j30280j10140p3049J1048Q1396J46186
$$ -139742 31279 121173 187378 154388 75960 -54320 -164460 -237509 -226461 -145065 1121
73A121J56221J32958N9051k5106j14234j67255j85192j49946q3364Q059R1322
$$ 1121 157342 290300 349351 324245 210011 42756 -142436 -292382 -375746 -367687 -276365
84b76365J54836J74468J54723R4461J7010o3344j20318j43678j23658p2349j817
$$ -276365 -121529 52939 207662 302123 319133 255789 135471 -8207 -131865 -204214 -206031
95b06031O3654J06104J12141Q0855K3266m3095r6818j20725j07575n9938Q912
$$ -206031 -142377 -36273 75868 156723 179989 136894 40076 -80649 -188224 -248162 -239250
106b39250P9063J29592J46978J24356O7690p991q2282j35345j53883j32956p9295
$$ -239250 -160187 -30595 116383 240739 308429 300438 218156 82811 -71072 -204028 -283323
117b83323p474O3480J14762J34016J17426P1318R630n0968r3049j05870q7494
$$ -283323 -290797 -227317 -112555 21461 138887 210205 219835 168867 75818 -30052 -117546
128a17546m4150J0937O0898R0670R2429O3987J4971m0863q5730j06172r4573n4719
$$ -117546 -161696 -150759 -89861 809 93238 157225 172196 131333 45603 -60569 -155142 -209861
140b09861K524O0087J01926J15418R7766N4219k872n7855r6326j08877r3740n5551
$$ -209861 -207337 -147250 -45324 70094 167860 222079 219207 161352 65026 -43851 -137591 -193142
152a93142o099M2862P7925R1235Q0353M9220O212l6209o5576p5429o1479k9795
$$ -193142 -199241 -156379 -78454 12781 93134 142354 148566 112357 46781 -28648 -90127 -119922
164a19922J0774M7039O7786O6995M4136P294l2335o2042p4368o3495l4838L834
$$ -119922 -109148 -62109 5677 72672 116808 124102 91767 29725 -44643 -108138 -142976 -139142
176a39142M1934O8346P6137O3857L5834j102l6889o1763p1412o2509l8827o027
$$ -139142 -97208 -28862 47275 111132 146966 145864 108975 47212 -24200 -86709 -125536 -131563
188a31563K6203N0390N9989N2824L2512M373k3156m1426m6788l6746j6018R610
$$ -131563 -105360 -54970 5019 57843 90355 94728 71572 30146 -16642 -53388 -69406 -59796
200e9796L0858M2732M0177K5121J121k3549m2210m8198m1412k2399K821K7187
$$ -59796 -28938 13794 53971 79092 80213 56664 14454 -33744 -75156 -97555 -94734 -67547
212f7547M4170M9224M0876K3263k38k1907l7110m1796l6182k2596l986J3500K6538
$$ -67547 -23377 25847 66723 89986 89748 67841 30731 -11065 -47247 -69843 -73829 -60329 -33791
225c3791L1361K8185J7151K948j1391k0772k3384j8770o597O538J8761K4352K2724
$$ -33791 -2430 25755 42906 45854 34463 13691 -9693 -28463 -35060 -28522 -9761 14591 37315
238C7315J3171q71j5510k5345k8749k3564j2163J643J4651K3047K4873K0774J1735
$$ 37315 50486 49615 34105 8760 -19989 -43553 -55716 -54073 -39422 -16375 8498 29272 41007
251D1007R59q513j5433j7245j5532r588k131N579J1540J4103J2623P546L32p168
$$ 41007 41966 33453 18020 775 -14757 -24345 -26476 -20897 -9357 4746 17369 24915 25247 18079
265A8079j2430j3626j1628n410J809Q453J1905J1981Q142K335m033q913j0104
$$ 18079 5649 -7977 -19605 -25015 -23206 -14753 -2848 9133 17275 19610 15577 6664 -3440
278c440q928n063R5M905P475Q345O790L584k06l728o381p505o380l989m72L221
$$ -3440 -12368 -17431 -17336 -12431 -4956 3389 10179 13763 13557 9829 3448 -4057 -10437 -14426 -14898 -11677
294a1677O785Q450Q615O728K523j710o529r389j0242q826m913j053K748N341N964
$$ -11677 -4892 3558 12173 18901 21424 19714 13185 3796 -6446 -15272 -20185 -21238 -18490 -13149 -7185
309g185N136L124J497Lj68J050J829L005L474K949R22r02l523n672p050p760p139
$$ -7185 -2049 1075 2572 2575 2407 3457 5286 8291 11765 14714 15636 14734 11211 5539 -1511 -9271 -16410
326a6410n263k139J730N943R227J0757J0158P174K945k120n997q614r115p065
$$ -16410 -21673 -23812 -22082 -16139 -6912 3845 14003 21177 24122 22002 16005 7391 -1724 -8789
340h789m476j354J139K524L221K534J792J491J916K262L524L875M300L173J422
$$ -8789 -13265 -14619 -13480 -10956 -7735 -5201 -3409 -1918 -2 2260 5784 9659 13959 17132 18554
355A8554p94l885o742q770r756r354o723k879K052O366J0163J1985J1181Q546
$$ 18554 17760 13875 7133 -1637 -11393 -20747 -27470 -30349 -28297 -21931 -11768 217 11398 19944
369A9944L714p64m755p296p673o226l905j594K60J255R92ol36l70N02K223M278
$$ 19944 23658 22894 18139 10843 3170 -3056 -6961 -8555 -8295 -7040 -6048 -6054 -6390 -6760 -6258 -4035 243
386B43N713O363N632K823o56m938q614j0755j1209r484n778n91N001R587J2780
$$ 243 5956 12319 17951 20774 20118 15180 6566 -4189 -15398 -24882 -30660 -31251 -26250 -16663 -3883
401c883J3105J1341P186K685k402o304q163q302o872n090k759j781r36j714j924
$$ -3883 9222 20563 27749 30434 28032 21728 13565 5263 -1609 -6699 -9458 -11239 -12175 -13889 -15813
416a5813j822j9K364N625R360J0838J1100Q536M096j784q233j2908j5313j5235
$$ -15813 -17635 -17654 -15290 -9665 -305 10533 21633 30169 34265 32481 24248 11340 -3973 -19208
430a9208j2529o875r82N293J0704J3457J4553J2456R299N071L91l200n125o131
$$ -19208 -31737 -38612 -39594 -34301 -23597 -10140 4413 16869 26168 31239 31630 28430 23305 17174
444A7174o711o471o148o992p489p884p145m837r10M429R849J4881J7486J7574
$$ 17174 10463 3992 -2156 -9148 -16637 -24521 -31666 -36503 -37413 -32984 -23135 -8254 9232 26806
458B6806J4206P812P10p251j2817j6403j7451j5293j1397n967n54L814P705R620
$$ 26806 41012 48824 49534 42283 29466 13063 -4388 -19681 -31078 -37045 -37599 -33785 -26080 -16460
472a6460J0119J0017Q235P258N398L575J750n10l447o172r732j2138j4035j3199
$$ -16460 -6341 3676 11911 19169 24567 28142 29892 29382 25935 19763 10031 -2107 -16142 -29341
486b9341j0712n444N09Q027J3954J7118J8202J5773J1359N259p62o137j0251j2495
$$ -29341 -40053 -45497 -44988 -36961 -23007 -5889 12313 28086 39445 44704 43942 37805 27554 15059
500A5059j2422j2159r672p560n013j701R54L850O460R095J0361J0904J0855Q908
$$ 15059 2637 -9522 -19194 -26754 -31767 -33468 -32514 -28664 -22204 -13109 -2748 8156 19011 27919
514B7919N931K106k529p286j1712j3651j4174j2229q374l213K125P092J0411J1927
$$ 27919 33850 35956 33427 26141 14429 778 -13396 -25625 -33999 -37212 -35087 -27995 -17584 -5657
528e657J1854J0128P484M667J122j568l650o095p963r384j0019r006p445m126
$$ -5657 6197 16325 23809 28476 29598 28030 24380 18285 10322 938 -9081 -18087 -25532 -29658
542b9658j002K982O530R164J0802J0972R749P129L891l69l727p414q989r492q998
$$ -29658 -30660 -27678 -21148 -11984 -1182 9790 19539 26668 30559 30190 26463 19049 10060 568 -8430
557h430p484m864j858M38K954M395N931O566O798P250N800M109J245j838n164
$$ -8430 -15914 -20778 -22636 -22198 -19244 -14849 -8918 -2352 4446 11696 17496 21605 22850 21012 15848
572A5848p810q937r350p522n027j629K212N019O814Q377P054O361M671K650L77
$$ 15848 8038 -899 -10249 -17771 -22798 -24427 -22215 -17196 -10382 -2005 5049 11410 16081 18731 19108
587A9108j601k851m317m804n064n400n041m449l343j890L39K542N347P628Q234
$$ 19108 17507 14656 10339 5535 471 -4929 -9970 -14419 -17762 -19652 -19313 -16771 -11424 -3796 4438
602D438Q421O395L599n45m161o724q357q360o424l871r52J751L561M253M367L939
$$ 4438 12859 19254 22853 22308 18147 11423 3066 -5294 -11718 -15589 -16541 -14790 -11229 -6976 -2609 1330
618A330K981K786J691J185R29R4m94j439k735l969n331n508n452m087j868J145
$$ 1330 4311 7097 8788 9973 10902 10996 10502 9063 6328 2359 -2972 -8480 -13932 -18019 -19887 -18742
634a8742L921P000Q221Q154O259L632Q5l175m826o049n727m085k295o42M60J272
$$ -18742 -14821 -7821 400 8554 14813 18445 18530 15355 10529 4480 -1247 -5332 -7627 -8269 -7809 -6537
650f537J376P83Q57R6Q92R90J795K277K528K129J319J3j985l213m423m827l926
$$ -6537 -5161 -4378 -3521 -3425 -2533 -1543 252 2529 5057 7186 8505 8518 6533 3320 -1103 -5930 -9856
667i856j885r7K089L894N096M788M024K075J49j474k878k891k651j720o95M07
$$ -9856 -11741 -11838 -9749 -5855 -759 4029 8053 10128 10277 8803 5925 3034 383 -1337 -2032 -1625
683a625M94N64j48q84j076p91j90L57J011J420J555J368Q97O16M2l39n51q29j139
$$ -1625 -1131 -567 -715 -1599 -2675 -3466 -3656 -3299 -2288 -868 687 2055 2952 3568 3610 3271 2720 1891 752
702G52p54o84r7K81R17J270N25J47q97j130j404j457n10k6n0O42P08R04J052J335
$$ 752 -2 -686 -783 -502 415 1685 2210 2357 1460 330 -1074 -2531 -3041 -3067 -3117 -2475 -1767 -863 189 1524
722A524Q43J197L72n04j643k118k398k123j143L00J681K052K804K483J564O49
$$ 1524 2367 3564 3936 3432 1789 -329 -2727 -4850 -5993 -5693 -4012 -1960 844 3327 4891 5540
738E540r4j035j076j722j185j078m40j18r1m04r52j403j651j515n24P07K050L670
$$ 5540 5446 4411 3335 1613 428 -650 -1090 -1208 -1299 -1703 -2655 -4058 -5709 -7224 -7748 -7041 -4991 -1321
756a321M852M841L835K227n90l193n347o582o129m652j590J498M050N223N529
$$ -1321 3531 8372 12207 14434 13844 10651 5304 -1278 -7407 -12059 -13649 -12151 -8101 -2878 2651
771B651L920K102o52k070k964l178j564l96R52J568J082L40j135k593l775l861
$$ 2651 6571 8673 8021 5951 2987 -191 -1755 -2151 -1199 369 1451 1791 656 -1937 -5712 -9573
787i573k502r63K327N326P438Q363P160M403o04m440q796j0338r555o606k356
$$ -9573 -12075 -13038 -10711 -5385 2053 10416 17576 21979 21375 16935 8139 -2199 -11754 -18360 -20716
802b0716J654N677P054O854N290K440K04k033k936k328j541P1J420K656K115Q54
$$ -20716 -19062 -13385 -6331 523 5813 8253 8457 6424 3488 1160 -381 -310 1110 3766 5881 6735
818F735j589l962o298o582n200k089K570O653J0377J0975R965N582J42m972r407
$$ 6735 5146 1184 -5114 -11696 -16896 -18985 -16415 -9762 615 11590 21555 27137 27279 22307 12900
833A2900j1803j1431q438m318L29M910P088Q033O717M121Q74j417k720k436r12
$$ 12900 1097 -10334 -18772 -23090 -22761 -17851 -10763 -2730 3987 8108 8982 7565 4845 2409 1497
848A497J186K740L909K852K9k641o710q820r112p379l585J160O644J0731J2945
$$ 1497 2683 5423 9332 12184 12213 9572 2862 -5958 -15070 -22449 -26034 -24874 -18230 -7499 5446
863E446J1879Q488L290l165q216j1223j1961j0044o061r11L438O098P241N695
$$ 5446 17325 25813 29103 25938 17722 6499 -5462 -15506 -21567 -22478 -19040 -12942 -5701 -6
877fL938J208p74j338j105N50K420L888M750L279P58k871p137j0128j1257j0226
$$ -6 3932 5140 4366 3028 1923 2473 4893 8781 13531 16810 17568 14697 7560 -2568 -13825 -24051
893b4051o490o76N193J0887J3769J3928J0779N775k29n779r457j0765r982o720
$$ -24051 -30541 -31217 -26024 -15137 -1368 12560 23339 29114 28885 23106 13649 2884 -7098 -13818
907a3818k687O00L722M693M443L055K75j047j841r55J443L446N455O759N523K249
$$ -13818 -16505 -15905 -12183 -7490 -3047 8 283 -764 -2605 -3560 -2117 1329 6784 13543 19066 21315
923B1315j433o549j0084j2320j1451q192l089K794Q529J2022J3423J1701P869
$$ 21315 19882 13333 3249 -9071 -20522 -28714 -31803 -29009 -20480 -8458 4965 16666 24535
936B4535K765k651o838q961q805o696l225k84K455L019K129N97j595l007k979
$$ 24535 27300 24649 17811 8850 45 -6651 -9876 -10160 -7705 -4686 -2557 -1960 -3555 -6562 -9541
951i541j303J102M291O814Q209P403N000N73m057q650j1162j1581j0129n203K02
$$ -9541 -10844 -9742 -5451 1363 9572 16975 21975 22548 18491 9841 -1321 -12902 -23031 -28234 -28032
966b8032O151R761J2232J1207Q169L439j549n390o619p015m919k247J08J833J781
$$ -28032 -21881 -12120 112 11319 19488 22927 21378 15988 9369 2354 -2565 -4812 -4704 -2871 -1090
981a090J139j101k766m139m080j984M30M152P102R077Q815O491K844k566p212
$$ -1090 49 -1052 -3818 -7957 -12037 -14021 -13591 -9439 -2337 6740 15555 22046 24890 22324 15112
996A5112j0511j1504r932o155j180L741P843R535Q955O471K672j150l719n150
$$ 15112 4601 -6903 -16835 -22990 -24170 -20429 -12586 -3051 5904 12375 15047 13897 10178 5028
1010E028m711l042p14J747K408J811K89k217m222m930n268l066L74M394P292R234
$$ 5028 317 -2725 -3439 -1692 716 2527 2816 599 -3623 -8553 -13821 -16887 -16513 -12119 -4827 4407
1026D407R184O901L119j230n965r103r739q838n519j523K406N899O949O388M179
$$ 4407 13591 20492 23611 22381 16416 7313 -2426 -11264 -16783 -18306 -15900 -10001 -3052 3336 7515
1041G515Q82j400l278l594k572l7J738L267L591K197m20k723n114n964n698l660
$$ 7515 8397 6997 3719 125 -2447 -2484 -746 2521 6112 8309 7889 5166 52 -5912 -11610 -15270
1057a5270m82L294O104Q161P895O061K715j048m837p324p661o599l801m96K527
$$ -15270 -15752 -12458 -6354 1807 9702 15763 18478 17430 12593 5269 -2392 -8991 -12792 -13288 -10761
1072a0761M413M879M002J579p39k368k932k396m85J357L577M581L766K181k78
$$ -10761 -6348 -1469 2533 4112 3373 1005 -1927 -4323 -4808 -3451 126 4707 8473 10654 10376
1087A0376l112m830n914n467l346l72K393M670O147N800L889J285j265l824n003
$$ 10376 7264 2434 -3480 -8947 -12293 -12665 -10272 -5602 545 6345 10234 11519 10254 6430 1427
1102A427n043l822j285P14K622L601L465K368L05j814k898k672j966k78J800L603
$$ 1427 -3616 -7438 -8723 -8009 -5387 -1786 1679 4047 4352 2538 -360 -3032 -4998 -5276 -3476 127
1118A27L766L594J922j33k483m038m546m138k371k03J633L340L744L393K283N33
$$ 127 3893 7487 9409 9276 6793 2755 -1791 -5929 -8300 -8503 -6870 -3530 214 3607 5890 6423
1134F423j530k533l486l035j842J73J580K857L454K770J159l87k080k662l129
$$ 6423 4893 2360 -1126 -4161 -6003 -5830 -4250 -1393 2061 4831 5990 5603 3523 861 -2268
1149b268k155o51J089K283K747K260J605j10j278k349k441k166j470K0J147K142
$$ -2268 -4423 -5074 -3985 -1702 1045 3305 4910 4800 3522 1173 -1268 -3434 -4904 -4884 -3737 -1595
1165a595K171K260R66j56j235k254k658j762j431O28K182K614L272L085J459J8
$$ -1595 576 2836 3802 3646 2411 157 -2501 -4263 -5694 -5066 -2884 -270 3002 6087 7546 7564
1181G564j522k597l074k731j579r57N92J099J605J404Q67J34k18m60p70n37K42
$$ 7564 6042 3445 371 -2360 -3939 -4896 -4304 -3205 -1600 -196 671 805 587 127 -643 -1180 -938
1198i38J029J488J854J336N37n08j446l113l127l190j719L1J681L063L934L806
$$ -938 91 1579 3433 4769 5306 4798 3352 239 -2888 -6078 -7797 -7766 -6085 -3022 912 4718
1214D718K814R50k20j682l304k927l049k110r76j98P02J119R38Q67N17K90K22
$$ 4718 7532 8482 8262 6580 3276 349 -2700 -4810 -5786 -5984 -5282 -4163 -3225 -2358 -1841 -1551 -1329
1231a329J82R84J597K341K387K087J114q19k311m343m657m846l351j210R40L200
$$ -1329 -1147 -163 1434 3775 6162 8249 9363 8544 6233 1890 -2767 -7613 -10964 -12174 -11234 -8034
1247h034M308M888M244K774J076n94k060k472k725k483j531p64N3J28L05r4m49
$$ -8034 -3726 1162 5406 8180 9256 8662 6602 4130 1405 -1078 -2609 -3373 -3320 -3192 -2887 -2981 -3430
1264c430n91n64K51J462K880L893M049L522J956n51k906n220o018o232m440k176
$$ -3430 -4021 -4585 -4334 -2872 8 3901 7950 11472 13428 12877 9971 4751 -1267 -7499 -11939 -14115
1280a4115J26K511M317M669M682L250J685M56r07j497j141j120o24k62l52o43
$$ -14115 -13989 -11478 -7161 -2492 2190 5440 7125 7581 6674 5177 4036 2916 2292 2030 1678 1035
1296A035j298k370k565k437k084l6J768L812N243N498M728K457J08k747m896n731
$$ 1035 -263 -2633 -5198 -7635 -9719 -9755 -7987 -4175 1068 6566 11294 13751 13859 11112 6216 485
1312D85n837m286k590p3J997L156L572L259K268J417M25K79j06O63J146Q65M89
$$ 485 -5352 -9638 -12228 -12301 -10304 -7148 -3576 -317 1951 3368 3793 4072 3966 4629 5775 6640 7129
1329G129l80j336k861l914m826m238k583n89K302M264N978O061M689K962K35k106
$$ 7129 6749 5413 2552 -1362 -6188 -10426 -13009 -13598 -11296 -7032 -1054 5007 9696 12658 12893 10787
1345A0787l996m500m522l248j627n1R30J588J287R37N48K92P47Q73J733J853K466
$$ 10787 6791 2291 -2231 -5479 -7106 -7157 -6227 -4639 -3352 -2415 -1867 -1575 -828 45 1778 3631 6097
1362F097K187J442k80k255l925m823n539m383k679m59K498M389N431N330M358
$$ 6097 8284 9726 9446 7191 3266 -1557 -7096 -11479 -14158 -14617 -12119 -7730 -2299 3031 7389
1377G389K592L58j479k414l131k275j985r12m51M5j75p61p68q82p25L20J570K672
$$ 7389 9981 10339 8860 6446 3315 1040 -945 -1857 -2308 -2263 -2438 -3199 -3967 -4849 -5574 -5254 -3684 -1012
1395a012L335L665K805J628l62k108l774m840m642l792k095l8K154L225M025L799
$$ -1012 2323 5988 8793 10421 10059 7951 4177 -663 -5305 -9097 -11192 -11230 -9076 -5851 -1826 1973
1411A973L102J734M47p12r82j492m66r52m47o96r83j732k026k145j975q74M38
$$ 1973 5075 6809 7256 6544 5562 4070 3604 2652 2205 1509 526 -1206 -3232 -5377 -7352 -8226 -7788
1428g788J777L088L509L945K923J719r2j581l482l191l657k678j646j06J011J847
$$ -7788 -6011 -2923 586 4531 7454 9173 9081 7500 4018 827 -2830 -5508 -7154 -7260 -6249 -4402
1444d402K529J970J815Q77N68k0j55nL45L61j27o86j346k371k525k729j716n10
$$ -4402 -1873 97 1912 2789 3357 3337 3182 3177 3522 3883 3756 3070 1724 -647 -3172 -5901 -7617 -8127
1462h127K79J751L080L247L458K389J686J11j256j836k332k416k038j284m63K55
$$ -8127 -7848 -6097 -3017 230 3688 6077 7763 7874 6618 4782 2450 34 -2004 -3288 -3751 -3496
1478c496L77P43P98O27N01M88M72O24Q09Q66O24K90m42r38j953k145k006j326
$$ -3496 -3119 -2376 -1578 -951 -450 38 510 1134 1943 2809 3433 3723 3281 2343 390 -1755 -3761 -5087
1496e087r26K77J282J993K436K266J898R61M09p39q10j431j523j268j374q07o10
$$ -5087 -6013 -5736 -4454 -2461 -25 2241 4139 5100 5509 4770 3960 2529 1006 -262 -1636 -2443 -3053
1513c053j05Q5J67N80K75K06N55O77Q40J198R70J169j99l17j067j530j757j238
$$ -3053 -3158 -3073 -2906 -2326 -2051 -1845 -1290 -613 227 1425 2395 3564 3365 3048 1981 451 -1306 -2544
1531b544o43k77M44J030J084J258J263R34O83j90j88o41j163j064j219p60j17
$$ -2544 -3187 -3464 -3020 -1990 -906 352 1615 2549 3232 3042 2854 2213 1050 -14 -1233 -1993 -2110
1548b110k3K50O23R2l4J49R6R6P79N47Q63J174P54o9j32o08j289r11j718l63n05
$$ -2110 -2133 -1883 -1260 -1168 -1202 -1053 -957 -861 -82 465 1328 2502 3256 3187 3055 2447 1158 247 -1471 -1834 -2339
1569b339K15M21P57O56J119K46K45k41n89j084o65l19l45O73O17J133P72Rl06
$$ -2339 -2124 -1703 -946 -290 829 1075 1320 1079 490 -594 -1259 -1578 -1923 -1250 -633 500 1272 1281 975
1588I75o54r28j046k75L9Q06J192J296O43L73m73q61q65j203n21j76J45M06P22
$$ 975 321 -607 -1653 -1928 -1889 -1083 109 1405 2048 2421 1948 1087 222 -981 -1502 -1678 -1533 -1127 -405
1607d05O59Q80p1l75o22j173r37n70o3P50J547J696K058J071J59q58j354j894
$$ -405 254 1134 1063 688 66 -1107 -2044 -2614 -2677 -1927 -380 1316 3374 4445 4604 3746 2392 498
1625D98j638j014j51K30R29O28O95L25m62m04n44l99j44P01P06J263R68Q05O6
$$ 498 -1140 -2154 -2305 -2075 -1146 -518 177 502 40 -364 -908 -1307 -1451 -750 -44 1219 2187 2992 3058
1644C058n01j599j845j589j905m70K09J271K095K373K234J309K48m26j486j795
$$ 3058 2557 958 -887 -2476 -4381 -4851 -4642 -3371 -1276 1097 3331 4640 4888 4462 2976 1181
1660A181j511r66m43r8N28J35n3n12q13n84m49N33R55J867K112J998J718Q54m21
$$ 1181 -330 -1296 -1739 -1837 -1309 -1174 -1227 -1739 -2552 -3136 -3585 -3052 -2097 -230 1882 3880 5598 6452 6031
1679F031j445j956k500k758j988j214j88J160J851K038J983J748Q70k30n70p91
$$ 6031 4586 2630 130 -2628 -4616 -5830 -6018 -4858 -3007 -969 1014 2762 3632 3402 2832 2041
1695B041o98p2k04N2k55p70j212j558j791r52l07P65J532K455K700K554J972J194
$$ 2041 1343 1271 1067 1119 864 94 -1118 -2676 -4467 -5419 -5726 -4961 -3429 -974 1726 4280 6252 7446
1713G446n6q04k075k651k752k433j504o58j05J198J221J332J331P80R36P27N82
$$ 7446 7390 6586 4511 1860 -892 -3325 -4829 -5487 -5592 -4394 -3173 -1841 -510 270 1206 1933 2515
1730B515P32P14K6K3p95j301k060k134j791j495o60M33R47K001K350K591J985
$$ 2515 3247 3961 3987 4010 3215 1914 -146 -2280 -4071 -5566 -6226 -5793 -4846 -2845 -495 2096 4081
1747D081J541Q63k38j091j615k240k162j993j325j140j50L33N71J162J294J540
$$ 4081 5622 6485 6247 5156 3541 1301 -861 -2854 -4179 -5319 -5469 -5136 -4565 -3403 -2109 -569
1763e69J353J810J253J305N97k03o59j079j455j934j977j721j199m71o0O39J052
$$ -569 784 2594 3847 5152 5749 5546 4887 3808 2353 419 -1558 -3279 -4478 -4949 -5009 -4370 -3318
1780c318J693K168K237J703J028J31o28j450j806k217j877j592j029l18M14O21
$$ -3318 -1625 543 2780 4483 5511 5642 5014 3564 1758 -459 -2336 -3928 -4957 -5275 -4861 -4240
1796d240J327J246J416J428J220J091N94J9j51m19n60j090j299j612j770j371
$$ -4240 -2913 -1667 -251 1177 2397 3488 4082 4101 3950 3531 2971 1881 582 -1030 -2800 -4171
1812d171j412n84L28R62K310K289K638K168J187J6q16j476j967k115j485q47j34
$$ -4171 -5583 -6167 -5839 -4877 -2567 -278 2360 4528 5715 5731 4915 3439 1472 -643 -2128 -2975 -3109
1829c109K67O34P53P22M80N88K45R9N79O15P37K04O80J82o98j756k372k359k087
$$ -3109 -2842 -2208 -1455 -733 -253 335 580 679 1258 1873 2610 2814 3494 3676 2978 1222 -1150 -3509 -5596
1848e596r80j87J344J923K965K854K042J139M2p85j814j842j700q25m47NQ36L91
$$ -5596 -6576 -6763 -5419 -3496 -531 2323 4365 5504 5546 4761 2947 1105 -595 -1420 -1867 -1862 -1026 -635
1866f35J31kl90n85m68p0N70J197J452J567J566L64n61j738k550k552k224j028
$$ -635 -504 -506 -896 -1481 -1949 -2019 -1449 -252 1200 2767 4333 4697 4136 2398 -152 -2704 -4928 -5956
1884e956J50J119K450K677K546J613N67l53j398j604j573j012l57L62K70M09L59
$$ -5956 -5806 -4687 -2237 440 2986 4599 5166 4813 3415 1811 238 -774 -1131 -769 -499 -90 269
1901B69n12q42j291j061n73K99Q72K189K353K093J258M47n97k008k256k329k076
$$ 269 -243 -1085 -2376 -3437 -4010 -3711 -2839 -650 1703 3796 5054 5501 4904 2896 640 -1689 -3765
1918c765r66N53J130K047J953J647O75k17r11j038j164r21K00M63N88P77J24m34
$$ -3765 -4731 -4178 -3048 -1001 952 2599 3274 3057 2146 1108 -56 -977 -777 -314 274 1051 1175 741
1936G41j185j246j158j130j26P93J268K021K035J799J012N5p73j615k210j749
$$ 741 -444 -1690 -2848 -3978 -4104 -3311 -2043 -22 2013 3812 4824 4879 4106 2491 281 -1468
1952a468j185l32M24J017J009J038L12j27o96q10m46l59N81O71J112Q59M43l02
$$ -1468 -2653 -2985 -2561 -1544 -535 503 815 688 -8 -818 -1264 -1623 -1042 -371 741 1600 2043 1741
1970A741k62j246j436o75p14q7Q42J261J423J345O87N41o40p36j195j352p56k32
$$ 1741 1479 233 -1203 -1878 -2592 -2679 -1837 -576 847 2192 2879 3420 2780 2044 849 -503 -1259 -1491
1988a491J76O48O67L71l3l96o27o58o48K10L91J009J147Q64L64J11m07q04j069
$$ -1491 -1315 -667 0 371 338 -58 -685 -1343 -1991 -1781 -1390 -381 766 1630 1994 2105 1698 894 -175
2007a75m39P2l64K47O35M78N60J87o52l6n72r15k05l07J17M69O03O66N10M1m39
$$ -175 -614 -542 -906 -659 -24 454 1014 1201 549 513 -59 -974 -1179 -1486 -1369 -900 -297 369 879 920 481
2028D81n88n02k91j47M59Q06M94L29K14m2o59m53n22k09K86K93M75O02Q6L07m51
$$ 481 -107 -609 -900 -1047 -588 218 712 1041 1255 1213 554 101 -421 -630 -344 -51 424 1026 1112 1419 968
2049I68o32o50n44p57l78K7L47P86P12N22L85J09j97p3k06Ol5K89L24K22j20m99
$$ 968 336 -314 -858 -1615 -1993 -1966 -1619 -833 -121 401 786 895 698 625 419 425 390 679 1003 1225 1105 606
2071F06p52o75p03n02J2M50P51R93N67Q95Q0k83n05n39q75n64m23K5r6J63O51
$$ 606 -146 -821 -1524 -2026 -2014 -1564 -813 180 747 1642 1722 1439 934 395 -480 -1044 -1467 -1442 -1538 -1375 -724
2092g24K43R7N00J51j06M99L23M30L09K83N3o52n63r73j213r19o83l09L49M79
$$ -724 -481 -384 116 267 161 660 983 1413 1722 2005 2058 1406 843 -130 -1343 -2262 -2945 -3254 -2905 -2426
2112b426J044J627O43O22K14m5K26m49m90l33l75n15m83m80p6j82l13K96O39N53
$$ -2426 -1382 245 888 1510 1724 1679 1905 1456 966 633 258 -257 -740 -1220 -1296 -1478 -1791 -1495 -856 -303
2132c03Q29O69R08L14J67j61p48o47j123j316o85o61m02N48M87M38O21P51Q67
$$ -303 526 1195 2103 2417 2584 2423 1675 1028 -95 -1411 -2096 -2757 -3159 -2611 -2124 -1686 -1065 -314 553
2151E53Q70N72O57L13K04l39m91j192j285j308q10o54m58J89O80J084R66J221
$$ 553 1423 1995 2652 2965 3169 2830 2339 1147 -138 -1446 -2256 -2910 -3368 -3179 -2499 -1415 -449 772
2169G72O98N36K00k6l18l86n51n31m77o42p09n64m73n40J80O21P47J444J509J520
$$ 772 1470 2006 2206 2180 1862 1476 925 394 -83 -725 -1434 -1998 -2471 -3011 -2831 -2210 -1463 -19 1490 3010
2189C010J024K97p9r75j198j887j634j369o66o2L45Q52O68Q21O43N53K55K05K23
$$ 3010 4034 4331 4252 3277 2079 192 -1442 -2811 -3477 -3539 -3194 -2342 -1674 -853 -210 343 598 803 1026
2208A026O52N28M75K84j67o28j452j518j464j285o61J9J000J764K001J862J228
$$ 1026 1678 2206 2681 2965 2798 2170 718 -800 -2264 -3549 -4210 -4191 -3191 -1427 574 2436 3664
2225C664M37j87j089j409j616j063j005J1K56J80O32L92O5m05j63j10K73Q16J289
$$ 3664 4101 3914 2825 1416 -200 -1263 -2268 -2257 -2001 -1821 -1189 -797 -732 -1137 -1300 -1410 -1137 -321 968
2244I68J244J413Q04J83j186j532k220k286j419q97R4J364J602K195J329J015
$$ 968 2212 3625 4429 4612 3426 1894 -326 -2612 -4031 -4928 -4834 -3470 -1868 327 1656 2671
2260B671L11l46r46j329q33m59J6M89P55K8Q3j90n26j437q06j29N42Q22J874J761
$$ 2671 2982 2636 1690 361 -472 -931 -915 -426 329 357 440 250 -276 -1713 -2519 -2648 -2106 -1284 590 2351
2280B351J519Q60j87j135j886k231k295j155m22M21J196J817J425J226M76m1p66
$$ 2351 3870 4730 4543 3408 1522 -709 -3004 -4159 -4581 -4160 -2964 -1147 278 1504 1980 1939 1173
2297A173o85n52l61K02O70P57O50k89k28r98j381j052j229k8N78J231K039J399
$$ 1173 488 -64 -425 -223 447 1204 1854 1565 1337 339 -1042 -2094 -3323 -3351 -2773 -1542 497 1896
2315A896J442N46m35q75j885j912j212r91j37O87J194J172R76P13k59j65l60j82
$$ 1896 3338 3884 3449 2574 689 -1223 -2435 -3426 -3563 -2876 -1682 -510 466 1179 920 755 395 213
2333B13j68Q4R48N67M62K65l54q89j150j418j209p41O7N69J431J375J375J219
$$ 213 45 129 1077 1644 2106 2371 2017 1128 -22 -1440 -2649 -3390 -3323 -2754 -1323 52 1427 2646
2351B646L43o39o60j061j276o56j6k4Q51J70O98J30k71k3l33k95J18M58J23N23
$$ 2646 2989 2350 1690 629 -647 -1303 -1319 -1343 -492 -322 376 506 235 212 -121 -416 -298 160 283 806
2371H06P32L01L0p86n74r24j051q01o58K25M61R38J186Q87M96K64j61l47m71l74
$$ 806 1538 1839 1869 1083 509 -415 -1466 -2267 -2925 -2700 -2239 -1301 -115 772 1268 1532 1371 1024 553 179
2391A79k82J58N5K37r8k56K36k58m60J97l09J33n0N18K52K42K11J20j15k46l50
$$ 179 -103 55 110 347 249 -7 229 -29 -489 -292 -601 -468 -518 0 252 494 705 825 710 464 114
2412A14m13o15l03P2J6O33M04M13M54J29j53m6k07M5l12J12j31l52Q7j88J13k75
$$ 114 -299 -914 -1217 -1145 -1129 -496 -92 321 775 904 751 705 498 543 231 343 212 -140 -53 -241 -128 -403
2434d03K32M6k80M3k20j84j74O6L03N66J31M06M0J87l46j46m24N9j40M64P7K57
$$ -403 -171 -125 -405 -362 -582 -766 -940 -874 -571 -5 126 532 572 759 413 267 -157 -98 -238 226 303 560
2456E60L36m9K13m93n00m91m58j47m4J50N43P21R6O39j86j88n32o40m97l72K0
$$ 560 896 847 1060 567 67 -424 -882 -1029 -1073 -923 -380 341 437 1076 890 702 170 -470 -967 -1339 -1319
2477a319O72P48N49N37o2k4o01n62m30j09M7L75N61N79J29J65m42o52q20o68o43
$$ -1319 -647 101 650 1187 1125 1101 500 -62 -492 -601 -554 -179 382 961 1090 1255 813 161 -659 -1327 -1970
2498a970j54N6O92J073J060R15M19l05l27j041p87n94m51N25O68N81P84M25k46
$$ -1970 -2124 -2068 -1376 -303 757 1672 2091 1786 1459 418 -369 -963 -1414 -889 -221 360 1144 1569 1323
2517A323o00q31n79o76M7O17N52Q27Q07j5J16n95j083j029q67q55J6N72R20J541
$$ 1323 723 -108 -687 -1363 -1316 -699 -147 680 1487 1472 1588 993 -90 -1119 -1986 -2841 -2825 -2253 -1333 208
2537B08J244Q51M93m99p03j117j038o38q0M56N63O66Q25k63m03j011q09r20q0
$$ 208 1452 2303 2796 2297 1594 477 -561 -1199 -1279 -823 -260 406 1231 968 565 -446 -1255 -2175 -2255
2556b255M53Q67J370J087J102K37k67r08j175j541j195n65K6O87J137J523J274
$$ -2255 -1802 -935 435 1522 2624 2861 2594 1686 511 -1030 -2225 -2790 -2764 -2077 -940 583 1857
2573A857O55J96m70r32r46p93m91o5N09P14M12K50m58p80j020j055o05J63O60
$$ 1857 2512 2708 2238 1306 360 -433 -924 -989 -480 234 646 896 438 -342 -1362 -2417 -3022 -2859 -2199
2592b199J339J420J395J006M63k82j081j147j461j088q20Q3L48Q29J280P18N63
$$ -2199 -860 560 1955 2961 3424 3142 2061 914 -547 -1635 -2455 -2372 -2024 -1195 85 803 1366
2609A366J93m60o35n44n50j2L23P27L28N36J74q85p60r69r69o04L59M92J159J409
$$ 1366 1559 1099 464 -80 -630 -642 -319 408 736 1272 1446 561 -199 -1168 -2137 -2741 -2382 -1890 -731 678
2629F78J205J087M10k45n79j061j475j152p75m6l3L46P22O58L26J28k68M3l17
$$ 678 1883 2970 3380 3135 2556 1495 20 -1132 -1907 -1953 -1986 -1640 -918 -260 66 194 -74 -31 -348
2648c48m10M26K82N38R40L05j87l13q20q65q35p25k54L23Q44R60J124R64O50n
$$ -348 -758 -332 -50 488 1428 1733 1546 1233 413 -452 -1287 -2012 -2266 -1943 -1099 -139 985 1949 2599 2594
2668B594j02p72j140q45r72o99j35K53O13M02L66M09J41k17l63J15K53M51M96
$$ 2594 2492 1720 580 -265 -1237 -1936 -2071 -1818 -1205 -803 -437 -28 113 -104 -467 -352 -99 352 848
2687H48O75K36L83m85l83j097j002o85p22o9K49O28R03J155J148L41j68k94n21
$$ 848 1523 1759 2142 1657 1274 177 -825 -1510 -2232 -2301 -2052 -1424 -521 634 1782 2123 1955 1661 1140
2706A140q80j149k09m45J25N26O37L33M30O9k16n04J50k56K9O61M82Q51M22m7
$$ 1140 260 -889 -1098 -1543 -1418 -892 -255 78 508 577 361 -143 7 -249 -220 441 923 1774 2196 2149
2726B149n36o74j033j420q28m55l8M15J355J184P85R70L29l84q35p41p76n38j36
$$ 2149 1613 939 -94 -1514 -2342 -2797 -2835 -2420 -1065 119 904 1874 2203 1819 984 243 -533 -1071 -1207
2745a207j22P34P49N74L51k06m85p35o67m05M18L44Q38R15Q84J28j46r15j107
$$ -1207 -1329 -595 154 728 1079 873 388 -347 -1014 -1419 -1001 -657 181 1096 1980 2108 1962 1047 -60
2764f0j271r13n14R7N73R69J097J352Q88J28k83p21j086p14l81j38N86O08O67
$$ -60 -1331 -2244 -2758 -2661 -2088 -1119 -22 1330 2218 2346 2063 1342 256 -458 -839 -977 -391 217 884
2783H84L69q0m17p56j002o58l63J84N24J066J129Q95K04k33n20r47j260q92m77
$$ 884 1253 1173 756 0 -1002 -1660 -2023 -1839 -1315 -249 880 1775 1979 1746 1226 279 -981 -1873 -2350
2802b350J25M08J309Q31J163M37j0n26q51q95n11k13K91N13P09M93K94k22p02
$$ -2350 -2225 -1817 -508 323 1486 1923 1913 1387 536 -359 -870 -1083 -792 -279 430 923 1217 995 293
2821B93r05o42q93J21M6N72J389J139O56L18l62l33j148q91m86j92M34L64O53
$$ 293 -612 -1254 -2147 -2026 -1980 -1408 -19 1120 1776 2094 1732 1399 251 -640 -1126 -1318 -884 -520 133
2840A33Q60J54K16k83m59o22p12m09j2K12P13O57N00K54k44o03q69r52J11k43
$$ 133 993 1147 1363 1080 621 -1 -713 -1122 -1134 -922 -209 448 948 1202 958 355 -514 -1466 -1355 -1598
2860a598J75Q54O04Q90K49L75n08m06o71l61n3l28M14L20L21L83K34n6n02n70
$$ -1598 -1423 -569 35 925 1174 1549 1041 635 -36 -397 -450 -778 -364 -44 277 660 894 838 336 -234
2880b34n15k26J2R3P4N78N68O0L88P3n25k51n91J37l69L55M87L25l3K80k02j76
$$ -234 -749 -975 -963 -870 -796 -218 350 410 798 871 346 95 -496 -359 -728 -373 114 439 406 686 484 308
2902C08k97k15j10j05m3L73q6K97q8P2M6k15k0k77j50J09j48J53L46Q2K33k31
$$ 308 11 -204 -314 -419 -462 -89 -175 122 34 106 152 -63 -83 -360 -510 -401 -549 -396 -50 32 265 34
2924C4M70j27j5K50j84PJ82l66j57j2p1k66L1j53R6r5J96j55m0K64k59L92J26
$$ 34 504 377 362 612 428 435 617 251 94 82 11 -255 -224 -377 -281 -376 -180 -335 -375 -111 -370 22 148
2947A48J9L11j20J41k54j95K0n70m1L3j52J92M66L79J82K2M63m20k62j64l35j44
$$ 148 167 478 358 499 245 50 70 -500 -541 -508 -660 -468 -2 377 559 581 1044 624 362 198 -137 -281
2969b81p4j20m3J16j22l1J86k38K24K2p4L97L06M52M04l2K05l85n01j51n16k42
$$ -281 -355 -475 -518 -402 -524 -555 -369 -607 -383 -361 -435 -38 268 720 1124 1092 1297 912 411 260 -256 -498
2991d98p1k00J29L11K61K57J18P9k1q9m4k01N8j3N2k06J04N5k61l22j71l3K11
$$ -498 -569 -769 -640 -329 -68 189 307 386 365 276 232 31 89 76 128 -78 26 81 -180 -502 -673 -706 -495
3014d95j4M75L58M02L94R0j19l09m47k53m00m20pj82o0J18L37J83P6J67nM6L02
$$ -495 -509 -34 324 726 1120 1210 1091 782 335 82 -318 -738 -745 -927 -987 -869 -532 -349 -273 -106 -111 -65 237
3037B37L32J05K13k48k5l66m28K4o45O8O5J14L70J85K25N60LJ28l88k62j70j21
$$ 237 569 674 887 639 614 248 -180 -156 -801 -733 -668 -554 -184 1 226 786 789 917 529 267 97 -24
3059b4k57J04j43L1l41j30r9M3K97J52L03M14M98L70J69J77k79m08p32l60k95
$$ -24 -281 -177 -320 -289 -630 -760 -859 -816 -519 -367 -64 350 848 1218 1387 1564 1285 877 145 -215 -510
3080e10j89l7N6J90K49L69lJ11k27J07r6j42P4J62M57k18J83j26n64l79l76k56
$$ -510 -699 -736 -680 -490 -241 128 125 236 9 116 20 -122 -48 114 571 353 536 410 -154 -533 -909 -1165
3102a165L42J96K66Q58M80K88M92k32n01n46n26m59n22k1mL17M25J51JK58k02
$$ -1165 -823 -627 -361 497 977 1265 1757 1525 1024 478 -48 -507 -1029 -1050 -1054 -737 -312 -161 -160 98 -104
3123a04n00N9PM34M46M40O04n5r1n02m11p96l54m14l1M49L50Q46O27P4j4J44o16
$$ -104 -604 -545 -538 -104 342 782 1386 1331 1240 738 327 -469 -823 -1237 -1268 -819 -469 377 1004 1078 1064 1208 592
3146E92m34m66k31j94Q0J72K35M77j74r2j05k13j88l83N68K71M63L57Q41J27m08
$$ 592 158 -308 -539 -733 -653 -481 -246 231 57 -35 -140 -353 -541 -924 -356 -85 378 735 1576 1703 1295
3167A295l50p07n70p02l13lK59L47O66N54M3J09o3m15l91o1q9P4k3M29L20J11
$$ 1295 945 238 -332 -1034 -1347 -1350 -1091 -744 -78 476 519 628 565 150 -241 -302 -391 -317 -340 89 409 520
3189E20j44k11j92j19o71J5L77J42N74P43K41%k73l06p81l91n43K8o2K31M55L24
$$ 520 376 165 -27 -146 -817 -802 -425 -283 291 1034 1275 1275 1002 696 -85 -476 -1019 -991 -1053 -822 -367 -43
3211d3L36j43L3J20j75j38j83K93J13r7L32K04P2l50l55p8n37Nr5J36L48M84P
$$ -43 293 150 183 303 128 -10 -193 100 213 116 448 652 724 374 19 -59 -596 -591 -686 -550 -202 282 289
3234B89L00P8K1o74L1m30k39n8L5K42m9L61J93J00j3o0o9J23J68p0J40J64m24
$$ 289 589 667 688 14 45 -385 -624 -682 -647 -405 -454 -93 100 200 187 127 58 181 349 279 419 583 159
3257A59J81j27J01k07l52l88N0p5J81K98J40L36j71k7J37N1l45j4p3j95R2K11
$$ 159 340 213 314 107 -245 -633 -583 -658 -477 -179 -39 297 126 99 236 287 -58 -72 -145 -340 -248 -37
3279c7JP1o0K69k2n6Q9j37K11k92mJ87J51j07j78Ol8o7M2n20q9K3J49J25L37J76
$$ -37 -36 35 -25 244 222 166 255 118 329 37 33 220 371 264 86 92 54 -13 29 -491 -580 -557 -408 -283 54 230
3305B30R4k8Ko8oJ8k34R2n4q1M10k74O8J03k42l4k34r2j56J26N7L15o2J65m2J24
$$ 230 324 296 298 230 224 242 8 100 46 -35 375 101 169 272 30 -4 -238 -330 -486 -360 -303 12 -50 115 73 197
3331A97j11k76j89j89Q8M21N5L65k7Q5N3j96l05k66J05J62j2j63M44J02J02r9
$$ 197 86 -190 -379 -568 -480 -59 -4 361 334 419 472 276 -29 -295 -190 -28 -40 -203 241 343 445 346
3353C46R2k53l42k85j55r3O6K96L19O3K15K69j71k67j76j19%J09K13K71O1K15
$$ 346 438 185 -157 -442 -597 -690 -624 -328 -9 54 269 538 367 100 -76 -195 -195 -86 127 398 459 674
3375F74J0m24k48k36m87k76p9M70K23M83L20J52J24l10k77k96l60l45K34j26M82
$$ 674 684 260 12 -224 -711 -987 -1066 -596 -373 110 430 582 706 396 119 -177 -537 -882 -648 -774 -292
3396b92M29L29o0J99k39m41k75om0M48L32J71M21J70k50n98m45n81m83k5R8J60
$$ -292 137 466 406 605 366 -75 -350 -356 -396 52 384 555 976 1146 896 298 -147 -728 -1211 -1236 -1138 -978
3418i78P15M44M98j51j2j1k77k05k05j2p5J92K46K67L19k26l51j54n52m36K24
$$ -978 -263 181 679 528 516 505 228 23 -182 -194 -269 -77 169 436 755 529 178 24 -528 -964 -740
3439g40J74N41K74J83M52N4m61K4q69m53k73j18M20K44L56J88M16K71k46o8p9
$$ -740 -566 -25 249 432 884 938 477 501 -368 -821 -1094 -1212 -792 -548 -192 -4 412 683 437 369 290
3460B90j79r8m9n9L27J94J42j57L3n10n67q2j68J33L7L12M90M30J41l0M1n74j43
$$ 290 111 13 -36 -95 232 426 568 411 444 -66 -633 -715 -883 -750 -713 -401 89 519 660 630 671 97 -46
3483d6l52j91J42J53L4J07M02J30N2j4k31j21n9J73J04k3K29j97k7l01q1l59j2
$$ -46 -398 -589 -447 -294 -260 -153 249 379 431 417 186 65 6 179 283 260 489 292 265 -36 -117 -476 -488
3506d88j21n7J04K70M42J81J4J76MR6l03J8o7l41Q8j18J42j86j81J75Q4o7j17
$$ -488 -609 -666 -562 -292 150 331 345 521 525 621 318 336 269 -72 16 -102 40 -146 -327 -152 -68 -135 -252
3529b52M81m0R9P5j65R9m01K71k49j68j71Lj30k3J85M91Jj92K24R9J90j11L98
$$ -252 229 189 288 363 198 297 -104 167 -82 -250 -421 -418 -548 -571 -386 105 106 -86 138 237 427 316 714
3552G14l19Nr2R7l35l68j4l12j24J18K20K18J5M79M3k7Q7l11ql77K41K57Mm4q4
$$ 714 395 400 308 405 70 -298 -312 -624 -748 -630 -410 -192 -177 302 345 318 405 94 86 -291 -50 207 211 167 83
3577H3j9j16kk14%J92k35L23K78K38K58j62K5n64j72l23n40R1J33K31K4K78N10
$$ 83 64 -52 -54 -268 -268 -76 -311 12 290 528 786 624 649 85 -87 -410 -950 -859 -726 -495 -471 -193 317
3600C17q1J13k21k93J81n2K54k9L07l1R8j97k36l0m22r2k04K54J2r7N55N32M5
$$ 317 236 349 128 -165 16 -36 218 189 496 465 563 366 130 100 -322 -414 -618 -364 -352 -449 106 638 683
3623F83q3k16k89m08k89m2J01K88K15K37N1K4q4K47k81l37K13j43K90J86L36j60
$$ 683 600 384 95 -313 -602 -644 -543 -255 -40 197 248 272 188 435 154 -183 30 -113 177 363 699 539
3645E39M6k01l93k14l09k21j38L66L21L9L68M2J72p7j40j82j97m45K47L01K47
$$ 539 585 384 -9 -223 -532 -753 -891 -525 -204 -165 203 245 417 340 200 18 -179 -624 -377 -76 171
3666A71J54J14L9j95j56k14j23qo3J49L86J77K40l28j17k47j98k11k08J02K0L29
$$ 171 325 439 478 283 127 -87 -210 -218 -281 -132 254 431 671 343 226 -21 -219 -430 -638 -536 -516 -187
3688a87K65J91l7j09J02K4m75PL01k13K83J2K80J20r0k05l17k25p9k20J49J09
$$ -187 78 269 232 123 225 249 -226 -219 82 -131 152 164 444 564 474 269 -48 -273 -352 -572 -423 -314
3710c14M49j07K54m0j2m58k48J21k0J33J19J59J73j4K32j92j95N8l6j18K0K65
$$ -314 135 28 282 242 230 -228 -476 -355 -375 -242 -123 36 209 195 427 235 40 98 62 -56 -36 229
3732B29o0j1J37j4p1j01k29j91k53R6m8K39K95K11j56J4j22j95N2j45P2M95o4
$$ 229 169 158 295 281 210 109 -120 -311 -564 -468 -516 -277 18 229 73 87 -35 -230 -178 -323 -251 244 180
3755A80K12K65l24J6k19k78n2l0l1J5L07k3J38J37k70l27K88l40j06K1R3K49K49
$$ 180 392 657 333 349 130 -148 -200 -230 -261 -246 61 38 176 313 43 -284 4 -336 -442 -421 -328 -79 170
3778A70K33j57J67k98J8k14m0j43J82K50Q5J66R7j85j40j22j03r1j00q0K52n7
$$ 170 403 246 413 115 133 -81 -121 -264 -82 168 253 419 516 331 191 69 -34 -125 -225 -305 -53 -110
3800a10j39J80R0J37l15j38kj09j78N29J12L60J86P5k99j73j77k96k26J27R5J06
$$ -110 -249 -69 21 158 -157 -295 -297 -406 -584 -55 57 417 603 678 379 206 29 -267 -493 -366 -271 -165
3822a65L66K6J29j67j1k43k15j29J45n5L05Q7K37J44j70m6p0o21k8K87j40M6O62
$$ -165 201 227 356 189 178 -65 -280 -409 -264 -319 -14 73 310 454 284 238 168 -453 -481 -194 -334 -288 374
3845C74K70J42rL5m32l28o5l63J10o5J05M27m4K46j98k01k49j24j92J39R3K95
$$ 374 644 786 777 812 380 52 -13 -376 -266 -331 -226 201 157 403 205 4 -245 -369 -561 -422 -329 -34
3867c4M60j86K88j19j47k43k43k42P1M3P1L09J82L06j39K25j33m29m45L49l63
$$ -34 426 240 528 409 262 19 -224 -466 -395 -352 -281 28 210 516 377 602 469 40 -405 -56 -419
3888d19P5L16j2J83j9j35j02o9k80m5k9Q7M26K03L44J51j48p0j52m06j29l14J40
$$ -419 -344 -28 -40 143 124 -11 -113 -182 -462 -507 -536 -449 -23 180 524 675 527 457 305 -101 -230 -544 -404
3911d04n6L87J47m3J68J26Q5l31l13j05M5k9K48K10J79q3j08m86K91j50j53K11
$$ -404 -460 -73 74 31 199 325 410 79 -234 -339 -294 -323 -75 135 314 231 123 -363 -72 -222 -375 -164
3933a64j77K90K21J65K99j05j77K5k93j58j14n0j35o8N8J04LM76j34p3J3J22k41
$$ -164 -341 -51 170 335 634 529 352 377 84 -74 -188 -238 -373 -441 -383 -279 -276 200 66 -7 6 128 -113
3956a13l8K66QQk4L7L0P5j08l69m3J19J23P4p1J64K34oj99pj01l8j54m0r1k34
$$ -113 -151 115 123 131 107 144 174 249 141 -228 -271 -152 -29 45 -26 138 372 366 167 160 59 21 -133 -173 -264 -498
3982d98K07NL5PJ50J38J45J60j92J44J3q9j28j01K4J51J10k29k69R9P3l4k06J8
$$ -498 -291 -286 -251 -244 -94 44 189 349 157 301 314 225 97 -4 20 171 281 52 -217 -118 -45 -79 -285 -267
4006b67J44j25K04N8j31M86k93J1J43n02j2o4L8Q5K54m7Q2O1M18k36m7k01J63
$$ -267 -123 -248 -44 14 -117 369 76 87 230 -272 -284 -348 -310 -225 29 -18 64 125 543 307 260 59 222
4029B22m00Pr0L27K54P1k08j23j74k28l74K5M63j26K09L66J77r3J19j00Nj53m44
$$ 222 -178 -171 -261 66 320 391 183 60 -114 -342 -716 -691 -228 -354 -145 221 398 305 424 324 329 176 -268
4052b68K9j0m9K15J44J99K33j56mm26j87m9k39J82L91J19Q2J69k21j01k57l31
$$ -268 -239 -249 -298 -83 61 260 493 337 333 -93 -280 -329 -568 -386 5 124 206 375 154 53 -204 -535
4074e35J18l9J27M25r2L53Q5Q1o0r0k65q2j72j4j31o3L46J05J12pj02l5m05P6
$$ -535 -417 -456 -329 96 4 357 442 523 463 373 108 26 -146 -160 -291 -354 -8 97 209 202 100 65 -340 -264
4098b64m47J17N57r0M23K59n8k26k63k49Q5k21l4L43J57J71K85j21j47Q4j92l11
$$ -264 -711 -594 -37 -127 296 555 497 271 8 -241 -156 -377 -411 -68 89 260 545 424 277 361 169 -142
4120a42k55j5J37j46M93j14R1J07q0l92O3p7Lj93R2M61J29K21O5M0j97k57j64
$$ -142 -397 -412 -275 -421 72 -42 49 156 76 -316 -253 -330 -327 -520 -428 33 162 383 448 488 291 34 -130
4143a30J08k61j01K90L61L1Q0L1l19k05Q3k95k19M01p3J29j18L56l6O3k42k5Q4
$$ -130 -22 -283 -384 -94 267 298 378 409 90 -115 -32 -327 -546 -145 -218 -89 -207 149 113 176 -66 -91 -7
4166gj76j37J10P0L19Q0K17q0k41k56n5Q6j56p7J57K47L0l1l08J09P2q4l25K05
$$ -7 -183 -320 -210 -140 179 259 476 396 155 -101 -156 -70 -226 -303 -146 101 131 100 -208 -99 -27 -111 -436 -231
4190b31J49MP0J23J0P9r9Q2j17r8R0n7Q5J04o6j82L03J1k23j05j18j0p0L09K4
$$ -231 -82 -78 -8 115 125 204 105 187 70 -28 62 5 90 194 128 -54 249 260 37 -68 -186 -196 -266 43 67
4215F7rk86J07K22m09J62R7j56o9J93J34J41q1O1j13JO4l22K77o5J24J83k70Q7
$$ 67 58 -228 -121 101 -308 -146 -49 -205 -274 -81 53 194 113 174 61 62 126 -196 81 16 140 323 53 140
4239A40M2k00L6k40p1J11J56k61J27L55k45M7l6L6l12M9J72K36r9J18lJ8j84K
$$ 140 182 -18 18 -222 -293 -182 -26 -287 -160 195 -50 -3 -39 -3 -315 -266 -94 142 43 161 158 176 -8 -6
4263fn5j94K04lJ22P6j11J37p0k22J12J8j44j01j29Q0L8K0J14J80l6K35k20q5
$$ -6 -61 -255 -51 -54 68 144 33 170 100 -122 -10 8 -136 -237 -366 -286 -248 -228 -114 66 30 265 45 -40
4287d0jO1j22K71J03N1n4K52l50p0j55l95J22K52j7M5O9K34O5k76Q1k98jJ95j82
$$ -40 -41 20 -102 169 272 323 269 521 171 101 -54 -449 -327 -75 -92 -47 22 256 321 45 126 -172 -173 22 -160
4312a60R7n0J89j21J48j33l5R8jo4L2kj34k7L96m2J98m41J36p4n10N8J50J8J45
$$ -160 -63 -113 76 -45 103 -30 -65 33 32 -32 0 -2 -136 -163 233 191 389 -52 84 10 -500 -442 -292 -274 -129
4337a29K20j49J37J3l47L90Qk07Q7J00j82P6J46j82P1m5r7K34j11Pl07J53J80
$$ -129 91 -58 79 92 -255 135 143 -64 23 123 -59 17 163 -19 52 7 -90 144 33 40 -267 -114 66
4360F6K13l30J57L0k59J26J8k36q2J3J53M47l88J30Q3j78j03K45k2O5j38J55j44
$$ 66 279 -51 106 136 -123 3 21 -215 -297 -284 -131 316 -72 58 141 -37 -140 105 83 148 10 165 21
4383B1R5J3L4k94k25J93m5Q8M0k06Q9R2j58O3N8K39j18M3J61k88J60j06J18j13
$$ 21 116 129 163 -131 -356 -163 -208 -120 -80 -286 -197 -105 -263 -200 -142 97 -21 22 183 -105 55 -51 67 -46
4407d6J17j02k4o9K19M1j12K32J50l22m8j29O1j78J61P4j99K36k30OP8j56K21
$$ -46 71 -31 -55 -124 95 136 24 256 406 84 36 -93 -32 -210 -49 25 -174 62 -168 -162 -84 -240 -19
4430a9J46j22J27k11Q9J4L06o0q1p7k71K35j00J8j64L11j84K20j5r6J79m37ro7
$$ -19 127 5 132 -79 10 24 330 270 189 112 -159 76 -24 -6 -170 141 -43 177 162 66 245 -192 -201 -268
4454b68J58L6k32K12K13Q0P8l34%J09l34J31R5ML25n7J16K7k59J72l19l5j89n6
$$ -268 -110 -74 -306 -94 119 199 277 -57 -57 52 -282 -151 -56 -52 273 216 332 359 100 272 -47 -82 -271 -327
4478c27r2J73J74Q7J10R8j27k09K5k73J69k02L92L9J19K4K16pj77j27l48m2R4
$$ -327 -419 -246 -72 15 125 223 96 -113 -88 -361 -192 -394 -2 37 156 180 396 389 212 85 -263 -305 -211
4501b11P3J07K38LO9O0j14n7k44m15J31P5o2M23L3P6J09k43%l17k4N5k5J56L4
$$ -211 -138 -31 207 210 279 339 225 168 -76 -491 -360 -285 -347 76 109 185 294 51 51 -266 -290 -235 -260 -104 -70
4526g0L01K41n6L2k71j13j64q7Pq0J24J03J90P0Jn0j89K3m88j11L82j18K65J54
$$ -70 231 472 416 448 177 64 -100 -187 -180 -260 -136 -33 157 227 228 178 -11 12 -476 -587 -205 -323 -58 96
4550I6K57m3j73j0k31j47j9J24m9K20Q4R5M52l44j48j91l8l59r7L91m7K60n6K05
$$ 96 353 310 137 127 -104 -251 -270 -146 -195 25 109 204 656 312 164 -27 -65 -424 -521 -130 -177 83 27 232
4574B32p5O2J3j86k89j83K98J45P3J32O0j7J56j33k82l3j09k7L8K3N1L09k9N5
$$ 232 157 219 232 46 -243 -426 -128 17 90 222 282 265 421 288 6 -27 -136 -163 -125 -102 -51 258 229 284
4598B84j96j30j86l3k7n0K82k30L18j5P8J78k99k90J99O5J25j55L11k13J52J32
$$ 284 88 -42 -228 -261 -288 -338 -56 -286 32 17 95 273 -26 -316 -117 -52 73 -82 229 16 168 300
4620C00m3q2j07l6j97J58N7m9q1J49r4K8k0L8r9K9k10M8k5K90J82j09m0p7j08
$$ 300 257 175 68 32 -165 -7 50 1 -80 69 -25 3 -17 21 -78 -49 -259 -211 -236 54 236 127 87 10 -98
4645i8N1K69m3j56j22K31j04J24o8m7j64J07j60j5p1L64n1p8J84j24j53P6l7P9
$$ -98 -47 222 179 23 -99 132 28 152 84 37 -127 -20 -180 -195 -266 98 47 -31 153 29 -124 -48 -85 -6
4669fJ02k1J88j17J47j79J79j69j52MR2n1j00j42K74R8j11J11l02J32j35j92J17
$$ -6 96 75 263 146 293 114 293 124 -28 -24 68 17 -83 -225 49 147 36 147 -155 -23 -158 -350 -233
4692b33K09J04J14j70J75j4k56P5k00Q2j14Q3K83m1J84q1J83k07j83j02lj8J61
$$ -233 -24 80 194 24 199 185 -71 4 -196 -114 -228 -145 138 97 281 200 383 176 -7 -109 -112 -130 31
4715C1J25K5N1k56j2j65K7j92k02K77m7J5K06N43j20M3j53j32l4k20m1J25l5J01
$$ 31 156 181 232 -24 -36 -201 -174 -366 -568 -291 -338 -323 -117 426 306 349 196 64 30 -190 -231 -106 -141 -40
4739d0K64j22N6K19m68J70n40P2K44N6LK0J60q2N7n0O1l31J3k70J08K26J63K72
$$ -40 224 102 158 377 -91 79 -461 -389 -145 -89 -86 -66 94 12 69 19 80 -251 -238 -508 -400 -174 -11 261
4763B61K18k88j23K85m91j50j38L82n8K5N4K37k29K50k83J68k79l61P2J8N42j06
$$ 261 479 191 68 353 -138 -288 -426 -44 -102 -77 -23 214 -15 235 -48 120 -159 -520 -448 -430 112 6
4785FJ83J84j4k23j84k6m9R7j03j43K19K47P0J30n3l5l70K2m23L99oJ76P4m0q7
$$ 6 189 373 359 136 -48 -74 -123 -26 -129 -272 -53 194 264 394 341 306 -64 -42 -465 -66 -72 104 178 138 51
4810E1j6M1k64j61J85k41J07K90J38L9J59k4O5l68m5rj98L4J98kJ25J50k95K11
$$ 51 35 76 -188 -349 -164 -405 -298 -8 130 169 328 304 369 1 -44 -53 -251 -217 -19 -21 104 254 -41 170
4834A70l38nj40k5K15k68K88L6J23O3J35m13K57m0j71K97l94J42J3K59k4L7K9
$$ 170 -168 -173 -313 -338 -123 -391 -103 -67 56 119 254 -159 98 58 -113 184 -210 -68 -55 204 180 217 246
4857B46k67K60j43k57J76K2j03OpJ68r7k5q8j49m9K46K0r1J45K32k6L3k53k75
$$ 246 -21 239 96 -161 15 37 -66 -60 -67 101 4 -21 -109 -258 -307 -61 -41 -132 13 245 219 252 -1 -276
4881b76L69n4r3J05k8M3k9J10K0N7k50k3p5l3L0nk49L55q8L40j23j94O7o8N7j2
$$ -276 93 39 -54 51 23 66 37 147 167 224 -26 -49 -124 -157 -127 -132 -381 -26 -114 226 103 -91 -24 -92 -35 -47
4907d7k21L91j8O2R7m7Q6p6l5p4r4R6k65n8o1j16L63M0j10M6O0M4k0nR1k47K71
$$ -47 -268 123 105 167 264 217 303 227 192 118 24 120 -145 -203 -264 -380 -17 23 -87 -41 19 63 43 38 129 -118 153
4934A53l58J20J1J3K7J23j2J03k30N1j7R1l2M5J24r5qk1l9j30R9k33m2J45p0k17
$$ 153 -205 -85 -74 -61 -34 89 77 180 -50 1 -16 75 43 88 212 117 109 88 49 -81 18 -215 -257 -112 -182 -399
4960c99L86M8mL2o8J1J25k43K64n25N04L0J0J15k76J36j08K7j54l0n9J23R3m6
$$ -399 -13 35 31 63 -5 6 131 -112 152 -373 131 161 171 286 10 146 38 65 -89 -119 -178 -55 38 -8
4984hK0J91j7J3j97k45P7q2k2l8K79O2J30j71K80k40K73k45k36K24k25J64K74
$$ -8 12 203 186 199 2 -243 -166 -248 -270 -308 -29 33 163 -8 272 32 305 60 -176 48 -177 -13 261
5007B61l8l0r9j40J83k45j23Q9j30L8Q7K73j06J77J5P5k39k55n5J2J87P3P0O3
$$ 261 223 193 94 -46 137 -108 -231 -142 -272 -234 -147 126 20 197 212 287 48 -207 -262 -250 -63 10 80 143
5031A43L40j61q2k05l02K09N5k33K86r8M0K84J6l47J70l41p3K22k70M2k4M45O3
$$ 143 483 322 240 35 -267 -58 -3 -236 50 -48 -8 276 292 -55 115 -226 -299 -77 -347 -305 -329 116 179
5054A79MJ5J89l52j37j39J25k23L18J83n1J49p0N6k96K04l48J21k18O2L89r7L8
$$ 179 183 198 387 35 -102 -241 -116 -339 -21 162 111 260 190 246 -50 154 -194 -73 -291 -229 160 63 101
5077A01O7j41J40k02k11J08l7nN9L12j80J06L04k82l7k23J06k04J14L2O0K15J79
$$ 101 168 27 167 -35 -246 -138 -175 -180 -121 191 11 117 421 139 102 -121 -15 -219 -105 -73 -13 202 381
5100C81K1j48j48l1j80K5qk38K57k9J53n6J27j7j31J5j57j16K34O6J6P9n0L38
$$ 381 402 254 106 75 -105 -80 -88 -326 -69 -98 55 -1 126 109 -22 -7 -164 -280 -46 20 36 115 65 403
5124D03j0k89j11j68r1pJ36p5Q0J69J90j73j32J55j33k74L2J6R2M7L34J8q0k2
$$ 403 393 104 -7 -175 -266 -273 -137 -212 -132 37 227 54 -78 77 -56 -330 -298 -282 -190 -143 191 209 129 107
5148A07j9L9k31n8JK14j15J88m1J26m1k16N4m12L01o5K25j56J02M5k08J1K09j94
$$ 107 88 127 -104 -162 -161 53 -62 126 85 211 170 -46 8 -404 -103 -168 57 -99 3 48 -160 -149 60 -134
5172a34J95l4J0m7j02J57MQ5J4k80J92j70J12J17j62p2J57M7p9J25p7m8k97J43
$$ -134 61 27 37 -10 -112 45 49 134 148 -132 60 -110 2 119 -43 -115 42 89 10 135 58 10 -287 -144
5196a44p1J91q1j4k48K74K11n9J67r8l2k21J85j2j70K59l9o1j16l0j6N0k1K89
$$ -144 -215 -24 -105 -119 -367 -93 118 59 226 128 96 -125 60 48 -122 137 98 37 -79 -109 -125 -75 -96 193
5220A93j76k33O4K09k56J86j10N1J97q9m9R0J14k60m9Q2m9J80j57K05n4J22J7
$$ 193 17 -216 -152 57 -199 -13 -123 -72 125 36 -13 77 191 -69 -118 -36 -85 95 -62 143 89 211 228
5243B28j79J87j04j76j0r8K49j74p7J28k42J13J29Q9K0l56K00j6%k3J88n1j64
$$ 228 49 236 132 -44 -54 -152 97 -77 -154 -26 -268 -155 -26 63 83 -273 -73 -89 -89 -112 76 25 -139
5266a39K46n3J11k15o8J4O6J03k38K07K4p3P6n3J15j80l9m4K4J92m5j10K0N9O9
$$ -139 107 54 165 -50 -118 -104 -38 65 -173 34 58 -15 61 8 123 -57 -96 -140 -116 76 31 -79 -59 0 69
5291F9k2k99M77j41j29r2M7J11J53j79L1J24M3o3k40j0j00J78N5J06Rj69k16J75
$$ 69 47 -252 225 84 -45 -137 -90 21 174 -5 26 150 193 130 -110 -120 -220 -42 13 119 128 -41 -257 -82
5315h2n2J33j70j95J84L05j51J81j60J19J26k49j69K44j22m1J89p6L6j01K14j30
$$ -82 -134 -1 -171 -366 -182 123 -28 153 -7 112 238 -11 -180 64 -58 -99 90 14 50 -51 163 33
5337C3J60k58J13j52K79j81P1l08J35j05J98j69J05p8J70l8j31L54J1k38Q3r0
$$ 33 193 -65 48 -104 175 -6 65 -243 -108 -213 -15 -184 -79 -157 13 -25 -156 198 209 -29 54 -36
5359c6j04J62J90k20m6J55j90J92L2j20L5n3J24k7J12l83K0J98j44J72j69K27
$$ -36 -140 22 212 -8 -54 101 -89 103 135 15 50 -3 121 94 206 -177 -157 41 -103 69 -100 127
5381A27j3j52j94J94p3K5J8J50k6L0J6j44q5K4J44J20k10K67k01k5q7j20J54M0
$$ 127 114 -38 -232 -38 -111 -86 -68 82 56 86 102 -42 -127 -103 41 161 -49 218 17 -8 -95 -215 -61 -21
5405b1n3N6j24L8M5pl9n5Q2q1L83m10L96j34j69K00j19M7J9R7l1j58K8l0J24k02
$$ -21 -74 -18 -142 -104 -59 -66 -105 -160 -78 -159 224 -186 210 76 -93 107 -12 35 54 151 120 -38 -10 -40 84 -118
5431a18R2L6r2K66k09j08J67r6O2n3L4J17j14R2m1L0Lk18K42j33O6P8j51J4J12
$$ -118 -26 10 -82 184 -25 -133 34 -62 0 -53 -19 98 -16 76 35 65 68 -150 92 -41 25 103 -48 -34 78
$$ [...]
8191H2
##END NTUPLES=NMR FID
##END=
