##TITLE=1H_2ABPA2804-1
 CDCl3, 8 sc, 
 28.04.2021
##JCAMPDX= 6.0         $$ Bruker NMR JCAMP-DX V2.0
##DATA TYPE= NMR FID
##DATA CLASS= NTUPLES
##ORIGIN= UXNMR, Bruker Analytische Messtechnik GmbH
##OWNER= root
$$ XWIN-NMR		Version 3.5
$$ Wed Apr 28 11:54:01 2021 Russian Standard Time (UT+4h)  she@DPX200
##.OBSERVE FREQUENCY= 200.131506
##.OBSERVE NUCLEUS= ^1H
##.DELAY= (6, 6)
##.ACQUISITION MODE= SIMULTANEOUS
##.ACQUISITION SCHEME= undefined
##.AVERAGES= 8
##.DIGITISER RES= 18
##SPECTROMETER/DATA SYSTEM= spect
##.PULSE SEQUENCE= zg30
##.SOLVENT NAME= CDCl3
##.SHIFT REFERENCE= (INTERNAL, CDCl3, 0, 15.7039)
##AUDIT TRAIL= $$ (NUMBER, WHEN, WHO, WHERE, WHAT)
$$ ##TITLE= Audit trail, XWIN-NMR		Version 3.5
$$ ##JCAMPDX= 5.01
$$ ##ORIGIN= Bruker BioSpin GmbH
$$ ##OWNER= she
$$ F:/spectra/data/she/nmr/H-F/1/audita.txt
$$ ##AUDIT TRAIL=  $$ (NUMBER, WHEN, WHO, WHERE, WHAT)
(   1,<2021-04-28 11:52:27.40 +0400>,<she>,<DPX200>,
      <created by zg, POWCHK disabled, PULCHK disabled
       configuration hash MD5:
       00 E9 B6 7A A2 85 ED C7 34 08 36 98 17 FE 4E 26
       data hash MD5: 16K
       2E D7 89 B2 8F C9 04 7C 40 FA A3 8E A9 6B 97 E6>)
$$ ##END=
$$ 
$$ hash MD5
$$ 55 4D 4D D4 5A 92 A9 71 CF E1 66 EB 4D 5C 7A BC
##$RELAX= 
##$RELAX= 
##$RELAX= 
##$RELAX= 
##$RELAX= 
##$RELAX= 
$$ Bruker specific parameters
$$ --------------------------
##$DU= <F:/spectra>
##$EXPNO= 1
##$NAME= <H-F>
##$PROCNO= 1
##$TYPE= <nmr>
##$USER= <she>
##$AMP= (0..31)
100 100 100 100 100 100 100 100 100 100 100 100 100 100 100 100 100 100 
100 100 100 100 100 100 100 100 100 100 100 100 100 100 
##$AQSEQ= 0
##$AQ_mod= 1
##$AUNM= <au_zg>
##$AUTOPOS= <>
##$BF1= 200.13
##$BF2= 200.13
##$BF3= 200.13
##$BF4= 200.13
##$BF5= 200.13
##$BF6= 200.13
##$BF7= 200.13
##$BF8= 200.13
##$BYTORDA= 1
##$CFDGTYP= 0
##$CFRGTYP= 5
##$CHEMSTR= <none>
##$CNST= (0..31)
1 1 145 1 1 1 1 1 1 1 1 1 1 1 1 1 1 1 1 1 1 1 1 1 1 1 1 1 1 1 1 1 
##$CPDPRG= <>
##$CPDPRG1= <>
##$CPDPRG2= <>
##$CPDPRG3= <>
##$CPDPRG4= <mlev>
##$CPDPRG5= <mlev>
##$CPDPRG6= <mlev>
##$CPDPRG7= <mlev>
##$CPDPRG8= <mlev>
##$CPDPRGB= <>
##$CPDPRGT= <>
##$D= (0..31)
0 1.2 0 0 0 0 0 0 0 0.06 0 0.03 0 0 0 0 0.0002 0 0 0 0 0 0 0 0 0 0 0 0 
0 0 0 
##$DATE= 1619596346
##$DBL= (0..7)
120 120 120 120 120 120 120 120 
##$DBP= (0..7)
150 150 150 150 150 150 150 150 
##$DBP07= 0
##$DBPNAM0= <>
##$DBPNAM1= <>
##$DBPNAM2= <>
##$DBPNAM3= <>
##$DBPNAM4= <>
##$DBPNAM5= <>
##$DBPNAM6= <>
##$DBPNAM7= <>
##$DBPOAL= (0..7)
0.5 0.5 0.5 0.5 0.5 0.5 0.5 0.5 
##$DBPOFFS= (0..7)
0 0 0 0 0 0 0 0 
##$DE= 6
##$DECBNUC= <off>
##$DECIM= 32
##$DECNUC= <off>
##$DECSTAT= 4
##$DIGMOD= 1
##$DIGTYP= 9
##$DL= (0..7)
0 120 120 120 120 120 120 120 
##$DP= (0..7)
150 150 150 150 150 150 150 150 
##$DP07= 0
##$DPNAME0= <>
##$DPNAME1= <>
##$DPNAME2= <>
##$DPNAME3= <>
##$DPNAME4= <>
##$DPNAME5= <>
##$DPNAME6= <>
##$DPNAME7= <>
##$DPOAL= (0..7)
0.5 0.5 0.5 0.5 0.5 0.5 0.5 0.5 
##$DPOFFS= (0..7)
0 0 0 0 0 0 0 0 
##$DQDMODE= 0
##$DR= 18
##$DS= 0
##$DSLIST= <SSSSSSSSSSSSSSS>
$$ [...]
##$SUBNAM2= <"">
##$SUBNAM3= <"">
##$SUBNAM4= <"">
##$SUBNAM5= <"">
##$SUBNAM6= <"">
##$SUBNAM7= <"">
##$SUBNAM8= <"">
##$SUBNAM9= <"">
##$SW= 16.9725357007746
##$SWIBOX= (0..15)
0 0 2 0 0 0 0 0 0 0 0 0 0 0 0 0 
##$SW_h= 3396.73913043478
##$TD= 16384
##$TD0= 1
##$TE= 0
##$TE2= 300
##$TE3= 300
##$TEG= 300
##$TL= (0..7)
0 120 120 120 120 120 120 120 
##$TP= (0..7)
150 150 150 150 150 150 150 150 
##$TP07= 0
##$TPNAME0= <>
##$TPNAME1= <>
##$TPNAME2= <>
##$TPNAME3= <>
##$TPNAME4= <>
##$TPNAME5= <>
##$TPNAME6= <>
##$TPNAME7= <>
##$TPOAL= (0..7)
0.5 0.5 0.5 0.5 0.5 0.5 0.5 0.5 
##$TPOFFS= (0..7)
0 0 0 0 0 0 0 0 
##$TUNHIN= 0
##$TUNHOUT= 0
##$TUNXOUT= 0
##$USERA1= <user>
##$USERA2= <user>
##$USERA3= <user>
##$USERA4= <user>
##$USERA5= <user>
##$V9= 5
##$VALIST= <valist>
##$VCLIST= <CCCCCCCCCCCCCCC>
##$VD= 0
##$VDLIST= <DDDDDDDDDDDDDDD>
##$VPLIST= <PPPPPPPPPPPPPPP>
##$VTLIST= <TTTTTTTTTTTTTTT>
##$WBST= 1024
##$WBSW= 4
##$XGAIN= (0..3)
0 0 0 0 
##$XL= 0
##$YL= 0
##$YMAX_a= 765244
##$YMIN_a= -807742
##$ZGOPTNS= <>
##$ZL1= 120
##$ZL2= 120
##$ZL3= 120
##$ZL4= 120
##$ABSF1= 10
##$ABSF2= 0
##$ABSG= 5
##$ABSL= 3
##$ALPHA= 0
##$AQORDER= 0
##$ASSFAC= 0
##$ASSFACI= 0
##$ASSFACX= 0
##$ASSWID= 0
##$AUNMP= <proc_1d>
##$AZFE= 0.1
##$AZFW= 0.1
##$BCFW= 1
##$BC_mod= 2
##$BYTORDP= 1
##$COROFFS= 0
##$CY= 11.3945322036743
##$DATMOD= 1
##$DC= 2
##$DFILT= <>
##$DTYPP= 0
##$F1P= 15.9154993809931
##$F2P= -4.1035820241983
##$FCOR= 0.5
##$FTSIZE= 0
##$FT_mod= 4
##$GAMMA= 1
##$GB= 0.15
##$INTBC= 1
##$INTSCL= 1
##$ISEN= 128
##$LB= 0.24
##$LEV0= 0
##$LPBIN= 0
##$MAXI= 10000
##$MC2= 0
##$MEAN= 0
##$ME_mod= 0
##$MI= 1.114404
##$NCOEF= 0
##$NC_proc= 0
##$NLEV= 6
##$NOISF1= 3.799351
##$NOISF2= 2.8
##$NSP= 1
##$NTH_PI= 0
##$NZP= 0
##$OFFSET= 15.70392
##$PC= 1
##$PHC0= -11121.42
##$PHC1= 13.80102
##$PH_mod= 1
##$PKNL= yes
##$PPARMOD= 0
##$PSCAL= 0
##$PSIGN= 0
##$REVERSE= no
##$SF= 200.130013532006
##$SI= 16384
##$SIGF1= 3
##$SIGF2= 2
##$SINO= 400
##$SIOLD= 16384
##$SREGLST= <1H.CDCl3>
##$SSB= 0
##$STSI= 0
##$STSR= 0
##$SW_p= 3612.71676300578
##$SYMM= 0
##$S_DEV= 0
##$TDeff= 0
##$TDoff= 0
##$TI= <>
##$TILT= no
##$TM1= 0
##$TM2= 0
##$TOPLEV= 0
##$USERP1= <user>
##$USERP2= <user>
##$USERP3= <user>
##$USERP4= <user>
##$USERP5= <user>
##$WDW= 1
##$XDIM= 8192
##$YMAX_p= 0
##$YMIN_p= 0
$$ End of Bruker specific parameters
$$ ---------------------------------
##NTUPLES= NMR FID
##VAR_NAME=  TIME,          FID/REAL,        FID/IMAG
##SYMBOL=    X,             R,               I
##VAR_TYPE=  INDEPENDENT,   DEPENDENT,       DEPENDENT
##VAR_FORM=  AFFN,          ASDF,            ASDF
##VAR_DIM=   8192,          8192,            8192
##UNITS=     SECONDS,       ARBITRARY UNITS, ARBITRARY UNITS
##FACTOR=    0.0002944,     1,               1
##FIRST=     0,             0,               0
##LAST=      2.4114304,     0,               0
##MIN=       0,             -807742,         0
##MAX=       2.4114304,     765244,          0
$$ Real data points
##PAGE= N=1
##DATA TABLE= (X++(R..R)), XYDATA
$$ [...]
2673a744K029N98l082L018m57k352L501k167r14L092k736L72K122l327J809J130
$$ -1744 285 883 -2199 819 362 -1990 1511 -656 -1570 1522 -1214 -842 1280 -2047 -238 892
2689H92k863K579o60j727L089k011o68L035k854P04J933l373K362N93l016L263
$$ 892 -1971 608 -52 -1779 1310 -701 -1369 1666 -1188 -484 1449 -1924 438 1031 -1985 1278
2705A278r62k063L791k598m16L191l426J040K262l861K525O67l234L564j233k019
$$ 1278 316 -1747 2044 -554 -970 2221 -1205 -165 2097 -1764 761 1428 -1806 1758 525 -1494
2721a494L654k456k49K860l623J667J772m053L012K29l184L878j941j627M312
$$ -1494 2160 -296 -545 2315 -1308 359 2131 -1922 1090 1319 -1865 2013 72 -1555 2757
2736B757l719J59L181l857J300J995l968L037J77l436M059j868j729L956l299
$$ 2757 -962 -803 2378 -1479 -179 1816 -2152 885 1062 -2374 1685 -183 -1912 2044 -1255
2751a255N34K535l761J941J294l858L820q84k827M152k344j253L875l561K52L420
$$ -1255 -721 1814 -1947 -6 1288 -2570 1250 366 -2461 1691 -653 -1906 1969 -1592 -1340 2080
2767B080m675K655J427m259L953l67l069L798k066j221L877l748Q90K771m147
$$ 2080 -2595 60 1487 -2772 1181 814 -2255 1543 -523 -1744 2133 -1615 -725 2046 -2101
2782b101K774N74l443L797r82k672M769l197j018M302m218J180K740m449K964
$$ -2101 673 1247 -2196 1601 619 -2053 2716 -481 -1499 2803 -1415 -235 2505 -1944 1020
2797A020O65l877L993j066k594M513l245n18L907m428J634K479m890L518J55l831
$$ 1020 1685 -2192 1801 735 -1859 2654 -591 -1109 2798 -1630 4 2483 -2407 1111 1266 -2565
2813b565M862k047k290M664l717K73L737m988J927K075m972M090K5l706M677k797
$$ -2565 2297 250 -2040 2624 -1093 -820 2917 -2071 -144 1931 -3041 1049 1074 -2632 2045 -752
2829g52j644M908l866R1L342m304K685J322m738L899q11l129N247k369k018N144
$$ -752 -2396 2512 -1354 -1263 2079 -2225 460 1782 -2956 943 132 -2997 2250 -119 -2137 3007
2845C007m660J101L420n474K869Q99l844M203p48l535N172l103j497N009m247
$$ 3007 -1653 -552 2868 -2606 263 1162 -2682 1521 773 -2762 2410 -693 -2190 2819 -1428
2860a428J446K729m865L346M16m129M967j856l364N607l225l90L861m862J886
$$ -1428 18 2747 -2118 1228 1644 -2485 2482 626 -2738 2869 -356 -746 3115 -1747 139
2875A39K447n197M392m62m014N280j718l238N179l025r45M269m985K149K038n264
$$ 139 2586 -2611 1781 1319 -2695 2585 867 -2371 2808 -217 -1162 3107 -1878 271 2309 -2955
2891b955M272M89m712N411k707k116N065m231K04M196n652K856K055n506M635
$$ -2955 1317 1806 -2906 2505 -202 -2318 2747 -1484 -1280 2916 -2736 120 2175 -3331 1304
2906A304k69m283N469k860j691N065m530P82L488n350K869J829n018M720j041
$$ 1304 1035 -3248 2221 -639 -2330 2735 -1795 -1013 2475 -2875 -6 1823 -3195 1525 484
2921D84l497N446l282j098M896n058J435L421n673L845J097n226N309j511l236
$$ 484 -3013 2433 -849 -1947 2949 -2109 -674 2747 -2926 919 2016 -3210 2099 588 -2648
2936b648N654l798p32M795n240J655L185n398L753P79m798N335j885k740N608
$$ -2648 3006 -792 -1524 3271 -1969 -314 2871 -2527 1226 2005 -2793 2542 657 -2083 3525
2951C525m523m82M936n600K381K332n434M609k13m343N569k637k545N690m687
$$ 3525 -998 -1480 3456 -2144 237 2569 -2865 1744 1531 -2812 2757 120 -2425 3265 -1422
2966a422J51M483n754K679K123n387M617m92m215N844l144j859N206m921J019
$$ -1422 -1271 3212 -2542 137 2260 -3127 1490 998 -3217 2627 -517 -2376 2830 -2091 -1072
2981a072L952o178L607J640n365M971j209l542N974l665j659N582n347J355L635
$$ -1072 2880 -3298 309 1949 -3416 1555 346 -3196 2778 -887 -2546 3036 -2311 -956 2679
2996B679n921L901J188n251N647j852l312N863m109m70M973n869K253L083o038
$$ 2679 -3242 659 1847 -3404 2243 391 -2921 2942 -1167 -1637 3336 -2533 -280 2803 -3235
3011c235M536M92m797N712k502k910O263m568l05M815n849K526K922o010M653
$$ -3235 1301 1793 -3004 2708 206 -2704 3559 -1009 -1314 3501 -2348 178 3100 -2910 1743
3026A743R1m871N998k688k426N450m487k0M530n844L013K077n933N348o39m580
$$ 1743 1834 -3037 2961 273 -2153 3297 -1190 -1210 3320 -2524 489 2566 -3367 1981 1342 -3238
3042c238O246l366k262N990n095L29M637o382L433J860n791N530j046m438O215
$$ -3238 3008 -358 -2620 3370 -1725 -1396 3241 -3141 292 2152 -3639 1891 845 -3593 2622
3057B622l554j544N650n662J551L772o386M185J271n599N792j857l542O566m429
$$ 2622 -932 -2476 3174 -2488 -937 2835 -3551 634 1905 -3694 2098 241 -3301 3265 -1164
3072a164r57N473n943K055L329o242M616M27n174O063k340l009O367m826j10M933
$$ -1164 -2121 3352 -2591 -536 2793 -3449 1167 1594 -3580 2483 143 -2866 3501 -1325 -1435 3498
3088C498o051K539K975o258N119k54m942O517l048k557O299n171K21M802o567
$$ 3498 -2553 -14 2961 -3297 1822 1568 -3374 3143 95 -2462 3837 -1334 -1113 3689 -2878
3103b878L273K678o246N281p10m732O522l380k165N953n307O51M294o270L577
$$ -2878 395 3073 -3173 2108 1398 -3334 3188 -192 -2357 3596 -1711 -1060 3234 -3036 541
3118E41J862n875N437r56m218O412m090j522N749n738J372M144o726M307J342
$$ 541 2403 -3472 1965 1009 -3209 3203 -887 -2409 3340 -2398 -1026 3118 -3608 699 2041
3133B041o032N940j471l872O479m201j153N560n860J733L686o542M529R50n507
$$ 2041 -3991 1949 478 -3394 3085 -1116 -2269 3291 -2569 -836 2850 -3692 837 1787 -3720
3148c720O251k337l281O439m711p15N671o322K432L310o483M876M12n411O430
$$ -3720 2531 194 -3087 3352 -1359 -2074 3597 -2725 -293 3017 -3466 1410 1822 -3589 2841
3163B841k642l155O597m934q4M988o358L241K545o474N325k57m828O406l337k189
$$ 2841 199 -2956 3641 -1293 -1377 3611 -2747 494 3039 -3435 1890 1633 -3195 3211 -126 -2315
3179b315O080n493Q05M555o598L518K188o180N534q62m580O496l605j707O050
$$ -2315 3765 -1728 -923 3632 -2966 552 2740 -3440 2094 1232 -3348 3148 -457 -2164 3886
3194C886o080J588L714o243L718J625n831N763j326m124O455m376r67N654o230
$$ 3886 -2194 -606 3108 -3135 583 2208 -3623 2140 814 -3310 3145 -1231 -2198 3456 -2774
3209b774J890L974o871M432J152n728O110j955l544O367m485o02N404o178K299
$$ -2774 -884 3090 -3781 651 1803 -3925 2185 230 -3314 3053 -1432 -2034 3370 -2808 -509
3224e09L355o225M741K15n155O116k562k727O226n001J61M800o238K865K899o415
$$ -509 2846 -3379 1362 1577 -3578 2538 -24 -2751 3475 -1526 -1365 3435 -2803 62 2961 -3454
3240c454N251L4n209O500l278k195O047n282N44M501o101L275K059n818N305p62
$$ -3454 1797 1831 -3378 3122 -156 -2351 3696 -1586 -1042 3459 -2642 633 2692 -3126 2179 1417
3256A417m455O247l800j509N725n688J499L959o503L967J485n855N850j557l886
$$ 1417 -3038 3209 -591 -2100 3625 -2063 -564 3395 -3108 859 2344 -3511 2339 782 -3104
3271c104O419m688p95N612n998J917L480o132M171O26n091O019k429l027O046
$$ -3104 3315 -1373 -2168 3444 -2554 -637 2843 -3289 882 1508 -3583 2436 7 -3020 3026
3286C026m508n19N101o155K789K810o191M786L36m944N979k707k621O239n001
$$ 3026 -1482 -2001 3100 -3055 -266 2544 -3647 1139 1475 -3469 2510 -197 -2818 3421 -1580
3301a580j19M805n884K741K636n828M905k50m648N963k939k130N647n182J089
$$ -1580 -1699 3106 -2778 -37 2599 -3229 1676 1426 -3222 2741 -198 -2328 3319 -1863 -774
3316g74M150o300L735J690n740N391r88l964O118l623j622N430n237J296L583
$$ -774 3376 -2924 811 2501 -3239 2152 1164 -2800 3318 -305 -1927 3503 -1734 -438 3145
3331C145n869L720R96n263N494j403l552N920l977q07M812n506J956L353o051
$$ 3145 -2724 996 1992 -3271 2223 820 -2732 3188 -789 -1596 3216 -2290 -334 3019 -3032
3346c032M219N06m905N492k100l064N953m326o46M911n608K313K704n522M100
$$ -3032 1187 1693 -3212 2280 180 -2884 3069 -1257 -1903 3008 -2600 -287 2417 -3105 995
3361I95R9m582N668k423k656N922m919M22M554n860K880K020n448M682j89m619
$$ 995 1094 -3488 2180 -243 -2899 3023 -1896 -1474 3080 -2780 100 2120 -3328 1354 1165 -3454
3377c454O112l091j996N540n037P41M259n649L132J576n374N116j005l687N750
$$ -3454 2658 -433 -2429 3111 -1926 -1185 3074 -2575 557 2133 -3241 1875 870 -2817 2933
3392B933l374j362N064n096J462L567n941L722J219n227N216j443l339N790m021
$$ 2933 -441 -1803 3261 -1835 -373 3194 -2747 975 2194 -3033 2183 740 -2599 3191 -830
3407h30q11N098n445J544L250n703M015N51m588N003j648l056N741m242m70M671
$$ -830 -1641 3457 -1988 -444 2806 -2897 1118 1669 -2919 2084 436 -2620 3121 -1121 -1591 3080
3423C080n382K074K632n487M180P4m257N411k509k315N418m393N1M337n603K549
$$ 3080 -2302 -228 2404 -3083 1097 1171 -3086 2325 -184 -2499 2919 -1474 -1423 2914 -2689 -140
3439a40K346n522M443k50l963N236k420k157N095m487N60L991n483L003J667m848
$$ -140 2206 -3316 1127 877 -3086 2150 -270 -2427 2668 -1819 -1259 2732 -2751 252 1919 -2929
3455b929M528q33l619N489l163j368M884m783J082L431n274L316J166m832M981
$$ -2929 1599 766 -2853 2636 -527 -1895 2989 -1794 -712 2719 -2555 761 1927 -2905 2076
3470B076j392l183N256l344q31M466m784J683K819n290L564P01m483M934j699
$$ 2076 684 -2499 2757 -587 -1418 3048 -1736 -53 2766 -2524 1040 1741 -2742 2192 493
3485D93k694N159l797m37M190n039K081K523n369L808L90m081M888k094k283N136
$$ 493 -2201 2958 -839 -1276 2914 -2125 -44 2479 -2890 918 1308 -2773 2115 21 -2262 2874
3501B874m159j2L796m937K542J910n047M260m29l826N007k405j736M811m393M53
$$ 2874 -1285 -1297 2499 -2438 104 2014 -3033 1227 798 -3028 1979 -426 -2162 2649 -1744 -1291
3517a291L651m948K766J479m657M290p51l285M942k667j500M709m349J077L013
$$ -1291 2360 -2588 178 1657 -3000 1290 539 -2746 2196 -471 -1971 2738 -1611 -534 2479
3532B479m942L099Q33m067M459j259k782M773l301p01M384m660J562K482m724
$$ 2479 -2463 636 1469 -2598 1861 602 -2180 2593 -708 -1409 2975 -1685 -123 2359 -2365
3547b365L394P45m235M502j508k747M866l209o01L901m394J730K208m542L512
$$ -2365 1029 1774 -2461 2041 533 -2214 2652 -557 -1158 2743 -1651 79 2287 -2255 1257
3562A257kl715M596k022j922M519l806K41L022m151K029J735m446L966m68l099
$$ 1257 1255 -2460 2136 114 -1808 2711 -1095 -854 2168 -1983 46 1781 -2665 1301 833 -2266
3578b266M314k529j369M229l934N46L108m425K405J480m256L728n38k755M140
$$ -2266 2048 -481 -1850 2379 -1555 -1009 2099 -2326 79 1559 -2697 1031 493 -2262 1878
3593A878k707j042M236l944Q69K758m564K956J009m042M094j062k777M530k613
$$ 1878 -829 -1871 2365 -1579 -710 2048 -2516 440 1449 -2593 1501 439 -2338 2192 -421
3608d21r80L742l884J162K301m105L172L66l418L896j551k120M065k903l04L483
$$ -421 -1401 2341 -1543 -381 1920 -2185 987 1353 -2065 1831 280 -1840 2225 -678 -982 2501
3624B501m132J799J984m117L127Kl329M208j766j997M474l629J58K775l723K060
$$ 2501 -1631 168 2152 -1965 1162 1164 -2165 2043 277 -1720 2754 -875 -717 2058 -1665 395
3640C95J314l709L362l92k968L892k093j391L566l120L32K792l897K205J142l612
$$ 395 1709 -2000 1362 970 -1998 1894 -199 -1590 1976 -1144 -812 1980 -1917 288 1430 -2182
3656b182L362p78k566L783k116j101L792l534P02K411l663K042J000l446L619
$$ -2182 1180 402 -2164 1619 -497 -1598 2194 -1340 -638 1773 -1890 152 1152 -2294 1325
3671A325j128k343L905k493o19L212l228Q97K123l849K888N26l358L555j241j737
$$ 1325 197 -2146 1759 -734 -1353 1859 -1369 -472 1651 -2198 690 1216 -2142 1413 172 -1565
3687a565L585k816k15L221l596J208J971l606K679L51k990L410j463j468L268
$$ -1565 2020 -796 -1011 2210 -1386 -178 1793 -1813 866 1217 -1773 1637 174 -1294 1974
3702A974k739J79K702l417J723J244l434K947k91k536L435j717j310L267k951
$$ 1974 -765 -586 2116 -1301 422 1666 -1768 1179 888 -1648 1787 70 -1240 2027 -924
3717i24L54K469l428J650J070l103L091m71k471L383j939j128L173l123P93K243
$$ -924 -570 1899 -1529 121 1191 -1912 1179 708 -1763 1620 -319 -1447 1726 -1397 -604 1639
3733A639l256J725Q17k982L013o28k385L497k200m89L074l095R26J806l359K202
$$ 1639 -1617 108 925 -2057 956 328 -2057 1440 -760 -1249 1825 -1270 -344 1462 -1897 305
3749C05O15k840L069j061j545K864k048l29K527k805J058J619l110K370K5k428
$$ 305 920 -1920 1149 88 -1457 1407 -641 -970 1557 -1248 -190 1429 -1681 689 714 -1714
3765a714K900j120j341K910k092j22K317k791J175J478l090K435p7k258K923j264
$$ -1714 1186 66 -1275 1635 -457 -579 1738 -1053 122 1600 -1490 945 868 -1390 1533 269
3781B69j350K783k168j69K389k754J055J310k695K225k99k022K832j569q20K639
$$ 269 -1081 1702 -466 -635 1754 -1000 55 1365 -1330 895 596 -1426 1406 -163 -983 1656
3797A656k461K91K118k962J442J029k868K415l68j824K785j550r64K626k465M21
$$ 1656 -805 -514 1604 -1358 84 1113 -1755 660 292 -1532 1253 -297 -1261 1365 -1100 -679
3813f79J757k645J611P22k407K300l91j826K787j817m17K350k334O17J279k422
$$ -679 1078 -1567 44 766 -1641 659 268 -1558 1229 -588 -1005 1345 -989 -372 907 -1515
3829a515J733N24k109K329p61j531K640j818q5J914k305Q09J453k422J809q1j671
$$ -1515 218 742 -1367 962 201 -1330 1310 -508 -593 1321 -984 -175 1278 -1144 665 584 -1087
3846a087K220j088q82K200j903k4K146k560J106J085k346J840J29j826K106p64
$$ -1087 1133 45 -837 1363 -540 -564 1582 -978 128 1213 -1133 707 836 -990 1116 352
3862C52j195K078j707N8J814k419J233P77j912J403r2j218J663r05p32J865j884
$$ 352 -843 1235 -472 -414 1400 -1019 214 991 -921 482 390 -828 835 -70 -802 1063 -821
3879h21L80J491k263J307O11j963J774l57j454K248j227p79K148j935K15J559
$$ -821 -441 1050 -1213 94 705 -1258 516 159 -1295 953 -274 -1053 1095 -840 -625 934
3895I34j971J213L51j844J792n32j123K023j255l48J843j739N50Q17j692J144
$$ 934 -1037 176 527 -1317 475 -57 -1180 843 -412 -760 1083 -656 -106 711 -981 163
3911A63M50j531J569l31j286K057j365l35J527j411M28J011j840J330L32j561
$$ 163 613 -918 651 320 -966 1091 -274 -609 918 -493 -65 946 -894 436 768 -793
3927g93J629o04p86J693j368l1J296j553P20O89j645J156K33j392J687n29j171
$$ -793 836 232 -554 1139 -229 -260 1036 -517 203 892 -753 403 636 -756 931 402 -769
3944g69J708r98k92J307j538N99O85j503J156N8j218J580r95n04J403j132R4J217
$$ -769 939 -59 -351 956 -582 17 702 -801 355 413 -805 775 -220 -724 679 -453 -359 858
3962H58j771P62P14j584J282q3j243J544q51n33J779j512L13Q36j488Q41N65j409
$$ 858 -913 -151 563 -1021 261 178 -1065 479 -372 -905 874 -638 -325 511 -977 -136 429 -980
3980i80J287j68q39J292m80q92J526j110O8J129j460O23L76j247J416j07j050
$$ -980 307 139 -700 592 112 -780 746 -364 -296 833 -627 -4 372 -875 541 434 -616
3997f16J383q67j49J138j204K60R22j469Q09L49j110J005M2j087J422q77k18J140
$$ -616 767 -100 -249 889 -315 -55 867 -602 207 556 -554 451 493 -594 828 -49 -267 873
4015H73j272L89N45j189J053P8j054J100k64r32J351p66m25J092j014o1R68j233
$$ 873 -399 -10 535 -654 399 477 -577 523 259 -673 678 -88 -513 579 -435 -496 472 -761
4033g61P91J97j032J110k81n91Q86p29q1Q04r88M34N84p11L36J80j004J224o56
$$ -761 30 227 -805 305 24 -567 319 -410 -491 313 -675 -241 343 -368 -32 148 -856 368 -288
4052b88m88J263q56r7Q39r18N13P06j226N79L64j022P51K6m78J014o80l16J018
$$ -288 -776 487 -369 -466 373 -545 -32 674 -552 27 391 -631 120 146 -332 682 2 -314 704
4071G04p53K52L93q35Q18l06o06Q85l32k80O31p69Q6P72j091N77N68j113O58K09
$$ 704 -49 203 596 -239 579 273 -333 552 220 -60 571 -198 -112 660 -431 146 714 -399 259 468
4091D68r52R11l64l70O58n76m1Q52q09J15M78q35Q48l21o95Q74k58k53P55p42
$$ 468 -484 427 63 -307 351 -225 -266 586 -223 -108 370 -465 383 62 -633 241 -17 -270 485 -257
4111b57j28Q77r25K51N14q57N84j9o77R18l12n16R95p14q2O29r87O60J10n16P19
$$ -257 -385 492 -433 -182 332 -525 59 40 -637 281 -31 -547 448 -266 -348 281 -706 -46 64 -452 267
4132B67k20n91R69n43m18J020p84J81Q35j032N46L34j113R24o5p04J061l55o74
$$ 267 47 -544 425 -118 -536 484 -300 -119 716 -316 230 564 -549 375 310 -394 667 312 -362
4151c62R27o12R4L67r27N98L24q68O73J30o13Q57m66j98P64q02K9O75q76M07K33
$$ -362 565 -47 47 414 -513 85 409 -459 214 344 -269 588 122 -76 688 -114 -85 590 -286 121 354
4172C54o62O78r0o17R71o16n07J026r01K46N45p51L00L87r85O64P1p37Q33m37
$$ 354 -308 370 280 -337 634 18 -489 537 -364 -118 427 -324 -24 363 -622 42 113 -624 209 -228
4192b28k59J007r01P3O22p57M21L76r83O35R5o71P94m65j97J003r05J21N36p41
$$ -228 -487 520 -381 -308 314 -443 -22 354 -629 6 101 -570 224 -241 -438 565 -340 -219 317 -424
4212d24O08L3n13P58m14m51J020n42m41R31p88R6Q08j064N19L98q67P43n3o11
$$ -424 184 217 -296 462 48 -403 617 75 -366 565 -223 -127 681 -383 136 534 -333 410 357 -254
4232b54R80n89l69Q97q97K72N94p69K97K28r26J125l39o01Q58l68l54P78r43L96
$$ -254 726 137 -232 665 -232 40 634 -135 162 390 -536 589 250 -351 507 139 -215 563 -380 16
4252A6K62p54O33K49r42R53l67o40J113o26m65R70r05L42N72j130P30J36o87O09
$$ 16 278 -476 157 406 -536 417 50 -590 523 -103 -568 402 -503 -161 411 -719 11 147 -540 69
4272F9j36n53J040n83k05R17r42M59K66p96M41L64p69P69l47n18J028p45j87J003
$$ 69 -67 -620 420 -163 -368 549 -393 66 332 -464 -23 341 -428 341 -6 -524 504 -241 -428 575
4292E75q41K21N56j104O73J83q93J036j69n50J026q15k4P30r38L92O01j087Q63
$$ 575 -266 -45 511 -593 80 263 -630 406 237 -313 713 -102 -126 604 -334 58 659 -428 435
4311D35%p65J060p06k90R12r20M0Q92r75L22N58j164Q35p5p95J090m88l46R84
$$ 435 435 -330 730 24 -266 646 -274 -234 658 -317 5 563 -601 234 159 -636 454 -34 -380 604
4331F04r75K60O13j049N62K88j083Q58M4p84J284j024j94J139r10n0Q87j069O60
$$ 604 -371 -111 502 -547 15 303 -780 78 122 -662 622 -402 -596 543 -367 -417 470 -599 61
4350F1J30p47N55J60p12J111p66p6Q67r27K50P48j216Q26K29j087J017l55o27
$$ 61 191 -556 -1 159 -553 558 -208 -284 583 -344 -94 654 -562 264 493 -594 423 68 -559
4369e59J006n77j79J205j031K18M67j021P78J85j032R68q4n06P92o38j66P72r48
$$ -559 447 -130 -309 896 -135 83 550 -471 307 492 -540 428 344 -162 630 -8 -174 598 -350
4388c50L83Q26j298P03K66j195J235n05n61J265r58r4J004j354L83P01j151P89
$$ -350 33 859 -439 264 530 -665 570 65 -496 769 -189 -283 721 -633 -250 451 -700 89
4406H9J35q71Q78m01m39J238j095K29Q73j195L55P91j452J044J15j179J295n65
$$ 89 224 -647 231 -170 -609 629 -466 -237 636 -559 -204 587 -865 179 294 -885 410 -155
4424a55m58J043r52J06J046j243N01O36j103J004k02p95J133o67l77J164r89J0
$$ -155 -613 430 -522 -416 630 -613 -112 524 -579 425 223 -572 561 -106 -483 681 -308 -298
4442b98R98j381Q41L45j011R25o4r80J434o86m35J136j209R1R17j108O32L72j145
$$ -298 700 -681 160 505 -506 419 355 -625 809 123 -312 824 -385 -294 623 -485 147 519 -626
4461f26J336l50p98J302r19k22R96j186L10P71j183O32L92j127J327m34q07J288
$$ -626 710 360 -438 864 -55 -277 719 -467 -157 614 -569 63 455 -672 655 221 -586 702
4479G02r38j2J049j668P93P90j237Q26q3j044J174m89o71J233q87j5R18j295M66
$$ 702 -236 -248 801 -867 -74 716 -521 305 222 -822 352 -137 -808 425 -462 -477 441 -854 -388
4498c88R37j256J012r1q95J112o17j28R16r97J36Q48j024N67K89j192J332l33
$$ -388 549 -707 305 214 -681 431 -186 -314 602 -395 -259 589 -435 132 421 -771 561 228
4516B28r92J437o53m79J243j065k2J086j399P59N38j279J146m67n65J197o09m75
$$ 228 -764 673 20 -459 784 -281 -303 783 -616 143 681 -598 548 81 -484 713 104 -371
4534c71J346j102j34J204j602R24L70j395J260n06o67J558j035m69J302j074J98
$$ -371 975 -127 -261 943 -659 265 635 -760 500 -6 -673 885 -150 -619 683 -391 -193
4551a93R02j302Q33K68j472J429l04r19J655j438p8J365j446N98N37j245R08K40
$$ -193 709 -593 240 508 -964 465 161 -758 897 -541 -619 746 -700 -102 435 -810 98 338
4569C38j285J564o25p93J370j100O1J146j403O39O39j370J274j16j065J361o30
$$ 338 -947 617 -8 -801 569 -531 -470 676 -727 -88 551 -819 455 339 -726 635 5
4586Em62J221j309M30J045j589Q32K88j225J285l72q30J569r29n27J436j359L46
$$ 5 -457 764 -545 -115 930 -659 173 461 -764 521 149 -681 888 -41 -568 868 -491 -145
4604a45R35j299Q69K91j089J021j85j063J518p95k92J160j335N00O64j396J052
$$ -145 790 -509 360 651 -438 583 398 -665 853 58 -234 926 -409 91 755 -641 411
4621D11L28j528J329k23q35R48j270M34J113j259L34J048j464Q08J12j348J451
$$ 411 739 -789 540 317 -518 430 -840 -406 707 -552 -218 830 -634 174 286 -1062 389
4638C89k34p78J280j119m0J159j354O48P25j447J043L0j238J552o31r44J583j046
$$ 389 155 -623 657 -462 -502 657 -697 -49 676 -771 272 302 -936 616 -15 -959 624 -422
4656d22MJ262j608P63O48j563J422j09j306J605o59o46J167r90j36J257j199O90
$$ -422 -418 844 -764 -1 647 -916 506 397 -909 696 37 -609 558 -432 -568 689 -510 180
4674A80M70j323J137j04j303J523n11l72J127j121M5J110j294J029q4j471J145
$$ 180 650 -673 464 360 -943 580 69 -303 824 -297 -252 858 -436 593 509 -962 183
4691A83L91o55J413j091r76K107j754K37J092j603J177J90j632J665p54p48J702
$$ 183 574 -81 1332 241 -735 1372 -382 -145 947 -656 521 711 -921 744 -10 -758 944
4708I44j481k06J660j743O38P84j588J172J43j319J696q90p10J754j210q9J307
$$ 944 -537 -743 917 -826 -188 596 -992 180 323 -996 700 -190 -900 854 -356 -445 862
4725H62j375K19R35j599J121J90j265J340m95m73J293j224K19R31j379Q04N91
$$ 862 -513 -294 641 -958 163 353 -912 428 -67 -540 753 -471 -252 679 -700 104 695
4742F95j572J480k09j262J715r25n21J492j286J66J020j387P89N83j576J474l80
$$ 695 -877 603 394 -868 847 -78 -599 893 -393 -227 793 -594 195 778 -798 676 296
4759B96q62J478r99p6J189j444K61R66j607J197J02j431J496l90r51J588r46l59
$$ 296 -566 912 -87 -163 1026 -418 -157 809 -798 399 501 -930 566 176 -775 813 -133 -492
4777d92J356j482M36J064j746J161K35j544J532n37q14J625j373J11J341j868
$$ -492 864 -618 -182 882 -864 297 532 -1012 520 -17 -831 794 -579 -468 873 -995
4793i95R66P67j865J413o9j113J317n23q61J780j197j69J147j384P43O62j438
$$ -995 -29 738 -1127 286 217 -896 421 -102 -963 817 -380 -549 598 -786 -43 619 -819
4810h19J172O0j139J400q26m26J479j241J13J233j623P51O28j583J442k85r42
$$ -819 353 413 -726 674 -152 -578 901 -340 -227 1006 -617 134 762 -821 621 336 -606
4827f06J354p16n59J573j548L53J006j418P89K28j208J337m08p47J502j215q2
$$ -606 748 32 -527 1046 -502 -149 857 -561 228 456 -752 585 177 -570 932 -283 -365
4844c65J230j464M22P54j502J417j00j298J458m15q31J528j223k15J546j430M00
$$ -365 865 -599 -177 577 -925 492 392 -906 552 137 -694 834 -389 -604 942 -488 -88
4861h8P52j496R06M64j255J122m96n15J255r89j29J277j646Q09N81j581J304j68
$$ -88 664 -832 74 538 -717 405 -91 -606 649 -340 -469 808 -838 -29 552 -1029 275 107
4879A07j083J772q43p33J589j460L45J101j553O62O56j304J218k75q98J508j004
$$ 107 -976 796 -47 -780 809 -651 -306 795 -758 -96 560 -744 474 199 -699 809 -195
4896a95j89J286j188K23R08j705J161L08j414J355l27j009J773j005l69J400j525
$$ -195 -384 902 -286 -63 845 -860 301 609 -805 550 223 -786 987 -18 -387 1013 -512
4913e12M84J070j911J372J42j428J534p31p60J645j058j7J133j684N36P33j405
$$ -512 -28 1042 -869 503 645 -783 751 20 -740 905 -153 -170 963 -721 -185 548 -857
4930h57J316j33j231J454n92n10J516j383j16J224j272M21P57j554J243j30j195
$$ -857 459 326 -905 549 -43 -553 963 -420 -536 688 -584 -163 594 -960 283 153 -1042
4947a042J598p73l36J250j154j29J264j687J012N61j352J022O6r81J483p62p43
$$ -1042 556 -217 -553 697 -457 -586 678 -1009 3 564 -788 234 300 -681 802 40 -703
4964g03J475j390M15R14j366Q68L18j272J205k07j165J767r62l23J430j351M20
$$ -703 772 -618 -203 711 -655 213 531 -741 464 257 -908 859 -103 -426 1004 -347 73
4981G3O98j268O79M58j130J055m99n50J444j227l9J141j370N29O27j231Q27L14
$$ 73 771 -497 182 640 -490 565 66 -484 960 -267 -306 835 -535 -6 621 -610 217 531
4999E31j313J445n34q82J522j136QJ215j672R13N19j403J131j10j113J395p35
$$ 531 -782 663 129 -753 769 -367 -359 856 -816 97 616 -787 344 234 -879 516 -219
5016b19n54J491j141L5R36j312P58N73j594J409k3j350J630q66n12J388j184K99
$$ -219 -773 718 -423 -388 548 -764 -6 567 -1027 382 359 -991 639 -227 -739 649 -535 -236
5034b36R74j391N87O18j465J477l21j170J709j071k53J501j386K03J053j625J048
$$ -236 738 -653 -66 552 -913 564 243 -927 782 -289 -542 959 -427 -224 829 -796 252
5051B52M84j470J416l48r65J606j027k21J151j228J95Q37j323J016J1j060J149
$$ 252 736 -734 682 334 -631 975 -52 -273 878 -350 -155 682 -641 375 386 -674 475
5068D75l55n52J071j074N6J360j556N68Q97j769J348j47j018J089k99q35J447
$$ 475 120 -432 639 -435 -379 981 -575 -7 890 -879 469 322 -696 393 94 -741 706
5085G06j085r2J127j356M50P90j200Q10n9r02J346p18n16R93p95NJ056j337P23
$$ 706 -379 -471 656 -700 -250 540 -660 150 91 -811 535 -183 -699 294 -501 -496 560 -777 -54
5104e4M97j223J082j50j042J532p67m16J357j106J58R23j533R93L50j369J068
$$ -54 443 -780 302 152 -890 642 -125 -541 816 -290 -132 791 -742 251 601 -768 300
5121C00K7j091J428j035K9J138j246N71M60j379J026L50j373J486p13o15J444
$$ 300 327 -764 664 -371 -342 796 -450 121 581 -798 228 578 -795 691 -22 -637 807
5138H07r01r0R33j057L01P24j407J165r6j144J308o20n66J052n33q9R86j534Q86
$$ 807 -94 -184 749 -308 -7 717 -690 475 379 -765 543 -77 -643 409 -124 -213 773 -761 125
5157A25L55j199J057k7j028J063m52m98J400j302K38Q23j331Q18L48j138J007
$$ 125 480 -719 338 311 -717 346 -106 -604 796 -506 -268 555 -776 42 390 -748 259
5174B59n0j011J174o09m37J314j386M80P94j271P25N64j295J105k29p37J203p74
$$ 259 209 -802 372 -237 -674 640 -746 -266 528 -743 -18 546 -749 356 127 -610 593 -181
5192a81j57J237j365M50P30j461J165J69j282J082j32o39J079q46j10J099j217
$$ -181 -338 899 -466 -16 714 -747 418 587 -695 387 255 -384 695 -151 -261 838 -379
5209c79L36P55j386J224j05j135J362p31n63J451j111j04J099j150O55M32j263
$$ -379 -43 712 -674 550 445 -690 672 -59 -622 829 -282 -386 713 -437 218 650 -613
5226f13J092j15j088J236m85m80J037r79J26R88j215M77M60j152R46m8r47J470
$$ -613 479 364 -724 512 27 -453 584 -395 -269 719 -496 -19 441 -711 235 187 -760 710
5244G10q97m37J186j008J64Q57j167P14O5q43R35k11o89R50n10l28J085j033M06
$$ 710 -187 -624 562 -446 -282 575 -592 122 187 -656 279 68 -621 329 -181 -509 576 -457 -51
5263e1N27j031N67M47j071J062k64n09Q52o67j26J082j205L31P21j175O29K37
$$ -51 476 -555 12 459 -612 450 186 -323 529 -138 -264 818 -387 -56 665 -510 119 356
5281C56q78J140m82n68J190r24k2N96q34R49Nj106R22K58j209J239n13n26J107
$$ 356 -522 618 136 -432 758 -166 -188 408 -426 523 528 -578 344 602 -607 632 119 -407 700
5300G00r79J95O68j074N78L89j092J063k94n81Q88o23k76J080j013J31Q44j261
$$ 700 -279 -84 584 -490 88 477 -615 448 154 -427 461 -162 -438 642 -371 -240 604 -657
5318f57P51K81j128J096l17o01R24o03j54R24j037L96O44j219Q95J35r15R26k87
$$ -657 94 375 -753 343 26 -575 349 -254 -408 516 -521 -125 519 -700 195 330 -585 341 54
5337E4o23R57p03k3R08r77L59M02r45P60J43q32R50j76l58O76o80K0Q19j055M39
$$ 54 -569 388 -315 -338 570 -407 -48 354 -591 169 312 -520 430 254 -104 572 -108 -88 731 -324 115
5358A15L67r31Q24j05p62J160l68q08J222r97Q1Q61j000L49M69j004P85j33o09
$$ 115 482 -449 375 270 -492 668 300 -508 714 -283 -202 659 -341 8 477 -527 258 125 -484
5377d84P38k27k36Q43p78j90P11o98M01M70j176Q03p7p65J136q20l7O14p23K82
$$ -484 254 27 -209 634 -144 -334 377 -321 80 550 -626 177 100 -665 471 -349 -386 228 -495 -213
5397b13O01q34K80L72q49R44l21n54R22n42k58J110j060K44O64r72N46R7q60J006
$$ -213 388 -446 -166 206 -643 301 -20 -574 348 -194 -452 658 -402 -158 506 -466 80 177 -683 323
5417C23k06o33J110q04pQ04q81P7R53j430Q64N4n39N54l7n04J089p41j36O13p83
$$ 323 117 -516 594 -210 -217 587 -294 -217 736 -694 170 224 -315 239 202 -302 787 46 -90 523 -260
5438b60J93O67j075Q11j80o18Q94n1q28R30n16j08N80r38N17N30q55M31R7r44
$$ -260 -67 600 -475 336 156 -462 432 381 -447 483 -33 -141 439 -499 18 548 -307 124 221 -723
5458g23J157m97m31Q79n98J05M71r01N06m6m23N54k38j61O41l98l30Q18n66j72
$$ -723 434 -63 -494 385 -213 -108 363 -538 -32 -78 -501 53 -185 -346 295 -103 -433 385 -181 -353
5478c53P10j037P48L5q11P47K7n93Q08l70k35O69n67K40K47o75M48J81n54O68
$$ -353 357 -680 68 103 -708 39 66 -527 281 -89 -324 345 -222 18 265 -410 38 219 -335 333
5498C33o57j57J015n91j96O94p20L24N75j020K60M89o65Q37l94k99N29l44j19
$$ 333 -324 -481 534 -57 -253 441 -279 45 620 -400 -140 349 -316 521 127 -172 357 13 -106
5517a06M25m35M31Q7o84M20P1o71Q48m10j78P75o58j80P56q06K97M28q63M97q0
$$ -106 319 -116 315 402 -282 138 209 -462 386 -24 -202 573 -85 -265 491 -315 -18 410 -453 44 -36
5538c6l55P08l31l00L35j98q1M49n53K34K90o42Q05m52l25P30m18n9M70m50P4
$$ -36 -391 317 -14 -314 21 -177 -258 191 -362 -128 162 -480 325 -127 -452 278 -140 -199 271 -179 -105
5559a05M11q61M11L48o64N69j02l97P14n70J79M63o08J98K13m61J96L84o58O43
$$ -105 306 -555 -144 204 -460 109 7 -390 324 -246 -67 396 -212 -14 199 -262 -66 318 -340 303
5579C03j35l24O49l34k19N17o62K76K61n54L47J57o85O74k13j69N54m27r3K35
$$ 303 168 -156 493 159 -60 457 -205 71 332 -222 125 282 -403 271 58 -111 443 16 -77 158
5599A58k22K31J59m91K98p9m04N26k53j71O21n42j06O30o57L32J55m61M43J69
$$ 158 -64 167 326 -165 133 54 -350 176 -77 -248 373 -169 -275 355 -302 30 185 -276 167 336
5619C36o10L48j74k79O66n47p8M38l49K17k4l72L78K91o16N73k85p6M32k98j46
$$ 336 -274 74 -100 -379 287 -260 -338 100 -249 -32 -56 -428 -50 241 -375 198 -87 -163 269 -29 -175
5640a75M84o28L78L13o07L44k11q1N58l66j81N05m60q1N07l60N2L27n32N12l1
$$ -175 309 -319 59 372 -235 109 -102 -183 375 9 -172 333 -127 -208 299 -61 -9 318 -214 298 267
5661B67k54K33j18j97K62k49J9M44m92K95o7l71N16j00m81O86m43k21M10k89O7
$$ 267 13 246 128 -69 193 -56 -37 407 -85 210 143 -228 288 188 -293 393 -50 -271 139 -150 -83
5682h3K65m24K36q9j04K12j46jJ65mj59L44m59P0J87l23K86J43l47K12k20j61
$$ -83 182 -242 -6 -95 -199 13 -133 -134 31 27 -132 212 -247 -177 10 -313 -27 116 -231 -19 -239 -400
5704d00M87j48q5J41k22N3K42j98j8L19l49L83k29k88L77nl57N12k62o4L20m11
$$ -400 87 -61 -146 -5 -227 -174 68 -130 -148 171 -178 205 -24 -312 65 60 -297 215 -47 -111 209 -202
5726b02L67j8m00N46l76j43O12r3l50L97k89r6K40l44K71R3k96M06j75k70M40
$$ -202 165 147 -253 293 -83 -226 386 293 -57 340 51 -45 195 -149 122 215 -81 325 150 -120 320
5747C20m83J08K85k93K91M1n25K83o0j28K39j46k77O87l70k65O00l50qK66m18
$$ 320 -163 -55 230 -63 228 269 -256 27 -33 -161 78 -68 -345 342 -28 -293 307 -43 -51 215 -203
5768b03J23O2l19N40j57j43J34k35N8J14k87K80Lm60N13o5m09O18l29r0M76r8
$$ -203 -80 -18 -337 203 46 -97 37 -198 -140 -26 -313 -33 -30 -490 23 -42 -451 167 -162 -252 224 126
5790A26l40N88o20J74L58n68L85K6k55K36N8j98L15n05L61K98m98J65Mj56J53
$$ 126 -214 374 -246 -72 286 -282 103 129 -126 110 168 -30 285 -220 141 439 -59 106 110 -46 107
5811A07q1j87N56n61J31J56j92L70j46l64K19K30k69L21l2m84M71l33l3L20m16
$$ 107 26 -161 395 -166 -35 121 -71 299 153 -211 8 238 -31 290 258 -226 245 -88 -121 199 -217
5832b17L15K13n18N4L72m38K52J92m79M26l38q0M25n38K20J64l06K00K4r4K26
$$ -217 98 311 -207 -153 219 -219 33 225 -254 172 -166 -246 179 -359 -139 25 -281 -81 -57 -151 75
5853G5O4k74K55m77J55J67k2j69K60j93j02L29l77M46k10j93N28j06j86K71l88
$$ 75 139 -135 120 -357 -202 -35 -57 -226 34 -159 -261 68 -309 137 -73 -266 262 156 -30 241 -147
5874a47K87L42o70K43R5l03M30j70j86M01m43O5K93l79L97J25m08J66l3m46M72
$$ -147 140 482 -188 55 150 -153 277 107 -79 322 -121 -56 237 -142 255 380 -28 138 105 -341 131
5895A31nk06N43m27j79N47m78R4J37k62L37M6m01K03L7n07N51o4j21K04m09K24
$$ 131 126 -80 463 36 -143 404 -74 20 157 -105 232 278 -123 80 117 -390 161 97 -24 180 -229 -5
5917eJ59m32M18o2k98M73l17p4L90l33L9K57o38M01K88m24J54J20l29L22k65P
$$ -5 154 -278 140 78 -220 253 -64 -138 252 -81 -42 215 -423 -22 266 -158 -4 116 -213 109 -156 -149
5939a49K97l07J14J91j80M7J0r9%oj19K95n6m05P11n84J28L58m53M25J63n85K94
$$ -149 148 -159 -45 146 -34 13 23 -76 -76 -82 -201 94 38 -367 344 -240 -112 246 -207 218 381 -204 90
5962I0K1k44M44j41m84O10n32J51L60m78L39J84o83L92M3k39L96l41J28J97m20
$$ 90 111 -133 311 170 -314 296 -236 -85 275 -203 136 320 -363 29 72 -167 229 -112 16 213 -207
5983b07M2L40l51K95J50m61M04k40l07L64l24K02L65n05K36J41m86N24K83o92
$$ -207 -165 175 -176 119 269 -192 212 -28 -335 29 -295 -93 272 -233 3 144 -342 182 465 -227
6003b27M53l32l90M86Ok10N25l12j44M20m31J99Q9l52L77R7m83N54m59K7L96m12
$$ -227 226 -106 -496 -10 -4 -214 311 -1 -145 275 -156 43 132 -220 157 254 -229 325 -134 -107 289 -123
6025a23O7K83l21K81p8l88N34pk90L68m46K55J79k86n7J08m45N78J23m69M68j51
$$ -123 -56 227 -94 187 109 -279 255 248 -42 326 -120 135 314 28 -29 79 -366 212 335 -134 334 183
6047A83k52L74k98j00M58n87K21R7l94L73p7k11L02j80J7K93l71J26Q4m81O74
$$ 183 -69 305 7 -93 365 -222 -1 96 -298 75 -2 -213 89 -91 -74 219 -152 -26 58 -423 251
6068B51k58k96O02l81k05L55m8j95K37k08p1M53n73J05L72m03K16l1k07M39k94
$$ 251 -7 -303 299 -82 -287 68 20 -175 62 -146 -217 236 -337 -232 140 -263 -47 -78 -285 154 -140
6089a40K12O5l89K13K31m85K78K02n72P29k00l70N41m54Q3L78l83L2K52k94K91
$$ -140 72 137 -252 -39 192 -293 -15 187 -385 344 144 -226 315 -139 -56 322 -61 -29 223 -71 220
6110B20J13o82P21k61l75N68l44j50N40m51J61J13k85L45n7l31L18k35j79N31
$$ 220 333 -349 372 111 -264 304 -40 -190 350 -101 60 173 -112 233 176 -155 163 -72 -251 280
6130B80k50q0L28k47MJ68n68N78j35l35L35l75j20N12j90j05M23m44K40J23m37
$$ 280 30 -50 278 31 35 203 -365 213 78 -257 78 -297 -417 95 -95 -200 223 -221 19 142 -295
6151b95K65J47n13M51j74j75N72n09Q1M21o19K59K90n65M63P1l99L41n3j32L85
$$ -295 -30 117 -396 55 -119 -294 278 -231 -150 271 -348 -89 201 -364 99 170 -229 112 59 -73 312
6172C12n55K13J45m23N58k31k62J70Q0k48N35k36k53L82m58K89J77k86L80j57
$$ 312 -243 -30 115 -308 250 19 -243 -73 7 -241 294 58 -195 187 -271 18 195 -91 289 132
6192A32m04O19p1n22O65l91l5L46m79K14M13p44M03q2k32K76r8k39O02o26L1K55
$$ 132 -272 347 276 -246 419 28 -7 339 -140 74 487 -257 146 64 -168 108 10 -229 373 -253 -222 33
6214C3k63L94K18p72M29Q7n75N31j42k43N84l64RJ84m50O05j43l72J47K10m70
$$ 33 -230 164 382 -390 39 126 -449 82 -60 -303 281 -83 -74 110 -340 265 122 -250 -103 107 -363
6235c63M68q7k24L79l91k8N96o10K68Q9l27J99N9m26P13l75q8M97l40j20N46p64
$$ -363 105 18 -206 173 -218 -246 350 -260 8 97 -230 -31 28 -398 315 -60 -148 349 9 -111 435 -329
6257c29M40j3l98O16l59j39O11n04k2M60o01R2L78l77J94K41n39O08k62l90P87
$$ -329 111 98 -300 316 -43 -182 429 -75 -97 363 -238 -146 232 -145 49 290 -249 359 97 -293 494
6278D94m82p1L70l62J7M04o16L92kn74N94l19N2M02m26m5M45n69K45K46n65K98
$$ 494 12 -59 311 -51 -34 370 -246 146 144 -430 164 -155 -103 299 -127 -172 273 -296 -51 195 -370 -72
6300g2M1l83O53o6o92Q47m50j77L72l1o0K97p48N90p3m12M74j53j0K45l18L1M08
$$ -72 -31 -414 239 173 -519 328 -122 -299 73 42 -18 279 -469 121 48 -364 110 -43 -53 192 -126 -95 313
6323C13l67K15J79m36M02l2n88M13j78o5M17m19O4L58l75K84N0m05K31O6k46M03
$$ 313 -54 161 340 -96 306 274 -314 99 -79 -144 273 -146 -82 276 -99 185 235 -170 61 127 -119 284
6345B84k09o8J11j14R0J80m75L60Ml99M56m2l66N81m13o7L66o83K11M75m02K36
$$ 284 75 7 118 4 94 274 -201 159 163 -236 220 178 -188 393 -20 -87 279 -404 -193 282 -120 116
6367A16j50l28N70l26Q2K17l26N2M09p94L44L17n75K64J12o31P17k0l75N53m26
$$ 116 -34 -362 208 -118 -36 181 -145 -93 316 -478 -134 183 -392 -128 -16 -647 70 50 -325 228 -198
6388a98j49P12o40K98K10m80K07n4j73N37l07k26N64m37K34K18o84N20M8l46K69
$$ -198 -347 365 -275 23 233 -247 -40 -94 -267 270 -37 -263 301 -136 98 316 -368 152 200 -146 123
6409A23J5j61J37k34O3N00n80K71Pm29L79J24m15L63j07k56O05l77jK64n24L92
$$ 123 138 -23 114 -120 -57 443 -137 134 141 -288 91 215 -200 163 56 -200 405 28 27 291 -233 159
6431A59Q6l34Q9K78m59M41j27j55L42l63J9K79m77K18K02m25L68j33k49L44k83
$$ 159 245 -89 0 278 -181 260 133 -22 320 -43 -24 255 -222 -4 198 -227 141 8 -241 103 -180
6452a80J65K53m10m9M20l51N7K25m38K44J64k53N24m87r2K79l17J86K65l78J26
$$ -180 -15 238 -172 -221 199 -152 -95 130 -308 -64 100 -153 371 -116 -208 71 -246 -60 205 -173 -47
6473d7L06n13L62Q2n78O41j82k12L73m64K19K75m94L53j2m62O95k14l10M87m88
$$ -47 259 -254 108 190 -388 253 71 -141 232 -232 -13 262 -232 121 109 -353 342 128 -182 305 -183
6494a83m8O65m76L6M93o56J93R7l01K11m3k25M95m37O5N48n21p8L02k58K25K4
$$ -183 -231 434 -42 -6 487 -169 24 121 -180 31 -12 -237 258 -179 -114 434 -87 -165 137 -121 104 128
6516A28k16J91P0m41M61n43J98L62n73L60R1l80L62j84j24K84k9m12N36k67j37
$$ 128 -88 103 173 -268 193 -350 -152 210 -363 -3 88 -292 70 -114 -238 46 17 -395 141 -126 -263
6537b63L06l47K80K89m40J60J60m64N52l33n2M68o28L07K65k19J25p6l34M99k5
$$ -263 43 -304 -24 265 -175 -15 145 -319 233 -100 -152 316 -312 -5 260 41 166 90 -244 255 230
6558B30l35K88k09LM08n32L57J80l17l9L83n53M24p8l73M24l63J23J13n25L55
$$ 230 -105 183 -26 -23 385 -147 210 390 73 34 417 -136 288 210 -163 261 -102 21 134 -391 -36
6579c6K31m18L05K36n67M23r1m39N20k02j03N53m23k3L55o24M40rm76M81k60J54
$$ -36 195 -223 82 318 -249 174 83 -356 164 -38 -141 412 -11 -34 321 -303 137 128 -348 133 -127 27
6601B7L48m15p9L65n35L08J70m95K50K7n5N4K7j06L39l70r9L65l12J43Q5j48K74
$$ 27 375 -40 -119 246 -289 19 189 -306 -56 -29 -84 -30 -3 -109 230 -140 -239 126 -186 -43 42 -106 168
6624A68n1l54M52k26j95M88l93L7N06p16M12j18m0L22k13l31N71m07K22J07l46
$$ 168 117 -237 215 -11 -206 282 -111 -74 432 -284 128 10 -30 292 79 -252 319 -88 134 241 -105
6645a05Q8K49n81N13m2m08N48k60n7K71l62R5K64m15J62J66m30L58O0m96N61k18
$$ -105 -17 232 -349 164 122 -286 262 2 -55 216 -146 -51 213 -202 -40 126 -304 54 114 -382 179 -39
6667c9l46N22k70j18N97n06K3M03m33K72%k52K66k72L5L55l69lJ64k71L75Q1n02
$$ -39 -385 137 -133 -251 346 -160 -137 266 -167 105 105 -147 119 -153 -118 237 -132 -135 29 -242 133 214 -288
6690b88M25l0l82M26l02k18O84m53L03mn45M05J56m21L96j99j09L78k56J42O1
$$ -288 137 107 -275 151 -151 -369 315 -138 165 161 -384 21 177 -244 152 -47 -156 222 -34 108 169
6711A69m21J97K15k46K71K51q17N79l07J24L11l99j29M01l43L37J43n28M14j29
$$ 169 -252 -55 160 -86 185 436 -381 198 -109 15 326 -73 -202 199 -144 193 336 -192 222 93
6731I3l15K62k12k15N33j63j49L64k91J06Q6m27L67K8o06M83N7m32O02k94n4M20
$$ 93 -222 40 -172 -387 146 -17 -166 198 -93 13 99 -328 39 67 -539 -56 1 -431 171 -123 -177 243
6753B43n10Q7L86m23K95o9l13N18k81k71N15l40L6K57l60J97L76o04K84N5m53
$$ 243 -267 -180 206 -217 78 9 -304 214 -67 -338 177 -163 -127 130 -230 -33 343 -261 23 78 -375
6774c75N49m04J20K50l34J68K46n10L73M8j82J51K9k58N09m85k9M04k91J16J66
$$ -375 174 -230 -110 140 -194 -26 220 -290 83 131 -51 100 129 -129 380 -105 -134 270 -21 95 261
6795B61n80M74M3m08K98l7k16O54n34QJ90k87J11L57m75M25k41l70M99j32k09
$$ 261 -319 155 198 -210 88 51 -165 489 -45 -37 153 -134 -23 334 -141 284 43 -327 172 40 -169
6816a69K89k84O2K83k70M8q5J5J36j24k53K43J02j64K24k39R0L30m19M25j46l85
$$ -169 120 -164 -102 181 -89 -41 -126 -111 25 -99 -352 -109 -7 -171 53 -186 -96 234 -185 240 94 -291
6838b91N06k52k71N73k81N8K15m41J23K48l28J79J12k24J47n8n4N08n45M7J85
$$ -291 215 -37 -308 265 -16 42 257 -184 -61 187 -141 38 150 -74 73 15 -39 469 -76 -29 156
6859A56k16J56K23o11M76P1m67L03M0m53Q13o09o5M16k87J35R7l42K47m2m0J11
$$ 156 -60 96 319 -292 184 255 -212 91 131 -322 491 -118 -183 233 -54 81 178 -164 83 41 1 112
6881A12j14j46K95k18o9L62m74K09J88l25J15J24l33M37k70r7N02l25j44K53l14
$$ 112 -2 -148 147 -71 -140 222 -252 -43 145 -180 -65 59 -274 163 -107 -204 298 -27 -171 82 -232
6902b32J63K14l65K88o0n5J09j69J1L07j83j84M28o54M15K2n4J58k53j93N71k55
$$ -232 -69 145 -220 68 8 -47 62 -107 -96 211 28 -156 272 -382 33 55 1 159 -94 -287 284 29
6924B9j86L09k67LM66o51J44L30m51N32Qm22K36k30J05K63l92J86O1k03K52K9
$$ 29 -157 152 -115 -112 354 -297 -153 177 -274 258 266 -156 80 -150 -45 218 -174 12 73 -130 122 151
6946A51l49L17r8kK58j52k21L71m92J71J87k57L08j88j80L96j12k96L85r0l3K22
$$ 151 -198 119 21 19 277 125 -96 275 -217 -46 141 -116 192 4 -176 220 108 -188 197 107 74 296
6968B96m66K71p7m66M51J26l76N60n38j68N74l04J02M7j67P5K22m55K26P7l66
$$ 296 -170 101 24 -442 9 135 -241 319 -219 -387 187 -117 -15 32 -135 -60 162 -293 -67 10 -356
6989c56N07k58j28K83p2j96N23m37K09J84m40L12j2l26L03j32QK86m38L8J97k41
$$ -356 151 -107 -235 48 -24 -220 303 -134 75 259 -181 131 119 -207 96 -36 -28 258 -180 -142 55 -186
7011a86J55K38j64J33j84k47L26k34K16J75k12k6Q0j15K84m9q1j22j3RP9K1p4
$$ -186 -31 207 43 176 -8 -255 71 -163 53 228 16 -10 70 -45 239 190 109 -13 -26 -17 62 83 9
7034IK27m17N8K31k24J76O7m68M49j91K0K96m14K21K83m24J03J87n37M60o4l61
$$ 9 236 -181 -123 108 -116 60 127 -341 108 -83 -63 233 -181 40 323 -101 2 189 -348 112 48 -313
7056c13M97k39o5J68k14LJ02k22M14j02l28K67J61l44K68r5j86M14l22P5K26k11
$$ -313 184 -55 -120 48 -166 -163 -61 -283 131 29 -299 -32 129 -215 53 -42 -228 186 -136 -61 165 -46
7078d6J47J13j10R5l14NM55m50J86j6j53kK88m01J64J40r3L03k98j10J93j87J75
$$ -46 101 214 104 199 -115 -110 345 -105 81 65 -88 -90 198 -203 -39 101 8 311 13 -97 96 -91 84
7101H4R5j38o1K53l69K40l2j58L40k89j00K93q7j38J46k13K80l3n28L55J03j65
$$ 84 179 41 -20 233 -136 104 72 -86 254 -35 -135 158 71 -67 79 -134 146 113 -415 -60 43 -122
7123a22J94n7k51L42j29j38R9j13L76p8l50J69R5j54J77j79J33l04J58k87M01
$$ -122 72 15 -236 106 -23 -161 -62 -175 201 123 -227 -58 37 -117 60 -119 14 -290 -132 -419 -18
7144a8j41J58j7m1J57j24j2J93k19J25R4p2j35K10j12J92j31j58K76r6k32J90
$$ -18 -159 -1 -18 -59 98 -26 -38 155 -64 61 155 83 -52 158 46 238 107 -51 225 129 -103 87
7166H7N4j58L29m50Q4K18l57L38l0k60K89j15k05L31q3k9K0p9O4k4r8L10j14j53
$$ 87 141 -17 312 -138 -54 164 -193 145 115 -145 144 29 -176 155 72 43 63 -16 48 24 -74 236 122 -31
7190c1N0J71l49L70k80j90N35m10Q5M9n1m8Q5l4P1j2k50J53Q5N0k5m9o4J13L9
$$ -31 19 190 -159 211 -69 -259 276 -134 -49 0 -51 -99 -14 -48 23 11 -239 -86 -1 49 24 -25 -89 24 63
7215F3p5K7j04J32l1j99K81k89K02N4j92j15K73j12K91jj17J01j32j61K72l14
$$ 63 -12 15 -89 43 12 -187 94 -195 7 61 -131 -246 27 -85 206 205 88 189 57 -104 168 -146
7237a46JL97l30J09J46l78K88J57l21K45o0q8J00j64L4L23l31k9MJ29J13l38K15
$$ -146 -145 252 -78 31 177 -201 87 244 -77 168 108 20 120 -44 -10 313 -18 -47 -43 86 199 -139 76
7260G6J7j26p3L90l43J36N8l08J5K70k34L41k81M0J86j52p6J01k20K54j56j31
$$ 76 93 -33 -106 284 -59 77 135 -173 -158 112 -122 219 -62 -22 164 12 -64 37 -183 71 -85 -216
7282b16K18j36M0j03J09k01K67j51l1L59k91J12R4k9k6n0k16L72p0k98L43k29
$$ -216 2 -134 -94 -197 -88 -289 -22 -173 -204 155 -136 -24 70 41 15 -35 -251 121 51 -247 96 -133
7304a33p4M15m13J28J24p9P0m6j86M28Q1m18K68o4k22L59k52K14J10m27n7L93
$$ -133 -207 208 -205 -77 47 -32 38 -8 -194 234 315 -103 165 101 -121 238 -14 200 310 -117 -174 219
7326B19j92J37j82k06M33k22J41K8m19K33K27m08K49k86Q3J81n7p9O5O1p3K5j69
$$ 219 27 164 -18 -224 209 -13 128 156 -263 -30 197 -211 38 -248 -165 16 -41 -120 -55 6 -67 -42 -211
7349b11K67j09J4M6J88m29L99l54K61K27o52M71j93N2k12K68k61K69mo8J37k20
$$ -211 56 -53 -39 7 195 -234 165 -189 72 299 -353 118 -75 -23 -235 33 -228 41 37 -31 106 -114
7371a14j36L45l46L2K71k47J62Q7j46K2N9j69K83k10o7J38N1m5K18j82L7l0j48
$$ -114 -250 95 -251 -219 52 -195 -33 54 -92 -70 -11 -180 103 -107 -174 -36 15 -30 188 6 43 13 -135
7394a35J72J10j98J76j27J66J0k01P8J5K0Qj00n0J67j85M1P2J7M2j76j06J88J30
$$ -135 37 147 -51 125 -2 164 174 -27 51 66 86 94 -6 -56 111 -74 -33 39 56 98 -78 -184 4 134
7418A34k57J85N5k73J00L18k63j9p1L6MJ50n5Ok32J71J51j88n4R5MR6j06M4O4
$$ 134 -123 62 117 -156 -56 262 -1 -20 -91 -55 -51 99 44 50 -182 -11 140 -48 -102 -7 -3 93 -13 31 95
7443I5j84P8Q8k30K66p0L6PO9j81M6n2k7J58k14L87j9j85l9N1n3r7K06j69L15
$$ 95 -89 -11 77 -153 113 43 79 86 155 -26 20 -32 -59 99 -115 272 253 68 29 80 27 -70 136 -33 282
7468B82j68q1P1l2P5r8k17J22O8j34M25m12J18K7K8M3q0j69K41J4k31J17J19j78
$$ 282 114 33 104 72 147 49 -168 -46 22 -112 313 -99 19 46 74 117 37 -132 109 123 -108 9 128 -50
7492e0J87m7k75J56R8j34J0q7J20M1n9J62k70q5J59j5j5K29j99m4J69j21L2r8
$$ -50 137 90 -185 -29 69 -65 -55 -142 -22 19 -40 122 -148 -233 -74 -89 -104 125 -74 -118 51 -70 -38 -136
7516a36j04L31j12jP1j66J25%K6o0K9j40J00J15k85K21J5k54J77r6J39K23l06
$$ -136 -240 91 -21 -22 49 -117 8 8 34 -26 3 -137 -37 78 -207 14 29 -225 -48 -144 -5 218 -88
7539h8N1J62j03Q0k7KK0p3M5J7j66J7J91K1k7p7q2J47k31Q1J02p1j7K45l65J57
$$ -88 -37 125 22 102 75 77 97 24 69 86 -80 -63 128 149 122 45 -37 110 -121 -40 62 -9 -26 219 -146 11
7565A1n8J09p7M0r6P9o5j40M5Q9M1K15l35J71O8k73J70j4j52M16l11k13L81j38
$$ 11 -47 62 -15 25 -71 8 -57 -197 -152 -63 -22 193 -142 29 97 -176 -6 -20 -172 244 -67 -280 101 -37
7589c7k7j00j26K60J06k51J90K9j56J66j52p0M24k01j12J03P0J24l2k43O2J63
$$ -37 -64 -164 -290 -30 76 -175 15 44 -112 54 -98 -168 256 55 -57 46 116 240 208 -35 27 190
7611A90q2j60K79j82j07J35Q4j06n8K18j51k99L69J69l87j5P1j3Q0Q4n6O0m7p5
$$ 190 108 -52 227 45 -62 73 157 51 -7 211 60 -239 130 299 -88 -103 -32 -45 35 119 63 123 76 1
7635AO8k09K23ln5J39l7r2j45K08j82K21k74J75J28k01n4L23l66J28o8L7P3j16
$$ 1 69 -140 83 80 25 164 127 35 -110 98 -84 137 -137 38 166 -35 -89 234 -132 -4 -72 -35 38 -78
7659g8MJ39j72O5J22o7o6K08k92L22j96L5pj63m4K18q7N8N9k90L42q1j4K3M0o6
$$ -78 -74 65 -107 -42 80 13 -53 155 -137 185 -11 24 17 -146 -190 28 -59 -1 58 -232 110 29 15 38 78 12
7685A2P7q9K04Qk89J42j5k08J48J24k28K87j37L7K4j45R3J0n1J64O3l33L42k28
$$ 12 89 0 204 212 -77 65 50 -158 -10 114 -114 173 36 73 97 -48 45 55 4 168 231 -102 240 12
7709A2J21n9j12O7J64k76J32J12k43J29L4k02K94N4l49K12l83J54J16m0J1K7J5
$$ 12 133 74 -38 29 193 -83 49 161 -82 47 81 -121 173 227 -122 90 -293 -139 -23 -63 -52 -25 -10
7732a0J00P4k18K6R7o6J23p4j95K94J9l00J44l76M64J4l57K41o8O4J86j94j22
$$ -10 90 164 -54 -28 69 3 126 52 -143 151 170 -130 14 -362 102 116 -241 0 -68 -4 182 -12 -134
7755a34L00k82R9J02k36K65j27k83L40J62l81M02m3j99K88l52J08j54K27j4j6
$$ -134 166 -116 -17 85 -151 114 -13 -296 44 206 -175 227 184 -15 273 -79 29 -125 102 88 72
7776G2j03J88k4j84K60l56Q4J38l0j75M1k04L44j67j08K64j0l5K00m00L71j16
$$ 72 -31 157 133 -51 209 -147 -63 75 45 -130 -89 -293 51 -116 -224 40 30 -5 195 -205 166 50
7798E0q8j04L23l08J09j63M4J66qj15K12k12J24Jj05j4M7j91J20Q1p6O1J8j54
$$ 50 -38 -142 181 -127 -18 -181 -137 29 21 -94 118 -94 30 31 -74 -88 -41 -232 -112 -31 -107 -46 -28 -182
7822a82L33k05J17r4k73K51J16p8R6p8j90Q2K38j9j32j89K12n1J39J27r4l16J98
$$ -182 151 -54 63 -31 -304 -53 63 -15 81 3 -187 -105 133 114 -18 -207 5 -46 93 220 126 -190 8
7845HK2j48L40j98j2n9P9j67L35j49M2P2k84J74q2j53K69k48L52k9k03J38R2j36
$$ 8 30 -118 222 24 12 -47 32 -135 200 51 93 165 -119 55 -27 -180 89 -159 193 164 -39 99 191 55
7869E5q8R5l14L36j65Q6K50n04K93n3k20L21j32l5J56J18l19L7J4q0L80l62n7
$$ 55 -33 62 -252 84 -81 5 255 -249 44 -9 -229 92 -40 -75 81 199 -120 -83 -69 -149 231 -131 -188
7892a88K23k86J73j25J32J00Q7m12L48j26j56K13k77K22L84l54Q6j94P4j0K10
$$ -188 35 -251 -78 -203 -71 29 116 -296 52 -74 -230 -17 -294 -72 312 -42 44 -150 -76 -86 124
7913A24k62K86K8j97J56j45Q1o5j83K98j17K5J18j73K16Or6o5J70k11M8J81k89
$$ 124 -138 148 176 -21 135 -10 71 6 -177 121 4 29 147 -26 190 196 100 35 205 -6 42 223 -66
7936f6P8N1m44N71j37q1K19k56K83l37R6k1j7l8J63L1l09K48m6p4K15l4k1j16
$$ -66 12 63 -381 190 53 -28 191 -65 218 -119 -23 -44 -61 -99 64 95 -214 34 -12 -86 129 95 74 -42
7960d2k23K09j46K01J12k64J05L34l72KL79l36K1J45j43jL3l09N28l26J68p5j12
$$ -42 -265 -56 -202 -1 111 -153 -48 286 -86 -84 295 -41 -20 125 -18 -19 14 -295 233 -93 75 0 -112
7983a12q6N00o28J00L13k53L62j49m4qK3q0Q4np7K93l58K36n6j74K17n7l3K2J2
$$ -112 -198 302 -326 -226 87 -166 196 47 3 -5 18 -62 22 17 -60 233 -125 111 55 -119 98 41 8 30 42
8008D2j35K73k21qK98k62j38J78r1l5J30k66K42j1j49J80n3p4K65j91qK30m35
$$ 42 -93 180 -41 -49 249 -13 -151 27 -64 -99 31 -235 7 -4 -153 27 -26 -100 165 -26 -34 196 -239
8031b39J97L7o1J68K7k86K38j23J09L6j78N8J72m20L73Oj21L5J70j71l5j61L6
$$ -239 -42 -5 -66 102 129 -157 81 -42 67 103 -75 -17 155 -265 108 114 -7 28 198 27 -8 -169 -133
8054a33K37k71P8J20j23L72k47j23L75k74j59K00l3K2J83j08j15P9k91M73j01
$$ -133 104 -167 -89 31 -92 280 33 -90 285 11 -148 52 19 41 224 116 1 80 -211 262 161
8075A61o3J51l09o1K34p1m5N6l74N67J04m77K97j34M5R5ml02J66j57R7J91k70
$$ 161 98 249 -60 -121 113 42 -3 53 -321 246 350 -127 170 36 81 176 172 -130 36 -121 -24 167 -103
8098a03L07k59q8L61k61j03J98j20P5Kq2J17J48k69kJ3R3J15k66JK98k87J17J37
$$ -103 204 -55 -143 218 -43 -146 52 -68 7 9 -73 44 192 -77 -79 -66 27 142 -124 -123 175 -112 5 142
8122A42j98j20J36k31M24k13l9M1O3J55J9m28M45l3k33J83j19n9lJ61k12K76k36
$$ 142 -56 -176 -40 -271 153 -60 -99 -58 5 160 179 -249 196 163 -70 113 -6 -65 -68 93 -119 157 -79
8145g9O5J09k39K19p8K3J2L3j54J36q4o3K25j36J6m1jK11J58l92R4j5r8L04l4
$$ -79 -14 95 -144 75 -3 20 32 65 -89 47 -37 -100 125 -11 5 -36 -37 174 332 -60 34 19 -79 225 191
8170A91k23K11l93K26J02j43k16K98j85K68j81l10L25P7R1l19J60l6o5k76L76
$$ 191 -32 179 -214 12 114 -29 -245 53 -132 136 -45 -355 -30 47 138 -181 -21 -57 -122 -398 -22
8191b2
$$ Imaginary data points
##PAGE= N=2
##DATA TABLE= (X++(I..I)), XYDATA
0@%%%%%%%%qJ6k3L1l2M0n6P2r5J19j44J75k07K48l02L62m26M98n80O76p84R06
$$ 0 0 0 0 0 0 0 0 0 -8 8 -15 16 -16 24 -32 40 -55 64 -80 95 -112 136 -166 196 -230 268 -312 364 -420 486
30D86j044J195j361J544j748J976k230K510k813L144l508L903m337M816n338N905
$$ 486 -558 637 -724 820 -928 1048 -1182 1328 -1485 1659 -1849 2054 -2283 2533 -2805 3100
46C100o522P195p932Q743r634J0611j1688J2880j4202J5678j7340J9230k1394
$$ 3100 -3422 3773 -4159 4584 -5050 5561 -6127 6753 -7449 8229 -9111 10119 -11275
59a1275K3891k6816L0301l4533L9804m6576N5628o8422Q8085j23482K89309r00773
$$ -11275 12616 -14200 16101 -18432 21372 -25204 30424 -37998 50087 -73395 215914 -684859
71f84859P81676K70532j175091J473337n96476o25360J262679j008211j07185
$$ -684859 96817 367349 -807742 665595 69119 -556241 706438 -301773 -408958
80d08958J092909j175532N28086M38222j138500R61765j7558q92562J114326n66001
$$ -408958 683951 -491581 36505 474727 -663773 297992 280434 -612128 502198 -63803
90f3803m08540J039962q78823J48660P69936j154799N46599L84513r46090Q92584
$$ -63803 -472343 567619 -311204 -162544 607392 -547407 -808 383705 -562385 330199
100C30199j47590p29067J024443n71939l11200R43737q38735J36366O38428r38114
$$ 330199 182609 -546458 477985 -93954 -405154 538583 -300152 -163786 474642 -463472
110d63472N75406K27736q80037Q35825j86809n85838R47086n64834j78770P94514
$$ -463472 111934 339670 -540367 295458 108649 -477189 469897 -94937 -273707 520807
120E20807r17352K55356O24461r15523N98084J37552q32373Q69832k60693n29205
$$ 520807 -396545 -141189 483272 -432251 165833 303385 -528988 340844 80151 -449054
130d49054R40376o04249j56386P45136q12832K95183M58224q55307O09637O6513
$$ -449054 491322 -112927 -269313 475823 -337009 -41826 416398 -438909 170728 237241
140B37241o93769Q03052l06115l79819P85069o58877k159O80480p97339L36028
$$ 237241 -456528 346524 40409 -339410 445659 -213218 -215377 465103 -332236 3792
150C792L54072p99712O35699j999o33474P98226l40800l64750P61587n90747m451
$$ 3792 357864 -441848 193851 191852 -441622 356604 15804 -348946 412641 -178106 -182557
161a82557N75985p25157L43485K97320p06717N74241k7460n08768O61423l74101
$$ -182557 393428 -331729 11756 309076 -397641 176600 149140 -359628 301795 -72306
171g2306k01238O74649o06997P0349M70527o73077M01566J81045o38675O20901
$$ -72306 -273544 401105 -205892 -135543 334984 -338093 63473 244518 -394157 226744
181B26744j18471m72304O75488l79652j66669N98058n91560J36847M15417o40951
$$ 226744 108273 -364031 311457 -68195 -234864 363194 -228366 -91519 323898 -317053
191c17053L89052J41427n43845N43874j68855l33576O12831m13242r5828N02905
$$ -317053 71999 213426 -330419 213455 44600 -288976 323855 -89387 -185215 317690
201C17690n44030K02059K98722n83124M34001N0260m98381N57896k02903k89495
$$ 317690 -226340 -24281 274441 -308683 125318 175578 -322803 235093 32190 -257305
211b57305N69782m25203l7875M67293n42167K09361K72442n35315L98461J1637
$$ -257305 312477 -112726 -150601 316692 -225475 -16114 256328 -278987 119474 131111
221A31111m07103N20017k46732k21473N07750m17948L6645L75160n24733K80822
$$ 131111 -275992 244025 -2707 -224180 283570 -134378 -97733 277427 -247306 33516
231C3516J82219n16250M52674m9095l82477N27579k84238j78441N02825m42434
$$ 33516 215735 -300515 152159 103064 -279413 248166 -36072 -214513 288312 -154122
241a54122N1867L68140n05650K63847J59260m53828M19300p8849l20296M71434
$$ -154122 -102255 265885 -239765 24082 183342 -270486 148814 69965 -250331 221103
251B21103k73551j12031M12421m14746J14022K72126m61142L09250P5357m01896
$$ 221103 -52448 -164479 247942 -166804 -52782 219344 -241798 67452 142809 -259087
261b59087M30310j38485k57348M61638l18705o2345L99973m31875J35563K53869
$$ -259087 171223 32738 -224610 237028 -81677 -144022 255951 -175924 -40361 213508
271B13508m40000L05555M8901l66348M09349j43068k18159M10382l04216j6797
$$ 213508 -226492 79063 127964 -238384 170965 27897 -190262 220120 -84096 -100893
281a00893L27466m00618J79022J78915m01668L24588r515l12778M05688j94364
$$ -100893 226573 -174045 4977 183892 -217776 106812 97297 -215481 190207 -4157
291d157j65142M00471l32981J3821L08701l92844J85554J52812l76520L14368
$$ -4157 -169299 231172 -101809 -87988 220713 -172131 13423 166235 -210285 104083
301A04083j8650k82140L66576j85043j26929L40527l06074M8839K41728l55281
$$ 104083 85433 -196707 169869 -15174 -142103 198424 -107650 -58811 182917 -172364
311a72364K05879R3542l26480L18898p4700k28361L62825k27550q3226L30250
$$ -172364 33515 127057 -199423 119475 44775 -183586 179239 -48311 -131537 198713
321A98713l25160P6049K24726l56818K20990P8661l15114L12859q0854k03346
$$ 198713 -126447 -50398 174328 -182490 38500 117161 -197953 114906 34052 -169294
331a69294L33643k19772n1636K83100l05630J04920J73470l22391K35933K4109
$$ -169294 164349 -55423 -107059 176041 -129589 -24669 148801 -173590 62343 86452
341H6452k66298L14112j27743j53985L22864k46661j2852K60786l12073J31184
$$ 86452 -179846 134266 6523 -147462 175402 -71259 -84111 176675 -135398 -4214
351d214J49018l12771K39927J0213k45661K93998j23394j32031K84274k25776
$$ -4214 144804 -167967 71960 82173 -163488 130510 7116 -124915 159359 -66417
361f6417M694K16453k76356J35315J02276k63309K32598l2386j94749K81302j56438
$$ -66417 -61723 154730 -121626 13689 115965 -147344 85254 52868 -141881 139421 -17017
372a7017q9159K67124k45551L9237J98178k86962J56015R1330k66249K36013l2297
$$ -17017 -106176 160948 -84603 -45366 152812 -134150 21865 113195 -153054 82959 50662
383E0662j90979K67373j47150p9340K42334k26436M4851J63880k51591J56288
$$ 50662 -140317 127056 -20094 -99434 142900 -83536 -38685 125195 -126396 29892
393B9892N1237k24019K33099o9340j48579K55172j72936l6885K21053k41518P8009
$$ 29892 81129 -142890 90209 20869 -127710 127462 -45474 -82359 138694 -102824 -24815
404b4815J45033k55111J71926L7839k16035K31153p3511j34989K38366j62131
$$ -24815 120218 -134893 37033 74872 -141163 89990 16479 -118510 119856 -42275
414d2275k9119J93294k12447P8128J09799k14799J65649N120j71515K12354r7257
$$ -42275 -71394 121900 -90547 -12419 97380 -117419 48230 53350 -118165 94189 -3068
425c068q7246K11176j79807J2840J68798k22085J06707Q8162k14940J83041j1668
$$ -3068 -90314 120862 -58945 -46105 122693 -99392 7315 95477 -119463 63578 51910
436E1910j68097K17205j01019q5821K03914j68912J1587J51016k01381J02583
$$ 51910 -116187 101018 -1 -85822 118092 -50820 -39233 111783 -89598 12985
446A2985O8373j85287J66359k8528j28931J92125j17355m7301J79328j77009M2173
$$ 12985 81358 -103929 62430 33902 -95029 97096 -20259 -67560 111768 -65241 -23068
457b3068J21282j97651J26987M1277j80003J78548m1786j22399J89459j18165
$$ -23068 98214 -99437 27550 68827 -111176 67372 25586 -96813 92646 -25519
467b5519m0125J67098j65229M0787J04617j71167J14055K4005j43217J56419n6189
$$ -25519 -65644 101454 -63775 -22988 81629 -89538 24517 48522 -94695 61724 5535
478E535q5263J64031j24100p446J35970j63004O8524P7064j66492J29650P466
$$ 5535 -79728 84303 -39797 -47243 88727 -74277 -5753 71311 -95181 34469 41935
489D1935j34900J60781o7410p5958J61190j22718l971J24691j49717O6422O4480
$$ 41935 -92965 67816 406 -75552 85638 -37080 -41051 83640 -66077 345 64825
500F4825j46192J19628n353j07545J43751p7381m7164J38263j25748K2794R8377
$$ 64825 -81367 38261 32908 -74637 69114 -8267 -55431 82832 -42916 -20122 78255
511G8255j49119Q9672L9336j41683J37306k7212j01491J53439r0410m1738J38431
$$ 78255 -70864 18808 58144 -83539 53767 26555 -74936 78503 -11907 -53645 84786
522H4786j28610K5727R4451j42294Q1085L4204j18460J17691l5988p2245J28095
$$ 84786 -43824 -18097 76354 -65940 15145 49349 -69111 48580 12592 -59653 68442
533F8442q9467j5838J04063j18419N1331N7944j31105J00070O200j04398J23617
$$ 68442 -21025 -36863 67200 -51219 112 58056 -73049 27021 33221 -71177 52440
544E2440n2832n8339J26154r8493o626J03376j17554M5577N4985j13096Q8074
$$ 52440 -392 -58731 67423 -31070 -37696 65680 -51874 -6297 48688 -64408 23666
555B3666k08q7938J09674m6216m6174R8993q4857J2403P6341j10263N7575L9015
$$ 23666 23458 -64480 45194 -1022 -47196 51797 -33060 -20657 55684 -54579 2996 42011
567D2011j01083Q9431j5160p4986J14851n9968m2735J06593q9032R959P7662j06465
$$ 42011 -59072 30359 15199 -59787 55064 -4904 -47639 58954 -30078 -20119 57543 -48922
579d8922N4506L8248r8473Q4083r472o7558R5579n5445k2290Q4738q6945K4779
$$ -48922 5584 43832 -54641 29442 19970 -47588 47991 -7454 -29744 54994 -31951 -7172
591g172N6518r2863O3409R358q0809R4936l3517n4414R7969o8649r935Q1708r4052
$$ -7172 49346 -43517 19892 29250 -51559 43377 9860 -44554 53415 -15234 -25169 56539 -37513
604c7513L1238N4991r4455O1774J2032p6470Q2139k7455m4203P9580n8614m268
$$ -37513 -6275 48716 -45739 16035 28067 -48403 33736 6281 -37922 41658 -16956 -21224
616b1224O1909p4231L3859K9176p3805O5526o823n9681P8894l9787k7319P7195
$$ -21224 40685 -33546 313 29489 -44316 21210 14387 -45294 33600 -6187 -33506 43689
628D3689p0114M114O4339p8793L5256L0886p5573O4715k548n9505P1854l2830
$$ 43689 -26425 -22311 42028 -36765 -1509 29377 -46196 18519 15971 -43534 28320 -4510
640d510k4782O6590o1284R185M9756o8896M0201J6315o1392O3368j7126m2217
$$ -4510 -29292 37298 -23986 -14801 34955 -33941 6260 22575 -38817 24551 7425 -34792
652c4792P1095m5368j4292O3434o3289J7577M1366o9863M4910J6672o0906N4857
$$ -34792 36303 -9065 -23357 40077 -23212 -5635 35731 -34132 10778 27450 -33456 21401
664B1401j1614l6177N9632l8743j2580N0334m7389J5176K3382m9003M0442J254
$$ 21401 9787 -26390 33242 -5501 -18081 32253 -15136 40 23422 -25581 14861 16115
676A6115m1886M9498k2823k0959N2031m4753J156M2903n3861K2499K5601n4147
$$ 16115 -25771 23727 904 -20055 31976 -12777 -11621 31282 -22579 -80 25521 -28626
688b8626L9264M490m3387M8760j9098k5875M8654l3784k847L3753m3348K1835
$$ -28626 10638 15128 -28259 20501 1403 -24472 24182 -9602 -12449 21304 -22044 -209
700b09J7014m3039L6063n721k8236M4863k9561j0536M3017m1738R773K9630m7719
$$ -209 16805 -26234 9829 4108 -24128 20735 -8826 -19362 23655 -18083 -8310 21320 -26399
713b6399K9485J2666m3832M1184p531l0335M3760k2713j2031L5802l3047P625
$$ -26399 3086 15752 -28080 13104 5573 -24762 18998 -3715 -15746 20056 -12991 -5366
725e366K3640l5951K2122M976k6350L2359j4898j5686L4765k5662l16K6417l4847
$$ -5366 18274 -17677 4445 9421 -16929 15430 532 -15154 19611 -6051 -6367 20050 -14797
738a4797J6927J7113l6923K6225L693k8495L1916j0486j9287L2726j9995o918
$$ -14797 2130 19243 -17680 8545 12238 -16257 15659 5173 -14114 18612 -1383 -8301
750h301K6220k5315O359J4431k3711J6935N38j8064K1652j0791o890J9992k2217
$$ -8301 17919 -7396 -1037 13394 -10317 6618 7156 -10908 10744 -47 -6937 13055 -9162
763i162O885J5819k6957J5593O265k3689K3964n294j9242K6677j2529j0206K2638
$$ -9162 -2277 13542 -13415 2178 8443 -15246 8718 3424 -15818 10859 -1670 -11876 10762
776A0762j8113Q85J5151j8684Q588N745j5232J4051l516q880J5397j2125M03J2592
$$ 10762 -7351 -6466 8685 -9999 -1411 4334 -10898 3153 -363 -9243 6154 -5971 -5568 7024
790G024j6333P796O925j6172J3727n5j3850J7170n987q549J6362j1033k106J3467
$$ 7024 -9309 -1513 5412 -10760 2967 2912 -10938 6232 245 -8304 8058 -2975 -5081 8386
804H386j2454K612Q560j1764O831K737q682Q074k135l002O654o649J938M606q008
$$ 8386 -4068 -1456 7104 -4660 2171 4908 -3774 4300 2165 -837 5817 -832 1106 5712 -2296
819b296O360P59q547R968l544o176J0427n743l735R264o848j479P356o696R46
$$ -2296 4064 4823 -3724 6244 2700 -3476 6951 1208 -2527 6737 -111 -1590 5766 -930 16
834A6L781m877J375J110j523R11j238L65O30k637K834j323k549M522l011k198
$$ 16 3797 -1080 295 1405 -118 793 -445 -80 550 -2087 747 -576 -3125 1397 -1614 -3812
850c812N125l725j142M375l664m82L267k845j48K191p83j546J429J450k933J463
$$ -3812 1313 -2412 -3554 821 -2843 -3325 -58 -2903 -3051 -860 -1643 -3189 -1760 -310 -3243 -1780
866a780K122m125K615K893o317M064K348o342N472L87m842N544j423k737M962
$$ -1780 342 -3783 -1168 1725 -4592 -528 1820 -4522 950 1337 -3505 2039 616 -2121 2841
881B841k932J41K701m151L866j035k585N893m919j57O411q129L626N118j0655
$$ 2841 -91 50 2751 -1400 2466 1431 -1154 4739 -180 -337 6074 -2055 1571 6689 -3966
896c966P817J870j0434J0476k066q119J1606n810m571J0505q363J30O984r215
$$ -3966 3851 5721 -4713 5763 3697 -4422 7184 1374 -3197 7308 -1055 -925 6059 -3156
910c156N173J283p348P909m344k967R166j0024K539Q097j4579R127M103j5113
$$ -3156 2017 3300 -4048 3861 -483 -3450 5716 -4308 -1769 6328 -8251 876 4979 -10134
924a0134J3913j513j3128J6921o870q946J7104j2210j391J3146j5096N815P205
$$ -10134 3779 2266 -10862 6059 -811 -9757 7347 -4863 -6254 6892 -8204 -2389 4816
937D816j3653J0565r69r683J4985r537l008J4150j5199N814Q603j7541J3906J840
$$ 4816 -8837 1728 759 -8924 6061 -3476 -6484 7666 -7533 -1719 6884 -10657 3249 5089
951E089j6698J9318o139j1928K1704j4770l122J9469j9662M785J3370j9688J2020
$$ 5089 -11609 7709 1570 -10358 11346 -3424 -6546 12923 -6739 -1954 11416 -8272 3748
964C748M034j7040J7929n093j0813J8293j3086m41J4473j9271R042R109k0835
$$ 3748 7782 -9258 8671 3578 -7235 11058 -2028 -2469 12004 -7267 1775 10884 -9951
977i951J6858q3j7855K2664j0278j1159K3897j8292k107K0492k3269Q196J2309
$$ -9951 6907 6824 -11031 11633 1355 -9804 14093 -4199 -6306 14186 -9083 -887 11422
990A1422k4238J8242J222j9901K2570r804r377K2339k0511K163J8632k5933J3646
$$ 11422 -12816 5426 6648 -13253 9317 -487 -9864 12475 -8036 -5873 12759 -13174 472
1003D72Q125k5119K4616n454j9382K9560j6894r104K8085k5797M382K0330k9882
$$ 472 8597 -16522 8094 2640 -16742 12818 -4076 -13180 14905 -10892 -6510 13820 -16062
1016a6062J7199Q510k6611K4065m810j5959K6438j8241l795K3727k4806R054J2352
$$ -16062 1137 9647 -16964 7101 2291 -13668 12770 -5471 -9266 14461 -10345 -1291 11061
1029A1061k6186K2733R0k3704K8648j1635j3040K9413k4335j75K5751l0286J1663
$$ 11061 -15125 7608 7698 -16006 12642 1007 -12033 17380 -6955 -7130 18621 -11665 -2
1042bJ5258l0184K2795K014k5145K9186j1101j4993K9285k2150l51K2583k9015
$$ -2 15256 -14928 7867 9881 -15264 13922 2821 -12172 17113 -5037 -5388 17195 -11820
1055a1820J3857J1863k9312K4822k687k2393L2575j8706j1375L2656k9131L167
$$ -11820 2037 13900 -15412 9410 6723 -15670 16905 -1801 -13176 19480 -9651 -6484
1067f484K4689l5535J8925J3148l5146K8891k696k4189L3653j9235j0454L1463
$$ -6484 18205 -17330 1595 14743 -20403 8488 5792 -18397 15256 -3979 -14433 17030
1079A7030k8610N847K0456l3027K2018N724k9851L2488j0728j9782L5303k4145
$$ 17030 -11580 -5733 14723 -18304 3714 9438 -20413 12075 1347 -18435 16868 -7277
1091g277m966L0660l3913J1764K1135l7456K4339O198l0342L3331j1563j9698
$$ -7277 -12243 18417 -15496 -3732 17403 -20053 4286 10484 -19858 13473 1910 -17788
1103a7788L5988k3523n498K8986l1156J2635J6120l3650K6374P27k6621L3329
$$ -17788 18200 -5323 -10821 18165 -12991 -356 15764 -17886 8488 9215 -17406 15923
1115A5923j5669j3337L4496l1292L466K9412l9101J8371J4799l6907L2864l593
$$ 15923 254 -13083 21413 -9879 -6413 22999 -16102 2269 17068 -19839 13025 9432
1127I432l0754M1181j8001j7075L6658l1828M707K7380l9545K0092J2842l4263
$$ 9432 -21322 19859 1858 -15217 21441 -10387 -5680 21700 -17845 2247 15089 -19174
1139a9174L1360p585k3473L8471k4528q656L4660l5268R920K2540l9588K7036
$$ -19174 12186 4601 -18872 19599 -4929 -13585 21075 -14193 -4273 18267 -21321 5715
1151E715O482l6463L7919j0174k4311L9831k6725o014L4819l7097J0455K2881
$$ 5715 12197 -24266 13653 3479 -20832 18999 -7726 -13740 21079 -16018 -5563 17318
1163A7318l8007K6321L936l2477L7485j3631k0087L8912k9567j538L3016l9534
$$ 17318 -20689 5632 9568 -22909 14576 945 -19142 19770 -9797 -11335 21681 -17853
1175a7853J6579J9160m1056L2811J680l4785M1047j6530j9151M1276l2423j043
$$ -17853 -1274 17886 -23170 9641 11321 -23464 17583 1053 -18098 23178 -9245 -10288
1187a0288L3850m0278J7639J6953l9143L3549k312l0340L9850k0335j3652L8715
$$ -10288 23562 -16716 923 17876 -21267 12282 9970 -20370 19480 -855 -14507 24208
1199B4208l5214N212K8485m1437K4013J1819l9830L7417o678k8912M2470k4803
$$ 24208 -11006 -5794 22691 -18746 5267 17086 -22744 14673 7995 -20917 21553 -3250
1211c250j2224M0123l7640O736K7808m1151K3968R840l6253L5718r582k3960L9785
$$ -3250 -15474 24649 -12991 -6255 21553 -19598 4370 14210 -22043 13675 4093 -19867 19918
1224A9918k6955o150L4317l8365J4855K0814m2671L1448M080l5717M0571j6338
$$ 19918 -7037 -13187 21130 -17235 -2380 18434 -24237 7211 11291 -24426 16145 -193
1236a93k1308M4699l3365l971L6921m1255J6094K0576m2834L3736J601l5459M2347
$$ -193 -21501 23198 -10167 -14138 22783 -18472 -2378 18198 -24636 9100 10701 -24758 17589
1249A7589j8232j8176M1408l4483K496L2552m3471K1830J6493m1676L6974n215
$$ 17589 -643 -18819 22589 -11894 -9398 23154 -20317 1513 18006 -23670 13304 8089
1261H089l1203M5977k5276j5236M3108l7232M708L1421m4445K3886J5293m1989
$$ 8089 -23114 22863 -2413 -17649 25459 -11773 -7065 24356 -20089 3797 19090 -22899
1273b2899L6666n077k9208M1786k4126j1029L8149l7418Q741K6406m1973K6791
$$ -22899 13767 8690 -20518 21268 -2858 -13887 24262 -13156 -4415 21991 -19982 6809
1285F809P532l7299M0230j3021k5412M4197k9340p495L8162m1468J3210K5220
$$ 6809 14341 -22958 17272 4251 -21161 23036 -6304 -13799 24363 -17105 -3895 21325
1297B1325m4604K9814O659l7367L9866j3532k3070M2115l0286l659L4746m0312
$$ 21325 -23279 6535 13194 -24173 15693 2161 -20909 21206 -9080 -12739 22007 -18305
1309a8305J6598J8929m0942L2951k51l3636M2609j9547j7992M2589l5703K043
$$ -18305 -1707 17222 -23720 9231 8980 -24656 17953 -1594 -19586 23003 -12700 -10657
1321a0657L3934m4026K0702J8101m2835L5689j563l3093M3346k1191j5984M1225
$$ -10657 23277 -20749 -47 18054 -24781 10908 9345 -23748 19598 -1593 -17577 23648
1333B3648l5672M430L0291m2109K3335J2431l9561L7735o914k8813M3293k6262
$$ 23648 -12024 -7594 22697 -19412 3923 16354 -23207 14528 7614 -21199 22094 -4168
1345d168j0126L9837l9870R842K7918m4493K7491R806l9739M0235j0882k6559
$$ -4168 -14294 25543 -14327 -4485 23433 -21060 6431 16237 -23502 16733 5851 -20708
1357b0708M3313k7407q493L7295l8862J1932K3349m1657K9064M479l4979L9610
$$ -20708 22605 -4802 -13295 24000 -14862 -2930 20419 -21238 7826 12305 -22674 16936
1369A6936j5425k0497M1769l2550k048L5304m2082J6786K0728m3056L2912J463
$$ 16936 1511 -18986 22783 -9767 -11815 23489 -18593 -1807 18921 -24135 8777 10240
1381A0240l4584M1382j7305j9017M0727l2279kL1956m0431J9461J5858l9221L3705
$$ 10240 -24344 17038 -267 -19284 21443 -10836 -10838 21118 -19313 148 16006 -23215 10490
1394A0490l624k9209M1088k2580j2947L9534l6496O528K8739m2725K5070J1961
$$ 10490 6866 -22343 18745 -3835 -16782 22752 -13744 -7216 21523 -21202 3868 15829
1406A5829l9856L7838p121k8380M2787k5038j0882L8385l6952Q415K6107m0726
$$ 15829 -24027 13811 6690 -21690 21097 -3941 -14823 23562 -13390 -4975 21132 -19594
1418a9594K5742Q110l5643L7100j1394k2680M0389k8411m689L4845l9423J4454
$$ -19594 6148 14258 -21385 15715 4321 -18359 22030 -6381 -11070 23775 -15648 -1194
1430a194K1667m1676L0301M007l5551L9922j4696k1795M1705l0307l655L4028
$$ -1194 20473 -21203 9098 13105 -22446 17476 2780 -19015 22690 -7617 -11272 22756
1442B2756l9577J5479J9854m0099L0517R84l1799L9122j8237j6303L8851l3206
$$ 22756 -16821 -1342 18512 -21587 8930 9914 -21885 17237 -1000 -17303 21548 -11658
1454a1658K611L0151m1055K1417J4259l9958L6035m799l0445M2659k2946j3691
$$ -11658 -9047 21104 -19951 1466 15725 -24233 11802 7003 -23442 19217 -3729 -17420
1466a7420L9940l6106N485K8888m1135K2900J1636l7121L5511p775k5294L9858
$$ -17420 22520 -13586 -8101 20787 -20348 2552 14188 -22933 12578 4803 -20491 19367
1478A9367k4966p971L5620l6904J1191K3307m0609K8183N569l5396L8684j2520
$$ 19367 -5599 -13570 22050 -14854 -3663 19644 -20965 7218 12787 -22609 16075 3555
1490C555k2534M0804k8482m804L4951l8636J3273K1406l9239K8023L724l2823
$$ 3555 -18979 21825 -6657 -11461 23490 -15146 -1873 19533 -19706 8317 12041 -20782
1502b0782L7656j4221j9399L8159k9362o47L0089l8084J7660J6290l8297L1834
$$ -20782 16874 2653 -16746 21413 -7949 -8596 21493 -16591 1069 17359 -20938 10896
1514A0896j714l0157L9666k0112j5405L9582l3609K255K9806l9683K0115J4077
$$ 10896 9182 -20975 18691 -1421 -16826 22756 -10853 -8598 21208 -18475 1640 15717
1526A5717l8101L3139l892k7520L8335k1688j0804L5426l4071P079K4866l8201
$$ 15717 -22384 10755 6863 -20657 17678 -4010 -14814 20612 -13459 -6380 18486 -19715
1538a9715K3718Q357l5297L6311r988k3642L9760k5989p527L5564l6621J0219
$$ -19715 4003 12360 -22937 13374 3386 -20256 19504 -6485 -14012 21552 -15069 -4850
1550d850K3555l9497K5963P328l4144L5492j0720k1579L7967k5802m995L1936
$$ -4850 18705 -20792 5171 12499 -21645 13847 3127 -18452 19515 -6287 -11282 20654
1562B0654l5003J3025J8809l7351K8426K022l0737L6909j5575j7833L8430k9809
$$ 20654 -14349 -1324 17485 -19866 8560 10582 -20155 16754 1179 -16654 21776 -8033
1574h033j126L1342l8098J6282J7653l7992K9641K34k9522L6863j6869j5598L5833
$$ -8033 -9159 22183 -15915 367 18020 -19972 9669 9903 -19619 17244 375 -15223 20610
1587B0610k9886K379K6821l6724J9234J2196l4456L1345n677k4950L7465k1892
$$ 20610 -9276 -6897 19924 -16800 2434 14630 -19826 11519 5842 -19108 18357 -3535
1599c535j0983L5170l3195O993K4083l7661K2607R648l4241L2510p032k3165L6361
$$ -3535 -14518 20652 -12543 -5550 18533 -19128 3479 13127 -21114 11396 4364 -18801 17560
1612A7560k2744q031L2124l2136Q719K0777l4777K3901M524l0328L3928j1675
$$ 17560 -5184 -13215 18909 -13227 -4508 16269 -18508 5393 9917 -20411 13517 1842
1624A842j9166L5472k5715k550L0159l5577J3395J9216l6234K6197K494k9240
$$ 1842 -17324 18148 -7567 -10117 20042 -15535 -2140 17076 -19158 7039 9533 -19707
1636a9707L4976j3600j7752L5096k6014j309K7305l3135J4791J4929l3656K7331
$$ -19707 15269 1669 -16083 19013 -7001 -8310 18995 -14140 651 15580 -18076 9255
1648I255j256k5530L3665j7140j1578L2511k9656M023K4809l4892J8836J0724
$$ 9255 7999 -17531 16134 -1006 -12584 19927 -9729 -5706 19103 -15789 3047 13771
1660A3771l2724L0649n486k3996L4753j9303j0202L1390k9556N908K1692l3237
$$ 13771 -18953 11696 6210 -17786 16967 -2336 -12538 18852 -10704 -4796 16896 -16341
1672a6341K0109P540k9598K9494q174j9225L2927k2779n018K9336l1411R815J8405
$$ -16341 3768 11308 -18290 11204 3030 -16195 16732 -6047 -11065 18271 -13140 -3325 15080
1685A5080l3235K3693M158k9133L1355j0234j7625L2403k3349l149K7262l0671
$$ 15080 -18155 5538 9696 -19437 11918 1684 -15941 16462 -6887 -10036 17226 -13445
1697a3445J1388J5838l1019K3909Q26k4840L0458j3627j2736L0327k5748J815
$$ -13445 -2057 13781 -17238 6671 7497 -17343 13115 -512 -13248 17079 -8669 -6854
1709f854K3752l1286J5810J1651l0662K7201k793k3602L2091j6345j1069K9914
$$ -6854 16898 -14388 1422 13073 -17589 9612 6819 -16783 15308 -1037 -12106 17808
1721A7808k6197L697K1258l0455J6887Q954k7579K5808n613j8311K9512j9228
$$ 17808 -8389 -4692 16566 -13889 2998 11952 -15627 10181 4568 -13743 15769 -3459
1733c459o017K6608k7288P902J6938l0137K0864M557k6771K8375q807j7203L0252
$$ -3459 -9476 17132 -10156 -2254 14684 -15453 5411 9968 -16803 11572 2765 -14438 15814
1746A5814k0977m319K6218k8197Q834J6515k9397K0326K868k3809K7287j0551
$$ 15814 -5163 -9482 16736 -11461 -2627 13888 -15509 4817 7685 -16124 11163 612
1758F12j4166K8122k1356p40K2042k7862J3160J1888k8408K3565j148k1734K8665
$$ 612 -13554 14568 -6788 -7528 14514 -13348 -188 11700 -16708 6857 5709 -16025 12640
1771A2640j4115j1183K8500k4256J751K1537k8183J4341R669k6095K3463l534
$$ 12640 -1475 -12658 15842 -8414 -6663 14874 -13309 1032 10701 -15394 8069 4535
1783D535j8956K7564j5331p571K4805k4268O356J6878k7662J7528N723k4201K5368
$$ 4535 -14421 13143 -2188 -9759 15046 -9222 -2866 14012 -13650 3878 9601 -14600 10768
1796A0768p565j6058K7870j8661m875K4513k5555P654J5734k7207J8443M039k3134
$$ 10768 3203 -12855 15015 -3646 -8521 15992 -9563 -1909 13825 -13382 5061 9100 -14034
1809a4034K4746q236j4367K5655j8701j616K0687k4666J0211J1645k5004K0038
$$ -14034 10712 2476 -11891 13764 -4937 -6553 14134 -10532 -321 11324 -13680 6358
1821F358k84k0338K5980j2312j0820K5744k1493R80K0139k6031J2203J0270k5176
$$ 6358 6074 -14264 11716 -596 -11416 14328 -7165 -6185 13954 -12077 126 10396 -14780
1834a4780K1159j673j8765K4837j2420q653K3134k0991L247J7075k4519J3830
$$ -14780 6379 4706 -14059 10778 -1642 -10295 12839 -8152 -4905 12170 -12349 1481
1846A481O820k2287K1752n074j5602K5025j5556n257K2543k2642N831J5385k5002
$$ 1481 8301 -13986 7766 2692 -12910 12115 -3441 -8698 13845 -8797 -2966 12419 -12583
1859a2583J6032N247k2336K2307n929j3997K3499j5672l543K0423k1918P601J2028
$$ -12583 3449 8696 -13640 8667 2738 -11259 12240 -3432 -6975 13448 -8470 -869 11159
1872A1159k2753J6969J284j8943K2824r561j1000K3264j8049n92J9074k3508J0172
$$ 11159 -11594 5375 6659 -12284 10540 979 -10021 13243 -4806 -5398 13676 -9832 340
1885C40J0524k3094J7863M24j8089K2266j0167r575K1954j8127Q09J6513k1536
$$ 340 10864 -12230 5633 6057 -12032 10234 67 -9508 12446 -5681 -4872 11641 -9895
1898i895J1074P396k0795J8509k610j5472K2079j2752o138K0830k0219M161J4854
$$ -9895 1179 8575 -12220 6289 3679 -11793 10286 -2466 -8604 12226 -7993 -3832 11022
1911A1022k2323J3080O073k0945J9887m066j4703K2405j3253n262J9395j8972
$$ 11022 -11301 1779 7852 -13093 6794 2728 -11975 10430 -2823 -8085 11310 -7662
1923g662M817J2495k0324J3505L285j7713J9346o616j0935K0737j5134j618J7416
$$ -7662 -2845 9650 -10674 2831 6116 -11597 7749 1133 -9802 10935 -4199 -5817 11599
1936A1599k0108P929J0401k0892J5655J479j7065J9934p821j0142K0361j4848
$$ 11599 -8509 -580 9821 -11071 4584 6063 -11002 8932 1111 -9031 11330 -3518
1948c518j431J6234j9078Q034Q861j8733J4919m11j4494J8724r405o981J8100
$$ -3518 -4949 11285 -7793 241 9102 -9631 5288 4877 -9617 9107 -298 -7279 10821
1961A0821j6091J928J4266k0041J0412O717j8890J6957k257j4464J9882j0426
$$ 10821 -5270 -3342 10924 -9117 1295 8012 -10878 6079 3822 -10642 9240 -1186
1973a186o543J8114j6328K277J3099j8554J0128N195j6608J6182l778j1516J8147
$$ -1186 -7729 10385 -5943 -3666 9433 -9121 1007 6202 -10406 5776 1998 -9518 8629
1986H629j1815l247J6154j7066N331J0451j8407J2616K259j5778J7610n758j0345
$$ 8629 -3186 -6433 9721 -7345 -2014 8437 -9970 2646 4905 -10873 6737 979 -9366
1999i366J8564j2575k351J5604j7055N858R152j6833J2156J740j4215J6420o851
$$ -9366 9198 -3377 -5728 9876 -7179 -1321 7831 -9002 3154 4894 -9321 7099 248
2012B48p469J6592j3066J12J2950j6190P428O971j6727J4212p41j3312J7170q244
$$ 248 -7221 9371 -3695 -3583 9367 -6823 605 7576 -9151 5061 4320 -8992 8178 -66
2026f6o822J6747j3900Q49J2680j6531Q121N972j5576J3685j794j1262J5641q706
$$ -66 -6888 9859 -4041 -3192 9488 -7043 1078 7050 -8526 5159 3365 -7897 7744 -962
2040i62m689J4493j3783K879J0320j6187R877L367j4117J4312l857r618J5699
$$ -962 -5651 8842 -4941 -2062 8258 -7929 1948 5315 -8802 5510 1653 -7965 7734
2053G734j0040l439J4139j4266L670R347j5176R758K581j2655J3025m202p489
$$ 7734 -2306 -5745 8394 -5872 -2202 7145 -8031 1727 4308 -8347 4678 476 -7013
2066g013J3654r884j141J1370j3449O179O006j3812J1251J59j1762J4527o269
$$ -7013 6641 -3243 -4384 6986 -6463 -284 5722 -8090 3161 3320 -8442 6085 -184
2079a84o507J4729j1368l81J1623j4024O055O538j3739J0724l2j0296J3017n976
$$ -184 -6691 8038 -3330 -3711 7912 -6112 -57 6481 -7258 3466 3434 -6862 6155 179
2093A79n464J2746j0747J167R200j2640P203L824j2429J1721k292q874J3532q220
$$ 179 -5285 7461 -3286 -2119 7081 -5559 1644 5468 -6961 4760 2468 -6406 7126 -1094
2107a094l320J2484j2199K648Q802j3440P838L391j2224J1708k576q076J2283
$$ -1094 -4414 8070 -4129 -1481 7321 -6119 1719 5110 -7114 4594 2018 -6058 6225
2120F225p768k463J0433j0953L340O704j1955Q389J158r905J1573m485o368J2347
$$ 6225 -1543 -4006 6427 -4526 -1186 5518 -6437 1952 3110 -6795 4778 293 -6075 6272
2134F272q872j357J0346j1703L963O637j2155Q885Q05r706J0728l903n389J0735
$$ 6272 -2600 -3957 6389 -5314 -1351 5286 -6869 2016 2821 -6885 3843 -60 -5449 5286
2148E286q008k65Q472j0551N075M265j0170Q776r44p951J1257o059l640J0692
$$ 5286 -2722 -2987 5485 -5066 9 4274 -5896 2880 1936 -6015 5242 -817 -4457 6235
2162F235r554J424Q107j1433O255L736j0410Q921r61p624J0627n317l472R587
$$ 6235 -3319 -1895 6212 -5221 1034 4770 -5640 3281 2320 -5304 5323 6 -3466 6121
2176F121q655J379O463r630N933J966q618R099k509n817R723o855j307Q818r647
$$ 6121 -2534 -1155 5308 -4322 1611 3577 -5041 4058 1549 -4268 5455 -1400 -2707 6111 -3536
2191c536K892N783j0135O770J642r049R302k792n694R547o643j172Q026q658L025
$$ -3536 -644 5139 -4996 1774 3416 -5633 3669 877 -4817 4730 -1913 -3085 4941 -3717 -692
2206f92M781r321O628N87p257Q639l680l899Q686p029j58P278r090M203L908r102
$$ -692 4089 -5232 1396 1983 -5274 3365 -315 -4214 4472 -2557 -2715 4563 -4527 -324 3584 -5518
2222e518P077K70o801Q587l933l654Q437o842m5O670q020M085K740p615P182j075
$$ -5518 1559 1829 -4972 3615 -318 -3972 4465 -2377 -2422 4248 -3772 313 3053 -4562 2620 1545
2238A545n583P956m697j841P309p287J886N168q530N423J964p327P016j293n474
$$ 1545 -4038 3918 -779 -2620 4689 -2598 -712 4456 -4074 1349 3313 -4014 3002 1709 -3765
2253c765Q095m528k473P460o917J387M884p381M466J594o188O161k017l930P102
$$ -3765 4330 -198 -2671 4789 -2128 -741 4143 -3238 1228 2822 -3366 2795 778 -3152 3950
2268C950n367p39O107o750K406L705p298N421O51o240O936k519m039P112m967
$$ 3950 -1417 -2156 3951 -2799 -393 3312 -3986 1435 2086 -4154 2782 263 -3776 3336 -1631
2283a631q98O093o638K206L506o347M624L48m985N943k497k843O286n099R5M944
$$ -1631 -2529 3564 -3074 -868 2638 -3709 915 1263 -3722 2221 -276 -3119 3167 -1932 -1837 3107
2299C107o454L319K422o301N426j46n168O755l303k466O232n093oN199n946K382
$$ 3107 -3347 -28 2394 -3907 1519 1373 -3795 2960 -343 -2809 3423 -1670 -1676 3523 -2423 -41
2315d1K623n498M588P6m180N129k827j506M877m714J171L692n633L437J014m819
$$ -41 2582 -2916 1672 1748 -2432 2697 -130 -1636 3241 -1473 -302 3390 -2243 1194 2208 -2611
2331b611M919j145l674N742l056j982N241m974R78L418n157K877J446m519M040
$$ -2611 2308 1163 -2511 3231 175 -1807 3434 -1540 -562 2856 -2301 576 2022 -2497 1543
2346A543r66k754M570l150r44L977m045J261K565m701L242N17m042M495j508k693
$$ 1543 577 -2177 2393 -757 -1701 2276 -1769 -508 2057 -2644 598 1115 -2927 1568 60 -2633
2362b633M954l558o99M201m357J337K678m362K543J148l815L687j058k287L964
$$ -2633 2321 -1237 -1936 2265 -2092 -755 1923 -2439 104 1252 -2563 1124 66 -2221 1743
2377A743k648l36L121l649J722J596l744L225M0l261M027j817j773M187k989k33
$$ 1743 -905 -1241 1880 -1769 -47 1549 -2195 1030 1070 -2191 1836 19 -1754 2433 -556 -789
2393g89L206l369J025K091l656K349M25k959L417j091j590L051k315j67K493l183
$$ -789 2417 -952 73 2164 -1492 857 1282 -1677 1740 649 -941 2110 -205 -372 2121 -1062
2409a062J449J210l067K759l66k566L442j660j466L512k955p2K817l474J485J616
$$ -1062 387 1597 -1470 1289 923 -1643 1799 139 -1327 2185 -770 -842 1975 -1499 -14 1602
2425A602l313K086L87k329K454q42j482K604k192J80J848k442J309P14k226K183
$$ 1602 -1711 375 762 -1567 887 45 -1437 1167 -1025 -845 1003 -1439 -130 584 -1642 541
2441E41l72k021K634j313q48K520k213R6K238k496P72J407k568J751M24k081K200
$$ 541 169 -1852 782 -531 -1379 1141 -1072 -976 1262 -1234 -462 945 -1623 128 552 -1529 671
2458F71o84q29J788j216k85J900k115P99R85j898J486J57j454K041j075r62K195
$$ 671 -13 -842 946 -270 -555 1345 -770 29 1014 -884 602 759 -695 1346 271 -691 1504
2475A504j876K01J906k400P06J297k067J421M55k004J858o34j209K112j279l33
$$ 1504 -372 -171 1735 -665 41 1338 -729 692 1147 -857 1001 367 -842 1270 -9 -342
2491c42J586j674N69Q45j850J340R4j478J916j176r33K197j693M3J685k215O99
$$ -342 1244 -430 139 984 -866 474 568 -910 1006 -170 -1103 1094 -599 -556 1129 -1086 -387
2508c87J316k054J186L25j805J631k17j207J647r54n03J525j163K80R52j674R00
$$ -387 929 -1125 61 386 -1419 212 -5 -1212 435 -519 -1022 503 -660 -380 572 -1102 -202
2525b02K31j114J568m64q74J647j193m00J980j908M65J186j987J297O89j818J572
$$ -202 29 -1085 483 19 -855 792 -401 -801 1179 -729 -264 922 -1065 232 921 -897 675
2542F75j91j411K108j150m65J805j472kJ359j868J233M27j572J453l69j260K106
$$ 675 484 -927 1181 31 -434 1371 -101 -103 1256 -612 621 1048 -524 929 560 -700 1406
2559A406j506k74J841j905M95J230k212J315O97k171J687N6j505J802j100n67
$$ 1406 -100 -374 1467 -438 57 1287 -925 390 1087 -1084 603 659 -846 956 -144 -711
2575g11J513j439K50J105j622J129R4j766K013o41j206J977j162o71K059k141
$$ -711 802 -637 -387 718 -904 225 319 -1447 566 -75 -1281 696 -466 -1137 922 -1219
2591a219M46J801k538J606N18k263K232l46j917K442j054r61K200j630j2J667
$$ -1219 -773 1028 -1510 96 614 -1649 583 237 -1680 762 -292 -1253 947 -683 -695 972
2607I72k027J138O67j850J949m04j459K384j537n78K217k397R41J525k815J966
$$ 972 -1055 83 750 -1100 849 445 -1014 1370 -167 -745 1472 -925 16 1541 -1274 692
2623F92P16k691K486l61j838K776j646p83K420k370M52J781k430J289Q39k514
$$ 692 1408 -1283 1203 842 -996 1780 134 -649 1771 -599 -147 1634 -796 493 1332 -1182
2639a182K437q87j390K889k136m60K331k600R32J468l143K336O05l068L085j081
$$ -1182 1255 368 -1022 1867 -269 -729 1602 -998 -66 1402 -1741 595 1200 -1868 1217 136
2655A36j804L326k377m21K590k631Q81J307k982K305Q4k260K944j355j521L198
$$ 136 -1668 1658 -719 -1140 1450 -1181 -300 1007 -1975 330 414 -1846 1098 -257 -1778 1420
2671A420k421M2K490l400J537J555l300K676Q5k814L342j118j747L273k288j51
$$ 1420 -1001 -959 1531 -1869 -332 1223 -2077 599 684 -2130 1212 94 -1653 1620 -668 -819
2687h19K808l271J364J471l118K505j17k387L188j646j102L108k725N67K389l673
$$ -819 1989 -1282 82 1553 -1565 940 823 -1564 1624 -22 -1124 1984 -741 -174 2215 -1458
2703a458J856J573l495K911m27k579L636k006j289L746l122J39K613l669J983
$$ -1458 398 1971 -1524 1387 960 -1619 2017 11 -1278 2468 -654 -515 2098 -1571 412
2718D12J298l605L133l92k735L781k381r29L708l754R21K611m130K352R18l757
$$ 412 1710 -1895 1238 846 -1889 1892 -489 -1418 2290 -1464 -543 2068 -2062 290 1208 -2549
2734b549L877j011k722M262k807r36L942l863J030K420m300K907Q97l761L826
$$ -2549 1328 317 -2405 1857 -950 -1886 2056 -1807 -777 1643 -2657 250 1147 -2614 1212
2749A212j127k286M139k909n43L576l851J550J878m172L550L25l839M262j546
$$ 1212 85 -2201 1938 -971 -1514 2062 -1789 -239 1639 -2533 1017 1342 -2497 1765 219
2764B19k236M677l356j26L324m215J600K486m406L030N64l690M299j747k010M314
$$ 219 -2017 2660 -696 -822 2502 -1713 -113 2373 -2033 997 1561 -2129 2170 423 -1587 2727
2780B727l576L02L192m288K182J654m181L638o07l524N027k588j688M574l959
$$ 2727 -849 -547 2645 -1643 539 2193 -1988 1650 1043 -2481 2546 -42 -1730 2844 -1115
2795a115K22L540m969K533J253l669L548n24l184M681k659j439M209m232Q47L284
$$ -1115 -893 2647 -2322 211 1464 -2205 1343 819 -2365 2316 -343 -1782 2427 -1805 -958 2326
2811B326m853K684P20l954M424o87l433M813l082n80M110m499J196L260m780K649
$$ 2326 -2527 157 877 -3077 1347 660 -2773 2040 -1042 -1622 2488 -2011 -815 2445 -2335 314
2827C14J210m666M830j410l022M911k662j705N060m976J818K426m657L496O56
$$ 314 1524 -3142 1688 278 -2744 2167 -495 -2200 2860 -2116 -298 2128 -2529 967 1623
2842A623m343M549j228k938N766m116r26M799n122J865K962n545L997J50m143
$$ 1623 -2720 1829 601 -2337 3429 -687 -1613 3186 -1936 -71 2891 -2654 1343 1493 -2650
2857b650N322k523j854M385l622N6L775n442K725K543n442M914r71l604N819l914
$$ -2650 2672 149 -1705 2680 -942 -886 2889 -2553 172 2715 -2727 2187 1216 -2388 3431 -483
2873d83j165M685m746J032K886m250K389J644m652L890m49l620N046k779j994
$$ -483 -1648 3037 -1709 -677 2209 -2041 348 1992 -2660 1230 781 -2839 2207 -572 -2566
2888b566M844m558J761K859n350L490Q43m538N085j772l304N766l719p97M582
$$ -2566 2278 -2280 -519 2340 -3010 480 1323 -3215 1870 98 -3206 2560 -1159 -1956 2626
2903B626n047J774L241n613L775Q95m920N286j665k876N460m018m80M746n258
$$ 2626 -2421 -647 2594 -3019 756 1651 -3269 2017 352 -2524 2936 -1082 -1562 3184 -2074
2918b074J992K529n022M059J69m349N169k172k485N689m565J51M324n846K929
$$ -2074 -82 2447 -2575 1484 1653 -2696 2473 301 -2184 3505 -1060 -909 3415 -2431 498
2933D98K224n562M615l68m124N535k618k408N671m940N19L886n498K923J784m985
$$ 498 2722 -2840 1775 1407 -2717 2818 200 -2208 3463 -1477 -958 2928 -2570 353 2137 -2848
2949b848M576r71l478N388l239j524N122n197J492L478n957L683J332n334N121
$$ -2848 1728 757 -2721 2667 -572 -2096 3026 -2171 -679 2799 -3158 525 1857 -3477 1644
2964A644j138l728N929m000q42N095n501J760L252n816M094O71m966N574j834
$$ 1644 506 -3222 2707 -1293 -2135 2960 -2541 -781 2471 -3345 749 1420 -3546 2028 194
2979A94k936N684m411l6M543n647K403K704n858M787J03m756N881k685k436N907
$$ 194 -2742 2942 -1469 -1505 3038 -2609 -206 2498 -3360 1427 1530 -3226 2655 -30 -2466 3441
2995C441m833K85M510n734K666K449n966N098n22m310O003l026j937N403n058
$$ 3441 -1392 -1107 3403 -2331 335 2784 -3182 1916 1394 -2916 3087 61 -1876 3527 -1531
3010a531N65M550o301L477J712n708N603j167l994N866l557j682N727n637J415
$$ -1531 -966 3584 -2717 760 2472 -3236 2367 1200 -2794 3072 -485 -2167 3560 -2077 -662
3025f62L751n865L556J320n599N540j575l603O042m106j280N656n586J682L289
$$ -662 3089 -2776 780 2100 -3499 2041 466 -3137 2905 -1201 -2481 3175 -2411 -729 2560
3040B560o073M410Q36n548N967k191l243O280m498m15N060o007K560K830n936
$$ 2560 -3513 897 1733 -3815 2152 -39 -3282 2998 -1500 -1915 3145 -2862 -302 2528 -3408
3055c408M487K86m989O122k683k564O314n366K19M942o048K778K588o024N167
$$ -3408 1079 1365 -3624 2498 -185 -2749 3565 -1801 -1582 3360 -2688 90 2678 -3346 1821
3070A821j31n120O505l049k290N933n346P16M512o458L413K228o020N695j212
$$ 1821 1690 -3430 3075 26 -2264 3669 -1677 -961 3551 -2907 506 2734 -3286 2409 1197
3085A197m458O581l685j625N585n508J261M055o463M121J319n959O110j480m337
$$ 1197 -3261 3320 -365 -1990 3595 -1913 -652 3403 -3060 1061 2380 -3579 2531 1051 -3286
3100c286O537m169j233N585n921J789L832o586M359R34n439N760j979l423O385
$$ -3286 3251 -918 -2151 3434 -2487 -698 3134 -3452 907 1841 -3598 2162 183 -3240 3145
3115C145m581p42N527o301K548K900o146M738K82n002O278k771k667N996n102
$$ 3145 -1436 -2178 3349 -2952 -404 2496 -3650 1088 1370 -3632 2646 -125 -2792 3204 -1898
3130a898K8N197o253K930K688o236N022K22n143O245k936k480O214n539Q60M705
$$ -1898 -1870 3327 -2926 4 2692 -3544 1478 1700 -3443 2802 -134 -2614 3600 -1939 -1079 3626
3146C626o701L596K129o123N851r74m713O646l586k026O015n504J011M210o195
$$ 3626 -3075 521 2650 -3473 2378 1404 -3309 3337 -249 -2275 3740 -1764 -753 3457 -2738
3161b738L674J611n896N744j414l986O684m363j274N627n776J470L855o433M302
$$ -2738 936 2547 -3349 2395 981 -3005 3679 -684 -1958 3669 -2107 -637 3218 -3215 1087
3176A087J141n847O154k166l630O776m711r31N670o332K269L370o671M983N01
$$ 1087 2228 -3619 2535 369 -3261 3515 -1196 -2127 3543 -2789 -520 2850 -3821 1162 1663
3191A663n482O154k417l104O423n002r0M979o330K993K710o406N407l03m927O591
$$ 1663 -3819 2335 -82 -3186 3237 -1765 -1855 3124 -3206 -213 2497 -3909 1498 1195 -3732 2859
3207B859l217k447O330n466N83M859o409L272K293o225N553l78m726O203l377
$$ 2859 -358 -2805 3525 -1941 -1358 3501 -2908 364 2657 -3568 1985 1607 -3119 3084 -293
3222b93k018O010n502R73M376o535L771J835n967N625j264m106O637l974j305
$$ -293 -2311 3699 -1803 -830 3546 -2989 782 2617 -3350 2275 1011 -3095 3542 -432 -1737
3237a737N489n917J766L764o332M134J077n627O050j817l767O396m519q78N212
$$ -1737 3752 -2165 -399 3365 -2967 1167 2244 -3383 2667 850 -2917 3479 -1040 -1918 3294
3252C294n693K023L036o112M841K06n135O060k579k869O414n143j07N038o338
$$ 3294 -2399 -376 2660 -3452 1389 1595 -3540 2520 -59 -2928 3486 -1657 -1764 3274 -3064
3267c064K896K630o198N254k38m965O362k925k517N978n176O98M255o078L137
$$ -3064 -168 2462 -3736 1518 1280 -3685 2677 -248 -2765 3213 -1963 -1265 2990 -3088 49
3282D9K190n918N487o01m401N966l182j886N758n614J302M217o430L853J657n782
$$ 49 2239 -3679 1808 1207 -3194 2772 -410 -2296 3462 -2152 -850 3367 -3063 790 2447 -3335
3298c335N585j517l561N881l738j114N232n467J465L829o165M203Q82n385N795
$$ -3335 2250 733 -2828 3053 -685 -1799 3433 -2034 -569 3260 -2905 1298 2180 -3205 2590
3313B590j905l315N796m329m26M804n784K380L148n978M383L54m909N678k401
$$ 2590 685 -2630 3166 -1163 -1589 3215 -2569 -189 2959 -3019 1364 1718 -3191 2487 86
3328H6k892O108m789M3M573n886K803K223n773N039n26m348N890l021k101N776
$$ 86 -2806 3302 -1487 -1444 3129 -2757 46 2269 -3504 1535 1009 -3339 2551 -470 -2571 3205
3344C205n358P08M364o016L199K073n546M823n07l976N743l370j658N488n240
$$ 3205 -2153 -1445 2919 -3097 102 2175 -3371 1452 945 -3031 2712 -658 -2316 3172 -2068
3359b068J178L929o118L666J284m995N274j366l593N831l892p68N093n520J858
$$ -2068 -890 3039 -3079 587 1871 -3124 2150 784 -2809 3022 -870 -1638 3455 -2065 -207
3374b07L151n762L903Q98n200N666j797l088N806m108q11M969n490K083K858n806
$$ -207 2944 -2818 1085 1983 -3217 2449 652 -2436 3370 -738 -1549 3420 -2070 13 2871 -2935
3390b935M367J45m539N441k165k726N434m385J41M387n509K446K363n837M844
$$ -2935 1432 1577 -2962 2479 314 -2412 3022 -1363 -1222 3165 -2344 102 2465 -3372 1472
3405A472j96m405N737k820k128N347m708N33M097n719K915J909n299M793o91l926
$$ 1472 1276 -3129 2608 -212 -2340 3007 -1701 -1168 2929 -2790 125 2034 -3265 1528 837 -3089
3421c089N598l340j566N445n072J134L628n556L324J241m872M934j251l633N871
$$ -3089 2509 -831 -2397 3048 -2024 -890 2738 -2818 506 1747 -3125 1809 558 -3075 2796
3436B796l628j232N191n187J494L273n341L581P75m734N235j739k959N519l792
$$ 2796 -832 -2064 3127 -2060 -566 2707 -2634 947 1722 -3012 2223 484 -2475 3044 -748
3451g48n44M495n031J805K652n320M345Q4m546N395k228k581N419m352L1M181
$$ -748 -1292 3203 -1828 -23 2629 -2691 1654 1738 -2808 2587 359 -2222 3197 -1155 -1124 3057
3467C057n410K352K450n342M390j55l992M989k366k214N062m290L17L792n106
$$ 3057 -2353 -1 2449 -2893 1497 1342 -2650 2339 -27 -2241 2821 -1469 -1152 2640 -2466
3482b466K590J722m748M186n55l601N343k830j900M873m426P11L517n141L276
$$ -2466 124 1846 -2902 1284 729 -2872 2471 -359 -2259 2614 -1812 -1101 2416 -2725 551
3497E51J111m803M677r81l213N116l422q05M149m384J543K869n121L589N20m332
$$ 551 1662 -3141 1536 555 -2658 2458 -964 -1769 2380 -2004 -461 2408 -2713 876 1396 -2936
3513b936M931j567k668M950l759j60M021m927K026K754n119L459M39l907M683
$$ -2936 1995 428 -2240 2710 -1049 -1209 2812 -2115 -89 2665 -2454 1005 1444 -2463 2220
3528B220j898k243M732l803L2L868m754K050J986m654L958k56l406M642k394j879
$$ 2220 322 -1921 2811 -992 -960 2908 -1846 204 2190 -2464 1494 1238 -2168 2474 80 -1799
3544a799M521m033O86L457n051K512J600m594M182o06l104M327k525j362M174
$$ -1799 2722 -1311 -625 2832 -2219 293 1893 -2701 1481 875 -2229 2098 -427 -1789 2385
3559B385l993P88L224m754K600J221m249M067r39k700M324k768o95L915m364J276
$$ 2385 -1608 -820 2404 -2350 250 1471 -2778 1289 350 -2350 1974 -794 -1489 2426 -1938 -662
3575f62K659m385K899Q60m062M165j337k362M442l033o41L577l902J596K023m025
$$ -662 1997 -2388 511 1371 -2691 1474 137 -2225 2217 -816 -1457 2120 -1782 -186 1837 -2188
3591b188L076J35l437M285j886k003M290l394Q9L430m160J996J889m375L529l4
$$ -2188 888 1023 -2414 1871 -15 -2018 2272 -1122 -1033 2397 -1763 233 2122 -2253 1276 1242
3607A242l288M181k166j370L787l316K77L049m263K382J001l549L608p95k539
$$ 1242 -2046 2135 -31 -1401 2386 -930 -653 2396 -1867 515 1516 -2033 1575 780 -1759
3622a759L778k292j107L610l761J195K505m227K638Q73l634L640j201k463M202
$$ -1759 2019 -273 -1380 2230 -1531 -336 2169 -2058 580 1453 -2181 1459 258 -2205 1997
3637A997k769j044L830l776J319K168l749K499O93l347L677j425j950L494k612
$$ 1997 -772 -1816 2014 -1762 -443 1725 -2024 475 1168 -2179 1498 73 -1877 1617 -995
3652i95k28L249l546J085K005l715K892K20l129L597j479j656L744k889M2K895
$$ -995 -1223 2026 -1520 -435 1570 -2145 747 967 -2162 1435 -44 -1700 2044 -845 -803 2092
3668B092l581J674J530l683L003k72k609L759j902j450L546l134L18K906l795
$$ 2092 -1489 185 1715 -1968 1035 763 -1846 1913 11 -1439 2107 -1027 -709 2197 -1598
3683a598K206R32l584L233l60k501L605k053j179L518l121K98K594l672K104J062
$$ -1598 608 1540 -2044 1189 829 -1672 1933 -120 -1299 2219 -902 -604 1990 -1682 422 1484
3699A484l268L148r74j923L312k252q86L220k924P75J881l542K408P75l182L298
$$ 1484 -1784 1364 390 -1533 1779 -473 -1359 1861 -1063 -288 1593 -1949 459 1234 -1948 1350
3715A350j222k135L601k518l00K664l107J078J934l275K474M10k825L096j208
$$ 1350 128 -2007 1594 -924 -1224 1440 -1667 -589 1345 -1930 544 954 -1871 1225 17
3730A7j751L330k433k26K605l064J364J650l243K423K76k850L396j632j103K764
$$ 17 -1734 1596 -837 -1063 1542 -1522 -158 1492 -1751 672 948 -1902 1494 -138 -1241 1523
3746A523k065k13K388k879J395J241l024K648l02k362L089j475j071L003k595
$$ 1523 -542 -755 1633 -1246 149 1390 -1634 1014 712 -1650 1439 -36 -1107 1896 -699
3761f99M16J937k916J733Q48k843K760n57k084L061j856q01K817k637L96K011
$$ -699 -283 1654 -1262 471 1319 -1524 1236 679 -1405 1656 -200 -1001 1816 -821 -425 1586
3777A586k957J690Q92k907K625n46j938K949k019l89K366k688Q46J688k816K061
$$ 1586 -1371 319 1211 -1696 929 383 -1555 1394 -625 -1014 1352 -1336 -490 1198 -1618 443
3793D43J18k418K978j132j267K592k016k40K229k712J113J419l025K607r0k188
$$ 443 561 -1857 1121 -11 -1278 1314 -702 -942 1287 -1425 -312 1107 -1918 689 599 -1589
3809a589K513j220j033K646k013K5J927k293J140R46k549K166j06j992K676j111
$$ -1589 924 -296 -1329 1317 -696 -671 1256 -1037 103 1049 -1500 666 560 -1432 1244 133
3825A33j148K552k089J63J916k492J186J159k751K267k61j665K598j503r89K557
$$ 133 -1015 1537 -552 -389 1527 -965 221 1380 -1371 896 635 -1030 1568 65 -924 1633
3841A633k049K28J565k556J628L85j981K060n76j522K430j355o24K117k182M41
$$ 1633 -416 -188 1377 -1179 449 834 -1147 913 337 -1185 1245 -110 -734 1383 -799 -358
3857c58J498k475J636N85k188K134o99j257K156j451m63J970k077N96J204k111
$$ -358 1140 -1335 301 886 -1302 832 133 -1124 1032 -419 -882 1088 -989 -393 811 -1300
3873a300J494L18j913K085q93j186K423j769pJ789k144Q86R47j929J451K80j658
$$ -1300 194 512 -1401 684 -209 -1395 1028 -741 -748 1041 -1103 -217 730 -1199 252 532 -1126
3890a126J943o93j117K053j314k25J641j877Q02P68j786J538n5j524K003q75p46
$$ -1126 817 124 -993 1060 -254 -479 1162 -715 87 855 -931 607 552 -972 1031 156 -590
3907e90J729j400N9J293j969J012P92j526J252L0j559J818p37r97J902j467j2
$$ -590 1139 -261 -202 1091 -878 134 926 -600 652 682 -877 941 204 -793 1109 -358 -370
3924c70J525j820P71P12j822J606l09j138J562j144j53J530j574J84J147j499
$$ -370 1155 -665 106 818 -1004 602 293 -845 717 -427 -580 950 -624 -440 707 -792
3940g92R10M62j619J572m26j210J715j013m51J725j380J7R83j540R24L64j193
$$ -792 118 580 -1039 533 107 -1103 612 -401 -852 873 -507 -490 493 -1047 -123 241 -952
3957i52J235k65q59J515r82k62J339j360M42Q66j602J101L24j346J536l48q69
$$ -952 283 18 -841 674 -308 -570 769 -591 -149 717 -885 216 540 -806 730 382 -487
3974d87J325j172JJ228j159J68Q84j333R47J08j200J425n03p30J329r06j29J060
$$ -487 838 -334 -333 895 -264 -96 788 -545 402 510 -690 735 232 -498 831 -75 -204 856
3992H56j331N48Q76j661J230j20j108J430m34p19J043n59l89J002j253O90M49
$$ 856 -475 73 949 -712 518 398 -710 720 286 -433 610 51 -338 664 -589 101 550
4009E50j244R24L1q46J053q18l43J324j012j2Q23j267Q07L67j331J058N2p09J056
$$ 550 -694 230 261 -585 468 -350 -693 631 -381 -393 430 -837 -30 337 -994 64 116 -593 463
4028D63n72n37J215r81j41J001j080O77J97j092J110l38m89Q10m02k03J014j040
$$ 463 -109 -646 569 -412 -553 448 -632 45 242 -850 260 -78 -567 243 -159 -362 652 -388
4046c88L32P88j020N14M74j225J084k72o11R29o91k15J242j179L09Q95j287M57
$$ -388 -56 732 -288 226 700 -525 559 287 -324 605 -86 -301 941 -238 71 966 -321 136
4064A36L14r27Q89q3q02R78l72l59J013j037J88O42r98O55N3r18J085k20q11R58
$$ 136 450 -477 412 329 -473 505 133 -226 787 -250 -62 580 -418 237 290 -628 457 237 -574 384
4084C84p13l6R00j158K26Q76j127O02L02r58R13j98o28J023n26m84R12q35K26
$$ 384 -329 -365 535 -623 -397 479 -648 -46 256 -702 211 13 -615 408 -118 -602 310 -525 -299
4103b99L19q17Q27O1n71O42k4n38O52m72m37R77n66O3P34j145Q56K71r41O74k61
$$ -299 20 -797 30 91 -480 162 138 -400 252 -220 -657 320 -246 -183 551 -594 262 533 -408 266 5
4124Em92J073p33M2M90n72M37L68q79N98K52r53R06m69l67R43p83K2Q15p81J12
$$ 5 -487 586 -147 -105 385 -187 250 618 -261 337 589 -364 542 73 -294 649 -134 -112 703 -78 34
$$ [...]
8191E6
##END NTUPLES=NMR FID
##END=
