##TITLE=1H_2ABPA2 0106
 CD3CN, 8 sc, 
 2.06.2021
##JCAMPDX= 6.0         $$ Bruker NMR JCAMP-DX V2.0
##DATA TYPE= NMR FID
##DATA CLASS= NTUPLES
##ORIGIN= UXNMR, Bruker Analytische Messtechnik GmbH
##OWNER= root
$$ XWIN-NMR		Version 3.5
$$ Wed Jun  2 11:26:20 2021 Russian Standard Time (UT+4h)  she@DPX200
##.OBSERVE FREQUENCY= 200.131506
##.OBSERVE NUCLEUS= ^1H
##.DELAY= (6, 6)
##.ACQUISITION MODE= SIMULTANEOUS
##.ACQUISITION SCHEME= undefined
##.AVERAGES= 8
##.DIGITISER RES= 18
##SPECTROMETER/DATA SYSTEM= spect
##.PULSE SEQUENCE= zg30
##.SOLVENT NAME= CD3CN
##.SHIFT REFERENCE= (INTERNAL, CD3CN, 0, 15.7039)
##AUDIT TRAIL= $$ (NUMBER, WHEN, WHO, WHERE, WHAT)
$$ ##TITLE= Audit trail, XWIN-NMR		Version 3.5
$$ ##JCAMPDX= 5.01
$$ ##ORIGIN= Bruker BioSpin GmbH
$$ ##OWNER= she
$$ F:/spectra/data/she/nmr/H-F/1/audita.txt
$$ ##AUDIT TRAIL=  $$ (NUMBER, WHEN, WHO, WHERE, WHAT)
(   1,<2021-06-02 11:25:09.32 +0400>,<she>,<DPX200>,
      <created by zg, POWCHK disabled, PULCHK disabled
       configuration hash MD5:
       00 E9 B6 7A A2 85 ED C7 34 08 36 98 17 FE 4E 26
       data hash MD5: 16K
       BB 5D 62 D7 05 3F 38 93 D4 62 46 A4 51 79 97 7D>)
$$ ##END=
$$ 
$$ hash MD5
$$ 22 94 1F D3 78 08 CD BF 3A 24 5F AD 72 0B 00 64
##$RELAX= 
##$RELAX= 
##$RELAX= 
##$RELAX= 
##$RELAX= 
##$RELAX= 
$$ Bruker specific parameters
$$ --------------------------
##$DU= <F:/spectra>
##$EXPNO= 1
##$NAME= <H-F>
##$PROCNO= 1
##$TYPE= <nmr>
##$USER= <she>
##$AMP= (0..31)
100 100 100 100 100 100 100 100 100 100 100 100 100 100 100 100 100 100 
100 100 100 100 100 100 100 100 100 100 100 100 100 100 
##$AQSEQ= 0
##$AQ_mod= 1
##$AUNM= <au_zg>
##$AUTOPOS= <>
##$BF1= 200.13
##$BF2= 200.13
##$BF3= 200.13
##$BF4= 200.13
##$BF5= 200.13
##$BF6= 200.13
##$BF7= 200.13
##$BF8= 200.13
##$BYTORDA= 1
##$CFDGTYP= 0
##$CFRGTYP= 5
##$CHEMSTR= <none>
##$CNST= (0..31)
1 1 145 1 1 1 1 1 1 1 1 1 1 1 1 1 1 1 1 1 1 1 1 1 1 1 1 1 1 1 1 1 
##$CPDPRG= <>
##$CPDPRG1= <>
##$CPDPRG2= <>
##$CPDPRG3= <>
##$CPDPRG4= <mlev>
##$CPDPRG5= <mlev>
##$CPDPRG6= <mlev>
##$CPDPRG7= <mlev>
##$CPDPRG8= <mlev>
##$CPDPRGB= <>
##$CPDPRGT= <>
##$D= (0..31)
0 1.2 0 0 0 0 0 0 0 0.06 0 0.03 0 0 0 0 0.0002 0 0 0 0 0 0 0 0 0 0 0 0 
0 0 0 
##$DATE= 1622618708
##$DBL= (0..7)
120 120 120 120 120 120 120 120 
##$DBP= (0..7)
150 150 150 150 150 150 150 150 
##$DBP07= 0
##$DBPNAM0= <>
##$DBPNAM1= <>
##$DBPNAM2= <>
##$DBPNAM3= <>
##$DBPNAM4= <>
##$DBPNAM5= <>
##$DBPNAM6= <>
##$DBPNAM7= <>
##$DBPOAL= (0..7)
0.5 0.5 0.5 0.5 0.5 0.5 0.5 0.5 
##$DBPOFFS= (0..7)
0 0 0 0 0 0 0 0 
##$DE= 6
##$DECBNUC= <off>
##$DECIM= 32
##$DECNUC= <off>
##$DECSTAT= 4
##$DIGMOD= 1
##$DIGTYP= 9
##$DL= (0..7)
0 120 120 120 120 120 120 120 
##$DP= (0..7)
150 150 150 150 150 150 150 150 
##$DP07= 0
##$DPNAME0= <>
##$DPNAME1= <>
##$DPNAME2= <>
##$DPNAME3= <>
##$DPNAME4= <>
##$DPNAME5= <>
##$DPNAME6= <>
##$DPNAME7= <>
##$DPOAL= (0..7)
0.5 0.5 0.5 0.5 0.5 0.5 0.5 0.5 
##$DPOFFS= (0..7)
0 0 0 0 0 0 0 0 
##$DQDMODE= 0
##$DR= 18
##$DS= 0
##$DSLIST= <SSSSSSSSSSSSSSS>
$$ [...]
##$SUBNAM2= <"">
##$SUBNAM3= <"">
##$SUBNAM4= <"">
##$SUBNAM5= <"">
##$SUBNAM6= <"">
##$SUBNAM7= <"">
##$SUBNAM8= <"">
##$SUBNAM9= <"">
##$SW= 16.9725357007746
##$SWIBOX= (0..15)
0 0 2 0 0 0 0 0 0 0 0 0 0 0 0 0 
##$SW_h= 3396.73913043478
##$TD= 16384
##$TD0= 1
##$TE= 0
##$TE2= 300
##$TE3= 300
##$TEG= 300
##$TL= (0..7)
0 120 120 120 120 120 120 120 
##$TP= (0..7)
150 150 150 150 150 150 150 150 
##$TP07= 0
##$TPNAME0= <>
##$TPNAME1= <>
##$TPNAME2= <>
##$TPNAME3= <>
##$TPNAME4= <>
##$TPNAME5= <>
##$TPNAME6= <>
##$TPNAME7= <>
##$TPOAL= (0..7)
0.5 0.5 0.5 0.5 0.5 0.5 0.5 0.5 
##$TPOFFS= (0..7)
0 0 0 0 0 0 0 0 
##$TUNHIN= 0
##$TUNHOUT= 0
##$TUNXOUT= 0
##$USERA1= <user>
##$USERA2= <user>
##$USERA3= <user>
##$USERA4= <user>
##$USERA5= <user>
##$V9= 5
##$VALIST= <valist>
##$VCLIST= <CCCCCCCCCCCCCCC>
##$VD= 0
##$VDLIST= <DDDDDDDDDDDDDDD>
##$VPLIST= <PPPPPPPPPPPPPPP>
##$VTLIST= <TTTTTTTTTTTTTTT>
##$WBST= 1024
##$WBSW= 4
##$XGAIN= (0..3)
0 0 0 0 
##$XL= 0
##$YL= 0
##$YMAX_a= 145598
##$YMIN_a= -153077
##$ZGOPTNS= <>
##$ZL1= 120
##$ZL2= 120
##$ZL3= 120
##$ZL4= 120
##$ABSF1= 10
##$ABSF2= 0
##$ABSG= 5
##$ABSL= 3
##$ALPHA= 0
##$AQORDER= 0
##$ASSFAC= 0
##$ASSFACI= 0
##$ASSFACX= 0
##$ASSWID= 0
##$AUNMP= <proc_1d>
##$AZFE= 0.1
##$AZFW= 0.1
##$BCFW= 1
##$BC_mod= 2
##$BYTORDP= 1
##$COROFFS= 0
##$CY= 11.3945322036743
##$DATMOD= 1
##$DC= 2
##$DFILT= <>
##$DTYPP= 0
##$F1P= 15.9154993809931
##$F2P= -4.1035820241983
##$FCOR= 0.5
##$FTSIZE= 0
##$FT_mod= 4
##$GAMMA= 1
##$GB= 0.15
##$INTBC= 1
##$INTSCL= 1
##$ISEN= 128
##$LB= 0.24
##$LEV0= 0
##$LPBIN= 0
##$MAXI= 10000
##$MC2= 0
##$MEAN= 0
##$ME_mod= 0
##$MI= 1.114404
##$NCOEF= 0
##$NC_proc= 0
##$NLEV= 6
##$NOISF1= 3.799351
##$NOISF2= 2.8
##$NSP= 1
##$NTH_PI= 0
##$NZP= 0
##$OFFSET= 15.70392
##$PC= 1
##$PHC0= -11491.68
##$PHC1= 24.40099
##$PH_mod= 1
##$PKNL= yes
##$PPARMOD= 0
##$PSCAL= 0
##$PSIGN= 0
##$REVERSE= no
##$SF= 200.130013532006
##$SI= 16384
##$SIGF1= 3
##$SIGF2= 2
##$SINO= 400
##$SIOLD= 16384
##$SREGLST= <1H.CDCl3>
##$SSB= 0
##$STSI= 0
##$STSR= 0
##$SW_p= 3612.71676300578
##$SYMM= 0
##$S_DEV= 0
##$TDeff= 0
##$TDoff= 0
##$TI= <>
##$TILT= no
##$TM1= 0
##$TM2= 0
##$TOPLEV= 0
##$USERP1= <user>
##$USERP2= <user>
##$USERP3= <user>
##$USERP4= <user>
##$USERP5= <user>
##$WDW= 1
##$XDIM= 8192
##$YMAX_p= 0
##$YMIN_p= 0
$$ End of Bruker specific parameters
$$ ---------------------------------
##NTUPLES= NMR FID
##VAR_NAME=  TIME,          FID/REAL,        FID/IMAG
##SYMBOL=    X,             R,               I
##VAR_TYPE=  INDEPENDENT,   DEPENDENT,       DEPENDENT
##VAR_FORM=  AFFN,          ASDF,            ASDF
##VAR_DIM=   8192,          8192,            8192
##UNITS=     SECONDS,       ARBITRARY UNITS, ARBITRARY UNITS
##FACTOR=    0.0002944,     1,               1
##FIRST=     0,             0,               0
##LAST=      2.4114304,     0,               0
##MIN=       0,             -153077,         0
##MAX=       2.4114304,     145598,          0
$$ Real data points
##PAGE= N=1
##DATA TABLE= (X++(R..R)), XYDATA
0 0 0 0 0 0 0 0 0 0 0 0 0 0 -8 8 -8 8 -16 16 -16 24 -24 32 -40 41 -48 57 -70 80 -90 104 -120 136 -153 174
34 174 -196 220 -247 276 -308 342 -381 421 -469 517 -573 632 -698 768 -848 934 -1028 1132
52 1132 -1250 1379 -1524 1690 -1880 2097 -2351 2655 -3020 3475 -4052 4817 -5878 7446 -9988
67 -9988 14776 -26779 115488 145598 -153077 35688 3405 -11165 103189 -71760 -64817 88005
79 88005 -8716 5522 -11439 -38370 69752 11286 -44758 28544 -9008 14471 19177 -44046
91 -44046 24517 20434 -30684 37884 -12189 -27036 59593 -17769 -31618 52755 -17839 -17039 38933
104 38933 -23743 -5668 31851 -19771 -456 14799 -11564 11704 410 -12568 17103 -2589
116 -2589 -7793 8944 -9524 6132 5123 -17331 13484 -1353 -12174 22801 -19388 -9421 33833
129 33833 -29611 -7058 31884 -33193 3849 23990 -34633 11222 12997 -27745 15373 548
141 548 -18488 12657 -7989 -5083 7006 -13623 4446 -655 -10639 8377 -13170 -1728 12662
154 12662 -23580 5519 11207 -27942 13747 5971 -29100 19821 725 -25906 20644 -3545
166 -3545 -19066 17577 -5432 -11119 10456 -7076 -3678 5529 -5255 -1443 -96 396 222 -6434
180 -6434 3703 1564 -8359 7134 -1012 -9737 13142 -3065 -11572 16674 -4752 -11181 18783
193 18783 -6825 -8549 18409 -8415 -3904 16042 -9240 -245 12562 -6872 2135 5581 -2704
206 -2704 5477 365 948 3867 -2742 6804 617 -4538 11744 -3883 -3038 13266 -7895 373 12983
221 12983 -9697 5231 10633 -11271 8214 6334 -8980 9070 2921 -5131 8539 -235 -1364
234 -1364 5227 278 1113 738 1819 2959 -2802 2667 2516 -4348 4385 1210 -5041 5908 -408 -4597
250 -4597 6238 -1431 -4256 5407 -1216 -4068 5003 -1946 -4299 5624 -768 -5652 4128 -63 -5490
265 -5490 2564 -97 -4493 1189 118 -3908 -1597 844 -2437 -4153 1783 -1482 -6433 2666 -1633
280 -1633 -6355 3840 -2907 -5737 4489 -4771 -4357 4174 -5264 -1873 2570 -5645 -376 881 -3962
295 -3962 -716 -974 -657 -1253 -2947 1821 -2573 -3397 3707 -4066 -3017 4090 -4589 -1614 3194 -4169
311 -4169 291 1480 -3126 1420 -322 -1786 2112 -1209 -839 2006 -635 -13 989 456 73 117 1695
328 1695 248 -374 2136 329 -593 2274 760 -298 1893 1406 -63 954 1665 684 1235 1580 454
345 454 1865 1459 262 2678 1018 406 3535 400 265 3859 410 588 3078 915 704 1411 1448
362 1448 1192 111 2323 1464 -803 2242 653 -540 2977 445 101 2166 -81 635 1103 -465
378 -465 1233 807 -401 430 -291 386 61 71 532 -1220 103 920 -1833 286 969 -2065 -183 446
396 446 -1764 -838 -47 -636 -1933 -659 104 -2451 -797 433 -3193 -312 -4 -3284 200 -596 -2509
413 -2509 318 -1451 -1817 94 -1631 -1012 -734 -1255 -807 -1926 -500 -708 -2758 604 -812 -3094 973
430 973 -1317 -2761 969 -1391 -1816 354 -1240 -761 -380 -756 -87 -1040 -455 69 -1027 55 -47 -745
448 -745 376 -134 -22 77 -303 611 -82 -38 785 -228 409 396 -87 1204 -48 122 1213 -84 918
467 918 717 95 1580 122 793 1741 -572 2161 1772 -1171 2846 1165 -795 3010 510 20 2385
484 2385 -170 1287 1728 149 1894 182 531 2263 -731 1422 1981 -1103 2275 1054 -1180 2646
500 2646 149 -547 2788 -434 14 2024 -425 697 907 -51 803 36 795 771 -910 1012 184 -1134
518 -1134 1004 47 -1114 469 -235 -725 144 -446 -762 -475 -393 -737 -408 -542 -900 -16 -980 -820 70
537 70 -1281 -817 235 -1563 -503 -657 -1292 -31 -1234 -1205 234 -1663 -691 204 -2448 -275 -358 -2067
555 -2067 -39 -1041 -1357 -184 -1858 -177 -612 -2367 520 -969 -1914 1113 -1675 -1246 1306 -2008
571 -2008 -229 682 -1853 500 -40 -1506 698 -450 -750 188 -471 119 -430 -109 935 -899 535
588 535 800 -1363 915 1031 -1102 861 986 -557 757 994 -58 451 1037 441 450 1227 443 513 1289
607 1289 235 879 1399 12 1033 1218 224 1057 891 489 1095 623 901 441 481 1556 52 637 1493
626 1493 -271 1009 1262 -366 1360 397 90 1945 -480 446 1696 -1089 1211 1135 -1237 1321 544
643 544 -683 855 -106 45 125 -553 925 -663 -292 1206 -1428 100 1055 -1990 526 354 -1798
660 -1798 1085 -224 -1569 811 -860 -1280 440 -658 -824 -518 -99 -415 -1222 108 -744 -1872 640
677 640 -732 -2080 682 -723 -1785 460 -898 -1560 -320 -711 -1174 -677 -481 -982 -357 -164 -1297
694 -1297 -329 -67 -1273 -179 -232 -1084 208 -210 -869 -183 -221 -489 -570 -56 -126 -981 133 112 -898 585
714 585 161 -988 967 -448 -510 958 -807 191 1079 -911 868 934 -830 1102 429 -314 903 188
732 188 415 638 175 1125 10 393 1212 -277 736 1366 -583 1083 822 -311 1493 308 -71 1702
750 1702 69 56 1382 178 392 1269 213 430 803 852 156 485 1030 98 364 1065 -107 260 885
769 885 -91 199 637 5 47 568 74 -188 506 53 -474 652 -32 -722 751 -259 -729 804 -537
788 -537 -414 384 -412 -329 -71 -259 -374 -718 164 -352 -1187 440 -401 -1330 574 -821 -1224 395 -1023
807 -1023 -555 196 -1131 -269 -378 -1077 -49 -873 -680 -262 -1097 39 -400 -1031 308 -878 -834 165 -1181
826 -1181 -413 114 -901 -190 -363 -621 -107 -629 -386 -96 -939 181 -51 -885 282 -77 -546 203 -41
845 -41 71 -139 -26 221 -92 228 495 -253 302 286 -132 471 216 -34 463 230 228 363 185 340 227 485
867 485 177 264 942 128 366 1028 -29 352 1094 109 591 755 447 703 274 992 592 144 1121 285
887 285 -107 1261 99 113 1072 -82 566 533 -25 855 24 108 828 -154 306 588 -298 707 21 -252
907 -252 908 -459 -30 795 -749 243 751 -811 441 -8 -635 128 -140 -178 -82 -644 250 -431 -374 276
927 276 -764 -630 52 -809 -53 -144 -780 -185 -301 -631 -390 -353 -649 -414 -415 -559 -469 -152 -863 -631 -81 -723
949 -723 -536 22 -447 -301 -376 -305 -349 -846 -270 -186 -765 -35 -445 -657 194 -362 -402 41 -785 -56 -200 -599
971 -599 609 -460 -217 532 -721 -60 691 -492 317 308 -404 575 -88 -154 253 -329 29 504 -110 347
991 347 359 132 644 -357 436 501 -581 779 375 -533 970 546 -54 732 619 374 710 406 196 269
1011 269 716 779 242 653 573 8 874 -165 319 1229 -4 -210 692 87 -71 541 407 196 147 349
1031 349 -221 260 553 -273 413 610 -388 258 252 -217 278 -81 -14 147 -356 251 -199 -417 349 -362 -141
1052 -141 214 -754 69 70 -612 355 -466 -490 353 -929 -180 122 -1009 -88 -219 -895 242 -542 -571 217
1072 217 -762 -293 51 -1069 -129 -218 -694 5 -443 -77 -376 -875 127 -507 -847 420 -633 -757 286
1091 286 -576 -284 137 -648 -239 -32 -375 -233 -17 -176 -176 118 -24 -309 -21 132 -440 106 31 -337 224
1112 224 -52 -167 148 233 -151 -40 425 118 89 524 21 31 711 -103 117 774 -126 407 681 -73 732
1133 732 375 -49 592 408 113 433 190 224 326 160 588 -53 453 549 -293 721 718 -336 745 177
1153 177 -163 954 76 29 847 -136 367 538 -296 349 444 -136 301 8 90 -141 -79 693 -273 42 472
1174 472 -494 242 513 -611 119 182 -579 53 412 -672 -168 203 -596 -269 298 -564 -341 312 -491 -600
1194 -600 435 -630 -392 420 -777 -604 243 -391 -528 100 -213 -770 -71 71 -947 -193 228 -1190
1212 -1190 -37 305 -1317 257 137 -1355 305 30 -1039 438 -110 -682 64 -242 -403 -122 -122 -243
1230 -243 -395 155 -193 -638 626 -129 -694 758 -363 -635 832 -442 -337 841 -709 -24 757 -443
1248 -443 162 595 -123 -25 502 57 -75 560 118 -260 601 507 -392 871 523 -519 786 476 -407 764
1268 764 495 -524 581 593 -177 359 782 -443 480 904 -466 549 988 -578 277 1071 -311 207
1286 207 1065 -514 16 838 -172 -120 720 -139 -296 647 215 -789 559 80 -765 1025 24 -956
1304 -956 1235 -125 -907 1082 -113 -892 242 -152 -529 558 35 -524 -157 308 -516 -454 446 -458
1322 -458 -499 722 -1097 -433 631 -999 -9 603 -1095 -261 551 -835 -250 439 -853 -270 360 -1033
1340 -1033 -703 424 -183 -1280 178 -351 -639 351 -157 -862 137 0 -885 538 -70 -997 640 179
1358 179 -610 556 -4 -907 46 235 -840 289 181 -1180 379 946 -1018 358 586 -936 131
1375 131 471 -669 -125 739 -474 -301 1058 -400 -349 1216 -219 -668 1315 -241 -628 1438 -371
1392 -371 -351 1428 -306 -581 1288 -16 -292 1027 295 -305 796 361 -573 566 670 -467 303 998
1410 998 -826 534 1040 -808 473 871 -779 429 885 -725 415 760 -666 99 805 -617 23
1427 23 843 -365 -347 933 -426 -445 808 -299 -650 829 -259 -462 549 -183 -619 579 -94 -798
1445 -798 319 -6 -926 507 52 -936 644 65 -1135 498 -17 -1217 583 -83 -962 144 -163
1462 -163 -1030 0 45 -688 -54 308 -696 -433 487 -779 -564 823 -892 -624 888 -1051 -479 810
1480 810 -898 -379 612 -867 -531 558 -455 -528 592 -205 -564 436 189 -864 673 140 -827 505
1498 505 316 -946 673 422 -905 708 295 -825 452 506 -688 385 473 -646 337 691 -436
1515 -436 245 683 -496 -2 815 -406 66 943 -380 -186 997 -335 -229 863 -89 -125 945 200
1533 200 -388 876 156 -478 865 293 -313 911 142 -537 873 108 -425 741 261 -329 518 430 -355
1552 -355 268 509 -175 95 618 -548 -88 729 -652 -30 732 -661 88 619 -806 12 555 -512
1570 -512 184 442 -496 87 327 -455 -257 202 -210 -564 425 -75 -750 578 -26 -781 439 -330 -576
1589 -576 456 -272 -737 365 -92 -737 269 -75 -805 261 47 -881 164 37 -657 -121 170 -769
1607 -769 0 285 -609 93 174 -462 -133 199 -436 -303 310 -343 -396 285 -213 -488 487 -357 -525 657
1627 657 -269 -520 510 -213 -507 358 -215 -218 434 -20 -54 -10 -1 -143 191 392 -114 266 327 -284 376 565
1649 565 -381 245 500 -375 375 426 -331 372 164 -225 364 372 -80 290 344 76 101 436 117 -11 359 118
1671 118 -75 567 15 -59 573 -31 -35 463 37 -140 383 144 -98 363 61 -88 373 170 -278 318 73
1692 73 -278 251 12 -164 308 13 -114 267 165 -135 40 127 -41 -274 125 -205 -179 332 -390 -167 217
1713 217 -281 -173 209 -516 -142 201 -360 7 -63 -430 -107 -77 -260 -258 -121 -37 -230 -290 63 -403 -148 144
1735 144 -639 -17 -52 -439 -40 -98 -523 -130 -45 -304 -65 -109 -173 -86 -56 -243 -297 64 -102 -190 51 -169 -173 79
1759 79 -128 -165 99 43 -8 -1 -51 89 128 -42 30 91 129 53 68 34 84 272 -99 23 295 -21 326 293 -53
1784 -53 191 383 43 128 117 -31 199 9 230 153 9 254 198 83 359 148 154 405 -235 278 202 -58 133
1807 133 20 15 219 -35 152 132 4 256 58 133 345 -38 148 144 19 210 53 -67 186 259 3 87 -46
1830 -46 -175 -9 -65 68 -136 -189 62 -80 -126 -43 -72 -55 106 -145 -161 -190 -154 -39 -159 -251 -157 -93 -172 -146 3
1855 3 -113 -194 -81 -190 -213 4 -53 -19 -245 -58 -206 -119 -94 -68 -123 -12 -284 -129 74 -213 -204 63 -159 -182
1879 -182 93 -272 -119 -178 -224 29 -226 9 -58 -187 -58 -135 -218 132 110 -88 146 -121 54 76 -152 118
1901 118 131 -25 232 103 21 50 -24 258 202 10 162 54 -220 165 271 187 156 47 231 -83 112 120 142
1924 142 155 146 65 84 107 85 275 0 162 138 212 30 152 122 197 46 48 147 104 96 91 264 45 9 161 108 15
1951 15 91 48 67 133 73 147 14 -79 149 -89 49 158 -233 -41 12 -234 2 -53 -118 -53 -149 -201 -198 -142 155 -70
1977 -70 -122 -59 -140 -44 -32 -289 30 -68 -280 50 -127 -200 -106 -206 -133 109 -341 -28 -64 -87 -83 -176 -169 -85 -312 -101
2003 -101 -172 -116 -53 -175 -110 -13 -215 -201 52 -88 84 -176 -79 61 -57 -15 -54 118 -113 -115 -138 -87 58 -133
2027 -133 57 -14 150 -26 128 211 4 94 98 124 224 -86 130 59 104 230 108 80 234 96 98 151 -43 119
2051 119 68 113 150 -77 79 166 -58 261 232 -85 235 127 50 287 -116 62 235 -13 171 119 -68 56
2073 56 -42 -4 346 183 -15 102 29 88 -3 57 180 -23 96 65 -76 130 139 -224 95 134 37 91 13 -79 53
2098 53 85 43 -36 -108 -68 -110 115 -93 51 -30 -201 60 -6 -222 -58 -157 -146 -31 1 -82 -35 -30 2 -231 -56 -20
2124 -20 -166 -102 -39 -263 -46 -53 -111 -59 -130 -139 -162 -152 -73 -163 64 -3 -240 -98 36 -169 -7 39 -94 262 -134
2149 -134 -186 54 -204 -18 92 -143 36 88 54 215 33 84 -22 56 178 175 89 122 -9 91 48 -106 61
2172 61 127 -28 62 233 172 223 134 45 21 3 133 149 122 140 181 119 88 259 105 17 171 67 14 237 159 1
2198 1 36 248 63 104 291 199 -44 -38 103 15 -15 -28 101 94 -63 25 27 59 -99 7 45 -41 45 -39 -94 4 -80 -54
2226 -54 -33 5 -114 -79 73 -71 -54 130 -119 -136 74 -119 -188 53 -193 -127 -35 -57 173 -115 -56 6 -54 -56 -106
2251 -106 -97 -92 -71 -34 -112 31 -197 -20 -74 -28 -78 -34 -131 -150 -203 3 -239 -49 -55 -87 -22 87 -81 -66 52 -92
2277 -92 -36 32 -43 77 86 42 -215 -146 -64 -25 -40 4 73 179 -32 105 18 89 35 -21 58 -49 26 220 121 91 184
2304 184 -15 25 160 30 268 73 -87 241 41 90 -23 -19 183 69 -88 304 145 16 222 154 -86 117
2326 117 28 288 -99 41 -52 99 -5 154 27 -108 12 -39 38 139 -44 74 -24 -100 -30 -32 208 4 21
2349 21 -88 -64 57 77 -69 -35 -11 -62 237 -215 -96 42 44 -16 32 50 -82 -136 -40 -148 -17 96 -120 -7
2373 -7 -60 66 57 -57 -139 -26 -80 -118 -43 -5 -53 -63 -78 -12 -81 -123 -22 -185 -48 -139 -69 36 -126 -2 41 41 6
2400 6 78 -164 -45 58 -116 -121 -60 -9 -136 -53 -48 -48 -57 21 122 2 -73 105 -52 106 0 -5 -44 -20 18 144 -45
2427 -45 110 38 -35 -17 114 94 -72 164 2 61 -36 95 105 -15 36 65 130 106 -28 45 73 -70 37 209 -14
2452 -14 94 23 -5 64 66 65 62 -25 161 100 150 45 108 -84 36 -61 -13 48 59 43 206 -158 -118 41 1 78 118 -36
2480 -36 216 39 -110 58 -29 93 -98 -21 -3 145 -78 136 -83 -115 -41 28 -127 -169 -88 -113 3 -16 85 -11
2504 -11 -23 224 -22 -70 -72 -195 -92 -138 -92 25 0 -91 -18 -110 -115 -195 39 -143 -78 -54 85 -122 -113 -53 -82 -49 -104
2531 -104 174 -163 3 -47 -76 205 -33 -19 -90 6 -109 -121 0 -99 75 -7 -2 -13 34 -117 -68 136 -97 -54 16
2556 16 -102 -32 73 -82 175 35 -208 227 181 -66 60 227 16 50 -51 -183 155 29 108 20 -27 -185
2578 -185 -74 -89 14 37 242 63 6 73 109 -148 -10 -15 -94 7 -4 -25 118 35 7 160 135 -80 74 25 -250
2603 -250 115 -98 -135 84 52 -104 11 91 20 87 72 -138 30 104 -210 2 105 -161 -4 -22 -75 54 -19
2626 -19 -175 -4 -21 -265 -60 29 -33 -289 -9 -56 -165 161 -130 45 -130 -66 -28 -58 -5 -28 239 112 43 31
2650 31 36 -87 71 -23 -220 148 -62 22 18 57 -205 -82 -12 -51 -184 126 -365 -7 72 -112 45 10 -41 34 8
2675 8 -94 -36 82 34 -85 151 -156 57 65 23 22 174 -119 2 205 -53 15 92 -21 34 58 -126 -58 55 68
2700 68 -117 190 126 -98 -38 138 -108 118 124 -45 76 194 -70 71 161 -236 -1 38 -80 -17 166 114 164
2723 164 80 -10 111 135 20 35 188 56 -65 170 96 12 252 -80 5 276 39 -246 309 0 148 50 -145
2746 -145 -184 58 60 -122 39 99 -133 123 -81 -73 33 72 -197 20 -22 -95 -51 -73 -327 -59 134 109 -80 142
2770 142 -17 -42 79 -158 -190 105 -106 21 82 -78 41 84 -95 -26 155 -138 -141 -74 61 -65 127 -114 -64
2793 -64 77 96 -179 81 -3 -50 10 111 -72 57 18 24 36 -95 -297 118 149 -55 116 151 -163 -80 162 -16
2817 -16 -91 180 -115 114 207 -126 7 319 41 -54 257 -64 30 107 -192 -64 -57 47 -99 108 78 -87 160
2840 160 85 -176 55 -51 -58 104 -15 59 122 75 -157 59 102 -44 4 25 -89 119 152 -152 65 93 -4 93
2864 93 89 -197 81 181 -183 19 -11 -112 -52 14 -191 -83 175 -172 -164 -33 31 -81 70 68 3 81 30 -105 210
2889 210 -162 -78 -10 -62 -19 -104 -24 -148 -57 -103 -74 57 -121 -32 -62 -7 -24 -89 -76 -198 -15 22 -189 -79 67
2914 67 -237 70 62 -109 -15 61 49 -6 -36 -23 -99 13 22 -98 57 57 -108 158 -51 -103 25 11 -110 150 -132
2939 -132 3 140 -25 -110 20 116 -118 82 42 -71 2 167 103 -47 117 -157 216 100 -211 -25 114 80
2961 80 -51 -29 -36 8 206 29 -3 82 59 -86 140 79 -59 13 86 -34 128 65 32 43 39 21 -17 30 -62 0 133
2988 133 -18 11 220 -51 49 87 19 -88 39 -149 108 36 106 36 42 -21 47 79 6 25 91 -187 -56 3 -28
3013 -28 -26 28 -142 -158 -47 -31 -82 -91 192 -23 -60 6 -90 4 41 -109 37 -219 63 7 145 31 -61 -143 35 162
3039 162 5 63 -281 15 -84 -145 243 350 -75 -341 119 -136 -90 101 159 -32 -87 -27 116 -141 78 154 -522
3062 -522 75 -7 -141 -127 292 100 24 430 72 -398 -67 -359 221 -162 -74 -58 -81 -75 -108 84 9 -211 310
3085 310 292 -17 -12 248 -73 -71 -637 -96 -101 -618 52 216 505 -121 109 -42 328 -534 53 29 51 -256 -731
3108 -731 -304 -185 -128 -107 285 145 -12 -351 -75 -60 -241 -279 130 9 4 241 -167 162 -174 46 59 -155
3130 -155 -80 105 -24 -143 52 -43 100 -177 121 36 47 -20 -251 230 -8 -74 98 -116 -133 113 67 112 -6
3153 -6 -47 -14 -220 -82 -55 -50 -76 -23 -138 -104 -60 -18 48 -57 -144 29 86 -13 -63 12 -74 -75 -107 -97 -17 -102 -69 -111 -42
3182 -42 -14 131 33 -56 -24 -13 57 -114 82 70 120 95 33 -17 29 -66 155 176 -123 15 -87 91 -66 -7 -117
3207 -117 102 87 49 104 34 -13 97 -151 -52 36 45 -39 -115 -73 -133 -26 108 148 23 -26 -79 51 -47 -122 -4 -2 -29
3234 -29 75 -114 57 11 18 10 7 12 -93 88 -116 -81 -1 -4 6 -124 8 118 -169 -43 44 -19 12 4 -114 -2 98
3261 98 39 146 84 77 145 46 -97 129 129 10 89 20 3 134 84 21 -166 81 -35 17 -14 -3 -111 -29 58 -53
3287 -53 -139 7 -196 44 -2 -118 -11 -180 53 -87 -29 84 13 72 31 152 92 10 -3 55 56 100 -20 -42 56
3312 56 -6 -10 -135 -57 117 57 25 -15 -90 29 140 -36 -11 219 -196 4 115 -20 279 140 151 -117 -61 457
3336 457 113 99 -197 -82 339 167 -53 -312 202 334 -308 167 133 -12 -65 308 162 109 6 -80 -11 -41
3358 -41 17 91 -11 -27 181 -5 -54 -81 -7 28 60 -65 -54 111 58 28 -87 78 -89 -10 -56 -83 -25 35 143 23
3384 23 -1 -110 76 98 -74 -131 -123 54 177 -36 -66 -16 116 60 -157 51 -42 -35 -81 -45 -41 99 52 -69 -76 112
3410 112 -22 -35 20 97 -4 -112 4 23 -89 8 54 63 63 5 -68 -27 178 -39 -126 2 -67 -19 26 74 171 47
3436 47 92 28 -75 -49 -84 12 -28 64 50 62 141 70 7 37 71 -23 -92 22 163 -93 -71 1 -31 12 -66 -47 66 21
3464 21 50 50 -161 -69 21 29 -118 -150 30 87 7 64 55 61 143 39 26 29 56 -4 83 -72 -143 -35 -50 32 24 32 10 -74 -24
3495 -24 196 -2 -35 50 6 108 -73 -41 42 119 46 -123 87 -82 153 -5 20 -12 95 -31 -146 173 85 123
3519 123 31 201 -9 23 -34 66 2 0 -53 41 -75 34 -106 159 -87 171 -56 -99 -77 -173 75 -20 -161 -84
3543 -84 27 -113 86 -46 -50 -34 133 8 101 -95 32 -6 -16 20 40 86 51 58 -149 -132 -121 23 74 40 -213 -39
3569 -39 33 52 -51 -116 -62 -12 81 102 -100 123 62 8 44 56 -3 -111 29 -85 -34 33 183 180 -17 -4 12 -26 0
3596 0 -77 -198 112 -88 -111 -42 -86 72 -108 71 -194 84 -14 -34 -38 -55 268 7 -77 -75 97 -155 269 -244 509
3621 509 -45 -146 -252 -18 -85 -24 51 -283 188 156 -145 260 -85 -321 60 12 142 118 -17 -16 97 159 -24
3644 -24 -202 39 -180 50 171 -38 106 -47 -28 164 127 -14 -30 -31 -70 65 16 110 108 -73 -151 40 -51 -109 34
3669 34 -128 -57 67 -121 109 -38 133 -73 50 3 49 -19 6 110 56 -102 -179 -1 -10 76 32 122 -2 -73 40
3694 40 -35 9 -17 -83 -18 -112 199 21 -37 -162 -75 -79 -27 -47 -231 -44 77 -14 -108 5 -19 135 174 21 26 89 16
3721 16 -86 -72 110 41 -105 134 62 75 121 -70 -72 74 11 43 -65 -4 1 23 72 -80 11 -23 94 -41 -12 157
3747 157 -47 91 59 2 -39 126 112 -147 -11 -117 89 25 117 -108 67 39 186 9 89 -109 8 -10 -61
3770 -61 29 59 -65 36 23 -47 64 -15 5 28 52 -23 94 34 -77 -31 -23 -87 -72 10 18 92 -66 108 -33 48 -69
3797 -69 -95 46 162 -99 90 -184 -190 -250 -60 47 -23 -213 -155 -328 3 241 41 40 -421 226 -160 -3 -170
3820 -170 299 84 -77 2 197 33 -326 -264 130 -88 134 -49 -193 65 172 77 -23 -84 122 64 116 -136
3842 -136 56 25 -40 10 10 3 93 -24 48 -80 130 -4 -37 -58 -49 151 123 27 -72 18 -171 -113 -110 53 94 5 -27 -161
3870 -161 -9 -4 -1 121 -112 -140 -144 -7 98 45 -24 -127 -100 -18 73 35 -213 38 -336 -124 -46 -85 10 -224 -168 -127
3896 -127 80 97 -29 -138 71 -30 46 -21 -75 -185 -10 -13 -43 -5 114 107 -135 102 -45 -13 81 -16 -53 94 56
3921 56 120 85 -5 -13 -59 -103 198 51 132 15 -36 -11 163 -5 -23 78 121 140 11 68 -62 -34 12 -66 -45 -46 -80
3948 -80 -138 -59 -57 119 -56 -92 80 115 125 -55 -106 132 -150 -30 8 210 20 -57 -5 -70 74 79 -12 3 -32 -104
3974 -104 11 76 -102 3 10 -18 -54 -111 158 -124 17 129 -40 -122 181 -109 24 -85 -6 1 57 -147 21 -135
3998 -135 193 100 172 80 9 -115 50 -103 -166 23 143 81 156 -37 168 -169 185 153 132 229 -542 -282 38
4021 38 213 119 63 117 -84 19 7 -122 -61 69 55 65 156 -43 15 -68 15 -78 33 -116 164 -66 -124 -36 60
4046 60 109 -30 88 -87 103 132 205 -39 0 -41 -67 -59 67 -107 22 -47 -102 -114 99 48 75 18 -76 -82 31 33 127
4073 127 69 83 29 36 -30 -102 -20 177 -104 -125 143 59 74 152 80 -29 127 29 -19 143 -98 110 7 -94 49
4098 49 4 -113 -6 -31 71 -38 -1 -44 8 -144 86 14 65 53 -36 24 58 68 -188 130 18 88 -28 -18 82
4123 82 -1 1 -28 -3 -9 124 148 58 74 114 12 28 -5 45 120 -7 -39 -79 98 -8 -23 177 33 -79 -13 75 -91
4150 -91 -88 -61 -100 13 170 114 84 129 -124 61 51 -56 -286 368 152 -202 -110 -201 -129 -42 11 -127 60 100 -117
4175 -117 -11 -9 66 92 47 -28 43 -138 14 -33 -140 87 -29 52 -93 -64 5 11 95 -78 -84 25 -8 -128 38 61
4201 61 -60 47 -43 43 0 63 -203 -58 -5 -85 -97 -22 -44 -7 23 -50 -134 7 133 62 -84 -93 124 61 30 -178
4227 -178 -62 -71 64 -53 -29 -31 34 -59 -157 93 -43 -196 32 50 113 -123 -11 15 9 15 40 19 113 89 -129 -89 3
4254 3 39 99 -7 92 3 -79 14 -1 28 -36 117 -102 -51 22 88 -5 -107 85 154 98 -35 27 -69 -22 10 112 -54
4281 -54 -2 -15 -129 139 -155 37 -73 52 -37 98 -91 10 -15 -82 -71 -97 -145 -38 22 -66 142 78 33 -118
4305 -118 -1 57 17 172 76 -104 29 28 -45 -27 12 54 -30 -115 76 -1 56 60 -68 -82 61 -115 -80 25 -21 10
4331 10 11 -69 -66 151 28 43 104 -40 52 37 16 -42 40 129 -132 -22 193 49 -18 -14 -179 85 -102 121 -87 -19
4357 -19 -51 -39 60 26 156 53 110 -62 70 94 -62 84 -24 26 3 27 153 -47 14 31 21 35 -91 -13 60
4382 60 67 -39 -137 -163 26 -110 -145 87 -60 -103 -105 25 115 -10 -71 129 52 -24 -134 -9 -86 169 -185 126 -60
4407 -60 -207 160 -175 201 114 -94 112 -193 -81 105 145 118 24 2 0 -85 -55 -39 -30 -95 -42 -104 51 -18 61 42
4433 42 70 28 -176 -37 -26 45 -154 87 91 -68 -11 55 -112 -25 -41 -66 72 74 105 24 30 68 68 71 31 -62 10 3 -77 37
4463 37 -112 -117 -182 -102 38 -31 -91 22 -59 46 88 -87 31 -63 -122 -6 -46 33 -88 -143 132 -46 -98 2 -172
4488 -172 183 96 -15 42 -44 17 62 55 65 -14 54 -10 8 91 204 -103 -4 -8 148 24 0 95 -126 -19 10 -110
4514 -110 -16 8 44 -72 -149 90 31 -189 -52 -13 -59 13 -45 9 -91 17 60 59 -30 27 -31 60 -87 -77 -32 46 -154
4541 -154 -145 3 -66 143 -85 -29 68 60 -112 17 209 -20 -79 55 176 -61 83 -105 119 160 70 7 24 28 99
4566 99 122 93 135 -60 112 18 -126 -96 55 78 -71 -83 55 161 50 108 -24 -53 41 39 -8 172 -12 -121 -74
4591 -74 -5 -66 17 -255 -124 -31 49 73 -117 -11 4 85 74 -16 21 52 -1 6 6 -36 -154 -27 -97 125 52 -94 -27
4618 -27 -51 -65 -33 19 182 106 120 -83 -21 21 -189 -34 54 35 -51 -165 28 -7 -128 37 -34 194 -91 25 16
4643 16 -64 -89 73 -50 -153 94 133 -105 42 -125 -36 -121 80 4 -9 47 -209 97 -128 20 -51 -5 29 40
4667 40 146 123 118 -58 -63 -28 -29 34 -116 -31 -1 -172 41 -36 14 -44 0 124 -90 -6 -36 -112 -73 27 12 -89 77
4694 77 40 94 -59 -38 76 -64 92 -105 -92 53 5 104 61 -365 -36 91 -106 -4 42 80 -25 -109 -136 -32
4718 -32 -120 -130 47 34 -6 70 106 -4 -58 -29 -29 -103 164 -146 -53 108 126 -21 -147 -14 3 -10 14 40 -25 -34 -181
4745 -181 17 -56 -37 -72 72 -53 -438 -105 -83 81 -128 205 -80 -353 -55 182 -24 82 -396 -37 -36 127
4767 127 -9 40 -158 1 -215 -88 -83 3 84 24 41 111 70 -137 11 14 13 -135 1 -15 72 -84 25 29 -10 83
4793 83 -105 -69 98 -56 76 69 85 -70 33 -9 -106 16 -3 8 145 18 -37 -55 29 -38 24 16 -35 22 165 -28
4819 -28 30 -120 -145 180 -61 -11 303 -31 107 5 27 41 101 95 -87 18 140 135 -91 -68 65 -45 13 82 24
4844 24 0 149 75 116 -49 35 -17 84 -207 -412 308 161 266 111 390 -325 210 214 18 8 -110 172 188
4867 188 66 39 59 -225 -35 109 -6 -65 -48 -89 -100 131 75 36 -41 -39 154 -27 -88 -34 10 -116 -139 65 -99
4892 -99 -64 40 35 82 10 -59 26 175 61 -55 -121 -54 -45 -119 -103 -88 -36 95 69 26 82 199 -145 -60 83 -15 -103
4919 -103 -99 -82 65 112 22 -21 -125 -59 -16 -215 -92 46 63 -21 -99 50 -103 -39 -30 12 -145 102 -45 12 -51 49
4945 49 -47 181 69 58 -30 -13 -141 188 -2 40 -49 66 59 39 90 -48 51 2 -73 20 97 51 -79 -70 45 -50 144
4972 144 -31 57 79 -33 50 -7 87 -60 -198 32 46 28 37 86 -9 -154 131 -36 -31 -70 -88 -55 106 15 -235 -29
4998 -29 -131 -41 39 133 -40 57 97 -17 -16 3 -65 -115 54 -7 16 45 6 -121 124 -84 -23 -64 33 -138 -146 -33 29
5025 29 -62 -27 53 -3 52 -18 6 16 81 -57 8 -129 -138 159 -49 38 100 107 -18 -17 -33 -43 -56 -184 -48 -132 -71 86
5053 86 54 -23 -30 -120 15 3 -54 40 27 -8 -50 -52 147 -23 -20 -48 137 141 -17 -50 -39 39 -62 -245 -178 -23 -21 40 -174
5082 -174 -109 -164 -143 -248 -41 18 255 194 240 41 195 -80 2 46 252 -345 107 56 -110 128 486 307 88
5105 88 188 317 248 19 83 29 -88 -228 -107 407 195 -241 64 -103 -69 -329 26 415 139 -23 -143 -315
5127 -315 187 184 30 72 156 331 -40 -34 -195 129 -310 23 123 260 135 -2 9 -93 -89 62 205 -172 22
5150 22 -190 153 -38 -89 224 9 92 -180 51 205 -210 -182 -2 115 -216 -313 -49 71 57 -63 193 -130
5172 -130 -308 218 269 -33 158 -18 -214 -66 86 -70 -40 95 -95 104 -125 81 -45 -9 -139 -29 -134
5193 -134 8 83 -149 -6 165 -143 49 25 63 0 -225 -99 65 22 -60 16 -89 134 54 -49 -193 183 57
5216 57 13 97 68 192 209 334 125 86 57 -133 -18 4 -99 -25 189 256 -284 -162 73 -115 -194 -150 -229 213
5240 213 -400 -36 -531 20 40 -90 -223 -191 -337 -318 -74 -2 143 -82 187 -356 382 316 100 -193 31 102
5262 102 -86 299 83 12 333 111 170 -58 -297 384 9 -133 -17 97 -47 195 -624 -46 76 285 243
5283 243 -6 -11 -98 48 39 -458 -531 751 -228 -120 110 -146 -263 268 198 -200 -178 -338 525 286 -263 -53
5305 -53 65 -251 -25 117 -832 -189 -58 -138 -203 21 71 -92 -292 -261 72 -132 -91 341 338 205 265 177 165 100
5329 100 -469 44 160 -122 324 93 -126 -129 126 -348 195 115 -193 -290 132 57 28 -197 400 340 -253 -222 42
5352 42 198 -422 306 -416 31 341 59 -81 -102 184 63 -46 382 45 -134 -207 -188 83 -182 22 -22 329
5374 329 -182 289 131 100 -127 -15 -108 -570 -71 -346 178 83 -246 -137 61 257 -101 160 65 523 -93
5395 -93 442 427 -6 -59 -443 -25 -429 -527 -704 40 -94 -51 -2 82 -183 -7 -100 306 -274 15 -19 -536 340
5418 340 -24 -125 202 92 -387 -71 32 69 90 -172 69 123 -20 0 -38 -49 252 54 -58 -48 -130 116 12
5441 12 235 156 122 108 149 -52 -16 -150 73 -87 78 -111 159 -15 89 -124 231 -33 -60 106 93 -3 174
5464 174 92 -113 137 -74 -56 -91 -159 73 57 -1 44 -14 -96 171 -70 -53 -185 3 -75 -194 89 -236 -68 -35
5488 -35 -58 -136 -137 -12 123 122 -25 149 276 -139 18 17 77 -127 -64 -231 -205 20 55 -140 79 114 118 -101 -116 -24
5514 -24 154 97 60 -192 -134 -183 -134 91 155 -48 -101 102 -112 9 135 3 142 -111 8 114 -94 -59 -165
5537 -165 28 -29 -148 -26 -144 -70 -56 6 3 -26 4 -124 108 -21 -50 110 147 -99 146 -129 5 62 9 -157
5561 -157 -118 -157 -152 -50 -79 -31 -181 30 -22 198 266 215 -224 -32 -130 -302 -247 -50 -323 -224 -156 24 -236 3
5585 3 -365 500 43 140 -163 86 26 184 437 303 23 -31 73 -316 89 -111 121 333 172 -281 92 -31
5607 -31 377 54 1 345 -453 86 100 -187 -128 270 -69 153 -81 157 -176 -188 358 -24 119 -38 150 -10
5629 -10 -26 159 -71 -24 -29 3 -64 -31 55 114 -23 -189 -22 0 -52 -6 39 109 -67 39 -23 -97 85 66 23 -65 74
5656 74 -48 143 -73 39 -102 -21 153 7 7 112 -111 -31 -77 -103 -165 -121 -31 121 -14 -20 -5 38 -70 -58 86
5681 86 35 66 71 178 49 2 -57 3 50 -44 19 103 11 33 -40 -165 20 -50 1 31 -176 -58 -9 18 68 -42 112
5708 112 -60 -148 -29 -15 110 50 -58 -95 116 -56 -71 71 -28 99 -32 35 -124 -11 -54 -2 102 -120 16
5731 16 208 97 98 -30 21 -22 60 153 -124 -2 -12 48 89 88 9 97 216 145 -37 -41 84 135 -27 2 -25 -171 86
5758 86 106 -89 41 -26 -16 -39 210 62 -139 70 -64 -17 -43 108 -75 -123 45 85 -156 -133 65 -57 -168
5781 -168 8 -22 -126 32 -116 -95 -39 -69 106 -51 68 -166 148 113 -55 48 -54 8 -84 -36 -54 -34 10 16
5805 16 -89 -16 114 27 -25 119 136 22 -81 -62 -58 75 17 -35 129 -103 41 96 -147 56 -62 -80 -14 -73 100
5830 100 14 89 109 -6 109 272 102 28 69 -40 69 81 -76 -104 -2 31 -50 -150 80 130 -24 -212 16
5853 16 -107 -96 -119 137 204 117 12 306 -294 290 -111 -389 8 -183 322 -146 148 -147 -58 155 111 2
5875 2 45 169 -53 -64 108 6 -178 15 0 -140 -80 15 -20 -105 0 111 -144 -11 93 0 133 92 -21 127
5899 127 -40 -39 -1 129 -37 -94 -122 -54 -41 8 -11 26 96 -23 78 -160 49 0 -327 -9 170 -23 299 40
5923 40 -235 -231 107 -143 178 161 53 62 29 -131 -120 18 -44 103 28 -37 105 45 -141 -89 -57 -76 -57 121 6
5948 6 -26 98 -54 -61 6 -41 -47 66 80 -5 229 13 62 -58 -121 25 -30 -7 -58 -59 -162 -130 -143 110 -161 24 59
5975 59 -137 -58 -10 119 128 -101 -68 -39 4 40 67 75 33 175 -16 -34 100 7 135 260 -91 94 144 -15 178
6000 178 124 97 -36 -44 55 -72 -261 -31 -45 -4 -47 45 39 6 -12 -1 -55 37 63 -53 90 55 8 49 -110 32 73
6027 73 -91 -174 -49 -1 170 -30 -15 -45 128 -36 -32 59 92 -104 -80 -80 7 72 120 15 -15 97 -41 57 -107 -118
6053 -118 -77 -37 46 78 23 -30 -18 84 -120 10 -97 -90 90 112 -61 25 21 -29 25 -113 -11 -60 -119 -58 120 -105
6079 -105 121 -95 -12 35 -24 27 6 28 107 -5 -31 84 -155 86 35 42 -66 42 94 234 -140 56 -76 -116
6103 -116 -116 -33 -67 170 -43 87 134 -73 92 -131 17 -107 173 -67 -3 8 106 -6 -56 31 -63 53 32 38 -29
6128 -29 53 62 -147 17 69 110 -169 -22 -26 110 16 -25 -63 -110 10 -29 -87 -19 45 -22 55 45 -66 121 -7 -38 32
6155 32 -104 57 52 47 -5 -123 49 76 18 2 -39 -62 -157 -43 -8 29 57 -49 -35 124 8 -60 -21 38 -12 -48 6
6182 6 22 141 4 163 -29 -53 -19 83 -60 69 -38 100 -71 81 67 4 -38 -106 -15 17 -8 72 -16 60 116
6207 116 -80 136 -71 -1 -69 26 -12 75 -11 18 -21 161 -17 136 68 77 -90 -32 -18 -52 -117 36 -18 -13 2 38 18
6234 18 -46 126 -94 -9 15 90 -64 -81 -51 182 80 -48 -72 11 25 -42 70 -94 -12 43 10 -8 81 68 66 -44
6260 -44 53 -45 -56 5 119 -71 141 21 -16 99 -139 46 59 101 -81 47 -63 41 -7 -41 -68 -103 30 13
6284 13 8 136 -159 30 87 101 87 -176 -22 112 -63 -12 -9 97 215 -83 126 60 -72 -138 -44 -21 14 -84 64
6309 64 55 126 38 -89 -6 -103 111 -38 -104 49 -104 41 80 -41 -42 -60 66 92 -29 54 -71 -84 22 140 -160
6334 -160 -31 -78 -103 -47 -118 -5 223 9 -42 49 17 -79 109 84 197 91 -65 20 -17 -63 -26 -34 -73 79 -81
6359 -81 36 82 -86 64 -73 -29 -65 96 102 -109 -30 -187 99 12 -138 114 -16 36 65 -60 -9 76 65 103 -12
6384 -12 66 -52 44 22 3 97 24 -32 49 -31 101 7 -159 -166 -42 68 -103 -160 -14 -89 -117 51 -176 -119 24 70
6410 70 -73 -46 81 -90 -31 141 -67 26 -99 133 15 -8 -29 158 88 -170 -3 37 80 -5 74 18 94 61 -87
6435 -87 -59 54 6 8 -176 -118 57 167 109 -3 -73 -161 88 -149 26 -99 1 50 30 42 13 57 40 51 60 -292
6461 -292 51 -72 -150 7 162 93 155 313 163 -147 106 -77 388 -5 371 606 157 -13 -63 262 -78
6482 -78 57 133 50 27 90 59 34 -44 2 -118 119 4 47 9 29 17 -63 -69 -77 30 -63 13 -163 -138 115 -99 21
6509 21 4 38 30 87 -107 45 132 1 106 48 -65 -30 -71 9 3 -203 38 175 25 20 133 -39 -125 19 74 7
6535 7 -48 52 84 -74 5 -134 28 74 -82 -166 -24 55 -31 -40 -45 -69 30 222 79 -4 -121 10 41 10 -247 57
6561 57 31 59 -44 149 48 26 -36 -78 -88 25 -67 6 59 -69 15 42 38 5 -24 -10 -64 -9 -19 25 176 -80 -101
6588 -101 153 15 115 -28 -35 20 -156 50 -86 -97 -26 23 -7 28 -44 79 84 -60 91 -50 119 1 -3 27 67
6613 67 -106 110 -84 -192 45 43 47 66 67 -107 -159 -30 -79 -53 -21 223 -92 11 25 -5 -21 -89 12 94 63 -12
6639 -12 -104 -19 -32 14 -44 -115 115 -16 129 56 -80 -16 106 17 -59 -165 121 -160 -38 59 -130 15 -59 -102 117
6664 117 -38 52 -2 -55 96 -66 37 51 -26 48 88 41 27 6 -26 42 84 179 36 48 -15 -52 -28 -43 -30 -31 -19 -81
6692 -81 -225 0 47 -85 11 75 -183 287 -247 163 168 378 92 98 382 18 -12 -225 -78 -160 131 -118 132
6715 132 -25 210 -8 -26 -12 35 131 27 -20 -51 46 -49 98 -34 -55 -41 272 48 -55 48 -103 77 55 24
6739 24 -204 -133 -42 -44 -37 -15 -47 -15 -50 -112 -47 214 -160 164 32 -65 -35 43 79 58 -54 -30 -89 -24 -62 93 14 150
6767 150 79 -6 113 75 34 0 48 -10 117 -8 -95 -58 -95 132 23 -56 -158 -24 -117 -17 -71 7 138 26 83
6792 83 117 -15 4 -22 34 96 -56 -90 -81 172 39 -53 -61 -48 -21 88 83 -41 -17 106 -108 -9 109 -80 122 -107
6818 -107 182 -34 -206 -11 -198 -36 -216 -84 18 126 -74 -104 36 60 7 5 -45 139 -48 122 126 35 -105
6841 -105 46 -40 17 -50 -88 -145 16 -71 22 230 -61 -18 -1 47 113 -72 94 -81 2 -184 -4 46 147 73 -114
6866 -114 46 99 -42 166 -84 -18 -153 -161 -47 -61 10 -132 113 28 -88 153 19 45 69 -97 73 3 0 7 -95
6891 -95 36 4 -45 -13 41 -79 -56 62 4 130 -127 -49 90 -151 27 98 68 166 -23 -74 -36 29 -30 -71 -58 -81
6917 -81 -41 121 33 34 5 36 -5 25 -124 29 -47 -38 -12 73 142 24 -69 -70 -23 -20 61 -118 -76 -68 -8 2 -46 -13 42 -97
6947 -97 38 68 -144 -248 -57 -16 70 -24 12 14 -83 100 51 20 85 106 -80 -75 54 -107 121 -80 62 49 13 -48
6973 -48 0 -45 -67 -20 -175 13 -21 1 -12 -19 -5 84 26 35 22 37 -66 140 -95 13 -3 -35 -111 185 -85 127 -79
7000 -79 11 -161 -6 55 -89 -15 126 -154 103 -2 7 56 -10 57 -27 41 -2 53 -165 -25 107 0 109 -19
7024 -19 67 -31 -21 193 -32 -35 101 28 112 82 -141 -122 135 16 60 -54 35 83 264 175 -112 154 126 -92 -102
7049 -102 -38 -44 23 -137 38 -69 95 41 77 128 10 92 77 -130 63 109 77 -10 96 78 -137 -66 -5 -97 177
7074 177 -49 9 95 48 36 -92 31 19 149 -68 84 -91 -17 -16 -13 76 29 26 27 -78 -35 0 143 126 -89 -60 -83
7101 -83 17 103 14 -104 -209 -60 -3 -55 4 -186 31 58 103 125 -81 48 141 5 -37 5 -101 81 -55 87
7125 87 -94 6 74 -52 17 -18 -61 26 -65 87 10 85 -15 -42 4 10 -142 -70 63 40 -120 -25 -83 -11 21 -18 -76
7152 -76 15 -38 45 -216 -53 57 -162 62 35 -103 -86 51 25 -5 37 -13 -14 31 70 44 -63 46 51 -57 -82 -11
7178 -11 44 -33 -26 25 34 -78 78 17 12 -11 79 49 -23 -21 233 143 -57 9 -86 -5 133 26 24 28 -80 -18 109 5 -48
7207 -48 -23 -105 89 30 98 91 -94 -68 45 60 -97 -57 -63 -40 12 -15 14 -108 -145 12 37 -106 -88 -147 19 13 -64 -98
7235 -98 11 -100 -95 -120 -28 118 75 -15 -83 -92 -111 170 -29 -97 30 44 85 -110 104 -48 42 -75 32 -14 -18 -126
7261 -126 103 20 153 104 -28 -12 192 15 186 22 -139 -61 12 141 -21 3 115 6 -47 -134 -112 -38 34 19
7285 19 -84 -127 -54 -63 161 137 133 101 -141 77 43 -107 25 433 184 167 -40 -232 -12 -179 -311 -463 -83 235
7309 235 392 -87 -320 136 60 115 48 -387 103 -108 196 -171 148 54 160 7 -51 6 49 91 82 77 -63 60
7333 60 27 168 118 99 -39 13 -39 -19 123 -37 -72 48 -22 -16 -11 93 148 -118 -55 35 -41 25 -92 -121 -11 41 -51
7360 -51 66 94 33 -51 7 51 -96 107 -55 74 -38 -16 -122 5 83 -38 51 -75 -56 67 12 22 39 4 96
7385 96 14 -38 -26 66 105 -102 112 -96 20 57 82 -129 -46 82 85 61 -59 24 -44 -7 58 -48 -78 -141 -197 101
7411 101 60 38 -78 -37 -23 47 -53 -4 -92 -134 53 -42 -84 -70 42 -7 82 -129 62 -69 6 -138 19 -24 -174
7436 -174 -62 -7 6 104 52 163 11 -81 -38 2 11 -96 -92 -40 -52 26 -89 -7 128 -29 -37 62 -169 9 183 119
7462 119 -11 -37 -40 -76 -2 21 -107 -119 -94 -100 -142 177 148 -111 53 33 112 91 -93 8 52 27 -1 -116 -36 4 1
7489 1 20 3 17 -31 -51 -119 35 -2 -124 -59 19 36 29 13 14 3 52 12 -16 -70 -92 -16 60 16 -17 161 216 66 103 49
7519 49 36 -170 -5 126 -5 33 0 -112 89 76 6 -101 83 -56 -86 -46 -34 -165 24 -187 -39 325 -245
7542 -245 -252 479 -189 396 461 -121 -16 -88 98 -6 92 -9 -55 -207 -31 103 83 -62 94 48 92 -49 -6
7565 -6 4 -59 219 -135 -22 73 84 -40 -52 -84 12 -18 26 -24 66 58 17 -94 -4 43 25 -20 117 -147 57 29 -26
7592 -26 82 -187 126 53 -27 18 -24 35 89 -216 -168 -113 -19 -3 288 -120 159 16 447 252 26 213 -90 2
7616 2 220 68 -113 33 133 -2 -133 -122 -159 -10 45 124 -127 -244 41 39 58 -93 -2 170 -28 59 -48 63
7640 63 -81 -103 134 52 12 -32 112 36 -104 183 -6 -122 -29 162 132 66 34 239 283 5 -262 -170 259 9
7664 9 97 -114 2 -151 350 -303 196 52 302 295 386 -275 -334 -227 183 86 -214 -295 -74 277 128 -294 319
7687 319 -517 -335 -173 -186 -57 371 -176 482 405 -191 251 33 361 139 -137 -184 -223 -342 -185 -535 -3
7708 -3 47 195 -153 -220 69 -129 -200 217 -11 66 -401 367 -91 -64 206 -295 -300 107 366 166 -81 142 -580
7731 -580 -105 -141 316 122 -196 -140 -82 320 83 -284 26 350 -390 5 -464 -128 -525 38 -70 400 359
7752 359 -58 165 1 -726 342 93 -30 -148 -153 -207 217 -95 -174 448 96 -177 1 -58 -54 295 -313 295
7774 295 -2 -100 -79 218 -107 197 -20 -133 416 29 21 -13 -366 38 124 126 -87 68 132 44 -134 134 44 150
7798 150 111 -179 35 -70 90 260 -144 81 -20 232 -271 -83 2 -87 -22 -100 -199 64 58 -21 -92 71 132 -55
7822 -55 77 -67 -39 -33 2 76 44 -63 -50 46 33 -105 221 8 -145 -70 -21 -79 89 -16 -16 -134 25 20 75 -63
7848 -63 -173 135 -149 4 102 -96 65 -71 0 1 32 -102 -40 -32 -167 0 20 49 46 -36 -76 158 16 77 52 53
7874 53 -12 3 46 107 127 -77 120 -16 -107 -55 -110 86 77 -12 -29 -123 -7 -26 36 -26 134 115 27 -45 -40 -111 -18 -23 68
7903 68 -89 99 -97 -16 -77 -46 38 -138 -62 -96 33 -82 -36 -162 43 34 -231 83 134 -91 -132 88 10 -43 40
7928 40 -32 -50 74 -20 73 32 105 40 17 -29 107 48 -90 168 -12 -65 71 -45 -15 146 -107 15 -30 -33 68
7953 68 -37 -33 39 7 -11 -13 39 3 -82 47 54 38 -7 -159 -131 -51 -82 -42 -4 5 79 -58 53 -13 -127 72 -51 -27
7981 -27 107 -52 358 15 -91 154 11 -72 3 125 -62 57 -20 61 3 103 -36 -16 -27 68 -22 67 -77 -24
8005 -24 156 -8 -41 -73 -27 32 8 53 12 -190 75 -212 194 81 -107 78 -113 -18 38 -1 66 -73 -14 -41 65
8030 65 41 12 44 66 65 75 41 -43 -27 163 13 17 10 -97 70 -52 30 -35 -165 -154 -29 68 175 -36 -67 -15 103
8057 103 55 35 -52 -1 -11 16 71 9 39 54 178 102 104 -167 -57 -119 86 -91 -3 -23 -117 -16 135 -17 54 165
8083 165 64 38 -76 -120 -12 -85 -89 -85 7 -45 179 103 77 -15 -5 35 92 -27 13 -1 99 -56 80 140 -53 49
8109 49 -42 44 -44 -45 -43 -263 35 50 -44 112 -10 -90 96 64 -3 -77 27 -42 -260 2 -49 58 -56 -118 -96 36
8135 36 -27 -22 23 -35 -147 60 92 -41 -65 -97 67 -2 -76 8 161 99 -12 71 20 -117 46 117 -6 173 64
8160 64 24 -114 13 51 -85 -29 -95 54 -15 11 64 116 60 -50 17 111 -54 90 83 -94 -71 -193 36 46 -129
8185 -129 59 59 90 75 -36 38
8191C8
$$ Imaginary data points
##PAGE= N=2
##DATA TABLE= (X++(I..I)), XYDATA
0 0 0 0 0 0 0 0 0 0 0 0 0 0 0 8 -8 8 -8 16 -16 21 -24 32 -32 40 -48 56 -64 80 -88 104 -120 136 -154 176 -197
35 -197 223 -251 283 -315 353 -393 435 -484 536 -593 656 -726 801 -883 971 -1072 1180 -1299
53 -1299 1433 -1581 1749 -1937 2152 -2397 2685 -3027 3436 -3945 4584 -5428 6593 -8318 11164
68 11164 -17006 58137 -142570 -55253 98696 -52222 73837 -36214 -94148 94240 24900
79 24900 -45906 14506 -34725 48169 29345 -66053 14184 16651 -15283 23333 -37478 1471
91 1471 38629 -35417 10780 14327 -42509 41354 4919 -54815 40389 4390 -43169 33853 -8160
104 -8160 -27751 31572 -12708 -19723 19447 -11787 -3338 5766 -18469 7509 2659 -18720 5951
117 5951 -4864 -5819 8296 -17347 2013 8925 -19686 12304 -4328 -23686 29292 -12787 -27425
130 -27425 35386 -18074 -19027 33321 -25964 -8387 27410 -26879 1369 14857 -23435 8212
142 8212 3564 -13069 10109 -7646 -2396 8187 -11722 5850 -1102 -8361 16680 -12483 -5437
155 -5437 22458 -19544 1723 21892 -25381 9265 18917 -26667 13858 13956 -22628 15058 8275
168 8275 -15376 12139 2467 -6709 9605 -745 -1742 4908 1245 3092 -1744 2950 7482 -5394
182 -5394 4653 7037 -8245 9537 7084 -12592 13401 6691 -14712 15935 4515 -14241 17409
195 17409 1501 -11777 16927 -2096 -8229 14931 -3611 -4247 8832 -3170 1563 2779 -2561
208 -2561 3718 -2118 1862 3241 -6717 6929 1599 -8992 10779 -2407 -8277 13082 -6566 -4275
222 -4275 12368 -10633 -1378 10207 -11825 1426 5972 -9415 2971 1475 -7090 2759 -991
235 -991 -3778 -296 -1856 327 -3835 -2350 2478 -6014 -739 1608 -7274 1173 1119 -8280 2300 1164
251 1164 -7659 2917 -254 -7423 2331 -143 -6828 2584 531 -7770 1260 1453 -6725 315 1575
266 1575 -5243 -219 888 -4225 -1691 1264 -1176 -3526 1172 931 -5175 1515 2611 -5901 3131
281 3131 1890 -5968 4436 447 -5351 5698 -501 -3400 5005 -2106 -1179 4296 -2003 265 2293
296 2293 72 1010 -842 2418 1648 -2550 4464 955 -3089 5872 -100 -2304 6005 -516 -517 4888
312 4888 -891 1523 3113 -515 3157 1844 -244 3369 1380 491 2213 1415 1083 1126 1941 1563 -111
329 -111 2311 1694 -646 2184 1690 -517 1712 1761 -266 802 1501 653 469 1192 257 540 1173 -471
347 -471 962 941 -1027 1638 160 -2003 2133 109 -2193 1461 -419 -1538 -51 -482 -526 -1110 -357
364 -357 51 -2703 -49 541 -3019 151 -23 -2652 -153 -1130 -1965 320 -1721 -861 -488 -1647 -1062
381 -1062 -1046 -1724 -1324 -1003 -1167 -1932 -1787 53 -2221 -1824 500 -2737 -1761 339 -2167 -1844 -462 -1038
399 -1038 -1711 -1008 38 -1595 -1071 1088 -2091 -939 1583 -2396 -158 1203 -2014 522 245 -1688
415 -1688 1020 -4 -679 718 -331 10 -239 -2 1241 -1170 989 1548 -1893 1542 1543 -1829 2062
432 2062 1415 -1037 1885 840 175 1587 890 1434 852 673 1819 235 1032 1806 517 1217 1299 522
450 522 1273 833 1317 1163 460 1610 817 559 1308 468 1374 955 212 1765 664 629 1497 52 1370
469 1370 847 57 1803 -379 477 1904 -1463 935 1812 -1752 1454 883 -1651 1452 -130 -637 1097
486 1097 -995 31 71 -1279 1084 -1187 -1091 1385 -1975 -314 861 -2755 443 191 -2525 912
502 912 -616 -2290 919 -1157 -1440 103 -1449 -818 -929 -1208 -303 -1660 -802 -354 -2350 -572 -268
519 -268 -2169 -537 -522 -1507 -577 -897 -1124 -800 -579 -1054 -744 -499 -1007 -549 -646 -1236 -73 -617 -1001 441
539 441 -905 -857 337 -857 -62 -8 -1192 626 -564 -893 969 -1010 -259 1054 -1319 367 780
556 780 -778 1035 -150 120 1387 -990 1060 1326 -1080 1947 666 -939 2627 102 -379 2308
572 2308 -412 560 1848 -529 1251 1210 -135 1349 765 655 980 531 1419 112 546 1984 -270
589 -270 851 2218 -382 856 2005 -310 604 1508 150 447 1314 498 252 1033 603 -33 977 250
607 250 3 873 -403 -121 866 -278 105 420 -307 339 -54 -152 1 -433 558 -262 -952 759 -666
626 -666 -771 812 -1077 -258 157 -1357 499 -734 -1281 696 -1459 -872 737 -2186 -391 342 -2057
643 -2057 -330 -554 -1228 -359 -1244 -392 -688 -1525 335 -1532 -1429 907 -1792 -929 920 -2250 -132
660 -132 509 -2118 32 -68 -1662 202 -482 -1030 -455 -381 -172 -947 -122 99 -1579 349 469 -1854
678 -1854 527 619 -1541 576 481 -917 742 485 -434 336 708 -117 406 660 -85 104 922 -126 247
697 247 875 -281 521 943 -211 603 764 228 638 784 813 219 604 1395 -29 851 1382 -383 1183
716 1183 944 -341 1597 627 41 1659 43 452 1551 -508 791 1246 -333 941 665 97 719
733 719 172 705 287 -247 1072 25 -199 1213 -770 253 1155 -788 388 480 -810 975 128 -837
751 -837 855 -178 -582 520 -258 -602 88 -10 -560 -389 228 -673 -795 137 -592 -974 92 -732 -933
770 -933 12 -529 -950 -152 -323 -1053 -384 -526 -1068 -237 -307 -1333 -52 -342 -1350 56 -518 -1261 21
789 21 -617 -1093 -173 -559 -434 -623 -408 -185 -1185 -84 26 -1419 245 47 -1341 462 -341 -692 695
808 695 -586 -253 513 -769 242 105 -481 567 -138 233 430 -569 719 178 -436 941 17 -309
826 -309 1049 -183 99 927 -112 510 248 376 821 1 415 1023 -168 767 667 -117 817 600 385
845 385 561 431 673 424 417 999 92 589 901 37 692 670 204 704 522 303 456 341 369 241 539 393
867 393 112 502 209 -216 788 -42 -120 728 -76 -35 447 -156 38 -73 22 286 -460 226 6 -942 342
888 342 16 -889 339 -468 -722 288 -821 -366 -80 -795 4 -525 -683 211 -883 -343 -246 -1127 91
907 91 -406 -927 435 -943 -839 406 -1123 -521 231 -821 -504 -312 -721 -285 -681 -484 -340 -804 130
926 130 -604 -966 178 -684 -552 200 -720 -301 225 -608 -121 91 -318 -56 -19 -221 -139 193 -80 -244 454
947 454 -15 -44 462 -49 -86 496 100 138 165 -44 363 -21 376 401 -216 781 510 -68 695 53 442 746
969 746 286 525 515 -171 810 78 -114 1288 171 225 914 -59 1051 455 -92 581 410 -128 1067 221
989 221 279 630 -487 654 27 -92 1208 -534 455 832 -385 691 393 -576 315 613 -207 106 392
1008 392 107 253 159 -176 -385 162 118 -649 117 -109 -748 74 -257 -360 -14 -136 -348 -243 -403 -608 -177
1029 -177 166 -566 -451 285 -805 -448 108 -872 -298 44 -839 -258 -292 -632 -259 -690 -458 -189 -788 -69
1049 -69 -395 -742 187 -559 -480 72 -816 -188 -68 -753 296 -292 -572 363 -515 -107 317 -578 215 4
1069 4 -681 445 -322 -535 428 -353 -60 189 -364 180 15 20 376 -227 352 375 -352 762 227 -465 863
1090 863 92 -317 844 102 140 688 210 257 428 229 312 451 484 100 353 631 118 375 523 132 438
1111 438 660 49 341 579 214 56 535 474 44 482 338 -58 750 281 -103 744 27 -110 681 -180
1131 -180 -71 585 -255 279 167 -296 376 4 -8 207 -51 178 -99 -163 247 -608 -74 622 -770 38
1151 38 151 -753 233 -187 -728 338 -419 -576 194 -544 -362 229 -654 -470 -103 -356 -379 -537 -4 -395
1171 -395 -615 -20 -605 -572 213 -690 -408 434 -860 -457 100 -800 -454 100 -745 -336 241 -549 -488 345
1191 345 -285 -655 499 -133 -647 573 -372 -712 332 13 -559 214 220 -419 19 376 -356 -130 763 -485
1211 -485 -65 928 -670 -135 891 -731 41 793 -618 408 616 -488 545 520 -115 388 439 110
1229 110 161 406 445 -234 530 740 -500 718 638 -522 786 455 -450 1069 100 -300 1112 -39 -40
1248 -40 908 184 58 633 171 -162 276 436 -212 346 611 -326 250 664 -481 202 755 -553 166 610
1268 610 -579 84 707 -615 -76 582 -445 -283 763 -448 -434 811 -513 -552 794 -496 -701 651
1286 651 -373 -606 467 -283 -684 400 -54 -948 117 -3 -945 -41 286 -1270 81 -191 -1271 248
1304 248 421 -1067 494 112 -1189 191 252 -951 -49 3 -714 -260 158 -536 -517 475 -678 -832 701
1323 701 -630 -1020 824 -547 -805 894 -631 -690 985 -502 -469 911 -429 -414 519 -95 -313 373
1341 373 1 -518 407 598 -594 588 787 -514 520 511 -846 886 323 -333 600 787 -390 513
1359 513 682 -517 448 1002 -372 8 1138 -306 515 1145 -347 284 1249 -497 60 988 -289 -93
1377 -93 946 -348 -237 1106 170 -567 877 432 -760 964 321 -916 1241 261 -1102 1086 190
1394 190 -1050 1033 104 -791 650 305 -852 398 432 -573 149 613 -558 -358 858 -841 -277
1411 -277 890 -978 -420 940 -906 -335 985 -810 -268 691 -847 -584 558 -587 -606 467 -349
1428 -349 -759 644 -188 -809 550 -250 -1081 351 -41 -1133 306 28 -904 115 247 -828 105 238
1446 238 -1024 -119 390 -1023 203 499 -1028 -6 496 -897 243 458 -989 118 482 -541 -7
1463 -7 525 -555 -133 658 -384 -319 791 -338 -615 859 -134 -676 1025 -241 -681 1130 -182 -512
1481 -512 1036 -247 -532 966 43 -380 609 338 -284 575 529 -442 440 749 -508 391 875 -695 267
1500 267 978 -569 253 787 -662 336 881 -519 377 927 -407 -30 996 -319 -256 914 -154 -327
1518 -327 831 -138 -429 883 -118 -510 794 65 -552 656 26 -403 472 281 -748 244 383 -842
1536 -842 512 274 -797 363 483 -837 340 87 -744 343 156 -571 119 228 -595 -195 275 -376
1554 -376 -257 420 -401 -317 523 -392 -563 581 -480 -551 619 -725 -449 619 -856 -432 222 -482 -351
1573 -351 398 -377 -546 308 -254 -646 129 18 -802 109 185 -786 204 277 -775 165 183 -832 186 304
1593 304 -604 238 305 -477 129 426 -546 24 563 -422 -152 431 -408 -82 608 -178 -67 722 -252 -199 523
1614 523 15 -180 612 21 -322 662 128 -397 661 205 -424 537 180 -419 763 223 -397 683 240
1633 240 -155 569 241 -144 258 261 14 197 424 -78 -196 557 -85 89 639 -296 156 709 -308 53
1653 53 584 -273 221 572 -433 51 286 -57 0 67 -29 -205 219 156 -176 48 97 -442 83 -34 -365 214
1675 214 -109 -387 90 -42 -336 39 -98 -387 20 -161 -379 -74 -8 -522 -22 32 -458 -135 26 -380 -53
1696 -53 -52 -282 -148 -46 -285 -207 -53 -148 -324 -5 -69 -416 80 -278 -311 199 -177 -501 416 -191 -302 297
1718 297 -309 -143 146 -324 -12 93 -132 -60 -92 23 -23 -67 235 -18 22 449 -245 8 289 -247 -35 277
1740 277 -179 162 167 -231 108 213 -103 190 -7 -55 114 -98 237 24 189 177 4 4 26 62 182 126 5
1763 5 315 60 166 202 151 109 195 112 151 266 114 79 176 63 187 342 35 -85 277 62 36 254 -6 0
1787 0 53 -55 63 96 51 79 -82 42 55 -80 95 -17 -182 77 -284 -120 129 -194 -82 114 -300 30
1809 30 -20 -141 97 -205 -103 -245 -254 -159 -209 -206 34 -171 -286 -71 -160 50 -104 -383 88 -132 -207 -23 -96 -115
1833 -115 -191 -180 -213 -147 -152 -128 -190 -180 -48 -126 -111 -160 -213 -158 -45 2 -237 75 76 -72 -38 -53 6 300 -130 149 86
1860 86 -48 -25 -5 -156 -87 -45 -117 201 91 51 401 56 118 12 -103 258 -128 84 306 -107 0 175 150
1883 150 261 114 -23 384 161 224 261 101 124 161 0 208 -32 62 344 145 344 124 107 195 93 113 228
1906 228 189 289 143 -32 173 139 -185 131 42 -29 333 37 149 -19 13 5 58 85 130 -37 77 -36 -83 92
1930 92 32 -114 -220 -71 176 -48 -149 -124 -148 33 -154 -217 -188 -44 -214 -84 -204 -207 43 -131 -1 -100 -275
1953 -275 -91 -126 -12 -115 -214 50 -133 -242 192 -290 -61 49 -247 -58 -85 -256 -84 -113 -200 92 -117 -22
1975 -22 13 -57 -203 -217 29 48 -216 -55 115 -121 25 14 -146 13 99 -18 29 74 12 -2 -105 -19 -82 -107 148
2000 148 -109 5 211 -272 84 175 -20 -53 163 44 90 103 90 90 38 183 176 168 225 -116 185 214 191 36 145
2025 145 231 -30 129 114 299 75 62 -22 179 150 -11 91 118 -6 79 113 -6 28 30 156 76 -25 252 -58
2049 -58 118 125 -110 70 2 -39 189 41 -3 -2 -175 -23 114 -100 249 47 -86 -18 -227 -33 4 -138 -93 30
2073 30 -347 -86 -190 -136 -125 -262 -28 -135 -114 74 -103 -47 24 -275 -50 -54 -95 -179 12 -226 -22 -42 -224 -164
2097 -164 -119 -98 80 -14 20 -58 -44 -51 -111 73 -131 -73 -27 -129 54 -15 13 -38 -53 -147 -101 -98 61 76 -59 225 -78
2124 -78 -87 26 -96 90 106 16 85 76 -100 63 -43 49 225 -73 115 26 4 38 -53 132 149 -69 33 304 -14
2149 -14 210 37 -27 162 62 -67 36 48 141 187 13 118 -31 109 287 272 104 149 20 149 -61 129
2171 129 107 90 28 13 42 -46 18 107 185 152 -14 54 44 -124 65 -92 46 -78 123 88 -16 74 -66 65 117
2196 117 -53 20 -46 -20 47 0 -102 -76 102 -181 -95 10 -31 -35 -50 -41 -242 35 -8 -124 -13 -102 -108 -79 -179 -157
2222 -157 -204 -73 -18 -101 -160 -3 -11 -57 -51 -2 -21 -121 -214 -77 -132 -80 82 -99 -2 -91 -242 84 -9 -196 -49 -5
2248 -5 -26 -46 -150 -76 -121 -61 -58 48 -41 -4 -98 -77 -51 -27 162 50 -58 13 74 71 86 114 43 19 195 25 -72 54
2276 54 50 -39 -8 73 217 -9 -39 -37 97 -164 -15 -7 76 130 112 53 -29 69 39 -49 137 28 -85 71 14 38 178
2303 178 -2 -69 122 18 44 -12 -81 118 55 -5 185 34 51 51 -73 -111 86 -76 129 -112 62 118 -154 -164
2327 -164 25 -98 -10 34 -1 -17 -13 -84 77 -20 -103 -6 -45 41 35 -165 163 14 98 -122 -207 -104 -111 -13 -11 -46 -143 -2
2355 -2 -131 -177 -2 -198 23 -33 -11 -25 -44 -39 -13 -66 -77 -155 128 -21 72 -16 -67 -112 -45 -72 23 -130 -113 -42 80
2382 80 55 -71 58 6 22 -38 155 -88 -9 -59 163 114 57 20 218 67 60 106 -55 70 -48 132 49 113 45
2407 45 137 -14 177 -18 126 -144 99 118 193 237 -34 108 7 -37 -58 135 176 -31 21 188 -65 34 182
2430 182 97 74 263 -98 13 50 -33 -46 2 1 48 -63 -44 -89 -41 -19 18 96 -97 197 10 11 14 -67 106 93 65
2457 65 -23 159 -44 -8 -52 -108 24 -45 -56 50 -163 -17 -107 -231 -60 -100 -206 52 -103 -44 -125 -199 -150 -92 -88
2482 -88 0 -39 -128 81 -112 -93 -25 -23 -166 -105 -137 -167 -130 153 90 -55 100 -26 -98 -147 -213 -115 -15 -134 10 -52
2508 -52 -117 -159 -8 -83 181 -26 -86 -105 -28 42 20 12 86 -20 30 68 45 7 176 -94 -51 -15 97 105 177 46 5
2535 5 23 78 -74 252 73 -79 34 -143 -94 20 78 -93 82 18 127 78 76 -52 46 32 7 46 175 2 -90
2560 -90 -67 -68 213 4 60 -3 94 19 167 49 -83 -23 -28 10 40 222 -73 24 27 140 42 -63 21 -141 -6 -113
2586 -113 -134 107 -92 -125 25 -131 -133 -59 148 44 -138 -9 -122 -6 -109 -39 -30 -57 -32 -48 104 -168 -121 -106
2610 -106 4 -26 24 -68 -35 3 2 -215 36 -72 -254 63 -170 -63 29 -37 -41 21 -9 143 153 42 -13 161 -37
2635 -37 -62 166 36 -130 59 -117 -295 30 107 -58 -9 -72 -71 -1 100 -89 -41 -43 -124 -120 41 -114 -89 174 53
2660 53 56 208 -112 58 33 -122 -236 137 1 12 9 -126 -63 176 45 -120 122 -84 46 197 115 -64 159
2683 159 98 74 155 75 -185 114 -123 6 97 153 45 109 78 -79 -69 -19 -8 138 188 -170 -78 22 -12 -36 228
2708 228 -67 121 282 -166 -54 195 -195 153 -31 -30 2 256 63 -66 -106 -53 -98 272 116 -83 50 -16
2730 -16 -173 27 62 -124 81 -107 -165 110 -99 -215 -129 59 -63 -51 -11 -212 76 -60 -98 -20 119 -107 -79
2753 -79 -98 -209 -43 295 -177 -10 62 -220 -8 180 -120 -37 183 -48 -103 62 -139 107 56 -22 79 56 4
2776 4 -74 290 -84 49 178 -160 -180 85 74 -63 256 -35 -152 -86 181 -205 -30 215 -131 66 35 79 41
2799 41 217 -169 72 15 -132 94 247 18 51 22 87 50 210 -63 21 109 8 -153 213 73 -97 110 -72
2822 -72 63 192 -92 -101 88 14 -46 167 -68 -49 52 68 -81 33 62 19 68 137 -21 158 147 -197 -35 33
2846 33 -147 135 119 -197 34 56 -142 17 65 -110 -42 54 -211 -15 161 -107 -95 123 -114 -28 82 62 -145
2869 -145 79 34 -200 124 13 31 29 -134 -110 52 -120 -96 23 -31 -123 77 103 -10 7 -55 -105 -54 79 56 -69
2894 -69 24 -117 53 209 -20 86 54 -53 -198 123 -155 -125 -18 -55 14 -151 -93 -204 45 -60 -15 222 -77
2917 -77 -58 50 -132 101 61 62 63 82 142 12 241 3 7 -3 -106 -59 90 75 103 95 98 -1 75 135 -51 125 29 -118
2945 -118 -90 142 -96 29 26 -63 -1 159 -67 62 204 46 47 15 20 -181 132 81 196 166 17 -59 58 26 -77
2970 -77 84 130 -181 49 -55 -140 157 -129 -138 16 -33 54 -103 26 0 -59 35 -142 11 48 -146 135 22 -82
2994 -82 -231 48 -91 18 195 -187 -43 47 -148 -170 115 -157 -86 51 -36 -134 165 -188 -103 65 -116 -104 -66
3017 -66 -130 5 -47 -249 -55 -63 -1 -57 -76 235 -66 -137 -46 -98 61 -25 183 -35 87 -292 -2 85 48 -69 13
3042 13 269 70 -175 125 218 -138 203 -201 152 110 100 -66 201 -22 -176 93 205 88 250 393 302 114
3064 114 233 -67 87 -61 5 19 -47 338 184 72 255 303 -62 -52 -13 288 -235 -61 272 149 226 154 76
3087 76 -572 -218 -380 -42 54 -199 -267 347 126 59 -150 129 66 120 192 239 -317 22 -220 -443 -155 -277 -17
3110 -17 -95 -75 -377 -115 -212 -100 -419 -120 171 -232 53 196 -30 81 11 -433 113 -81 -41 -18 -6 203 14
3133 14 -27 -190 -34 -14 -55 -289 24 48 66 -27 101 32 35 21 -93 -55 49 -107 -7 -84 53 -26 -67 55 24
3158 24 6 -184 3 104 -99 27 -6 -47 158 55 10 -58 9 9 91 -58 -110 82 -148 -113 -69 10 98 -44 -163
3183 -163 -232 86 1 53 75 269 17 38 38 -11 -58 25 79 -11 -50 56 -45 50 163 -36 -64 -86 -94 -109 -55 226 124
3210 124 49 107 42 -102 14 73 28 45 -22 -16 -33 30 -16 -63 -184 101 -7 60 -50 51 -115 -49 44 16 -47 1
3236 1 -67 108 142 42 -44 -13 -39 59 -10 -104 -10 -43 -37 -58 14 6 -53 75 28 -53 128 -86 -8 -181 -16 70 29 -97
3264 -97 -152 36 -189 -36 -224 -167 21 -134 39 36 -171 0 64 6 14 -78 -175 -42 -143 -40 -41 -162 97 -55
3288 -55 -58 -62 -83 -71 -68 11 -32 132 50 -30 -35 -57 -27 12 -21 44 -17 9 57 158 -100 -143 16 14 -62 -116 -44 -5 -157 71
3318 71 237 -22 -60 -189 -109 -24 12 -292 12 172 -75 -123 -124 12 246 71 -40 13 -262 27 228 163 228 -285
3342 -285 204 300 137 103 70 -214 250 -73 312 63 52 -19 -40 391 5 -7 17 38 66 117 -11 -38 -66 133
3366 133 17 73 17 -17 15 67 5 -39 -16 142 34 -91 82 -15 -116 47 58 14 88 25 6 130 104 -81 -25
3391 -25 22 -7 -118 6 -17 -25 -36 -78 -61 -28 105 -54 85 -35 -24 -52 -5 -122 -99 -161 -13 -101 93 21 -96 16
3417 16 134 -51 -95 -51 97 107 2 -3 -43 5 -92 98 49 26 -142 17 -20 32 -58 87 5 100 62 -119 81 82
3443 82 -174 34 -69 -181 -53 32 8 99 126 15 39 7 26 78 60 -24 -87 -70 85 33 113 134 -179 77 33 -31
3469 -31 -204 39 57 -34 56 109 -18 112 -119 79 -68 -63 -75 -81 89 45 -39 -119 135 73 -34 1 74 109 213 75
3495 75 -5 63 15 38 82 107 35 116 -12 -49 2 -64 -234 -57 -53 -82 106 -80 -48 20 -38 -57 0 -44 203 -38 25
3522 25 -8 12 -153 68 -8 51 -40 94 45 -20 -27 -238 -70 -55 -48 33 -131 -20 1 -20 78 46 103 -74 -115 -55 76
3549 76 74 226 -41 -90 -7 24 14 107 91 -61 -34 -34 -58 81 20 24 -194 32 37 67 -5 3 -86 -51 112 52 14 9 33 41
3579 41 -88 21 -121 -180 -105 -30 -64 36 -23 -27 -91 48 182 54 -41 -45 -54 193 -29 15 119 93 150 52 -102 -78
3605 -78 29 116 75 70 -46 -168 51 -102 44 -247 154 -107 -11 25 176 21 -50 135 -134 -90 -31 195 193 -5
3629 -5 -69 -111 -293 -21 102 210 -57 -65 -13 100 -67 -111 -128 -43 83 -125 5 -138 48 40 24 -100 27 -13 20
3654 20 38 90 -25 -24 -61 -32 54 -22 106 -80 51 128 -91 167 30 -14 67 -79 -64 13 -222 -49 -13 -137 -38
3679 -38 -51 -129 86 -26 35 111 47 -123 12 41 -92 -61 -45 -77 128 30 61 -11 -46 -39 -197 -120 -27 -23 -45 -56 90
3706 90 -55 26 104 69 -1 9 38 127 132 -133 -6 37 -27 -48 52 47 173 -122 146 112 103 -173 -83 53 134 26 10
3733 10 -28 -139 6 37 -1 -70 95 -28 -106 133 55 -13 -26 153 -83 138 21 68 -98 147 -83 -126 -26 57
3757 57 -161 90 188 -23 32 106 -125 44 88 -61 62 -60 -66 -67 26 13 30 89 -73 -14 116 -75 -157 115 5
3782 5 21 32 -53 102 69 85 -109 -175 -76 129 -110 -62 -35 -34 -42 40 -41 47 -86 -135 154 81 217 127 144 139 -87 -137
3810 -137 -190 -101 105 162 -91 63 -34 -216 64 -39 239 -152 375 294 284 -147 51 204 37 263 -352 113
3832 113 -98 180 -45 -90 -21 66 24 -73 -14 52 8 -2 116 12 6 11 -150 -219 130 64 -92 119 19 -46 -80 22
3858 22 -29 16 -171 3 37 23 -99 -136 39 129 101 -170 -99 46 216 64 53 -67 90 29 -172 43 112 67
3882 67 -7 -44 2 -11 -49 -164 81 23 282 385 -265 -262 -198 46 42 68 -32 11 -64 -8 -116 -115 -107 73 88 94 228 185
3910 185 -59 36 -139 -12 -99 7 -82 26 -12 -75 -89 -207 -126 123 1 179 160 95 -102 -18 -24 -69 -61 -8 -168
3935 -168 50 -36 36 16 80 -120 -132 -84 9 63 -3 -58 101 93 13 -75 7 138 -27 85 10 19 76 23 -35 17 57 -89
3963 -89 -102 41 45 -45 -42 57 -11 -47 -267 10 -70 -30 -17 17 -119 77 152 3 30 -4 -163 81 -80 54 22 51
3989 51 -64 3 25 -178 1 31 39 4 -96 36 -29 -9 -61 89 -6 6 -86 132 200 5 301 -77 214 129 79
4014 79 112 -61 120 -161 2 37 264 -286 -221 -137 -211 -7 14 -160 110 -3 126 22 -57 61 0 -119 231
4037 231 220 -261 16 215 -77 80 -89 40 26 -71 158 -102 80 -15 -61 57 -2 0 0 54 -8 -43 -81 152 -125
4062 -125 -112 -96 114 -72 -135 94 41 -126 -33 -27 -36 127 -74 144 16 19 3 -73 -20 -52 -124 273 -101 -20 182 -43
4088 -43 -17 21 82 -96 -6 -90 -40 63 104 8 -7 -18 5 33 36 -20 -103 -23 -13 183 -32 -4 -75 -68 97 68 -44 -69
4116 -69 -60 131 -102 15 -79 -14 -83 -46 -148 1 77 -27 25 -85 -80 -91 -124 -3 -91 -49 21 24 115 -10 79 33 -168
4143 -168 43 -37 179 165 116 -73 -46 88 16 209 -15 188 138 138 -73 128 5 91 -66 -156 235 -47 -150
4166 -150 154 -210 287 409 -199 95 121 68 -33 26 6 -49 10 19 -197 107 -14 -80 -43 -2 -169 -59 104 46
4190 46 40 30 -45 -35 -100 -58 119 -101 -95 3 -177 78 50 30 -39 184 119 18 -40 -64 -25 26 3 61 50 -124 77
4217 77 -72 67 -79 38 -83 59 -28 120 78 -32 -100 -114 11 -35 34 -52 -11 -66 -3 42 -71 139 55 -75
4241 -75 42 -23 -95 161 -34 35 -92 -78 45 -134 110 -8 73 206 52 -59 52 86 -88 -51 8 -61 40
4264 40 -63 -115 -95 130 -148 -26 51 50 -12 47 -76 84 190 -90 -53 -34 -38 40 -8 44 80 167 98 29 128 -69 27
4291 27 40 -131 0 110 99 13 56 122 22 -62 -199 -79 -37 80 74 -61 18 193 26 64 -46 32 -91 -24 -7
4316 -7 -114 -70 1 -121 101 -91 -65 -159 -27 -19 -22 -34 -46 73 14 25 18 -99 -8 26 -31 112 89 -124 85 -22 -2
4343 -2 29 19 23 16 -70 -60 4 -117 51 140 24 -8 -242 12 168 -77 -49 -99 109 12 46 -89 22 124 -17 -9
4369 -9 6 -50 -81 -61 -40 -43 65 7 -23 88 110 -43 -15 -26 -196 121 69 202 -20 35 34 -118 -56 9 15 140 -139
4396 -139 74 -6 -151 -6 -42 94 149 32 -11 -58 -34 99 102 81 12 67 -19 141 28 102 153 87 -175 -15 43
4421 43 11 54 -7 14 30 86 33 82 101 -76 15 41 41 112 15 -108 -21 56 -4 -176 80 17 -30 45 100 6 29 64 14
4450 14 -11 -67 -51 -124 49 88 109 73 -6 111 18 42 20 -70 -206 46 -9 24 -30 -81 -34 -55 -42 -124 -7 92 -27
4477 -27 27 -98 76 -122 43 -41 -58 -28 -21 -57 8 -96 128 43 -143 181 -14 142 173 -9 -79 89 -166 -82
4501 -82 -28 -11 -112 -145 133 44 16 -67 152 -59 27 34 -103 -104 -43 -122 -131 36 -75 27 -67 2 87 -191 -166 -84 175
4528 175 -194 -12 143 -190 -14 13 25 -180 -23 -38 -4 -10 -68 81 -62 -47 -82 -46 10 108 38 -15 -92 -25 105
4553 105 -16 42 -51 -128 -21 -104 -43 15 -76 -19 -3 97 -69 47 44 -45 -43 75 4 -58 -51 -104 149 -59 -79 -74 108
4580 108 -122 -3 23 -10 -114 34 -7 -175 -175 37 -149 99 102 -37 180 41 38 121 40 6 55 -53 -173 93
4604 93 -22 -78 85 -46 21 -33 207 22 76 -39 57 45 56 -75 52 -85 28 -14 34 -26 -22 -46 160 -7 -39
4629 -39 -22 -198 55 -5 -27 111 47 -60 -107 125 22 -83 -75 -17 20 53 57 56 25 26 -3 60 -37 115 -127 118 65
4656 65 43 118 119 135 -24 -3 -17 92 -10 26 -138 89 -38 -185 -12 19 171 -30 -15 49 -71 -49 205 108 -20
4681 -20 -27 135 60 -71 -12 16 -2 -167 -98 11 -47 -68 2 -207 20 -80 -126 -204 124 -102 -38 -3 -11 44 72 -256
4707 -256 -286 250 -29 43 -17 -109 -121 -34 82 80 8 -97 -46 -7 106 3 91 -11 27 13 32 -27 -37 7 114 -129
4733 -129 40 -14 80 38 -26 29 -26 29 0 110 100 24 36 66 62 221 -9 103 218 -109 130 49 -38 193 14
4758 14 320 283 -132 93 -7 -291 -76 -142 47 -125 125 -133 68 64 -38 -127 -47 -13 119 -31 70 -12 6
4781 6 -17 36 161 -50 18 -32 9 47 -92 55 212 15 62 -63 -67 -25 20 49 -94 2 69 -149 -4 -27 -97 -74
4807 -74 -51 -56 -76 -78 171 15 12 41 54 -81 -45 -62 121 140 -93 -46 -5 -45 -75 -60 33 -11 -116 -117 43 0 58 53 74
4836 74 -55 -82 99 26 50 3 -139 31 -36 -26 9 -63 -20 -44 100 -451 364 -13 34 43 -32 108 -90 46 4
4861 4 65 -3 43 14 42 -93 -21 9 -36 -113 89 -87 84 -1 -164 -108 25 13 158 -83 86 -19 -112 -34 48 -91
4887 -91 99 -128 183 29 13 92 28 80 -113 6 -141 -22 -38 -136 -67 -61 49 -1 47 83 -123 91 -3 -85 -110
4912 -110 112 -63 84 51 -31 -23 -85 -10 -42 -61 -38 -64 -57 -28 -52 8 -46 -8 -113 -82 66 -138 62 -59 -1 -84 40
4939 40 52 196 38 -65 72 81 -22 -111 38 -62 1 -15 36 114 -43 8 159 -58 -10 -74 -46 150 -149 -125 -118
4964 -118 95 -43 25 -78 2 -2 -190 -47 -9 -69 -55 -31 -56 -40 36 -9 19 -168 87 56 49 -56 21 97 23 48 -15
4991 -15 60 152 -13 -79 100 64 -51 -218 -42 -140 -96 -86 19 -51 -127 14 -22 67 101 -78 175 -102 4 -257
5015 -257 -68 -116 -183 21 -175 47 -43 189 -7 187 -138 -92 -42 -18 20 110 89 -2 -110 7 86 130 25 103
5039 103 -70 18 -137 47 44 107 95 82 -56 -74 -14 7 -111 76 92 65 -42 76 61 -23 30 -84 -11 -112 180
5064 180 -28 101 -172 -90 67 -110 48 -15 136 107 -68 40 -184 -95 160 -88 104 -238 109 259 -136
5085 -136 84 -211 2 66 228 81 2 129 124 220 -110 -289 56 -284 -194 -93 -111 27 -205 213 -156 34
5107 34 218 125 334 372 -117 -107 -322 11 7 -203 103 -325 -261 201 -298 -139 -239 150 -332 -177 35 -84
5129 -84 50 -211 193 182 -117 74 -45 -302 25 90 317 -28 -34 81 15 -158 -111 18 -545 -185 -187 233 -22
5152 -22 -116 -395 -92 120 237 7 -115 -1 -48 -312 585 -390 228 365 108 -204 -183 -180 -90 185 -250 240
5174 240 -65 115 -11 336 -2 -86 -143 132 78 114 -86 -22 4 256 88 110 39 164 58 -89 5 -63 -92 -130
5198 -130 210 -47 -113 -162 -48 -77 -18 -184 -73 -51 -34 -255 99 -2 92 74 194 78 -181 8 -317 -312 119
5221 119 -130 55 19 117 1 23 95 125 -101 426 -105 0 -96 317 100 457 -120 -185 170 -109 -75 -235 -98
5244 -98 -91 112 173 -68 119 -1 369 238 83 443 -225 9 169 -280 -53 -16 97 71 142 -43 383 267
5266 267 263 275 324 156 202 370 -455 421 -242 262 507 18 -291 -137 -9 -89 -170 -144 25 234 -129 366 137
5289 137 -71 -335 194 -63 -112 -126 -284 236 -285 -103 41 -59 398 120 156 -161 10 -789 -283 211 -44
5310 -44 321 -498 -472 -20 -55 121 -177 -119 398 -721 30 -235 208 -197 180 196 -18 86 65 431 -406 -286
5332 -286 -688 89 305 200 -471 -116 595 -259 -6 585 87 99 192 -69 -170 451 144 546 -387 -2 188
5353 188 104 58 24 361 128 676 143 -28 -34 -179 148 -176 -186 162 -126 457 -226 -87 -69 282 60 54 144
5376 144 -20 -21 187 160 118 2 -94 92 123 -17 27 -354 -255 -157 218 -357 53 19 -8 99 -49 114 49 163
5400 163 -237 187 -163 -106 34 130 -19 -147 -57 -144 182 178 185 -6 -158 -111 482 -119 137 360 -33 27 -14 397
5424 397 -61 -62 -99 33 138 -115 19 14 -165 113 -10 -104 -112 -51 62 82 -74 187 -69 -66 23 -97 -39 180 137
5449 137 89 29 -58 88 17 20 242 -110 38 54 -38 8 3 11 102 63 -17 342 -148 -69 -47 -19 78 -57 -50 -50 61 -67
5477 -67 -42 -39 165 -75 51 178 95 50 120 -18 114 -128 -65 -82 -176 137 63 -86 -96 -32 162 19 -194 29
5501 29 36 -170 25 -123 82 29 -31 19 102 106 75 13 13 68 50 55 -89 -96 105 -85 8 -25 -22 -42 99 136 -31 42 -55
5530 -55 71 92 67 -50 -107 -4 -38 -19 -104 -48 96 19 43 34 53 28 -123 -6 41 91 69 47 96 49 34 84 -59
5557 -59 8 -33 -61 125 208 284 227 49 136 -38 333 156 128 -205 -138 75 59 -232 5 -63 -33 -33 -60 -181 341
5582 341 182 -105 -88 115 483 -149 -165 -450 -99 -235 -531 99 414 -49 -67 58 43 120 -114 151 366 173
5604 173 471 -403 254 100 -171 732 94 31 -296 -196 -216 89 -137 4 513 -228 -35 -404 127 -70 -21
5625 -21 181 -175 -102 -212 135 78 -101 -89 70 -50 69 -67 40 -24 -40 -12 60 -51 -27 -74 23 18 52 -61 -19
5650 -19 -87 -28 -69 -26 -23 -8 93 153 79 -49 81 28 2 -89 141 -77 -66 118 -88 170 132 -72 82 44 -30 21
5676 21 -14 15 133 -42 35 -61 -20 41 -133 112 -62 -20 -68 127 56 -119 68 -11 29 -88 24 40 -49 -92 -73
5701 -73 36 19 23 19 129 -63 1 -48 -28 49 42 10 146 77 11 -67 -14 -115 -24 87 -117 -22 67 19 94 23 68 11
5729 11 12 36 -59 127 100 -84 -89 -42 -18 5 -8 -29 85 179 -89 72 -58 125 62 -29 19 -2 -19 137 8 -67 -24
5756 -24 14 -140 56 46 75 -146 73 -77 86 -137 -137 -51 62 104 40 -143 -84 44 60 113 -41 30 172 -18
5780 -18 141 34 -47 13 -11 102 -44 57 -10 112 -61 -20 -7 91 87 -87 36 15 -128 -116 38 -10 -22 -98 35
5805 35 -65 31 25 -35 -14 -72 30 29 -120 -37 -154 94 -132 35 -30 -85 66 -41 19 -103 70 13 83 -39 58
5830 58 -24 -34 96 124 -27 139 43 -3 111 12 71 -54 30 48 -163 97 92 -66 117 157 -11 -31 223 -129 -104
5855 -104 -200 51 -272 227 -216 -24 -259 -278 275 180 651 -70 288 -34 188 58 131 -64 -110 16 -35 139
5877 139 -76 -102 -19 95 51 -4 209 161 32 64 -1 -68 71 36 31 -188 92 -50 36 -75 18 132 -108 17
5901 17 72 0 20 -131 17 12 -98 44 11 -22 -9 -42 72 136 -194 252 296 -273 349 46 -300 606 52 47 15
5926 15 -51 -23 -92 -113 -50 -27 195 -73 -2 -89 -80 -79 -3 -113 74 -82 -59 -1 -22 58 177 91 -61 26 -52 -17 156
5953 156 1 -156 -13 91 -112 -36 -144 -62 106 -80 35 120 40 27 57 87 15 66 -32 -45 -22 99 -95 8
5977 8 -15 4 137 29 91 -5 3 -110 -85 28 9 50 46 5 -88 -43 202 -51 -13 166 -11 5 -144 9 10 -117 1
6004 1 -58 63 0 -24 -84 53 44 133 102 -51 63 -106 -11 92 112 5 69 -33 -77 86 51 -55 38 -36 -13 -54
6030 -54 118 -35 -28 -137 -24 -24 94 -16 46 83 -38 -65 29 81 -7 -110 -9 100 -15 -65 180 -55 -14 -134
6054 -134 63 149 -156 95 -33 -91 18 -144 -18 67 5 -159 -91 -97 69 -35 -153 -40 -49 39 9 -4 -67 -92 101
6079 101 -92 -102 56 57 -85 -61 59 16 37 -132 24 38 68 86 -42 68 -48 88 82 -47 -236 15 -158 -83
6103 -83 61 -13 -16 68 -12 -1 -59 66 -73 119 -5 -7 -61 120 -43 57 26 -31 -29 88 35 -10 129 -33 -35 -38 -169
6130 -169 -31 126 38 66 15 77 -117 -101 10 14 138 10 61 -72 -74 104 120 36 32 -111 -153 70 8 9 84 57 -172
6157 -172 -81 -31 89 129 79 -11 69 -76 126 135 33 -56 -53 -6 24 44 59 -124 28 48 81 -117 -80 -114 -61 68 -83
6184 -83 -148 -123 59 62 -37 4 57 -72 -58 71 -130 17 -150 -113 27 -52 156 15 -11 160 -18 -104 -79 -79 34
6209 34 -52 -8 -191 -35 122 64 72 -44 -57 -83 -74 31 -176 -22 -46 47 23 14 -108 -186 -74 -188 -87 -57 -81 -50
6235 -50 -27 129 90 43 -18 18 8 134 -42 42 9 -44 127 35 145 217 81 61 -63 -81 111 136 107 -59 36 163
6261 163 -61 36 112 -48 48 61 -14 -30 50 -91 -137 -155 40 95 -32 75 -14 -48 40 -68 -238 -91 -104 68 43
6286 43 -53 76 25 11 61 75 220 33 -91 50 -63 -45 94 -34 102 29 -18 121 -172 -136 79 90 -30 -121
6310 -121 -95 -11 -24 54 76 -20 -77 150 72 43 -170 75 -5 -10 105 48 -8 -72 -18 -108 87 -48 5 62 -2 -24 -38
6337 -38 19 -16 190 44 -24 46 37 -88 8 47 11 24 -71 -100 -17 -98 61 176 -64 54 87 -100 -11 -117 -12 23
6363 23 -219 66 -24 -111 124 -86 -86 -56 29 -75 97 8 -91 -179 66 -45 51 185 73 -3 14 -9 35 89 -49
6388 -49 -18 79 47 101 143 83 35 -19 -3 -54 -117 -44 29 42 -30 38 28 -54 96 -108 -15 -35 126 -61 80 -137 58
6415 58 -37 -128 38 -86 -2 31 71 73 -94 2 53 -57 131 -4 -55 11 30 -54 74 -76 80 56 118 8 10 -11
6441 -11 -34 88 -93 -26 -40 -42 32 -25 8 -53 -35 -145 179 -29 -104 3 -17 -11 -63 21 115 -113 164 -89 -149 49
6467 49 129 59 -55 -38 -394 190 -21 94 -155 133 9 -11 -384 24 -57 4 -163 -230 359 -10 91 -58 65
6490 65 145 27 123 -23 180 38 -102 85 108 88 -116 -48 -61 74 21 -2 -27 69 34 -42 -23 -144 -31 18 -31
6515 -31 88 86 -28 107 -38 47 38 25 -75 -14 41 32 7 78 -35 -53 -21 -69 67 89 68 -88 -17 -41 30 -19 -10 -42
6543 -42 22 43 -6 87 -54 102 289 -45 39 48 59 11 53 59 -153 79 54 -82 27 22 57 82 6 54 -43 71 22
6570 22 59 63 36 -41 -135 -100 196 -41 -175 18 -26 12 80 101 -61 3 0 62 22 -67 14 72 23 53 77 156 104 -45
6598 -45 50 79 86 -11 -80 -80 -87 18 -28 -17 -123 144 -40 -40 -143 61 26 229 63 39 -101 -62 2 -60 44 -189 -73
6625 -73 114 34 -11 -82 -47 3 107 -59 -12 76 -12 -201 -70 -87 -15 -5 -6 -138 75 92 31 82 -9 -86 -177 86 27
6652 27 94 -91 52 24 -74 68 60 48 -166 -120 -62 -88 42 2 44 13 -41 91 124 72 68 59 36 -178 -189 -58 -137 -69
6680 -69 79 -35 61 -34 156 -128 38 -17 108 41 6 111 25 -5 5 112 -38 -75 114 -34 296 -47 57
6703 57 367 427 155 111 -93 91 346 9 -28 -52 -26 44 79 60 -110 -112 -159 -33 -39 -4 -17 25 -34 -105 -115 102 121
6730 121 -36 10 -115 7 17 10 14 126 52 9 24 58 15 -24 26 -68 31 -22 24 73 -2 64 -116 28 -86 -135 -36
6757 -36 -7 -40 -1 137 -128 66 88 66 -117 -181 -62 4 126 -9 45 -71 -25 152 -116 -74 -130 221 74 -46
6781 -46 -2 -107 67 -10 65 -143 -85 -88 29 -36 -10 -49 -117 56 141 43 22 -20 -14 74 23 87 31 44 -90 103 141 -69
6809 -69 -94 135 -9 90 -198 -61 35 9 -152 94 156 4 77 -135 56 -70 9 27 -36 111 -59 76 59 -137
6833 -137 -93 -25 -27 21 44 80 -90 22 -48 65 3 34 42 -73 44 73 26 13 -19 93 -59 -89 71 16 -3 -94 69
6860 69 -225 62 -69 40 76 -44 -82 -5 -64 -37 -13 53 -151 -37 1 10 -22 -65 3 108 -70 -87 25 -39 7 -48
6886 -48 19 -74 -18 75 9 37 39 -104 35 -22 71 57 -85 -30 -68 -144 -3 -53 -79 -35 -221 -44 -34 45 -113 156 46
6913 46 91 -78 -3 119 -4 74 -147 39 140 46 -61 79 27 -14 -47 26 198 28 19 -20 -163 -31 -9 -22 -66
6938 -66 12 -16 81 -34 145 -86 90 -68 -71 -38 13 -16 11 11 -56 52 -78 45 56 35 -11 44 16 -97 60 50
6964 50 67 132 7 94 21 -35 -6 -15 -12 38 -3 -20 -137 14 -44 -146 53 -226 6 -55 -57 76 -169 210 1 26
6990 26 0 85 -139 108 70 -24 -137 58 -67 37 -181 18 -47 -5 -84 99 24 97 66 -112 28 98 192 -19
7014 -19 -31 69 152 3 -28 -38 -42 49 59 182 5 59 -59 -107 -18 126 76 -52 -68 8 44 -50 109 60 -179 -28
7040 -28 91 -18 34 -125 36 -102 -6 23 -53 21 18 49 44 119 33 -179 42 89 -101 -10 -46 19 55 92 95 9 45 -85
7068 -85 49 23 61 -103 -131 23 24 -175 39 -135 111 47 -67 33 -73 70 -85 -51 -65 13 -22 -26 -102 -14 -5 -16
7094 -16 -13 96 -98 -157 32 35 53 118 25 -69 182 44 48 183 -85 74 215 -137 -41 39 -108 54 123 42 43 -125
7120 -125 -44 -34 -76 -66 -124 -12 41 110 -39 61 -112 28 94 80 -59 -131 25 65 115 -70 -108 -47 -44 -21 11 33
7146 33 122 34 -124 76 3 -34 41 -180 60 -60 105 -24 176 45 15 89 94 -145 -67 99 12 119 81 -102
7170 -102 82 0 -230 -4 -101 -69 135 -75 11 -53 10 -90 65 73 -27 -14 8 42 -42 3 156 24 38 47 55 29
7196 29 10 53 44 124 -36 232 9 -116 -85 -44 -43 -2 95 -32 132 -6 -77 43 -47 58 39 -71 61 -42 55
7221 55 40 -106 -2 -6 5 72 190 26 -127 91 -87 -36 -146 -7 20 -45 -63 139 3 -76 -53 86 -31 12
7245 12 94 -73 -110 -95 10 -129 -61 -17 25 -49 -23 -12 89 -52 -176 -169 -45 -85 -60 -142 -82 75 -18 -95 41 -2
7271 -2 -33 -91 -23 -1 -101 107 46 -14 -80 143 16 -173 26 159 22 16 -97 -24 -81 -77 -262 126 84 217 -168
7296 -168 208 -77 -264 326 82 137 -96 411 -5 -137 -60 17 -594 29 331 -26 -329 270 287 333 64 167
7318 167 -104 -88 -13 58 238 219 -17 -252 -22 13 58 182 41 16 -26 9 -21 -87 142 -48 158 -21 56 46
7342 46 23 -63 61 21 51 249 33 -25 -51 107 -42 27 -61 -136 -116 -89 -59 82 -58 21 -154 12 35 -41 -77 182
7368 182 -53 28 51 43 147 -155 -10 -97 85 -124 -53 -113 16 -74 -171 74 -46 -80 -105 -28 -48 27 -62 149 5
7393 5 -53 33 13 -88 -84 -40 -19 4 68 1 -55 -166 17 -14 -88 88 -76 4 22 100 54 83 37 43 112 -12 99 75
7421 75 -135 -57 12 -109 -4 19 103 32 -8 -101 4 9 -12 49 69 -49 73 20 34 -70 -43 40 39 -89 -31 21 82
7448 82 164 -111 146 -52 -80 -140 29 49 -14 -120 51 -35 7 -39 -55 -34 -19 49 -38 34 -47 43 86 -81 34 -44
7474 -44 -99 19 5 -70 23 -23 -71 32 -68 16 -30 -46 166 3 -48 -85 -21 -45 -97 -4 -71 39 -138 -145 -26 -32 -46
7501 -46 -83 -59 -43 69 24 58 5 0 98 79 -51 -11 -22 -1 1 191 -48 -45 -33 -11 -101 38 35 157 -120 -110 -34 -182
7529 -182 -164 10 96 -185 -167 -19 -61 69 164 128 -9 -22 155 6 54 416 -96 -140 240 -143 -104 -22 44 -31
7553 -31 50 18 14 -40 -87 -107 -117 110 -75 10 127 -108 -69 50 -26 133 -10 -76 32 -13 125 13 62 -113 189
7578 189 -153 -17 -21 -69 31 96 -60 -19 27 51 2 -41 4 -3 -209 33 -53 -100 98 44 -2 91 18 -85 65 -139
7604 -139 -22 60 -127 -265 336 -32 -177 55 79 -72 25 -97 -10 -50 18 127 -101 150 48 -47 51 11 49
7627 49 -66 -83 170 -48 115 24 -138 30 -11 -52 -71 -75 18 -77 -201 -234 -182 -22 -117 55 -98 -4 -388 116 82
7652 82 112 27 -94 289 108 277 288 92 -150 -227 57 -16 174 -13 141 -315 214 168 127 329 -471 69 372
7675 372 -120 -292 305 -104 -265 205 165 605 -72 -108 -44 282 -582 -286 292 -280 201 -47 282 -22 144
7696 144 -82 -467 -30 376 -348 411 -197 -511 -239 440 360 -289 83 -45 23 -329 -273 -691 185 -46 314
7717 314 34 440 -105 298 73 115 269 -8 -37 -306 145 -266 -170 -356 391 257 -582 42 -414 -188 -261
7738 -261 185 39 -16 -251 -109 52 26 -86 331 -144 -295 416 187 414 -171 361 -71 2 -220 -14 -16 -256
7760 -256 -289 240 222 88 -74 -209 15 203 -258 -163 -109 62 -208 14 196 208 -27 216 -152 -174 210 -1
7782 -1 -262 -121 200 -188 126 152 160 74 -327 -50 -107 157 -35 72 -20 149 -2 -80 106 50 -88 -223 -227 33
7806 33 -369 -35 -43 -220 126 -135 -470 -143 313 244 -72 89 -265 -155 -19 -329 -59 -103 254 100 -7 -136
7828 -136 7 99 -203 5 26 2 -26 -42 138 -10 116 -55 80 -26 -37 -121 31 27 -38 -128 -31 -93 -65 146 -32
7853 -32 -244 91 90 -70 -102 56 36 -126 -152 -73 22 96 -57 -41 40 60 -64 -24 39 85 70 59 -78 77 -42 -101
7879 -101 19 5 64 0 102 -50 89 -44 9 -61 -52 81 -42 254 -91 -241 3 63 -12 -43 -73 -4 73 173
7903 173 126 61 -8 -33 75 34 69 -29 83 -13 -22 -146 -94 -105 144 -6 19 27 156 -8 -165 -24 16 61 72 115
7929 115 -76 88 46 -37 94 -50 -99 85 -130 -104 -137 -107 -76 -169 10 141 -95 172 28 -134 18 20 -21 45
7953 45 -52 -58 19 48 78 75 27 -16 -11 17 -10 -77 -60 51 -133 70 -7 199 26 87 -3 54 -31 -53 -120 52 -37 -26 -21
7982 -21 -111 -172 -74 3 -50 85 71 43 19 54 57 -38 -22 -56 123 -61 -31 23 37 36 76 68 58 -82 68 113 10 14 -109
8011 -109 -118 -86 67 40 -173 -39 237 8 100 33 -12 11 93 -53 21 2 -31 -121 -2 99 4 56 131 -63 30 9
8037 9 0 -40 52 -93 46 140 -71 -73 49 42 -22 36 41 172 -49 194 -62 -62 -79 -80 -20 -43 -6 -27 -45 112 -31 -54 60
8066 60 -60 3 26 -63 64 -10 -19 67 -19 22 -52 75 -187 41 62 -6 29 55 102 -62 -6 -10 36 82 -7 -124 78
8093 78 22 -47 24 26 -32 80 92 -103 -107 -80 -11 152 116 91 59 42 -114 -93 -166 65 21 13 -51 -119 35 -151 48 119
8121 119 -167 -143 197 -124 108 38 111 -174 104 90 0 -78 -83 184 23 -9 -112 -65 -143 -25 128 -40 -18 94
8145 94 136 61 3 -14 -129 161 -8 -28 -34 -79 22 -98 -8 -77 7 -54 -3 -37 34 12 66 36 -61 -10 20 12 -19 57 -16
8174 -16 216 50 37 30 146 -89 63 127 -9 32 -58 53 83 113 14 85 190
8191A90
##END NTUPLES=NMR FID
##END=
