##TITLE=1H_2ABPA1305-4
 CDCl3, 8 sc, 
 14.05.2021
##JCAMPDX= 6.0         $$ Bruker NMR JCAMP-DX V2.0
##DATA TYPE= NMR FID
##DATA CLASS= NTUPLES
##ORIGIN= UXNMR, Bruker Analytische Messtechnik GmbH
##OWNER= root
$$ XWIN-NMR		Version 3.5
$$ Fri May 14 11:13:46 2021 Russian Standard Time (UT+4h)  she@DPX200
##.OBSERVE FREQUENCY= 200.131506
##.OBSERVE NUCLEUS= ^1H
##.DELAY= (6, 6)
##.ACQUISITION MODE= SIMULTANEOUS
##.ACQUISITION SCHEME= undefined
##.AVERAGES= 8
##.DIGITISER RES= 18
##SPECTROMETER/DATA SYSTEM= spect
##.PULSE SEQUENCE= zg30
##.SOLVENT NAME= CDCl3
##.SHIFT REFERENCE= (INTERNAL, CDCl3, 0, 15.7039)
##AUDIT TRAIL= $$ (NUMBER, WHEN, WHO, WHERE, WHAT)
$$ ##TITLE= Audit trail, XWIN-NMR		Version 3.5
$$ ##JCAMPDX= 5.01
$$ ##ORIGIN= Bruker BioSpin GmbH
$$ ##OWNER= she
$$ F:/spectra/data/she/nmr/H-F/1/audita.txt
$$ ##AUDIT TRAIL=  $$ (NUMBER, WHEN, WHO, WHERE, WHAT)
(   1,<2021-05-14 11:11:54.23 +0400>,<she>,<DPX200>,
      <created by zg, POWCHK disabled, PULCHK disabled
       configuration hash MD5:
       00 E9 B6 7A A2 85 ED C7 34 08 36 98 17 FE 4E 26
       data hash MD5: 16K
       B8 44 61 A7 23 61 35 41 05 9F C6 65 B7 A7 71 8C>)
$$ ##END=
$$ 
$$ hash MD5
$$ 60 BC AE 4D 42 7D 70 85 1D 27 58 43 61 56 CC E0
##$RELAX= 
##$RELAX= 
##$RELAX= 
##$RELAX= 
##$RELAX= 
##$RELAX= 
$$ Bruker specific parameters
$$ --------------------------
##$DU= <F:/spectra>
##$EXPNO= 1
##$NAME= <H-F>
##$PROCNO= 1
##$TYPE= <nmr>
##$USER= <she>
##$AMP= (0..31)
100 100 100 100 100 100 100 100 100 100 100 100 100 100 100 100 100 100 
100 100 100 100 100 100 100 100 100 100 100 100 100 100 
##$AQSEQ= 0
##$AQ_mod= 1
##$AUNM= <au_zg>
##$AUTOPOS= <>
##$BF1= 200.13
##$BF2= 200.13
##$BF3= 200.13
##$BF4= 200.13
##$BF5= 200.13
##$BF6= 200.13
##$BF7= 200.13
##$BF8= 200.13
##$BYTORDA= 1
##$CFDGTYP= 0
##$CFRGTYP= 5
##$CHEMSTR= <none>
##$CNST= (0..31)
1 1 145 1 1 1 1 1 1 1 1 1 1 1 1 1 1 1 1 1 1 1 1 1 1 1 1 1 1 1 1 1 
##$CPDPRG= <>
##$CPDPRG1= <>
##$CPDPRG2= <>
##$CPDPRG3= <>
##$CPDPRG4= <mlev>
##$CPDPRG5= <mlev>
##$CPDPRG6= <mlev>
##$CPDPRG7= <mlev>
##$CPDPRG8= <mlev>
##$CPDPRGB= <>
##$CPDPRGT= <>
##$D= (0..31)
0 1.2 0 0 0 0 0 0 0 0.06 0 0.03 0 0 0 0 0.0002 0 0 0 0 0 0 0 0 0 0 0 0 
0 0 0 
##$DATE= 1620976313
##$DBL= (0..7)
120 120 120 120 120 120 120 120 
##$DBP= (0..7)
150 150 150 150 150 150 150 150 
##$DBP07= 0
##$DBPNAM0= <>
##$DBPNAM1= <>
##$DBPNAM2= <>
##$DBPNAM3= <>
##$DBPNAM4= <>
##$DBPNAM5= <>
##$DBPNAM6= <>
##$DBPNAM7= <>
##$DBPOAL= (0..7)
0.5 0.5 0.5 0.5 0.5 0.5 0.5 0.5 
##$DBPOFFS= (0..7)
0 0 0 0 0 0 0 0 
##$DE= 6
##$DECBNUC= <off>
##$DECIM= 32
##$DECNUC= <off>
##$DECSTAT= 4
##$DIGMOD= 1
##$DIGTYP= 9
##$DL= (0..7)
0 120 120 120 120 120 120 120 
##$DP= (0..7)
150 150 150 150 150 150 150 150 
##$DP07= 0
##$DPNAME0= <>
##$DPNAME1= <>
##$DPNAME2= <>
##$DPNAME3= <>
##$DPNAME4= <>
##$DPNAME5= <>
##$DPNAME6= <>
##$DPNAME7= <>
##$DPOAL= (0..7)
0.5 0.5 0.5 0.5 0.5 0.5 0.5 0.5 
##$DPOFFS= (0..7)
0 0 0 0 0 0 0 0 
##$DQDMODE= 0
##$DR= 18
##$DS= 0
##$DSLIST= <SSSSSSSSSSSSSSS>
$$ [...]
##$SUBNAM2= <"">
##$SUBNAM3= <"">
##$SUBNAM4= <"">
##$SUBNAM5= <"">
##$SUBNAM6= <"">
##$SUBNAM7= <"">
##$SUBNAM8= <"">
##$SUBNAM9= <"">
##$SW= 16.9725357007746
##$SWIBOX= (0..15)
0 0 2 0 0 0 0 0 0 0 0 0 0 0 0 0 
##$SW_h= 3396.73913043478
##$TD= 16384
##$TD0= 1
##$TE= 0
##$TE2= 300
##$TE3= 300
##$TEG= 300
##$TL= (0..7)
0 120 120 120 120 120 120 120 
##$TP= (0..7)
150 150 150 150 150 150 150 150 
##$TP07= 0
##$TPNAME0= <>
##$TPNAME1= <>
##$TPNAME2= <>
##$TPNAME3= <>
##$TPNAME4= <>
##$TPNAME5= <>
##$TPNAME6= <>
##$TPNAME7= <>
##$TPOAL= (0..7)
0.5 0.5 0.5 0.5 0.5 0.5 0.5 0.5 
##$TPOFFS= (0..7)
0 0 0 0 0 0 0 0 
##$TUNHIN= 0
##$TUNHOUT= 0
##$TUNXOUT= 0
##$USERA1= <user>
##$USERA2= <user>
##$USERA3= <user>
##$USERA4= <user>
##$USERA5= <user>
##$V9= 5
##$VALIST= <valist>
##$VCLIST= <CCCCCCCCCCCCCCC>
##$VD= 0
##$VDLIST= <DDDDDDDDDDDDDDD>
##$VPLIST= <PPPPPPPPPPPPPPP>
##$VTLIST= <TTTTTTTTTTTTTTT>
##$WBST= 1024
##$WBSW= 4
##$XGAIN= (0..3)
0 0 0 0 
##$XL= 0
##$YL= 0
##$YMAX_a= 259889
##$YMIN_a= -414666
##$ZGOPTNS= <>
##$ZL1= 120
##$ZL2= 120
##$ZL3= 120
##$ZL4= 120
##$ABSF1= 10
##$ABSF2= 0
##$ABSG= 5
##$ABSL= 3
##$ALPHA= 0
##$AQORDER= 0
##$ASSFAC= 0
##$ASSFACI= 0
##$ASSFACX= 0
##$ASSWID= 0
##$AUNMP= <proc_1d>
##$AZFE= 0.1
##$AZFW= 0.1
##$BCFW= 1
##$BC_mod= 2
##$BYTORDP= 1
##$COROFFS= 0
##$CY= 11.3945322036743
##$DATMOD= 1
##$DC= 2
##$DFILT= <>
##$DTYPP= 0
##$F1P= 15.9154993809931
##$F2P= -4.1035820241983
##$FCOR= 0.5
##$FTSIZE= 0
##$FT_mod= 4
##$GAMMA= 1
##$GB= 0.15
##$INTBC= 1
##$INTSCL= 1
##$ISEN= 128
##$LB= 0.24
##$LEV0= 0
##$LPBIN= 0
##$MAXI= 10000
##$MC2= 0
##$MEAN= 0
##$ME_mod= 0
##$MI= 1.114404
##$NCOEF= 0
##$NC_proc= 0
##$NLEV= 6
##$NOISF1= 3.799351
##$NOISF2= 2.8
##$NSP= 1
##$NTH_PI= 0
##$NZP= 0
##$OFFSET= 15.70392
##$PC= 1
##$PHC0= -11120.53
##$PHC1= -0.9989996
##$PH_mod= 1
##$PKNL= yes
##$PPARMOD= 0
##$PSCAL= 0
##$PSIGN= 0
##$REVERSE= no
##$SF= 200.130013532006
##$SI= 16384
##$SIGF1= 3
##$SIGF2= 2
##$SINO= 400
##$SIOLD= 16384
##$SREGLST= <1H.CDCl3>
##$SSB= 0
##$STSI= 0
##$STSR= 0
##$SW_p= 3612.71676300578
##$SYMM= 0
##$S_DEV= 0
##$TDeff= 0
##$TDoff= 0
##$TI= <>
##$TILT= no
##$TM1= 0
##$TM2= 0
##$TOPLEV= 0
##$USERP1= <user>
##$USERP2= <user>
##$USERP3= <user>
##$USERP4= <user>
##$USERP5= <user>
##$WDW= 1
##$XDIM= 8192
##$YMAX_p= 0
##$YMIN_p= 0
$$ End of Bruker specific parameters
$$ ---------------------------------
##NTUPLES= NMR FID
##VAR_NAME=  TIME,          FID/REAL,        FID/IMAG
##SYMBOL=    X,             R,               I
##VAR_TYPE=  INDEPENDENT,   DEPENDENT,       DEPENDENT
##VAR_FORM=  AFFN,          ASDF,            ASDF
##VAR_DIM=   8192,          8192,            8192
##UNITS=     SECONDS,       ARBITRARY UNITS, ARBITRARY UNITS
##FACTOR=    0.0002944,     1,               1
##FIRST=     0,             0,               0
##LAST=      2.4114304,     0,               0
##MIN=       0,             -414666,         0
##MAX=       2.4114304,     259889,          0
$$ Real data points
##PAGE= N=1
##DATA TABLE= (X++(R..R)), XYDATA
$$ [...]
1222d13N54N34r46N27K74r94R57l61n75R09m62m2O15n91K8L19o08M40M2m49P08
1243D66n86m0N91p81K72K51m32L02J69p86P43k13k56M22j84l17N89m63kM49n23
1264c29L04J55n44M95j37l02N70m26n6M61k55k18N63n93K39J86m36L57l1k02L64
1285A65j49k76P75o16J02L35o92N20L66p94N28O2p17Q36k92m61J030p96JP65r03
1306b11J61O10q92N42J36n91N12j24r0J36k70J95K20n58M95j21n86Q03m29m23
1326d85Q53n47j88R49r34L5Q33r59J08O27p41L76J19o20L65J77n4Q4n0j38K52
1347F2k76K05r7j68M47l36k97P37n37p7P71p87J54N63o72R8O94p40L35L76p91
1368c36N07J17m52L62r5q2J77j88K20k01l5M85n01r1O70p55J97N37o71J99N57
$$ plain form
1222 -413 141 675 -271 256 530 -464 493 132 -443 466 4 -38 577 -14 14 333 -275 165 207 -242 466
1243 466 -120 -160 431 -350 -78 173 -259 43 212 -574 169 -44 -300 122 -62 -379 210 -253 -255 194 -329
1264 -329 -25 130 -414 81 -56 -358 212 -214 -270 191 -64 -282 281 -312 -73 113 -323 34 3 -199 165
1285 165 16 -260 515 -101 1 336 -356 164 530 -264 264 326 -391 445 153 -308 722 -74 -73 692 -211
1306 -211 -50 560 -332 210 346 -245 267 143 53 189 -81 114 334 -224 271 150 -436 367 -62 -485
1326 -485 368 -179 -367 582 -352 -317 516 -443 -335 292 -449 -73 46 -574 -209 -32 -86 -2 -52 -190 62
1347 62 -214 -9 -106 -274 173 -163 -460 277 -260 -337 434 -353 -199 364 -308 -210 484 -256 79 455 -336
1368 -336 171 288 -164 198 103 21 198 10 230 29 -6 479 -22 -113 557 -198 -1 536 -135 64 621
1389F21j040M97M29q59N24J60r33P86k8n10N52j16k35K43j58l0J36k15K20j70
1409a26j72N94m32PL65o84K94L41o75L62L27p06O45K4p31O54j06l57N86k30j99
1430b19L44l00J91Pj52K92j67j19L24k03k6L90n57K56K65n58L62Q7n37M41K07
1451C28n61O71l26k10N39l77j05K28l77L40Qm21N76l60j62M41l45N9K16j51k2
1472a1L17m70K38J04l91L71r4l53L72j20k08K30k41J73K44m45J20R3m01O29j71
1493a4k70M44k23k02M80m57O6M41m58R3K17l78J93J48l65Q1K91k47K76k36K1J54
1515E5k16K72M5m32N41j59k04L91m04j8O22o30J06K96m93J74M00o13L23L37n53
1536a60L84j41O9M6k46J89m9k11J73j5j47L65l68j18P72p48oN39m83QM49p75K97
$$ plain form
1389 621 -419 78 507 -352 172 332 -601 185 157 -353 199 83 -152 91 -67 -97 39 -176 44 -126
1409 -126 -298 296 -136 -129 236 -448 -154 187 -488 -126 201 -505 140 164 -567 87 -19 -376 210 -20 -219
1430 -219 125 -175 16 23 -129 163 -4 -123 201 -2 -28 362 -195 61 326 -232 130 217 -320 121 328
1451 328 -233 438 112 -98 441 64 -41 187 -190 150 158 -263 313 -47 -209 232 -113 -54 162 11 -11
1472 -11 306 -164 74 178 -213 158 64 -289 83 -37 -245 -15 -256 -83 161 -284 -164 -71 -472 157 -14
1493 -14 -284 160 -63 -265 215 -242 -176 265 -193 -100 117 -261 -68 80 -285 -204 87 -160 116 -120 -99 55
1515 55 -161 111 156 -276 265 106 -98 293 -111 -129 493 -137 -31 265 -228 -54 346 -267 56 393 -160
1536 -160 224 83 152 198 -48 141 92 -119 54 39 -108 257 -111 -229 543 -205 -211 328 -155 -147 302 -473 -176
1559a76K81m16L77%l07K02J0n6Q7j60J45p6M2J41l13J26K88m33J02K89m44K07
1581h4M30o93L49J91m78M18R8n37L56O2l35M05k03oJ37k36K48j10L1R6j92M3K38
1604B28m24K48K08l98K70Q6l04P6K70m69L49Rm68N27k6k67L79k76j54L60j12j55
1626d3J19o4J60j93r4L77l27o3J69k27J24J04l36M20R7o87N04j6l16M17j78k03
1648b56L44j10l21M99m38J64J44l59K93R4o2J83l52L0K76l47L66J39m48K81lk25
1670a08J95k6j54L03j96j86M43k47MJ83k74J78n0o5J45j22j29M55k68j17K90m41
1692a87J39L59l09n1K69l40L35k23j49L08k10J4J27j26j09K33k53K52J1l30L62
1713A22j51q2L43m82O0L73l51j2L60m38J91K02m05K16P0k67K19J42k90J26q7J64
$$ plain form
1559 -176 105 -311 66 66 -241 -39 -29 -85 2 -158 -13 -89 -47 94 -219 -93 195 -238 -136 153 -291 -84
1581 -84 346 -347 2 193 -285 133 231 -306 50 112 -223 182 -21 -27 110 -126 122 12 43 139 -53 -10 228
1604 228 -196 52 260 -138 132 218 -86 -10 260 -209 140 149 -319 208 182 -85 294 18 -136 224 112 -43
1626 -43 76 12 172 -21 -115 262 -65 -128 41 -186 -62 42 -294 126 223 -464 40 24 -292 125 -53 -256
1648 -256 88 -22 -343 156 -282 -118 26 -333 -40 54 -8 175 -177 -147 129 -218 148 287 -161 120 117 -108
1670 -108 87 61 -93 210 14 -172 271 24 28 211 -63 115 65 0 145 23 -106 349 81 -36 254 -187
1692 -187 -48 311 2 -49 220 -120 215 -8 -157 151 -59 -45 82 -44 -153 80 -173 79 90 -240 122
1713 122 -29 -111 232 -250 -190 183 -168 -180 180 -258 -67 135 -270 -54 16 -251 -32 110 -180 -54 -141 23
1735B3J17j99J06k23J57J06j64o1M31m67J22L65m66K20K98n42J46J73l71L37Q3
1756A91k97K29r3j12K75j07n4O2l5J24j26n8K19l11J05K52l23R9P4k88L11Kl99
1779b60K06J68n54N41k8k47L27j44k05L27j06p5R7j19J15j93J5R6o8O3O3j13M2
1802e2R5k70J52L07n48M30M8l30J98m3n2J85j09k99M26j78O5O8j35M2Q1N0j24
1825GK1j59L89l26J7K38l88L33O0l47L46K4m73N10j93k00M20l16j70M51m09J1
1847a54K77q6j22J87j53Q3L8j50J15n5L7m4p0L23j72j53L10k61j36M53l53j6L50
1870B48l49L7L03m02Q4K35k93O5R0k15K65J0j79M7J2j42K63k74K69l1k26K80j7
1893H0j11J94k96j10M11k84j1L31l32J62J59l00K13m9j72J86o3p4K47k09P2J06
$$ plain form
1735 23 140 -59 47 -176 -19 87 -77 -138 293 -174 -52 313 -153 67 365 -177 -31 142 -229 108 191
1756 191 -106 123 30 -82 193 86 32 94 59 183 57 -1 218 -93 12 264 -59 40 114 -174 137 139 -260
1779 -260 -54 114 -440 101 73 -174 153 9 -196 131 25 -50 47 -72 43 -150 -135 -39 -107 -44 19 -94 -52
1802 -52 43 -227 -75 232 -316 114 162 -168 30 -13 -65 120 11 -288 138 -40 25 93 -42 0 81 131 7
1825 7 28 -131 258 -68 -51 187 -201 132 192 -155 191 215 -258 252 59 -141 279 -37 -207 244 -165 -154
1847 -154 123 37 -85 102 -51 32 70 -80 35 -20 17 -27 -97 226 54 -99 211 -50 -186 267 -86 -102 248
1870 248 -101 -64 239 -163 -79 156 -137 -72 18 -197 68 78 -101 -54 -42 -184 79 -195 74 43 -183 97 80
1893 80 -31 163 -133 -243 168 -116 -127 204 -128 34 193 -107 106 57 -115 71 8 -66 181 -28 44 150
1915A50j40K2J70l23J88M5j78K02j24Q5j15J8J47Jj28k5L4k26L31n2q8K55l64
1938a15N3J76k02l4K48k81J51J32l98K71Q7k06M5O2p8Q9l3J1J35l22J51J15j60
1961a03J59j03j52K94p2j26J65j99Q5K21m55M99j35l20K95K9k22L69k29r0L09
1982B19l20N1J48r3R9L6j19J15j9j17K76l83J91L7k89K02P3k43L68j50l90N67
2004B59j41k18L99l70j11L13k01q9K19j56J43J9j72K27k54K09rj78J37n7q7K82
2026A64j37j74L19j02j04K01k21k2K88k85j55M44k62J01O9k17PK8K3L3Q0k08J93
2049F3j85J71N7r4kJ75k89K74j57j40K98k29pL13k42K7J66l18J24J51k69J83O7
2072A37j77J64j05O1L4j86Q4J36j71O8kk14L38j38j33J77j95kK70j83n0N8j53
$$ plain form
1915 150 10 32 202 -121 67 112 -66 136 12 97 -18 0 147 148 20 -5 29 -197 134 82 -6 249 -115
1938 -115 -62 114 -88 -122 126 -155 -4 128 -270 1 88 -118 -73 -11 -89 0 -33 -22 113 -209 -58 57 -103
1961 -103 56 -47 -199 95 23 -103 62 -137 -52 169 -286 213 78 -242 53 82 -140 229 0 -90 219
1982 219 -101 -50 98 5 104 140 21 136 117 0 276 -107 84 121 -168 34 107 -136 232 82 -308 259
2004 259 118 -100 299 -71 -182 131 -70 -159 60 -96 47 66 -106 121 -133 76 67 -111 26 -31 -118 164
2026 164 27 -147 172 70 -34 167 -54 -76 212 -73 -228 216 -46 55 124 -93 -86 -58 -35 -2 78 -130 63
2049 63 -122 49 106 12 10 185 -104 170 13 -127 171 -58 -65 248 6 33 199 -119 5 156 -113 70 137
2072 137 -40 124 19 80 114 -72 12 148 -23 45 43 -171 167 29 -104 73 -122 -124 146 -37 -87 -29 -182
2095a82J46J48k92L07j33j91K23l0j54L08j51l8J10m0K3jk86K04pmJ69j07j41
2118a19K24j78P8N1k08J95R5k02O3l7j55K27j13O8J59k25j2K48k18J07L7j09J66
2141A42n3j86K65o3j64K18j59L4j9r6J18okj64N4M5K85m28J28J01j65L1K68k98
2165a14k3K26k48O2J34k77L12j83r6K76j08j24J08L0M2Q7l01K90j39p7K36j38
2187b5L3J30k90J19J29j73J56M6l17L75j79j59J49n0qL05k48r5J57p1pO6o8J42
2211A17J5k0m2j09J92j2j62J63j24j24L18k06q6M54l64K7J51l50p2K80j45J77
2233G8K15l27L9P3j61J08l5O9n3j28O8O0K2qm4j51J70j00j20K57k90L2L09j79
2257i6j18K50q4j2J73l83L22J57l48K15Oj92N1l8QK44j20K2n5j29K67l9j22J76
$$ plain form
2095 -182 -36 112 -180 127 -6 -197 26 -4 -158 150 -1 -39 71 31 54 53 -233 -29 -36 -40 129 22 -119
2118 -119 105 -73 5 56 -152 43 138 -64 -1 -38 -193 34 -79 -11 148 -77 -89 159 -59 48 85 -24 142
2141 142 89 -97 168 105 -59 159 0 34 15 -81 37 31 29 -135 -81 -36 249 -179 -51 50 -115 -84 184 -114
2165 -114 -137 89 -159 -97 37 -240 72 -111 -207 69 -39 -163 -55 -25 17 104 -197 93 -46 -123 113 -25
2187 -25 8 138 -152 -33 96 -77 79 125 -192 183 4 -155 -6 -56 -64 241 -7 -102 55 -16 -23 43 -25 117
2211 117 132 112 70 -39 153 141 -21 142 18 -106 212 6 -80 374 10 37 188 -162 -234 46 -99 78
2233 78 293 -34 5 78 -83 25 -10 59 6 -122 -54 6 28 20 -24 -175 -5 -105 -225 32 -258 -226 83 -96
2257 -96 -214 36 -48 -60 113 -270 52 209 -139 76 82 -110 -59 -97 -89 155 35 57 2 -127 140 101 -21 155
2281A55j83N0J39l40K80p4j26J40J33k99L02o6j37P1m8o9K39r0mK0j64Q8l9J31
2305A09q4O3p3Q5l6n9J64k87O6K21k68J48N8j46O7o9Q2M3k16j9K24j49J3km5J2
2331i8K02j14J19j57n0J99k15Q9O0k20J96N2j67J38l1k07K07o7o0K72l29J21K78
2354B18m41K28J43k25J55j9j96L46j68k56L81k58l0M16k86p0J72j00K4n6j1L4
2376AJ05j13J39j31L7J33k42J70k6p1K6o9l6J00r8M6l5N3p0K49l27J33J02k17
2400a41J52M5o5N7l6n6J04po6q0J15j5pj37K36j06j07J41o2O0L9k2j53K83l16
2425a44J24J73j64oJ41q7m2J01k52K42P8j56J27p5kLk08J99J2r6L9jrK21l06P5
2451a3J78k50%K46k56N1J13j35J07j03J1K2p3R3r9J33L5j05J5R6j45r3J93k41
$$ plain form
2281 155 -28 22 161 -179 101 27 -99 41 174 -125 177 111 -26 45 -3 -72 167 77 73 93 -71 17 -22 109
2305 109 25 88 15 100 64 5 169 -118 -52 169 -99 49 107 -39 28 -41 41 84 -132 -151 73 -76 -63 -65 -110 -98
2331 -98 104 -10 109 -48 -98 101 -114 -25 35 -185 11 63 -104 34 3 -204 3 -64 -124 148 -181 -60 218
2354 218 -223 5 148 -77 78 59 -137 209 41 -215 166 -92 -122 294 8 -62 110 10 34 -22 -33 1
2376 1 106 -7 132 1 38 171 -71 99 73 2 28 -41 -77 23 -75 -29 -64 -11 -81 168 -159 -26 76 -141
2400 -141 11 56 -9 48 12 -44 60 53 -13 -93 22 7 0 -137 99 -7 -114 27 -35 25 64 42 -111 172 -144
2425 -144 -20 153 -11 -17 124 37 -5 96 -156 86 164 8 135 60 58 61 -147 52 64 -32 7 6 -3 218 -88 -13
2451 -13 165 -85 -85 161 -95 -44 69 -66 41 -62 -51 -29 -102 -9 -108 25 60 -45 -30 66 -79 -172 21 -220
2475b20J53K72k55L0K97l63J13p4k27L75r2k25J89L2p4J20o5o1J42n5r4J07K0
2498D5M7p4l9O3q1Q7j8m9j0J93k29o9J36j23J34L7k63L20k4m9L4p3l9J43j75J51
2524G5qj51J03j0j4Q8j91J10J67k98J33K6mm8J82k65J90q9l5J54r3j56K40j73
2548f7R5J3j43N3J03j02m4J82l28L44q5p2J57q9M0J6M9k43J42k33L72k35J05p4
2572d4R1j11J23r1J17j7j19P8Q8j68J73j50o0K07J6j03K4j9j25J60j43J80K4p8
2596E3R9j99k7L1M2k0L4pJ86j50j28K06j06o5J54k8k16K04j20O3J12r3p7J73j96
2621g5N7J41l53J72J29j24J59p0r8L2J7J04m1k02K02j21r4K61k60P5K28l28J31
2644e8L9mJ49q2k24J68O6l3m1K9K5r4L8M0J05n0j21P3pO1j6j96J48M9j12K49j64
$$ plain form
2475 -220 -67 205 -50 -20 277 -86 27 -47 -274 101 9 -216 -27 5 -69 51 -14 -75 67 12 -82 25 45
2498 45 92 18 -21 42 -39 48 30 -19 -29 164 -65 -134 2 -121 13 50 -213 107 83 34 68 -5 -44 99 -76 75
2524 75 67 -84 19 9 -5 83 -108 2 169 -129 4 30 26 -22 160 -105 85 -4 -39 115 22 -134 106 -67
2548 -67 28 41 -102 -49 54 -48 -92 90 -238 106 21 -51 106 17 57 73 122 -121 21 -212 160 -75 30 -44
2572 -44 47 -64 59 -32 85 68 -51 27 115 -53 120 -30 -90 117 133 30 54 35 -90 70 -73 107 131 53
2596 53 152 -47 -74 -43 -1 -21 13 6 192 42 -86 120 14 -51 103 75 -141 63 -57 6 118 25 -52 121 -75
2621 -75 -18 123 -230 -58 71 -53 106 36 -62 -30 -13 91 50 -152 50 -71 -165 96 -164 -89 139 -189 -58
2644 -58 -19 -23 126 44 -180 -12 54 21 -20 9 34 -60 -22 18 123 73 -48 25 18 79 63 -133 15 64 -48 201 37
2671C7j2J58l01l0L98l44K87r1j24J30J17l05M4N0o1J63j86M1NnJ26k03R9P8m1
2696C0l5R3j27J5N7j09R2P7k45K28o0l03L34j05j03K27k51J65Mj12J13J98l16
2719a33J82q4NP4j57L6J55o0o0P2m6j6J08j73J01j4j18J80j18o2K75j44lO5p7
2744a2O7j81Q7J03p4M1J12k51J66J9p6R4j3n2j5p0m3L16p5j74J8O3j12R3j72R5
2770d6K15k31m6Q1O6j80J21j97J55Q1j82K82j35r2J03r3m8M7k8R8M6j42K46k32
2794a11J64L8m8l5%j07m1J53j53J28j14R4Q9j14O6po8K08j19q7J37j2k59K14J2
2819B8o7J44k29P9k0J02jj9p0K33k12p6J54q8n5K04k07J06K3k44N2J76j52K19
2843H0l2j49J46m0j32J6J52k00K78o1jK8o0P8n2j78J09mj41J23K9N4J65l15P7
$$ plain form
2671 37 25 183 -118 -148 250 -94 193 102 -22 108 225 -80 -36 14 -47 116 -70 -29 -24 -29 97 -106 -7 71 30
2696 30 -5 88 -39 -24 33 -76 16 93 -152 76 16 -287 47 -58 -161 66 -185 -20 -16 -128 -15 183 -133
2719 -133 49 -35 -30 44 -113 -77 78 18 -42 30 -16 -32 76 -97 4 -10 -128 52 -66 -128 147 3 0 65 -12
2744 -12 55 -126 -39 64 -10 31 143 -108 58 77 1 95 82 30 15 -55 -98 218 143 -31 -13 50 -62 31 -141 -46
2770 -46 169 -62 -108 -27 39 -141 -20 -217 -62 19 -163 119 -16 -108 -5 -98 -146 -99 -127 -29 17 -125 121 -111
2794 -111 53 91 43 8 8 -99 -140 13 -140 -12 -126 -32 57 -57 9 2 -66 142 23 -64 73 61 -198 16 28
2819 28 -39 105 -124 -45 -65 37 36 17 -53 180 -32 -108 46 -42 -97 107 -100 6 29 -215 -163 13 -139 80
2843 80 48 -101 45 5 -127 -111 41 -159 119 58 57 85 25 103 51 -127 -18 -22 -163 -40 -11 43 208 -107 -30
2868c0P7j67R1J38j89Q8O4k58L40o8m0q3J40k44K24j51J34L8l13J93k9qK40k41
2892e4%J69j96J9R6o7J09j8m5J57q4k2m2R8j04P0k65K9L24l61M8J58m6K3Jr8J65
2919F4j01J00J73l40P1J16j56J60k16nL46k33l6N2Q4j05M8j69J21J21k62j2J80
2942An1P5j17K38j21j48J89j2j44K35K9k96Q2J4k0K28k10r0L53k41j08J95j33
2965e2J04j3o4Q0kk46J09K34j57jJ35j01j1L1J14j94kJ7L8j26J16L9o0J38j85
2990e9q7K95j52J83j99Q1j08P2m2J31j94j19K95j57o2J76q6J5N6j25R0Pj66K24
3014F9r2j84L09j02r3K81k59J26q2N6q9Qk7K30k71m8L55j51r0K25k63J30N0k00
3038a12K08J23k80M0k8rK04o5m1m5m3J43K3q4N2o8Ro5Q2j08J93j57LP9j29J70
$$ plain form
2868 -30 47 -120 -29 109 -80 8 72 -186 154 86 46 -37 103 -141 83 -68 66 104 -209 -16 -45 -53 187 -54
2892 -54 -54 115 -81 -62 34 -33 76 58 13 170 86 64 22 120 16 86 -179 -150 174 -187 -139 19 -27 -4 -3 -101 64
2919 64 -37 63 236 -104 -33 83 -73 87 -129 -134 212 -21 -57 -5 79 -26 22 -147 -26 95 -167 -179 1
2942 1 -50 25 -92 146 25 -123 66 54 -90 145 174 -122 -40 -26 -46 182 -28 -118 235 -6 -114 81 -52
2965 -52 52 39 -25 55 53 -193 -84 150 -7 -8 127 26 15 46 160 -34 -36 -19 19 -107 9 48 -12 126 -59
2990 -59 -146 149 -3 180 -19 62 -46 26 -16 115 -79 -198 97 -60 -122 54 -32 -17 39 -86 4 11 -155 69
3014 69 -23 -207 102 0 -93 188 -71 55 -27 29 -60 -52 -79 151 -120 -168 187 36 -54 171 -92 38 88 -112
3038 -112 96 219 -61 -21 -49 -58 146 81 40 -5 -48 95 118 34 86 18 27 -38 44 -64 129 -28 -25 54 -75 95
3064I5j4q3K1n5j64K69q5K5J29j50L6n1q3j4K15j59j8R9q7J57j27j06J96j95J01
3089d8K27j10j37k8q8K57j17j33K24m1j09K15k37Q8R4m5oO4o3L4k0rk4K8j22J94
3115H8n9N4k3qQ0j22m5O8k5rJ65j77r1J54n5k0L2j11K2k2NQ5l9L3L3K4j05J65
3143I7k01O9J18k11K06j28k0L3J8j58L06n1MMo7j41K46j06r2J46j80R4Q0k24J30
3168b8P6j41J40o1kO2k3l5k3j55K42r9K0k9o6P7J51k92J73K3Jk01K03m6J84lj79
3195c1K38j47J2J2j05Q1J2j06Q5j9o4P6m0n5Q4o4mQ7j61L0p3Q9J40K7j83l8K34
3222A17l09L14k13P5O1l9O3j22JkJ06j76J45p8k3J60Oo7j18N2oR9k14J88j00m8
3248a28J55o1L4l9m8n1J11j41J07R8j38N5J07k18J55o1oN4j3N1J05k63K43k5j02
$$ plain form
3064 95 81 -2 19 -36 -200 69 -16 9 138 -12 24 -27 -110 -124 91 -68 -86 13 -74 83 -44 -150 46 -149 -48
3089 -48 179 69 -68 -96 -184 73 -44 -177 47 6 -103 112 -125 -37 57 12 6 70 7 41 21 12 -12 16 -106 88
3115 88 29 83 60 52 132 10 -35 33 8 -1 164 -13 -104 50 -5 -25 7 -104 -82 -104 -99 -14 -53 -20 13 37 -68 97
3143 97 -104 -35 83 -128 78 -50 -70 -37 -19 -177 129 78 82 86 19 -122 124 18 -74 72 -108 -14 66 -158 -28
3168 -28 48 -93 47 -14 -16 46 23 -12 -35 -190 52 -47 -27 -56 -122 -45 106 -186 -13 10 11 -190 13 -33 151 148 -31
3195 -31 207 60 72 84 -21 60 72 -34 51 32 -32 44 4 -51 33 -31 -35 52 -109 -79 -152 -63 77 104 -79 -117 117
3222 117 -192 122 -91 -16 45 6 69 -53 -52 -54 52 -124 21 -57 -80 80 86 19 -99 -47 -53 46 -168 20 -80 -128
3248 -128 27 -34 0 -39 -87 -138 -27 -168 -61 37 -101 -46 61 -157 -2 -63 -69 -15 -28 23 128 -135 108 83 -19
3273a9Q2m9m7PL1r1J74j79N2J56j82Q8L7j34J30p0n2J44j88n9K22J2l19K09K3
3298b2m4J97k09j8J16o5M3N4n7Q3j73K27k10jK05j77M4J48r1j56J55j69J06J43
3322A29l07L9P7r9J26J56j46pJ11n8M5l9j13j7N5J56j36o5r1J36P3o7P0mj96J64
3348hq5K25j16p2L33l46J45o9o7P6Jo5O8N4j29R4P3n0j03J98q2j26j7J89j13m9
3374d1J45j88Q4J20p2k86L19k42R4J25j77J75J00j75J32k53J56j1Q2o7O1J7l01
3397b03K01%O3j15Q9Kq1J9j8j8O9k5l9O9J5q0J45j12R3l0m3j05J34p8k2J64j67
3424g3P3k2K5M7o0o2P8M1p3J21k14J58M1k14M4N2r0J33J70j38m6M9j07J51r1j
3450hn4J18p2R3j28J15j23j67J98N4kJ1q3j02K43j75L2k6O4R8j1k39R0j00K04
$$ plain form
3273 -19 63 14 -33 -26 5 -86 88 -91 -39 117 -65 23 60 -74 56 -14 -66 78 -110 -169 53 65 -254 -45 -22
3298 -22 -66 131 -78 -96 20 -45 -2 52 -5 78 -95 132 -78 -79 126 -51 -7 141 50 -106 49 -120 -14 129
3322 129 -178 -139 -62 -161 -35 121 -25 -32 79 21 66 27 -86 -103 -48 108 -28 -93 -184 -48 25 -42 28 24 -172 -8
3348 -8 -93 132 16 -56 277 -69 76 7 -60 16 17 -48 20 74 -55 39 112 62 -41 157 75 -51 -68 121 8 -41
3374 -41 104 -84 0 120 48 -238 81 -161 -67 58 -119 56 156 -19 113 -140 16 5 87 20 81 98 -203
3397 -203 -2 -2 61 -54 35 37 -44 -25 -43 -61 8 -17 -56 13 28 -52 93 -19 74 44 1 -104 30 -48 -70 94 -73
3424 -73 0 -22 3 50 -10 -72 6 47 -26 95 -119 39 80 -134 -90 -38 -128 5 175 37 -9 40 -67 84 -7 -8
3450 -8 -62 56 -16 77 -51 64 -59 -226 -28 26 24 35 -48 -150 93 -82 -50 -76 -12 86 75 -164 -74 -174 30
3475C0k8j52K20M4k11J59j04P4P5j74Q7J02m3j35l1Q7M6l7j06J25P6r6Q0P2m6
3500A14j57L1O6Q6j33j1J32j47j7j13J18J64l4j98K46j04r1J18oQ7J16k32m8J35
3524A22k00K5j01J61k8j23M2J08j62M6J06o9p4K39j54Q9j26MQ9l1M3k6N6n7K03
3549A82k36M8q7Q6O7L9r8L6Om4p3Q0l2K6P4m0p2q3L45k25P5O5j42o6J26j05J84
3576A36j12m9KQ7j74P8R5j06K7j18L3J74p6l1J88m5j37J08n6k2J5LL1p9n9J39
3602E2p8r6J30q4j0L1L4P9j13n0K82j57j99J98l0l8J31j33K6J22j00M4J2Rk75
3627b13J04J59j29M1m7J17j30M0J17q3Q1k2j05J30n4J16j51j18J38J20j63N0P2
3650G0j24m1J34r1N9j11J74l5j35J96j19J72j67K2k3jr0N9J22j47J68M0k53J62
$$ plain form
3475 30 2 -150 70 114 -97 62 -42 32 107 -67 20 122 79 -56 -87 0 46 9 -97 28 104 8 88 160 114
3500 114 -43 -12 54 140 7 -4 128 -19 -36 -149 -31 133 99 -99 147 43 -48 70 64 151 267 35 -13 122
3524 122 -78 -53 -154 7 -21 -144 -102 6 -156 -110 -4 -73 -147 92 -62 27 -99 -95 -6 -37 6 -20 36 -21 182
3549 182 -54 -6 -93 -7 60 99 1 37 43 -1 -74 6 -26 0 74 34 -38 -121 224 -1 74 139 -3 -69 57 -48 136
3576 136 24 -25 -23 64 -110 -32 63 -43 -16 -134 -101 73 -3 -34 154 109 -28 80 24 2 17 20 51 -28 -87 52
3602 52 -26 -122 8 -76 -86 -55 -21 58 -55 -105 177 20 -179 19 -11 -49 82 -51 -25 97 -3 41 53 62 -213
3627 -213 -109 50 -79 -38 -85 32 -98 -58 59 -24 57 35 -70 60 6 122 -29 -147 -9 111 -52 -2 70
3650 70 -54 -95 39 -52 7 -104 70 35 -100 96 -23 149 -18 4 -19 -20 -110 -51 71 -76 92 132 -121 41
3674D1n1R6j94K03j45J05k11N9K07k05Q0L5K2n3No2J00j3O4j07m9L6m8J80r6n2
3700e3l6m5J69M3n3L2j35O7m3k4o1J76q5O6m8M4L5n7J10q6J67j92J90j93K9j3
3726Do9j9Q3J86k69P9lpk8J35o6r7J96j85K7p9J18J12k16J02m9J27j9q1O7j72
3752a23J03l6K2J3J40j8l1R1j79Q7j05R9k2r4Q3K9r6M9j99J78j65J13J39l9m3
3777dJ09p2P9j25rN7l1%j53K36n4K3j8j09J09K9r1M0j3j62J96Mo6R9l4R3r4j05
3805f6R0P5K9p3l8p9N1n1O2p7J19lK0k06K54Lk15K93k26R4l%l6J16j18O1n5n6
3833c5J01j96K55j35Jq9J06j38Q7J44j35J5k0O6mO5Lj05j09J60M8m0L4j16q9L6
3859i0P0l2M0k18L32j26R3oq7o6Q1J7j18J28j90J66Q0j7k8p2J24K5J3j09o3Q5
$$ plain form
3674 41 -10 86 -108 95 -50 55 -156 -97 110 -95 -15 20 42 -11 -6 -68 32 19 83 -24 -73 -37 -85 95 -1 -53
3700 -53 -89 -134 35 78 25 57 -78 -11 -54 -78 -139 37 -48 18 -30 14 49 -8 102 16 183 -9 181 -12 17 4
3726 4 -65 -84 -1 185 -84 -5 -8 -15 -43 92 26 -71 125 -60 -33 -112 6 118 -98 4 -45 82 63 -18 49 -123
3752 -123 -20 -56 -34 -21 119 101 70 161 -18 69 -36 63 41 -53 30 59 -37 12 -187 -9 -174 -61 78 39 -4
3777 -4 105 33 112 -13 -22 35 4 4 -149 87 33 56 38 -71 38 67 -24 16 3 -159 37 41 -25 74 40 133 39 -66
3805 -66 24 99 128 55 17 -62 -11 -62 0 -77 42 39 59 -147 107 110 -105 188 -38 56 53 53 17 133 15 76 21 -35
3833 -35 66 -130 125 -10 -9 -98 8 -130 -43 101 -34 -19 -39 27 23 88 91 -14 -123 37 85 45 79 -37 -126 -90
3859 -90 -20 -52 -12 -230 102 -24 69 63 -24 -90 -9 8 -110 18 -172 -6 74 57 29 -43 81 106 119 10 -53 32
3885C2J0NL6r6L9lq8K03j52P1K3j81K26q3j84j8J89J8L3q8k2M8m7n8J39M1j81
3912h8J32j24N1l8Q9Q3m3j55l0J22r5J25K6P4j26k35K84j77O2M7M8j00J03k01
3936a66R0J69j28J21j06l1Q6n5K19k20o4J99ln3l2p6J32J9j78Q5L4r8J16M2L9
3961A41k64K70n9J4r8r9O1J9N7rP2q2J06r8r9J26p3R9p3k4J9K9QK0o6N9M8p2o2
3990c0J44p4L2l7m8l2P2K8n8p5N7L2J41j28O7Oj45K3K9j1k7Lp7J35k4P6k30J15
4018c6k6R6m0o4M6j3R4kK4R3k18M4J33j03P9q3O0q2n3P3K2o2O3j18J03Om8K8J56
4047A72j71K8r2j21K44m0j59L2J51p9L0o8Q9M0QP2j47k1J5l4j9K55j48K2J8M3
4073A20k24J45j68J64k6M0n7N8m5K4K9j38R2j6J6M1l8p5l1J22K4q1K5L3Pj12J85
$$ plain form
3885 32 42 47 83 -13 26 23 -65 138 -14 57 80 -101 125 42 -142 -160 29 47 80 -8 -30 18 -29 -87 52 93 -88
3912 -88 44 -80 -29 -67 22 105 62 -93 -123 -1 -96 29 55 129 3 -232 52 -125 -63 -16 32 -68 35 -166
3936 -166 -76 93 -35 86 -20 -51 35 -20 199 -21 -85 114 111 58 26 -50 82 101 -77 8 42 -56 60 102 141
3961 141 -123 147 88 102 4 -95 -34 -15 42 33 105 23 129 31 -68 58 -15 84 11 -13 6 35 43 63 -3 56 104 32 -30
3990 -30 114 40 72 35 -13 -45 27 55 -3 -78 -21 11 152 24 91 97 -48 -25 4 -7 -34 -31 -108 27 3 79 -151 -36
4018 -36 -62 34 -6 -70 -24 -37 57 55 79 172 -46 -2 131 28 107 24 84 2 -51 22 44 -18 45 -73 30 36 -12 16 172
4047 172 1 29 -63 -184 60 20 -139 -107 44 -35 -5 -73 16 56 64 136 -11 -32 -17 -51 -70 185 37 59 77 120
4073 120 -104 41 -127 37 11 51 -6 52 7 31 60 -78 14 -2 14 55 17 -58 -89 33 57 -24 1 34 41 -71 114
4100A14l7j01Q3q2L8P1k5j5p7O4p2P1q9OK44k53J1L6J34p5j05P0N7j00N9J26j89
4127c6J75j81L3R4j02j7O1K9q3J56k19J21L0j02J11p1j14n8N0J89Rr2J09J8j06
4152DP3j4j03Q0q4J4R7j17P9q2n1N0jj09J17P2o2LL1N7J6Jp6M4n2JL5n5J01j0
4182E9l6J58j39Ll3q9P3M0P0j17j7nO5J3m4K61l09J2J90k85J28p5N9P3k0p0O0
4209B5p1R1j04N6k9N8j34J51Jk9o3J38j99M2k1N8R4j39J09mk0j81J39J2O7k0j42
4236a15J96q3m6P5j12Q8j28LL05k79L2J5J33j40R9j59L4K01n0j15J04k04N3J64
4260G1m3L3M2k7j10J23r8J68j72K34j36r6PP2j13J47l9k7j13O9P3l4j2O2p6q2
4286g7J91p2k06M6nJ37m0Q4Lk8j8m7r9Q3L9M9j20N7P6n1O1%Kn8Q%L4j69J58l6
$$ plain form
4100 114 77 -24 59 -23 15 86 61 46 -31 33 -39 32 -57 -51 193 -60 -49 -13 121 46 -59 11 68 -32 27 153 -36
4127 -36 139 -42 -9 85 -17 -34 27 56 -27 129 -90 31 61 -41 70 -1 -115 -173 -123 66 75 -17 92 110 4
4152 4 77 63 -40 40 -44 -30 67 -50 29 -53 -104 -54 -55 -164 -47 25 -37 -34 -3 54 70 71 -5 39 -13 -12 23 -32 69 59
4182 59 23 181 42 45 12 -77 -4 36 106 -11 -28 -33 32 45 1 262 -47 -35 155 -130 -2 -77 -18 55 35 -35 25
4209 25 -46 45 -59 -3 -32 26 -108 43 44 15 -48 90 -109 -67 -88 -30 64 -75 34 30 10 -171 -32 -20 47 27 -115
4236 -115 81 -2 -48 27 -85 3 -125 -122 183 -96 -64 -49 84 -56 43 -116 -82 119 69 -46 58 -146 -93 71
4260 71 28 61 103 76 -34 89 -9 159 -13 221 85 -11 -4 68 -45 102 63 36 -77 -8 65 31 19 81 5 -77
4286 -77 114 42 -164 -118 -123 14 -26 58 61 33 15 -32 -131 -48 -9 40 -80 -23 53 2 63 63 65 7 15 15 49 -120 38 2
4316BLJ01M0k77J63N7Mj60jP6M3Lj72K05j43L7J28r2k4KqP9j56L0R0m8J3J72j11
4345E6M3j00J39l8j16N4p7J04Jk2m5J34k5j39Q1J7l7R7k4k68K21p4qP7N3r0O9
4372H3q3J70k66L4R8n9r5J63j48J54Rj09LKO3o2r1J81j01J91n9j03J14o4j27L3
4398f9N5k6N7j07L0Qro1J06K7k0l1J0j43J60P0q5J9J2j81L40r8j28L9M7J55j77
4425@J44j52Qo3J07n4j8O0p1R4m5j19R3Q9j25L3N3m4J08q2l0J06k13J41O8l3o
4452D9k0L1K3l6j18N1j69J16K4j9J5R5L5j3M2q7L0j84K06m3J7lj23J45q5J65m7
4479I7k13J53k2R9lO6j17pj04J25p1n2N8r7O6J8j19P7J08M3n6o3O8L0m2L1n4j27
4507a08J44P5j12m9P5o1NJ14p3j36K52N9k67J90j03m3J25p7N4j59J12K10l68J42
$$ plain form
4316 2 5 106 146 -131 32 89 93 -67 -68 8 51 54 -118 87 -56 -19 109 17 -7 -5 -13 66 -90 -60 30 -18 -5 167 56
4345 56 99 -1 138 100 -16 38 -39 65 66 44 -1 133 108 -31 50 67 30 127 103 -165 56 -18 -26 51 104 14 83
4372 83 0 170 -96 -62 36 -23 -118 45 -103 51 60 -49 -46 -44 19 -43 -134 47 -54 137 78 -25 89 25 -102 -69
4398 -69 -14 -40 17 -90 -60 -52 -61 -122 -16 11 -9 -40 -30 -173 -13 57 -28 -9 3 -178 162 64 -64 -25 22 177 0
4425 0 144 -8 0 -63 44 -10 -28 32 -39 55 10 -109 -16 73 -52 -19 34 -10 98 16 -14 92 -121 20 88 55 49
4452 49 29 60 83 47 -71 -20 -189 -73 -49 -68 -53 42 77 64 106 19 49 -135 71 28 45 42 -81 64 -21 144 97
4479 97 -116 37 15 114 111 177 60 53 -51 74 3 -49 9 -88 -22 -4 -123 -46 62 105 49 -14 54 84 42 73 19 -108
4507 -108 36 111 -1 -50 25 -36 -31 83 10 -126 126 185 -82 108 5 -38 87 10 64 -95 17 227 -141 1
4531AJp9lj4J75k7j08k0J89j90p4J23L3q8J40j6J40j46n0N2p5O6k8M6L8j95pQ5
4559c1J14r9K7l8Q8l1l8m7P4LK9q8n9J6J75L4r3m6N8j2j01J23J5j63J31M6j55
4586f8K13j11q5R0j17M6n6R8j4P1j39j4l7J96l7r2O8j9j25K78j31o2O0q2L1k3
4612f1o6J10Q2o5J7J01o9j12r5J04P6kR8l1r9J8P4kl0P2j35N5j0j14Q1M8m6L5
4640C4n5KP4p6r5K28n6jJ7j32J91r9J6m4J17k37J14M2o1n8J70Jj06k5J14n7l6
4667a8J89k51J79j75N5J51j15p5J21o6M4p9j13J59J17j29o7N4r1P6n5J42j18J06
4691D1o5J08N2p4k8q6K8j4P3Oo9P8K7J46k38lJ3Ol5O6J4L6j44R7j18J33J2K4n9
4720B7J4q8N4K4j62Q6J62j72L2J7q8K34r0j26pJ40j05l2Q9j13Q3O6m8j7J40j91
$$ plain form
4531 1 2 -77 -80 -94 81 54 -54 -74 115 -75 -149 -26 7 -81 59 43 183 37 -13 39 -36 30 2 48 86 -109 -116 -31
4559 -31 83 -16 11 -27 61 30 -8 -55 19 22 51 -37 -96 -80 95 129 36 -10 48 36 -65 58 73 -90 41 87 -68
4586 -68 145 34 -51 39 -78 -32 -88 10 -4 67 -72 -86 -123 73 36 -56 12 -7 -132 146 15 -47 13 -69 -38 -61
4612 -61 -127 -17 65 0 17 118 49 -63 -158 -54 22 20 118 87 -12 6 80 78 48 120 -15 40 30 -84 -3 45 -1 34
4640 34 -21 -19 55 -21 -116 112 56 55 72 -60 131 32 48 4 121 -116 -2 40 -21 -79 91 92 -14 -39 75 18 -18
4667 -18 171 -80 99 -76 -21 130 15 -60 61 -5 39 -40 -153 6 123 -6 -73 -19 -110 -34 -89 53 -65 41
4691 41 -24 84 136 62 34 -52 -24 -38 35 41 -28 50 77 223 -15 -18 -5 1 -34 32 46 82 -62 35 -83 50 62 86 27
4720 27 41 -47 7 31 -131 -45 117 -55 -23 -6 -94 140 50 -76 -83 57 -48 -80 9 -104 -21 45 -3 -20 120 -71
4746g1Q3k1J0J09j81o4Q8O1p6P1Q1n5q5J49j87k2R1k2o7J62n6L1r6LN2N6m9n0
4774e5L3j22K14n2qJ05k21M6J60o7j00N1L4o9Q6q3J38j08N4K3M6j92J46j22K49
4799A86p1j11k4J03j00J6J15j29J23j01LL4O1r3J00k0j4O8j64L7m5N0L05k71J4
4824G2Lk30J61M1j04R9%K3Kj45P0o9J49j62J42p3J24j22J2J57j85K1L2j55J14
4849b3J57p2r2J6j19J80P5k87J85o8pJ49j31K5l5O7Kp0O9J02J2j33K7q6R5n5q4
4876a01J69%Lj37J23J46j80Oj0Q0j55m0J20j5J3R5l4N8o7j19M3N8m2j06J21j48
4902a19J28N5j62R0J12j66R1k4N7j08p0K47o0k35J88j53K11j30OK3P2j23Q1np4
4927f8RM1k6R1N1n7nj49o4J57K6rQM1qN8j48J07j30L9P2n3lj3N0j57Q3M8q4J19
$$ plain form
4746 -71 12 -9 1 110 -71 -135 -47 14 -62 9 90 35 -50 99 -88 -110 -19 -41 -108 54 -2 29 -67 -64 -12 44 -5 -55
4774 -55 -22 -144 70 18 10 115 -106 -60 100 33 -67 -16 18 -51 35 -48 90 -18 36 59 105 -87 59 -63 186
4799 186 115 4 -20 83 -17 -1 114 -15 108 7 10 44 105 12 112 92 78 146 -18 19 -26 24 329 58 72
4824 72 75 -155 6 47 -57 42 42 65 67 -78 -8 -77 72 -90 52 -21 103 -19 -7 150 -35 -14 18 -137 -23
4849 -23 134 62 -30 -14 -133 47 122 -165 20 -48 -55 94 -37 -12 -47 20 22 -48 21 123 135 2 29 -57 38 -17 -101
4876 -101 68 68 71 -66 57 203 23 29 19 99 -56 -96 24 9 22 117 83 141 74 -45 -2 56 14 -92 29 -119
4902 -119 9 64 -98 -8 104 -62 29 5 62 -46 -116 131 71 -164 24 -129 82 -48 -42 -19 53 -70 11 6 -68
4927 -68 -59 -18 -44 47 98 41 36 -113 -177 -20 6 -3 5 46 38 96 -52 55 -75 -36 36 -17 -20 -33 17 -140 -57 -9 -93 26
4957B6L2R5r0j22P7n8P7o5o3J98k29J51p7J60j50L6l5p5P9L0L1r5J37j18K35j24
4983F3O8m7k16J7K00K1q2m4k3q2J04Q4m6q3K21j56J59p6j10O6r2l1K12j14QQ9
5009A10j83m9J72K8q7Q9j55J23j09J16j06N8j48Q5k7J43J49k3j99l1r0J08l7l0
5033i3J84K5o0k4m6J10M5j38K4L8j00J2J24k69K25j06P2n5k0J21KrK3O0l87J85
5059e7J9M6m2k8L6J12n2j56J24M4k1J02j84M7N2q5P4l6J5nQ9j40J03j85J47J73
5085A92j89J43j90M6O3l7j02P9p2J43j51R9J22j69J1q9j9J54j95K70l9l0n7j2
5109b9M6n1L8Q8r1L0N4n7J3q8n3J34j24L2q8R3J18j5r6J30r2p4L4M6M0j93J91
5136C6m2L6q9P5j2j22M3O3m2J59j41L7p0N9R7n5k0P7q0o2O2N2p1N2k1j5R4kj41
$$ plain form
4957 26 58 153 63 -59 18 -40 37 -28 -91 107 -122 29 -48 112 -38 -2 -37 -112 -33 -3 28 -67 70 -48 187 63
4983 63 131 84 -132 -115 85 106 24 -20 -43 -125 -21 63 17 -66 155 -1 158 82 -28 38 -54 -85 127 13 21 110
5009 110 -73 -122 50 78 -9 80 -75 48 -61 55 -51 7 -141 -56 -83 60 209 186 -13 -44 -134 -26 -63 -93
5033 -93 91 116 56 32 -14 96 141 3 27 65 -35 -23 101 -168 57 -49 23 -32 -52 69 71 62 85 145 -242 -57
5059 -57 -38 8 -34 -62 -26 86 34 -122 2 46 25 127 -57 -10 42 -43 31 -5 10 5 94 -46 57 -128 19 192
5085 192 3 146 -44 2 65 28 -74 5 -67 76 -75 24 146 -23 -12 -101 -120 34 -161 109 70 40 -17 -29
5109 -29 17 -34 4 92 1 31 85 28 41 -47 -100 34 -90 -58 -146 -53 65 50 -46 84 -8 -82 -48 -2 38 -155 36
5136 36 -6 30 -59 16 4 -118 -75 -12 -54 105 -36 1 -69 -10 87 32 12 89 9 -53 9 61 -10 42 21 6 100 98 -43
5165d3kN1q5J51p6m5L1NM1l3j12l6K87n2q4m4Q9P6j58K9l2L6N3q3j73J87O4J6
5193E8J5p0k4P5J01K8j19n5Nq5J23k2L8r3n6qJ43r1l8J21n0o5qR1j58J97n9k7
5221c3J6j08J91K7j24O3m6P4n0P1mM2o2RL9r0N3r4M0R6j59r5P3J66r0Q2n6m2r0
5250a01J74L0k6q3J04j47J09o0L7n4m4Q3P2p2j33Q9P5n1l4n1Q8M6J4m5k7R5j13
5277b5m3J22p9J62k32M4J0K3J00P8k05J31r3%P3l3n1J0kp8K51j64J46k94K32M9
5303A32j62K1J89j14n8l7Mp3J20Q5j55j7K2m8K49j67m4J05o8l8r9K39m8pn7j6
5329d2R2n8j53K72j12Q9k25Q6P4J5j6j37J76j94J45k6m6M8p2KO2m0Q3K2jJ0j4
5356D0n2O2K8k15K49n2q0l3J33L0k31J63n0nM4j47R9J46p3N8k01l2L1J33L0j26
$$ plain form
5165 -43 -45 6 -79 72 -4 -49 -18 -13 28 -5 -117 -153 134 82 -2 -46 43 119 -39 -10 -42 -6 47 -36 -209 -22 42 58
5193 58 73 3 -21 54 155 183 64 9 14 -71 52 30 68 -25 -81 -89 54 -37 -75 46 -4 -69 -77 14 -144 53 -6 -33
5221 -33 -17 -125 66 93 -31 32 -14 60 10 81 77 119 57 66 105 15 68 -26 14 110 -49 -144 -71 95 5 87 31 -11 -101
5250 -101 73 103 77 -6 98 -49 60 0 37 -17 -61 22 94 22 -111 -22 53 2 -32 -83 5 51 65 20 -7 88 -25
5277 -25 -68 54 -25 137 -95 -51 -41 -18 82 160 -45 86 -7 -7 66 33 -18 -8 -10 -88 163 -1 145 -149 83 132
5303 132 -30 -9 180 66 8 -29 -25 -98 22 107 -48 -65 -43 -91 158 -9 -53 52 -16 -54 -153 86 38 31 -26 -42
5329 -42 50 -8 -161 111 -1 88 -137 -51 23 38 22 -115 61 -133 12 -14 -60 -12 -84 -82 -20 -60 23 45 44 54 40
5356 40 -12 50 78 -137 112 60 -20 -53 80 110 -121 42 -8 -13 31 -116 -17 129 56 114 -87 -119 -88 45 75 -51
5382e1l5Q0j45Q4K44j43j17J89j07j20J48oq6J20j07nR7l4j7J35j65ll0J19k3
5407B2l6L1M6rP9k02L4j0J3J03J6p7K6j51P0mL5k8P7j47Q5N9p8K7kl9R0k0P7k6
5437F1m9n1O7j0L0n6m3M1O5M3m6J3j49j0P7p0J36l8pR0m7K2l1J62j66Oj06J01
5465C5r6J55q1O5j06J15o9Q1k5j0q2kj72K50r2K34j48m5N5K5o9jj5r1nN9N5n1
5493c1k3k4J60j10O3%o8K19k33O9m0l1K7P1O0o6no1J5n6l4P6RNk2J26p2p3Q1p5
5523d3m7J01m3L5O1L5j40N1K0J9k62K77O0r5M7r6j6n2J86q6R9j72J04p3p4R4p
5550a7J06j81J55j45RJ54r1R6p4k6j6J43j0l2q2k1O7N5o9j94J81%j6l1P4o0O7
5577D2j2n8n3J93k46J72k6j4O2j06N9j01J69L4pj31R8p2k5L1l7M2j4J5rK9l5K3
$$ plain form
5382 -51 -86 -6 -151 -67 177 34 -83 106 -1 -121 27 21 -65 55 -52 -57 40 6 -11 124 -41 -44 -74 45 22
5407 22 -14 17 63 54 133 -69 -35 -45 -32 71 87 10 36 -115 -45 -49 -14 -42 35 -112 -27 32 -46 -19 -21 -60 30 10 87 61
5437 61 12 -39 28 18 48 -8 -51 -10 55 98 52 65 -84 -94 -17 -87 49 11 4 94 47 69 38 200 34 40 -66 35
5465 35 -61 94 13 78 -28 87 18 99 74 64 -18 -20 -192 58 -34 200 52 7 62 87 18 17 2 -89 -94 -35 20 -31
5493 -31 -54 -78 82 -28 35 35 -33 186 -47 22 -18 -49 -22 49 109 43 38 -23 -8 -64 -98 -22 -13 -8 -30 96 24 -49 32 -43
5523 -43 -90 11 -32 3 64 99 -41 10 30 49 -213 64 124 29 76 -20 -36 -88 98 12 111 -61 43 -30 -104 -10 -17
5550 -17 89 -92 63 -82 -73 81 -10 86 12 -14 -30 113 103 71 -11 -32 35 90 21 -173 8 8 -8 -39 35 -25 42
5577 42 30 -28 -81 112 -134 38 12 -2 60 -46 13 -88 81 115 108 -23 75 3 -22 9 -28 14 0 15 6 35 0 23
5605B3j24J74j14J7j7k0J31j34Q9r4L5q8P8R0n2l6K37k03N3J1j44n8J44L7o4M9
5631B0K4L1Oj81J72j31p8K07n6j3Q5m8j73O3P0j14l4K33j34R5j07P2Ln4R9j67
5657a10M0O8m4jl2J50j0q5R6l3m3M8p1K9r7J90q9Kqj6N6lj80J56l9k7R6m2M5r3
5687d7Q7l0lK9j8n5N9j1m5n3J4Q3L4n7%J2r8n8K77j49P6m8l7m5J45q3Q4o2O0J5
5717G6j86J72q2J23q3P1p1J37r5j09J9J17j43J28r0q8K7j17J74j3l3K0N9p4oJ33
5743F6j59N7J41mj30J24k35K1J35P9m9j22J41q7P9k1q3LO5P1j90J1q2J58j6J42
5769A15k4r7L8n3K5K8J2l4j0L8j04mJ99p0K2j5q2%Q0n7n7N5J24j31L0R9j04M6
5797F9r0l4P6P2p2n6n3k9K0P2J15j54M0K3K0J3r6J11K0j01O3j60Q9J2J4r2J27
$$ plain form
5605 23 -101 73 -41 -24 -41 -61 70 -64 25 -69 -34 -122 -44 46 -6 -42 195 -8 45 56 -88 -146 -2 35 -29 20
5631 20 44 75 81 -100 72 -59 -137 70 14 1 86 38 -135 -72 -2 -116 -150 83 -51 44 -63 9 12 -42 57 -110
5657 -110 -70 -2 -46 -47 -79 71 61 -24 72 39 -4 44 -27 2 -95 95 6 8 0 -16 40 37 -143 13 -26 -53 43 1 46 -47
5687 -47 40 10 7 36 18 -37 22 11 -34 -87 -73 10 44 -13 -13 -1 -99 -157 120 -29 47 -1 -38 -83 62 -21 63 1 61 76
5717 76 -110 62 -20 103 20 91 20 157 62 -47 -28 89 -54 74 -16 -104 -77 -194 -20 -33 -66 -46 13 -61 -67 66
5743 66 -93 -36 105 101 -29 95 -140 -119 16 95 46 -76 65 -22 57 36 -47 -44 21 92 -98 -87 -169 -11 -27 115
5769 115 91 -6 32 -21 4 32 44 10 0 38 -66 -70 129 59 81 66 -16 -16 64 7 -50 5 129 -2 28 127 23 69
5797 69 -21 -55 21 93 21 -35 -88 -117 -97 -25 90 -64 -24 -1 19 32 -64 47 67 -34 29 -131 -42 -30 -16 -108 19
5824A9N0n9k5n0J5K2j8P0p2P4k1j23J21o7J76j65P0P5j91K1M9K4m3L3Q5j7JR3
5852A47j66J29l4o6R3k0n3n4R6N6m9j77J71m6K0j21J23o7o3M1Q4q0R7M1j28L7
5878A1p3m0N0RL0m7J30q4K3k9k0Q0oJ0r6J23p6o2J83j30R9p3o9J49j06K5j39P7
5906e1j34J26Lj8P9m6R5K2j7q0J7j05J46o6L1J4j60K44k5j34J36r2j47J95J34
5931A67j95J56j09j9j28J06%M1o0J68j16JQ6r2jJ10j58M4J1M0j28J0J29p2q0L3
5957e6R2J1M9rj5l5p6K0J65n4m3j7l7P1o7o5M0O1j48J31M3j11p2M6j8R6p7J5o4
5986a24K10j44J98j92K4N6j1r3J41l7p9M8r2M2N1J3K9n2L6R7j49p8K0J24l4j4
6012a0j0lo2P0J23j14M8m3m2J9J16rR7k03K6L8p4R7Q8k58J72oj55L4K39k40L3
$$ plain form
5824 19 69 10 -15 -65 -50 -28 -46 24 -48 26 5 -118 3 -64 112 -53 17 92 -99 -78 -29 -5 -48 -15 70 53 54 147
5852 147 -19 110 76 10 103 83 30 -24 72 128 79 -98 73 27 47 -74 49 -18 -81 -40 44 -36 61 102 -26 11
5878 11 -62 -102 -52 -43 -13 -60 70 -14 9 -20 -40 40 34 44 -52 71 -5 -67 116 -14 85 12 -57 92 -14 11 -128 -51
5906 -51 -185 -59 -56 -74 5 -41 54 76 59 -21 -4 -109 37 -29 2 16 -144 100 75 -59 77 -15 -162 33 167
5931 167 -28 128 19 0 -128 -22 -22 19 -41 127 11 12 98 6 5 115 -43 1 12 52 -76 -66 63 -9 -89 -56
5957 -56 36 47 96 87 72 37 -39 -19 146 92 49 32 -5 66 -1 -66 -26 35 -113 18 61 -50 -122 -76 -94 2 -75 -60 -124
5986 -124 86 -58 140 -52 -28 28 17 -76 65 28 -51 -3 -95 -53 -2 11 40 -12 24 121 -28 -106 -86 38 4 -10
6012 -10 -20 -23 -85 -15 108 -6 42 -1 -43 -24 92 83 180 -23 3 41 -33 64 152 -106 66 60 -95 -61 178 -62 -29
6039b9j8J74o5j2p7N9n4M4J5q1N9J32%j81M3N1N2j13K9p4o5J62m2J5J1j2j68J69
6067B4j5j18J24Rm3P4N1op3m0K7N8l8j3j80J63L9p8J45j16k2J5P8M4j93p0J78
6094B4r1l9P3J21l8j4j10rM3J03Qj07J5j1j50J14J25q3J9R2r3j14J76O2j14O7
6120F9j17l2J09N5j92J36Q0j37j8L2j22L0J43r1QJ31j31J40p2m8k7K17k40M4P1
6145C8J7j10Q7j24J49R2k36K02n8J0j05m7k1J37q6O1K5L9j85O9L8r8J02R9l8j68
6171a11K01m8q8Q9k3p2J07l0m9L8Q1o3O8j71J11O3J5ol35K19O7p3K7n6j3J6K10
6198A74k28O4j42K12J5p3p5Lr5R8N2Q7k0oK8j39kn0J74o9M4p5Q1j06qJ32m5j11
6226h0J00O1l01K16p0m8K03L3k1o2k5N4q1J56j07p6P6j8k7j1Q5k8mM0j23m0J26
$$ plain form
6039 -29 -47 127 62 50 -27 32 -22 22 37 -44 15 147 147 -34 9 60 112 -1 28 -46 -111 51 9 24 35 23 -145 24
6067 24 9 -109 15 24 -19 55 106 100 27 -13 14 72 34 21 -159 4 43 -35 110 -6 -28 -13 65 109 -84 -154 24
6094 24 -67 -106 -33 88 50 36 -74 -83 -40 63 71 -36 -21 -32 -182 -68 57 -26 -7 85 -8 -122 54 116 2 69
6120 69 -48 -80 29 84 -108 28 108 -29 -47 -15 -137 -107 36 -55 -47 84 -47 93 21 -27 -54 163 -77 -33 38
6145 38 55 -55 32 -92 57 149 -87 115 57 67 -38 -85 -106 31 -55 6 31 70 -115 -46 -8 -106 -4 95 57 -111
6171 -111 90 42 -46 43 20 -52 55 25 -24 14 95 32 100 -71 40 103 118 112 -223 -4 63 -10 17 -39 -52 -36 174
6198 174 -54 10 -132 80 95 22 -53 -50 -145 -47 5 92 72 66 94 -45 -47 -97 77 8 52 -23 58 -48 -56 76 31 -80
6226 -80 20 81 -220 -4 -74 -122 81 114 93 31 6 60 -21 135 28 -48 28 10 -17 -28 57 29 25 65 -58 -98 28
6253B8L9j63J22j31J59j35J07j2P3kk90J44K6L2P2k0k4K7o7Q9k9J07k70L4J04
6278B0k9O6j54J19l8n5J01N4Jm4J23j41j87J22O5J5%Q7k08j5N7P6J06j67J38Q
6304A20j90J05O3j14J0k8L4J46K5j42p9R5n3j06J87j38n4J08q1J32j7L3m8q0l0
6329a02N3%K9N3j6p3L2J41j09J8k8m7%L6J72j89j08J22%J4M0j27J62j35m3J63
6355E8M1j46P0K1r5K33k35K27k56J89j91J29j10K2j05J41J22p0m6J17r8n0L6r0
6379h6R7m4J7m3N3m5N6O6n9pl6l2J83j46P5N7r1P4o5j08O5K8K1k0m7P0n7n0K37
6408A63m5j62J21n3o7J13j36J21q2P6j58J97p3j13K8R4n8J5r7J53qM7j41rk3J09
6434A2J0R3j97M5N7n1j53K37j23o4M8j1J22r6n7J26Q3j00K9l5J03j27m6J36J4
$$ plain form
6253 28 67 -96 26 -105 54 -81 26 14 87 85 -205 -61 -35 -3 69 49 25 52 -15 74 45 152 -118 -84 20
6278 20 -9 57 -97 22 -16 -71 30 84 85 41 164 23 -164 -42 23 38 38 125 -83 -98 -41 35 141 -26 112 120
6304 120 -70 35 98 -16 -6 -34 0 146 171 29 -50 45 -8 -114 73 -65 -119 -11 -92 40 23 56 8 -72 -102
6329 -102 -49 -49 -20 33 17 -56 -24 117 8 26 -2 -49 -49 -13 159 -30 -138 -16 -16 -2 38 -89 73 -62 -105 58
6355 58 99 -47 23 44 -51 182 -53 174 -82 107 -84 45 -65 -43 -148 -7 115 45 -1 116 18 -32 4 -86
6379 -86 11 -33 -16 -59 -6 -51 5 71 12 5 -31 -63 120 -26 49 106 15 89 24 -84 -19 9 30 10 -37 33 -24 -74 163
6408 163 118 -44 77 24 -43 70 -66 55 -27 49 -109 88 15 -98 -70 24 -34 -19 -116 37 29 76 -65 -74 -97 12
6434 12 22 115 -82 -37 20 -31 -184 53 -70 -134 -86 -97 25 -71 -128 -2 81 -19 10 -25 78 -49 -95 41 55
6459E5j92Q8J29l1j08N4o0ML7k0o1R2Q1q2N0J1j12jk5J17l6n3J0R4m1J8j37L5
6487h4j2K3M1mJ53j23L1k5J91j84j0L2j39l0J88j45J86j13O4kk4R3k9j07L2J1
6513A4m8O8j2l2J56k05Q2l1Rpp0M4O5n1M7o4K0m6K0J31j03jl8M3n4M7J28l9j27
6542e4N5J8l6R1j3L4j83K01j31K2m8Q0j76K0Q8N9q8J01k0J7l1K0M6j83J60M5j59
6569f5jj6J29j62O4k4N6qo8N4L5q0P8n7m4J45j40PK04j28k4k5Q0J90j86j0m7J17
6597G4M2r4j7J14k40J66k0j09J6JJ48l9o2Lk4j5J93j52j29Q6J53j08L9l8q4N1
6623d5P7n4O8J25j31M5j73K8m6K15n3K0j32M1j12O5J08q7LJ8jK1J05q5m1J14l4
6650E9j08J43ok46J90O4j52J72l8q9o0R8p7p7J63l3M3j47J82k9n2l3K3P8L8j34
$$ plain form
6459 55 -137 -49 80 49 -59 -5 -65 -61 -24 -44 -105 -13 68 -14 36 47 -65 -66 -91 26 -10 -63 -53 41 0 18 -119 -84
6487 -84 -96 -73 -32 -36 117 -6 25 0 191 7 -3 29 -110 -140 48 -97 89 -24 40 38 14 107 78 -29 3 14
6513 14 -34 34 22 -10 146 -59 23 -8 1 -6 -76 -32 33 -18 29 -35 -15 -61 -41 90 -13 -14 -52 -9 -63 -16 112 73 -54
6542 -54 1 19 -17 74 61 95 -88 113 -18 4 -44 36 -140 -120 -32 27 -61 40 20 37 6 26 72 -111 49 94 -65
6569 -65 -66 -82 47 -115 -51 -75 -19 -27 -95 -41 -6 -86 -8 -65 -109 36 -104 -97 107 -21 -45 -70 10 200 14 4 -43 74
6597 74 116 22 5 119 -121 45 25 -84 -68 -67 81 42 -20 -17 -41 -56 137 -15 -144 -58 95 -13 26 -12 -96 -45
6623 -45 32 -22 46 171 40 85 -88 -60 -106 109 56 76 -56 -15 -127 -62 46 -41 -38 -20 -21 0 105 20 -21 93 59
6650 59 -49 94 88 -158 32 96 -56 116 78 -11 -71 27 -50 -127 36 3 46 -101 81 52 0 -33 -10 68 106 -28
6676b8J44n7j00J02o4N2j32J28j9q9r3Q4O7L1Kk28J93o6J7l5J39j63N2k9M0L8
6702a4j11O8mJ63N3k7j71m0L7M4j37Q0N0P0k52J37n9J04mm7O2j8j22L9K49j27
6728B3p4J16l0j38J72o5j11J82k33K18k6k01J43P2m6j3j32K16M1j0j39K27k60
6751f8M2Q5j44J41o8K8j3j8nJ18o7q7M3LR0n1m4P1j13Q6J61j90j00J84L3j08J2
6778B1o5k7M1R8k5J3l3p7M1K07k68J05o2J11j75R4l5L4M8j27N1J60j53j14J3J69
6804D5k1r5J30o2j6o1K5L4K1j33K66j43l0j69O0J24p9P3L7p4J0J04L9j59J05j59
6830a28R3J05r3N3m3N6j34j1O9j1L9pQPO0l4j6kM3j1l7m7k9O1o2L4NL5M7M3j42
6861d9J00o6J15j30R4m3j39nJ30j36J72K7j73q3L28k30J41r1o0K36j72o7J07j07
$$ plain form
6676 -28 116 59 -41 61 -3 49 -83 45 26 -63 -156 -72 -5 26 28 -200 -7 -73 -56 -91 48 -115 -63 -92 -52 -14
6702 -14 -125 -57 -61 102 155 128 -43 -83 -46 -2 -139 -59 -9 61 -191 -54 -113 -9 -13 -60 2 -16 -138 -99 150 23
6728 23 -51 65 35 -103 69 4 -107 75 -158 60 34 -167 -24 48 2 -11 -143 73 114 104 -35 192 -68
6751 -68 -26 59 -85 56 -12 16 3 -15 -20 98 31 -56 -13 -10 80 29 -15 56 -57 29 190 0 -100 84 117 9 21
6778 21 -44 -71 -30 68 43 56 23 -54 -13 194 -74 31 -31 80 -95 -1 -36 -2 46 -81 -30 130 -23 -137 -124 45
6804 45 24 -71 59 -3 -19 -80 -55 -21 0 -133 133 -10 -40 -209 -149 -25 -104 -31 6 -68 -58 46 85 -74 31 -128
6830 -128 -35 70 -23 30 -13 43 -91 -102 -33 -44 -5 -12 -4 3 63 29 13 11 54 43 6 -41 -70 -9 -71 -37 -32 3 50 93 -49
6861 -49 51 -15 100 -30 64 21 -118 -123 7 -129 43 70 -103 -186 142 -88 53 -38 -98 138 -34 -101 6 -101
6885a01J96j39J5K6k1Mp1M9J05K0n1p4j5P7J56j93M8j05M1J23j35N8Qn3J21j1
6911G8j12q9P6K5L8n2N7o3J50k7j40K8J54r5j2k5k28J82J3Nl8R4N9j25J49o0m8
6938fJ1l0R3j93J99o6K4Qr7M9L2p1qj05J95j34M4Q1k2J26j02l1NJ6j79K72j07
6965DM5j1Q2m9j44N1M1J40k25k1J14r2P7o0J50j02Mj4N4n3K9N5M8l2p7n6J2RR4
6994G3j20J92q2K2p6j14K57k31J32n1l8M1j07K00l5j18K01k30J19J6j70J09j1
7017b1kO0j45J68r8oN0j01K72k66N5MJ50q9k2m8J00k0mN5j37Q5q9J10j69J17o6
7044e7O1j36K52j64J00J1N5r4j02K5N7k9J6K9m0Qk8J05j59O4L4l7o5P2o7j4J51
7071D8P6j11J42j84Pm0J17j10J48j45R8j95K02p3N0Q4j87K02k18K2R4j10Q8Qj04
$$ plain form
6885 -101 95 -44 -29 -3 -24 -20 -91 -42 63 83 32 -42 -57 20 176 -17 31 -74 -33 90 -45 13 21 -32 89 78
6911 78 -34 -123 -47 -22 16 -36 21 -42 108 81 -59 -31 123 28 16 -9 -237 -55 -42 -37 -75 19 78 -47 102 42 -6
6938 -6 5 -25 68 -125 74 8 32 40 -57 -8 24 -47 -55 -160 35 -99 -55 26 4 130 28 -3 2 18 -161 111 4
6965 4 49 38 120 71 -73 -22 19 159 -66 -87 27 -65 12 -48 102 0 4 -10 44 -9 20 75 123 91 14 -42 -30 -21 73
6994 73 -47 145 63 85 9 -105 152 -79 53 2 -36 5 -102 98 63 -55 146 -84 35 51 -119 -10 -21
7017 -21 -23 37 -108 60 -38 -44 6 -95 177 -89 -34 -30 120 31 9 -39 61 41 37 92 -45 40 -49 61 -108 9 -57
7044 -57 4 -132 120 -44 56 67 122 28 -74 -49 8 -21 -5 24 -16 -8 -36 69 -90 -26 8 -29 -94 -22 -89 -103 48
7071 48 124 13 155 -29 -22 -62 55 -55 93 -52 46 -149 53 -20 30 114 -73 129 -89 -67 27 -83 5 13 -91
7096i1K44k27M8L6m9p6L1P3R3k05J26q2o2J57K1N8j50j67J17J1J78j06J66j11
7120C3o3J8N8j28J90j63k7M7p1K05k00O0j9j7M2Oj2K8k3L2o3J17j74J02J1l2M2
7147aL9o1J11j8j8l4Ko9J8k4J1O7JP8j48Q6P7j21N9m3J12m5Kj13o8K4K7J37p2
7176A6p3J25K7j09nj12K60k24J73k77L04Qk03M1L2r0jJ98n8j0N1Qq9J00j6k15
7202a39K46j69j7J04O9l5o9lo1m2J09m0J13ojj3k05K48r3J2Q0j97N2M4J33oj04
7229A0k2K2J04n2n8j05P6KL3l3RJ48J4j26o3NJ09J6j80M5K2K7l2N9o6j14K36M1
7257A27o5j30Q0J10j81N7n0N8j06J2L4K4L3q0j8n3J99r6J12j63O6p6K2J04k8M0
7283C2q8O2l0m3J08p8R2k8Q0n6q2P4o0p9J03KM7o6mm9M6l4J0Q2k6J01k8j39J4
$$ plain form
7096 -91 153 -74 -26 10 -39 -115 -84 -11 82 -123 3 -79 -141 16 37 95 -55 -222 -105 -94 84 -22 144 33
7120 33 -30 -12 46 -82 108 -55 -82 -35 -106 99 -101 -41 -60 -77 -35 -29 -41 -13 -36 -4 -67 50 -124 -22 -11 -43 -1
7147 -1 38 -23 88 70 52 18 20 -49 -31 -55 -44 23 24 102 -46 40 117 -4 55 12 124 79 81 -32 -100 -76 -49 88 16
7176 16 -57 68 95 -14 -19 -131 129 -95 78 -199 105 113 -90 -49 -17 -107 -108 90 32 22 73 81 -8 92 76 -139
7202 -139 107 -62 -79 25 94 59 -10 -13 -74 -116 -7 -47 66 60 59 46 -159 89 -4 8 88 -109 -57 -13 120 114 10
7229 10 -12 10 114 62 4 -101 -25 -23 10 -23 -14 134 148 22 -41 -36 73 89 -91 -46 -24 3 -29 30 -36 -150 86 127
7257 127 62 -68 12 122 -59 -2 -52 6 -100 -88 -54 -30 3 -77 -95 -148 51 -45 67 -96 -30 -106 -84 20 -8 32
7283 32 -56 6 -24 -67 41 -37 55 27 107 51 -31 43 -17 -96 7 9 56 -10 -14 -63 -17 -51 -41 41 15 116 88 -51 -37
7312c7R0p8P9m5pJ9j00K8k2M4L7J12p3j74J26J70j21l2J23j03K0j10O1K2m8P8
7338E9j57R3J20o4j13L9J31o0k1n9k4PN5k2k2j8N7q1J08K3k19K00j01J28l1L3
7364F1l0j22R2N4q5J34k84K60K4q3j22P8P9p2L9k15L11j97j3M9M4R7q1N5n9L9
7390E3j37J08r7J03m1O3J55k24P9j27l8K8j35J44J24k12K03k6j8j0J3p7J47k21
7414a43J45qJ42j92R3n6O9j06K7J00j13oJ64j76M3n7olO3j0j4O4n1N7n5k3J64
7441A12j92K8qM3L0n8P7o5J3J15j50R6o1J07q7n9l3n3J10qk5N3k5mJ35J5k67K12
7469E1r1Q8L8j26J0J06j2j16J23r4J29j54K3K0o0N4O3j36R2j1M9j06Q2p4L1J06
7495H5n8J0r9N5l4P0L2j15P6m6q0J19Po5J79p1qo5J8n4o7J83j89J49j3P2r2Q6
$$ plain form
7312 -37 53 -25 54 9 2 21 -79 -51 -73 -29 8 120 47 -127 -1 169 48 16 139 36 56 -54 7 29 -19 59
7338 59 -98 -5 115 51 -62 -23 108 48 27 -32 -56 -49 6 -16 -38 -56 1 -80 28 51 -168 32 -69 59 28 61
7364 61 31 -91 1 55 -30 104 -180 80 104 21 -101 -23 56 -16 23 -192 119 -78 -91 -42 2 99 18 73 14 53
7390 53 -84 24 -73 30 -11 52 207 -17 62 -65 -103 -75 -210 -66 58 -154 49 23 5 -5 8 -69 78 -143
7414 -143 2 -6 136 -56 37 -19 50 -56 -29 71 -42 -48 116 -60 -17 -74 -80 -83 -20 -30 -44 20 -31 26 -29 -52 112
7441 112 -80 -52 -60 -17 13 -45 32 -33 -20 95 -55 41 -20 87 0 -59 -92 -145 -35 -43 -68 -15 -40 -44 91 106 -161 51
7469 51 -40 48 86 -40 -30 76 64 -52 71 -23 106 -48 -25 -5 -65 -11 52 -84 8 -3 46 -60 22 -52 -21 85
7495 85 27 37 -62 -7 -41 29 61 -54 22 -24 -104 15 22 -43 136 65 57 -8 10 -44 -111 72 -117 32 19 91 -1 85
7523H5j1j06J08p8J7N9J03j43rlp7J5lP3k08J19J45o8l4P8j69N8%K0l2Q6N3r8
7551b0nO0l8J06Nj30K1m9Q7p7P3j21L7J34o1Q2k19R1J25k3op2m2J12j53J1J27
7578E5L8j37k2J18n0j36K09j00O1J36r3k7QPq5q3R9%L5kJ12j16J20k28K5j9P6
7605AlK7p6q6J55Pj1QJ8J8k2K5J4k15J38o4N1O9j58N8J01N4k0k17P6J6O6k1K2
7634C1L3q9j8J03m2O9J3j20P1Mm2r2Q3l7L1n9J75j02rk9K5N0j45q4J91r9J20J28
7662A60j39n2O7j45J87j36O9m1j1J12J3j33oM8k6O2l9J45j65O9j63J02O3L7j52
7687g4J40o3M0j92L55j75r7J53j35J9K4m0m4J24p1K8n3P1n4J1R0j0k4R4k48J19
7713a2Q9j00j20P9J18p1JN4r0J03j0j36P2j0K2p3J48k11J15M8m1K14k64J0m3J86
$$ plain form
7523 85 74 -32 76 -2 15 74 177 34 25 22 -55 -40 -43 30 -178 -59 86 18 -16 62 -107 -49 -49 -29 -61 25 78 -20
7551 -20 -25 35 -3 103 108 -22 -1 -50 37 -40 33 -88 -51 83 22 104 -115 -24 101 78 72 0 -42 70 -83 -72 55
7578 55 93 -44 -66 52 2 -134 75 -25 36 172 79 52 60 67 -18 -101 -2 -2 33 31 143 27 147 -81 -56 -75 1
7605 1 -2 25 -51 -137 18 25 14 22 40 58 36 61 75 -140 -2 -66 -15 54 -104 -46 55 109 89 -128 -52 -36 30 9 31
7634 31 64 -25 -43 60 18 87 100 -20 51 55 13 -79 4 -33 -2 -61 114 12 3 -26 -1 49 -96 -180 11 -88 32 160
7662 160 21 -31 36 -109 78 -58 11 -30 -41 71 84 -49 -55 -7 -33 29 -10 135 -30 39 -124 -22 41 78 -74
7687 -74 66 3 43 -149 206 31 -66 87 -48 -29 -5 -45 -89 35 -36 -8 -61 10 -44 -33 57 47 23 117 -131 -12
7713 -12 77 -23 -143 -64 54 -17 -16 38 -52 51 41 -95 -23 -33 -11 -84 64 -147 -32 16 -25 189 -75 -65 -108 78
7739G8k07K64k17J57j29Q7M1MjoN2o4n5k2Q3j01k3J45N8j11k6j80K81m7j15RJ7
7766b8P7O9kj43L2kJ15o3L2l1r2Q8Lj90J49l5pQ8p7J46j04J20m5q9k5K2%L0j07
7795f9Q9r7n6J91j24L0nQJ97j63K0o5pJ13j02J25l6n7j66P7Q5O8o4J0P9o3J0l6
7823hJ05o1m9M3j8J0l1k6Q1j76J37N3o3O1j66K92Nk74O9J63k16j7R7j42J33j3
7849a1K8P2k63Q4kO2P2l4j09J25n7jJ1J08o4k22K37j4r4J27m5L3J12k32R8j4M3
7876E0o9L5N3O1J2j50R3j27J3J46j13q4J8J5j0J3p0K16k30J33J35j44oJ67p9k7
7902E1j67J07p8J71k1o3rN1o1j6l7pJ27l3j11K5l4J69j76J52J5m1l3J04k6k5O9
7929A03q7l3k8N4K8o3J12Mj38Q2j32N5j02J18j1oq7J78j61J6J99p8N7j30O4m6
$$ plain form
7739 78 -129 135 -82 75 -54 33 74 78 77 71 123 59 4 -18 65 -36 -59 86 144 33 7 -173 108 61 -54 -45 -28
7766 -28 49 118 116 -27 5 3 118 55 87 56 -36 52 55 -135 14 -21 -28 60 -17 129 25 145 100 11 -14 8 8 38 -69
7795 -69 20 -77 -133 58 -66 -36 -41 -33 164 1 21 -44 -51 62 -40 85 49 -8 -174 -97 -12 56 -8 2 81 18 28 -8
7823 -8 97 36 -13 30 12 22 -9 -35 46 -130 7 60 -3 58 -108 184 189 -85 -16 147 -69 -86 11 -131 2 -11
7849 -11 17 89 -174 -90 -92 -30 42 8 -101 24 -33 -34 -23 85 21 -201 36 22 -72 55 10 43 155 -77 21 7 50
7876 50 -19 16 69 130 142 -8 85 -42 -29 117 4 -80 -62 -47 -57 -44 -114 102 -128 5 140 -4 -10 157 78 51
7902 51 -116 -9 -87 84 63 0 -9 42 -19 -35 -72 -79 48 15 -96 -71 -105 64 -112 40 55 14 -19 85 59 34 103
7929 103 16 -17 -45 9 37 -26 86 90 -48 34 -98 -43 -145 -27 -38 -44 -131 47 -114 -98 101 23 80 -50 14 -32
7955c2K0M8R6j84m2N7N1o3p7mJ05Q9j10l0R6k2l2J27j6j77L3k0k7J37j34R0K9
7982Hq5J07N6j05j6M8J05j62k7N3j09J56j39R4O8j97R3Q9n3J27j24M9l6r7J12
8007A5L5r2J27j51J45L4j07j2J7L9j00J4J03k29J46N1JJ17j38j30Q9K4o5K10j49
8032fj21J84l8o8J33k6l4j3k5O7l2r2P8K1m1J5j55J63J60n0o8j08K2n2J96n3q6
8059b9J11j12L8j01J3j6J31K1j8Mq7J4J79o5j67P1N3j0L4k17J52J5o2l9J10p1
8085d8J54j65O0N8j1Q1j94O6q6j9J27P1n5j0j87J39o7J34K0r7O3K1j9r8o2J85
8111F1J29k70J21j4k46J55J16j35J21Kpo4Q8j47J21j23Q8J36n3k0J3o1M9j73K05
8136I2j60R5k6j02J9P2K9j63J69l5K5r7n8P9J13q4J16k19J87p9N7j4N8k7j4j42
$$ plain form
7955 -32 -12 36 132 -52 -94 -37 14 -49 -126 -130 -25 64 -46 -76 20 -2 -34 93 77 -100 -67 -87 -114 23 -111 -21 8
7982 8 -77 30 86 -19 -35 13 118 -44 -71 -18 -127 29 -110 -16 52 -145 -52 37 -16 111 -13 36 0 -97 15
8007 15 50 -42 85 -66 79 113 6 -6 11 50 -50 -36 67 -162 -16 35 36 153 15 -115 -26 -2 -67 143 -6
8032 -6 -127 57 19 -49 84 58 24 11 -14 53 21 -71 7 28 -13 2 -153 10 170 120 52 -56 -34 -86 110 57 -29
8059 -29 82 -30 8 -93 -80 -96 35 56 38 42 -45 -31 148 83 -84 -13 40 30 64 -153 -1 14 -48 -87 23 -48
8085 -48 106 -59 1 59 48 129 -65 1 -85 -104 23 94 39 29 -158 -19 -86 48 68 -29 34 55 36 -62 -124 61
8111 61 190 -80 41 27 -219 -64 52 -83 38 40 33 -31 57 -90 31 -92 -4 132 79 59 72 11 60 -113 92
8136 92 -68 27 1 -101 -82 -10 19 -144 25 -10 15 -82 -140 -61 52 -32 84 -135 52 -27 30 16 74 47 33 -109
8162a09J10N2lo5O1R6j26j30J29K7m5P6r9P7J8o5m0N9j11J79n3k26K37M4j60L8
8188b9r7K7J50
$$ plain form
8162 -109 1 53 50 -15 46 142 16 -114 15 42 -3 73 -26 51 69 4 -36 23 -88 91 38 -188 49 93 -67 -29
8188 -29 -126 -99 51
8191E1
$$ Imaginary data points
##PAGE= N=2
##DATA TABLE= (X++(I..I)), XYDATA
0@%%%%%%%%%%qJ6j6J6k4L2m0M8n6P2q8J04j24J48j76K08k43K83l28L80m39N03
32B68n70O45p33Q29r34J052j180J320j473J639j822K022k242K483k743L026l336
49a749L676m049M461m916N416n970O592p291Q084q991J0036j1260J2716j4484
63g729J6682j9499K3257k8554L6682n1310J24357l93531L53626J42574n12741
74c16186M95827j33416k19539L68677k20933o7156K12123k58865K10488K1964
84I2984k67635K73603p2319j38698K68447k56652K8253K51390l32994J53579J75411
95A75369l82073K48906R5306l28888K65326J0881k32147K29624o7762r0507J56347
106H0382j28838K9391P9570j27410J18359l5638j13431J87844r1914p5121J66630
$$ plain form
0 0 0 0 0 0 0 0 0 0 0 0 -8 8 -8 8 -16 16 -24 24 -32 40 -48 56 -68 80 -96 112 -131 152 -176 204 -235 268
32 268 -302 343 -390 439 -495 557 -623 697 -776 863 -959 1063 -1179 1304 -1439 1587 -1749
49 -1749 1927 -2122 2339 -2577 2839 -3131 3461 -3830 4254 -4737 5299 -5961 6755 -7729
63 -7729 8953 -10546 12711 -15843 20839 -30471 93886 -299645 53981 196555 -316186
74 -316186 179641 46225 -173314 195363 -25570 -92726 119397 -139468 71020 92984
84 92984 -174651 98952 26633 -112065 156382 -100270 -72017 179373 -153621 -42 175369
95 175369 -206704 42202 137508 -191380 73946 84827 -147320 82304 14542 -75965 80382
106 80382 -48456 -19065 60505 -66905 51454 15816 -97615 90229 -1685 -76806 89824
117H9824j50510L6619J50414k31550Q3641J37401k12638J14323M9318j82295J74622
128E9169N17j55636J46287l6280n8185J00179r4464K3969O9723j05958P4999L076
140B7396q9291J20408o2603n7827J40442j08597j2334J29569j43244L6309R9803
151H0031j54449Q2168N5585j41260J07349P726j03331J06130l5271m2610Q4845
162D6913p4566J7164N2113q6315O0992q81o5609J02395n7049m8405J17551q8653
174b4350j0311R8688j15541M0410P6855j25921O3309M2757j00828P8446m103o7592
186d8181Q3163l5597k5769N9894n7095K2244K8630o3590N7293r284n3267Q3055
198D1496m6051l3672Q9436p1745l553P6550q9120K5851O0302r0039M2248L1566
$$ plain form
117 89824 -60686 -24067 126347 -105203 -21562 115839 -96799 17524 66842 -115453 59169
128 59169 59686 -95950 50337 14057 -44128 56051 -38413 -14444 55279 -50679 24320 27396
140 27396 -61895 58513 -4090 -61917 78525 -30072 -42406 87163 -56081 -19772 80031
151 80031 -74418 7750 63335 -77925 29424 37150 -66181 39949 4678 -37932 46913
162 46913 -27653 -10489 41624 -44691 16301 15420 -50189 52206 -4843 -53248 64303 -24350
174 -24350 -34661 64027 -51514 -11104 65751 -60170 3139 45896 -54932 23514 19411 -48181
186 -48181 34982 -615 -26384 33510 -23585 -1341 27289 -36301 20992 11708 -41559 41496
198 41496 -4555 -38227 51209 -20536 -24089 52461 -36659 -10808 49494 -40545 1703 33269
210C3269p0003N4819m324m5059N6636k6480j4440L8096m0554K3825J3444n1780
222c2551N3360j0405m2656O5724m1334k1447P4704o4584m753O8138p1269J7969
234i104M5323p0807L8999K1562n8371M4959k821l2680M3093k7236n109L3340m0906
247a9758K3460J2018m4030M5990j1130l6958N9394l3390k3190O2529m9866l850
259a8781N3452n7828J5116L6820n4664K8221J6011m1947L5420o077k3029L3731
271A6445k2765L17K2343l3559K2661Q177l5735L7819j0241k9152M8710k8006j8029
284b1015M9234l7862l546L9306m2517J2227K7064m2145K1625J1248k9185K6356
296A0790q865j4357K8118k0936l59J9023k7420J9439O612l3631L3394l273k8093
$$ plain form
210 33269 -36734 18085 13761 -31298 25338 -1142 -15582 22514 -18040 5785 19229 -32551
222 -32551 20809 10404 -32252 33472 -7862 -29309 45395 -19189 -23942 44196 -27073 -9104
234 -9104 36219 -34588 4411 25973 -32398 12561 9740 -22940 20153 -7083 -12192 21148 -19758
247 -19758 3702 15720 -28310 17680 6550 -30408 28986 -4404 -27594 34935 -14931 -18781
259 -18781 34671 -23157 -8041 28779 -25885 2336 18347 -23600 11820 5743 -17286 16445
271 16445 -6320 -6003 16340 -17219 5442 13619 -22116 15703 5462 -23690 25020 -2986 -21015
284 -21015 28219 -9643 -13189 26117 -16400 -4173 22891 -19254 2371 13619 -15566 10790
296 10790 1925 -12432 15686 -5250 -5609 13414 -14006 5433 12045 -21586 11808 8535 -19558
309a9558L6501j8973j5919M1313l0207q538L5776l1141O756J9433l2535J9782
321B690Q718k6406K1450o193r693K3520k3202K483K1104k7290J5771O299k8999
334a9748L1010l902k7716L4319j3151j5252L2488k6126k740K8711k7251N619J4507
347A0768k2545J7895J41j9286K1821r481n259J8155k2264Q535J5969k6984J5190
360B655O908k4059K5553n654k2785L0724j0733j4281K4897j7854j807K1379k2589
373g646L837J3485j7282J1698o66j2538J8024q934o637J5328j5365N659J2215
386A1178k3296J3357Q494k1883J8363j766j7933K3659q193j4399K2314j2274m343
399f722J6622j6911M388J0506j5539R376M54j0024J5074q902m906J5296j5204
$$ plain form
309 -19558 16943 -2030 -17949 23364 -6843 -15381 20395 -10746 -3990 15443 -17092 2690
321 2690 11408 -14998 6452 259 -9434 14086 -9116 -6633 14471 -12819 2952 9251 -19748
334 -19748 11262 7360 -20356 13963 812 -14440 18048 -8078 -10818 17893 -9358 -3739 10768
347 10768 -11777 6118 6259 -13027 8794 -687 -5946 12209 -10055 -1520 14449 -12535 2655
360 2655 9563 -14496 11057 5403 -17382 13342 2609 -11672 13225 -4629 -6436 14943 -7646
373 -7646 -3809 9676 -7606 4092 3426 -9112 8912 -22 -6659 8669 -6696 -1037 11178
386 11178 -12118 1239 9733 -12150 6213 4447 -13486 10173 1980 -12419 9895 -2379 -6722
399 -6722 9900 -7011 -2623 7883 -7656 1720 2174 -7850 7224 -1678 -6584 8712 -6492
412f492M685J0977k0400J3028O701k0409J7239p81j5997K0930q963j0672J9949
425I795j2328k294J3521j5277O180P862j5014J1020q91r064J4369j0118k781J4328
439I308j4358L764R822j7066J1122M921j7154J4433q61j1936J5509p223o588J4121
453G814j0067p78R497j1600O166L592j0750R528j948o220J0604q061k286J1603
467G094j1307K320P839j2748Q076L985j2765R938N90r494J0763m839m866J1492
481F078q672n99P502q816N346K524j0016R844j087q144J1333o820l056J2008j1444
496d019O02J0477j2201M723N885j2089R076J543r830R526l088m321Q894p240K71
511a791O865q964N417J966q978J0245l449o659J1549p270k522J0867j0959J807
$$ plain form
412 -6492 -1807 9170 -11230 1798 8499 -11910 5329 4548 -11449 9481 518 -10154 9795
425 9795 -2533 -4827 8694 -6583 -403 7459 -7555 3465 2574 -6490 7879 -2239 -5020 9308
439 9308 -5050 -1286 8536 -8530 2592 7513 -9641 4792 3931 -8005 7504 281 -6307 7814
453 7814 -2253 -3031 6466 -5134 1032 4624 -6126 3402 1454 -4766 5838 -2223 -4509 7094
467 7094 -4213 -1893 5946 -6802 1274 5259 -7506 2432 3022 -6472 4291 -548 -5414 6078
481 6078 -2594 -3193 4309 -4507 839 3363 -6653 3191 2104 -6040 5293 -1527 -4583 7425 -4019
496 -4019 -3417 7060 -5141 -418 5467 -6622 2454 3997 -5833 3693 605 -3716 5178 -2062 -1791
511 -1791 5074 -3890 1527 3493 -5485 4760 1311 -5348 6201 -1069 -3591 7276 -3683 -1876
525a876Q796j1778N386M090r913Q222n50o919Q091l450k437N990o596K879L854
540C789q307O376j57o248Q773m548m636J0475p113k390R372q752J378O876r620
555d732M085M319q082N091J028n479N709k155k470N345m224N16L088m759L725
570A005O75n730O428j514m761P602m587k187P758o562l18O664p353K216M540p390
586c514M642J218n310N451k183k384N299m228L98L836o053M241J251o539O997
601C122j888n034Q222m761k855Q216p238L45O680p948L141K957o446N460n57m746
617c330N900k631j758M641n437K183L449o525M241P98n039N726j876m199O913
632C056l557k347N819m870K47M287n067K043J970m212L349k51k612L930k743j77
$$ plain form
525 -1876 6920 -4858 528 4618 -5295 2927 2377 -4542 3549 99 -2338 3652 -2944 -65 3789
540 3789 -4518 1858 1701 -4547 4226 -322 -4958 5517 -1596 -3986 5386 -3366 -1988 4888 -4732
555 -4732 -647 3672 -4410 681 1709 -3770 1939 -216 -2686 2659 -1565 -1049 2039 -2720 1005
570 1005 1680 -4050 2378 864 -3897 3705 -882 -3069 4689 -1873 -2191 4473 -2880 -664 3876 -3514
586 -3514 1128 2346 -2964 2487 304 -2080 3219 -1009 -611 3225 -2828 1413 2664 -3875 3122
601 3122 1234 -3800 4422 -339 -3194 5022 -2216 -1871 4809 -3139 2 2959 -3487 1973 1416 -3330
617 -3330 2570 -61 -1819 2822 -2615 -432 3017 -3508 733 1531 -3508 2218 342 -3857 3056
632 3056 -501 -2848 2971 -1899 -1652 2635 -2432 -389 1581 -2631 718 467 -2145 1785 -958 -1135
648a135L351m244J843K272m756L343J339n395N092m22m428N932k322l263N540
663B747k945j287M400m367J047K888m100K494J61k572L772k548j183M307m044
678a230J102K918n535L668J756o042N106p8m889N785j732l695N762l565j069M425
694B687m074Q09J988l070K391o12j796L394k929L93K737m380K756J447n050M311
710A002L92m781N160j423l460N516l067j729M736l278m64L018l040J174J419k924
726a749K151k40j024K155k226N88K044l092J587J461l721L252N17m246M071n73
742I55l084M078j318k575M125j926j643L353k459J46J984k508J235M19j398J546
758I30r76o46K493k689P77J846l499K487N97l497L326j58l349L930j452k051L822
$$ plain form
648 -1135 2216 -2028 -185 2087 -2669 674 2013 -3382 1710 1288 -3140 2792 470 -2793 2747
663 2747 -198 -1485 2915 -1452 -405 2483 -1617 877 1038 -1534 2238 -310 -1493 2814 -1230
678 -1230 -128 2790 -2745 923 2679 -3363 1743 1665 -3224 2561 829 -2866 2896 -669 -1738 2687
694 2687 -1387 -578 1410 -1660 731 119 -1677 1717 -1212 -819 1918 -2462 294 1741 -3309 1002
710 1002 1394 -3387 1773 350 -3110 2406 -661 -2390 2346 -932 -1396 1622 -1418 -244 1175 -1749
726 -1749 402 162 -862 1293 -933 -345 1699 -1393 194 1655 -2066 1186 1703 -2543 1528 955
742 955 -2129 1949 631 -1944 2181 255 -1388 1965 -494 -348 1636 -872 363 782 -616 930
758 930 -46 -692 1801 -888 -111 1735 -1764 723 1320 -2177 1149 991 -2358 1572 120 -1931 1891
775A891k798l29K943k882O30J518k523K162k59k074K811j735l23K353k852J035
791d32J919l348K063R16l218L016m77k509L363j378j219K742k151j48K232k326
807i55R43R22j965J898o13j113K216j706k91K091k137M81J757k766J803N27k441
824a349K145p2j782K250q16j222K131j483j20J458j816J061K90j336J406m64j086
841h05K188j767m26K307k495O91J755k750J360J180k732J837M72k505K390l31
857C69j577K091j332k69J358j369N45O49j487J428o54q45K193j799m8J895k129
874i81N12J772k643J361R59k781K459o0j872J870l63j094J628q97j06R50j041
891c27O00M7p85J069o96k36J338j412R7J629k099Q40J253k517J647N98k347J989
$$ plain form
775 1891 -907 -1236 1707 -1175 -545 973 -1550 612 353 -1721 1090 -645 -968 1385 -1467 -432
791 -432 1487 -1861 202 1118 -2100 916 439 -2070 1293 -85 -1304 1438 -713 -861 1371 -955
807 -955 -12 910 -1055 843 230 -883 1333 -373 -664 1427 -710 -229 1528 -1238 565 1092 -1349
824 -1349 796 724 -1058 1192 376 -846 1285 -198 -318 1140 -676 385 675 -661 745 281 -805
841 -805 1383 -384 -810 1497 -998 -307 1448 -1302 58 1238 -1494 343 815 -1690 700 369
857 369 -1208 883 -449 -718 640 -729 -184 465 -1022 406 -248 -1093 1100 -699 -747 1148 -981
874 -981 -469 1303 -1340 21 980 -1801 658 598 -1274 596 233 -861 767 -130 -236 714 -327
891 -327 273 320 -465 604 -92 -328 1010 -402 -305 1324 -775 65 1318 -1199 448 1046 -1301 688
909F88K13j985J991n35j358J977j043l76J165j017J14P81j087P53j88o80J323
926G36j241J23J158j493N77Q86j721Q74Q28k009J700N9j902K273r66q50J756j144
944c56m64J465j210J99Q59j130P41j86o19J098n58k85J159j414N42Q67j712J459
962D55J34j760J982m70j173J737r32n64J859j626o4J525j845R68O34j298R91j92
980C61p64J161o08m22R93j148P27M69j304Q44jr31J208n74o73J530r84l00J068
999F52j151M33N93r41L12N31r85R50l15p37R88o02j85R00q71J06N87p23L57L68
1019B67j117J096l25o43J108p16j74J073j015R9J001j275P27K18j083J071j25
1036A87q20J168o27n43J599j228l2J131j468Q95L90r78O55K4p40R57m38n14J230
$$ plain form
909 688 901 -1084 907 372 -986 991 -52 -428 737 -280 -166 615 -472 281 93 -587 736
926 736 -505 -382 776 -717 -140 746 -975 -101 727 -1282 418 477 -1425 848 -118 -968 788 -356
944 -356 -820 645 -565 -366 493 -637 104 -82 -701 397 -161 -446 713 -701 -159 708 -1004 455
962 455 589 -1171 811 341 -832 905 -27 -591 1268 -358 -422 1103 -742 226 860 -438 553 361
980 361 -403 758 150 -272 721 -427 300 769 -535 309 308 -623 585 11 -662 868 -116 -416 652
999 652 -499 -66 527 -414 -102 429 -556 394 79 -658 330 -272 -457 443 -428 -322 265 -458 -101 267
1019 267 -850 246 -79 -722 386 -330 -504 569 -446 -347 654 -621 106 324 -759 312 187
1036 187 -633 535 -92 -635 964 -264 -296 835 -633 262 652 -326 329 353 -387 570 132 -382 848
1055H48j030R7P56r89O45R8p11P31j46p19J069p15j92Q13j014N74M61j025M90
1074D1M03j097R96k14p76J024m59l79P75n73O2O26q62L56K28p10O71k05m51Q63
1094C19o65J05N42r33M65N24j147P81L00j055J235l28p50J109l94p35J113o06
1112a20l94J103r96L14M19n41L44J69n23O74n03N6N19p93M45K25o93P04q7q27
1132e05J138k92q26J351p68m67J208r95o4Q39q00J31M86o22L57l0l53N61n87K04
1152c4K78p39N49J12o59P84k29n78R08m54m44R82p33j63R00q11j56Q44p91Q8P36
1173C90o80L08R6m27J77lo9J15M6N3q6j89L90k00l17P97l30l87Q51o42j59P74
1195E08q03K03O95r09L36N50j008N58K67o40O46j99l40O37n52K45J90n63L04J35
$$ plain form
1055 848 -182 -85 671 -318 327 425 -286 445 299 -420 649 -66 -258 555 -459 115 576 -449 41
1074 41 444 -653 343 129 -647 377 -82 -461 314 -259 -197 429 -433 -77 151 -559 112 -93 -544 319
1094 319 -346 -241 301 -632 -167 357 -790 -9 291 -764 471 143 -607 502 108 -627 486 -120
1112 -120 -514 589 -407 -93 326 -215 129 298 -225 449 -54 2 521 -272 173 398 -295 409 322 -505
1132 -505 633 341 -485 866 98 -369 839 -156 -220 619 -181 -50 436 -186 171 141 -212 349 -238 -34
1152 -34 244 -495 54 166 -493 291 62 -516 392 -62 -506 476 -257 -420 480 -331 -487 357 -434 -346 390
1173 390 -290 18 114 -313 -136 -139 -208 -93 -47 6 -80 -269 121 -79 -396 401 71 -316 535 -107 -266 508
1195 508 -295 -92 603 -306 30 580 -428 130 397 -243 403 204 -136 501 -51 194 384 -179 125 260
1215B60m03N81l20l62Q08p92n6R14r39J08P48j031N58L02r08P91p5o94P45m87
1235b52r0O36m97M5M70p46M29q3l98O63l84j98N58l85n8M88o09K19M72p38M02
1256e6J62m44L05r1j92N44l54kM11n39L00J24m47L88J60m80L72m6m02P17k66l48
1278a84O34n12m3M49m84J68L78o58N62m1l01M72n33J11M04o58K81M51o96L67K30
1299C97r11R42l24n13Q18m65j14M82m85j80P25o95K26K12o06O49j58j18K93m28
1319b53J86K26n82N37p0p40Q61j58m80P01k17n49Q86m58l27P39o10l4P04n53J08
1340h3J55k44K32L6j52J96j42K8m8m0K96Mm20M57j50n27Q14k54n34J024n66k78
1362a96O66n17j62O50n13p6N55o26K03J50k37K49j02l0J46k88L55k7l76N24l50
$$ plain form
1215 260 -143 438 118 -244 564 -228 -284 630 -309 -201 547 -484 74 376 -532 259 184 -510 235 -252
1235 -252 -342 294 -203 -158 312 -434 -5 -88 -486 177 -207 -405 153 -232 -290 198 -411 -192 280 -458 -56
1256 -56 106 -338 -33 -124 -316 228 -126 -128 283 -256 44 168 -279 109 269 -211 161 115 -287 430 164 -184
1278 -184 450 -62 -105 344 -140 28 406 -252 310 269 -32 440 -93 18 422 -236 45 496 -200 167 397
1299 397 -514 428 104 -409 409 -56 -170 312 -173 -353 372 -323 -97 115 -491 158 0 -118 175 -253
1319 -253 -67 159 -423 114 44 -696 165 7 -473 228 11 -538 348 -110 -437 302 -308 -342 362 -191 -83
1340 -83 72 -172 60 96 -56 140 -2 26 -22 -62 234 238 -182 275 125 -402 412 158 -376 648 82 -196
1362 -196 470 -47 -209 441 -72 -148 407 -219 -16 134 -103 146 44 14 160 -128 227 200 -176 348 -2
1383bm06P84n33p0O26o62n9P78q88J82N83p20L84J68o03L81N1k81J17K52k02K49
1405A29k63J25J47m41M69l02k13P18l87l19O67m43j74N98n28J46M63p67M26M97
1425E48p48L83J81p49N92j61j51L55l05J56J86l56K09k1l75N60l45p4N85o39J18
1446e1M22m92O8M09o93N35j48l31M99k30j87L05j74l4K95m37K27%j43L64k94j01
1468a91M28l40j82M74l40j4L52l82j4K99m20K61N0k21L33k75P4K47k86r8L97l72
1490b20L04K3k68K78J10n18M41l8k84L11j60j34N44l43M3J46m54J70K48k83K81
1511A97q8j04J61k18K18K6l03J19J43l29M00J62n42O41l61l30N28n11P9N20n72
1532a64o6M93l13K09j18j43k4Q4K4J9j32R3m1j45M57k60l64M76j12j61L46k18
$$ plain form
1383 -2 -408 376 -157 -227 399 -263 -322 456 -432 -250 333 -387 -3 165 -438 -57 -6 -287 -170 82 -120 129
1405 129 -134 -9 138 -303 166 -136 -349 369 -18 -337 330 -113 -287 311 -217 -71 392 -375 51 548
1425 548 -200 183 364 -385 207 46 -105 250 -55 101 287 -69 140 119 -256 304 -41 -115 470 -169 -51
1446 -51 371 -121 -53 356 -337 198 50 -281 218 -12 -199 106 -68 -102 193 -244 -17 -17 -160 204 -90 -191
1468 -191 237 -103 -285 189 -151 -165 187 -195 -209 90 -330 -69 -19 -240 93 -182 -108 139 -147 -245 152 -220
1490 -220 84 107 -161 117 227 -291 150 112 -172 139 -21 -155 389 46 89 235 -219 -49 199 -84 197
1511 197 109 5 166 -52 166 192 -111 8 151 -178 222 384 -158 483 122 -208 320 -191 -112 408 -164
1532 -164 -230 263 -50 159 41 -102 -126 -42 -18 1 -131 -38 -79 -224 233 -27 -391 85 -27 -188 158 -60
1554f0k73N30k89k01O84o71J39K52l22J71J12k34J61Q9j92J39o1O9q9k40N03j68
1576D9j38M02l97n3N15n15KO14q45L88L38m89O6M02m68K74Qk06J98p3p9L6k5P5
1600G9q0j04L14p7l35M35k30j26M31l20j21M31n13M9L79l87J2L39o20M10P8k77
1622b33J40K8k11L65k96P2K81j68P0j18o6K54j73j25L79k53J9J52l40J87J85n36
1644c87M57J53n05M12j07k64L42m3q0J88j93L7J32k47K11j6k22K30j47j80N11
1665B82k41m9J48k49J72J06k92J12J22l53M28k5j76L26m53M9J90k18K05N8k40
1686i8J29K00l42L50l60r2K56q5o5K00j79N2J55k98J50l6j56J54J12l3j01op2
1709a65K48k97J78l2k61L80Lk74L79k12l11N79m11J99J78m23J17K84k92K54M2
$$ plain form
1554 -60 -333 197 -92 -293 391 -280 -141 111 -211 -40 72 -162 -1 88 -104 35 -26 43 -46 -286 217 49
1576 49 -89 313 -84 -137 378 -137 -135 479 -366 22 360 -129 -63 339 -129 145 153 -53 145 72 -7 29 4 79
1600 79 -1 -105 209 132 -203 232 2 -124 307 -13 -134 297 -216 -167 212 -175 -163 176 -444 -34 44 -233
1622 -233 -93 -65 -276 89 -207 -135 146 -22 48 -70 -136 118 -55 -180 199 -54 -35 117 -223 -36 149 -387
1644 -387 70 223 -282 130 23 -241 101 58 -22 166 -27 10 142 -105 106 90 -132 98 -49 -229 282
1665 282 41 -8 140 -109 63 169 -123 -11 111 -242 186 161 -15 311 -142 -93 97 -121 84 142 -98
1686 -98 31 231 -111 239 -121 -213 43 -42 -107 93 -86 -34 121 -177 -27 -63 -219 -65 47 14 -87 -93 -165
1709 -165 83 -214 -36 -68 -329 51 54 -220 159 -53 -364 215 -196 3 181 -242 -125 159 -133 121 163
1730A63k57J34J42l27L08j59pJ51k38J67K0j86L46j54l30O21k62k74L86l83K6
1751a13M17m98K04K22l64K34Mj98K01l0j56R4j18J01M6j44J83Ql02L20j44k18
1773b51L51k77j6L73l10j5L07m21K9L57l01L7J51k95K19Q8j05L6m2J30J53k88
1795i0J95j80r0J62K0p8K77l65Q7L76m97J02K96j94L8J88n73L26J65l29K92o3
1817F5k54L51p8j80J96p8J00J5k62K14j22L6K42l70L1K01l26L07J94m25K58N5
1839A70n02N11j12k55K75j66j49K87n3j59K87j57P5r0QJ65r8k8J13k89L2K00l19
1862b54L03R9l57L85j53l06M12m1l42L39q0j07K27k75J09K05k58K9K40j54J17
1883A38o4j87L54l14J30K69n63R6L10j34M7O2k70L34O8k00J93k42m1L6M1R7n7
$$ plain form
1730 163 -94 40 182 -145 163 4 -3 148 -90 77 97 -89 257 103 -227 394 132 -142 244 -139 -113
1751 -113 304 -194 10 232 -132 102 106 -92 109 79 -77 17 -101 0 46 -98 85 93 -209 111 -33 -251
1773 -251 100 -177 -193 180 -130 -145 162 -259 -230 127 -174 -137 14 -281 -62 26 -79 -43 -85 45 198 -90
1795 -90 105 -75 -165 -3 17 -61 216 -149 -62 314 -183 -81 215 21 59 247 -326 0 165 -164 128 65
1817 65 -189 162 84 -96 100 22 122 137 -125 89 -33 3 245 -125 -94 107 -219 88 282 -143 115 170
1839 170 -332 179 67 -188 87 -79 -228 59 6 -153 134 -23 52 -38 -30 135 37 9 122 -167 -135 65 -254
1862 -254 49 148 -209 176 23 -283 129 88 -254 85 5 -102 125 -150 -41 164 -94 -65 175 21 138
1883 138 74 -113 241 -73 57 326 -237 -141 169 35 82 144 -126 208 276 76 269 27 -14 22 63 160 103
1906A03j94L51k18j11J60j24j5J52j98j31L26o7L7L7k73J79oj56K24j70Q4m6k7
1929h3p8J69l00L84m2l49L34m0j07K22j18k6L6j65Q0K27l06J41J72l29J09Q7q2
1952f4J47n7j83O7M7N7lJ27L4j03k08J93L5j13L22l96j09L98l70J32K70k06l3
1975a6L29l36J22J28l24K22J07k89K36j12j87J83j95J35j16l4J42Pj2J98k50p3
1997a35M07m63J25Q1j94J59J91l25K52J66m80K91j29r8J30n0j09L41l19Q2J1n1
2019a17K86k18P5M9k10J36J73l18J81R0j96J68j49m7L19q8k90K41%k95L67l03
2041a46J02K01j00M1J6j08O1l7j15J95j57J20J04l29K19J6j70J77O5l51K63J20
2063A87l12K49Ol08K55k06L4K54j01j60J52j73J61k5j08J17k7jJ33k43J04Q4j50
$$ plain form
1906 103 -91 260 42 -69 91 -33 -48 104 -94 -225 101 34 71 108 -165 14 8 -148 76 -94 -10 -56 -83
1929 -83 -161 8 -292 92 50 -299 35 -5 -112 110 -8 -34 2 -163 -83 144 -162 -21 151 -178 -69 18 -64
1952 -64 83 26 -157 -90 -43 14 11 138 172 69 -139 54 89 -24 298 -98 -207 191 -179 -47 223 17 -16
1975 -16 313 -23 99 227 -97 125 232 -57 179 67 -120 63 -132 3 -113 -147 -5 2 -10 188 -62 -135
1997 -135 272 -191 -66 15 -179 -20 171 -154 98 264 -216 75 -54 -152 -22 -72 -181 160 -159 -77 -66 -117
2019 -117 169 -49 26 75 -135 1 174 -144 37 127 -69 99 -50 -97 222 134 -156 85 85 -210 157 -146
2041 -146 -44 157 57 98 114 6 67 30 -85 110 -47 73 177 -152 67 83 -87 90 155 -196 67 187
2063 187 -125 124 130 -178 77 -129 -95 159 58 -102 50 -123 38 13 -95 22 -5 -6 127 -116 -12 72 -78
2086g8J56j97k3M06n88J73M26m45J25P2j72K22J46l61J55j03K2J08k8q8J39j34
2108f7J56j0k39J54N3k3J90p6k12Q3n6L5K19j45J8R0k04J43J8j66J75K4l26K02
2132C6q2M1J23j75ML55k31q5J68k57J41Mk53J72M5p9K29j13j10R2j81N3K51l24
2156a76K19j43mK73j29j00K08k91J49J06k30k9K22j19N8J31k46J64L0q6P5j22
2178d0rmjm0J11j56J52l7P1Q3j66p5M14l72P3K53k75J79j61k3J46j56J8J00j36
2203e1m1K90j40j29K00q3k6r7J69q0q2j6K55l03K79j14j14J87j05j89M08k06j51
2226a39L41j54l04L47j25l1K24j86M6Q3j48j84L40q3j5j50R5o7L2O2q2j26K55
2249C1j4k02J55J28k67K01R7k52K38r7q8K70j81o2L14l97O8J18J2K5o8r0J00p7
$$ plain form
2086 -78 78 -119 -142 264 -324 -151 275 -170 -45 27 -145 77 223 -138 17 -86 -64 44 16 -72 67 -67
2108 -67 89 79 -160 -6 47 24 214 138 -74 9 -47 -12 207 62 80 170 -34 109 127 -39 136 160 -166 36
2132 36 -46 -5 118 -57 -53 302 71 -14 154 -103 38 42 -211 -39 6 -73 156 43 -67 25 -156 -103 148 -176
2156 -176 43 -100 -104 169 40 -60 148 -143 6 112 -118 -147 75 -44 14 145 -101 63 93 7 82 -40
2178 -40 -49 -53 -54 -94 17 -139 13 -24 47 130 -36 -111 303 -69 4 257 -18 161 0 -23 123 -33 -15 85 -51
2203 -51 -92 198 58 -71 129 46 20 -77 92 12 -70 -86 169 -134 145 31 -83 104 -1 -190 218 12 -139
2226 -139 202 48 -256 91 -34 -65 159 -27 19 102 -46 -230 110 27 12 -138 -43 -110 -78 -16 -98 -224 31
2249 31 17 -185 -30 98 -169 32 129 -123 115 18 -70 200 19 -43 271 -126 -58 60 72 97 29 -61 39 -38
2273c8Q3N9j42L9O9k26K51k00k0L92l01N1Q8k99K31J46k60J21J84l02J41K4k57
2296a66R1L4m0J57k82J84J14k43J51M7p9J5r9Q5J40j88L6J84j92J0J84j73M1k
2320Ij01N9J50k85Q0J16p3Q3j51J37J67k59J37Q4j71R3J4j13J79m7k25K23L3l5
2344A04q1j33J05J27j26K06j11j61K10j57j75K95q3n1J27k51P8K51k70J81O2j59
2366a2J83j13k37L16q5j43J39j21J03p2K1J9R8j70N8j43K01lk72J40K02l85J62
2389a14K23k35J54j27r8J95L7j32J31K2k49K09K4n7M1k12J92q8L5lM0O0P1k27
2413a08K00M3k71L85j53j62Q6J41j01J26m4j37M6J0n0OQ2j14O8p8M0J44j43J01
2437A17j62j03J56o3J30l5j00N5M2j47K13r9n3K12k54n4K58m8j36m0Lj0K53l84
$$ plain form
2273 -38 45 104 -38 1 70 -156 95 -105 -125 267 -34 17 105 -194 37 183 -77 44 228 -74 67 91 -166
2296 -166 -75 -41 -81 76 -206 -22 92 -151 0 47 -32 -17 -116 -31 109 -79 -43 141 -51 -41 143 -30 11 9
2320 9 -92 -33 117 -168 -88 28 -45 38 -113 24 191 -68 69 153 -18 75 89 -24 155 108 -117 106 139 104
2344 104 23 -110 -5 122 -4 202 91 -70 140 -17 -192 103 20 -31 96 -155 -77 174 -96 85 147 -12
2366 -12 171 58 -179 137 52 -91 48 -73 30 -42 -21 -2 96 -74 -16 -159 42 39 -233 -93 109 -276 -114
2389 -114 109 -126 28 -99 -197 -2 35 -97 34 56 -193 16 40 -17 24 -188 4 -84 -49 -52 -12 48 119 -108
2413 -108 92 135 -136 249 96 -66 20 161 60 186 142 5 51 61 11 17 99 -15 53 -25 15 159 16 117
2437 117 -45 -148 8 -55 75 40 -60 -5 37 -110 103 4 -49 163 -91 -145 113 65 -71 -111 -108 -118 135 -249
2461b49L41j51l2J23j2q7J66j61P5J51l18L16k83pK49k25j02K92k20K24L3j53
2483c0q2J76j82J27J31k61J48K0J7j7j1j6L4q0O1R0r0J33k27n8J84K7k34J46p2
2508f6k3J89j44L8R6j41J89L9l35J86j5RJ33j25k6J16k50K13J9j89Q7l9j22K33
2532G2n5j31K66k67O1J48k50P0J47j95J51J17l15L37j60m3K18k08M1J09r3j39
2554a19J50j56K89N7k89J86q5j7J10j89RJ63k16J24kM7M6q9L0O3Lr3L8k9P9j4
2580I6k14J79m6n3J96j59M0R7j72n9J45K7j62K67k05l5R8j78J68kq0J46j83j6
2604a05J97k01J77J06l34L80k64j67K94j91K7J83j00o2J40k9q6J08M0j11J50k30
2626g8M0J18l3j20L1J50j33q6J08M4j45J84m2ln0p2M1L22k46j52J34j27%L44j58
$$ plain form
2461 -249 92 -59 -91 32 20 -67 99 -62 13 164 -154 162 -121 -128 121 -104 -206 86 -134 90 123 -30
2483 -30 -112 64 -118 9 140 -121 27 47 64 47 36 20 54 -26 35 125 35 168 -59 -117 67 94 -140 6 -66
2508 -66 -89 100 -44 -6 90 -51 138 177 -158 28 13 22 155 30 4 120 -130 83 102 -87 0 -39 -161 72
2532 72 17 -114 152 -115 -54 94 -156 -86 61 -134 17 134 -181 156 -4 -47 171 -37 4 113 20 -119
2554 -119 31 -125 164 221 -68 118 33 16 126 -63 -54 109 -107 17 15 62 108 19 49 112 115 22 60 31 110 96
2580 96 -118 61 15 -38 158 -1 39 136 -36 -95 50 77 -85 182 -23 -58 40 -138 30 28 -52 94 -89 -105
2604 -105 92 -109 68 174 -160 220 -44 -211 83 -108 -81 102 2 -60 80 51 -35 73 113 2 152 -78
2626 -78 -38 80 47 -73 -42 108 -25 -111 -3 41 -104 80 38 35 -15 -87 -46 276 30 -122 12 -115 -115 229 71
2651G1j05R8n8n0J50k22K13j52M3J9J3j13J93j98J16j4j13J70K6j61K05k04p9
2674a52K13j94J5K48j73R5M0j60P4O1j26MM0Q6M0j73J17j05R8J17l3j71N5o3o9
2699a16L27l53J43J4j01O1J95k41J33Pk28K74nj10P0qn2m4O5RPj81J93N9k18J76
2725G6J7j07K26k44K7K6k3Q1J05k43O4M3j43J68k9j23K59r9j68K36k97Q9O0j01
2749a00J56on9njn3J69j57j8M3J07j19j0j86Q1K24o9J84j46j12J66o4n0R4j11
2774d2k6J65j34K08j59k0O5J23k58qK6m8J43m4k3J15r0rK42k16K09j66J8O2j42
2799ij64K59n9J5j8q8NJ48j15J22K0k60J96j2r2J24j23R8J9k28J94J0j29P0j6
2824c3L3J22k48J48O2j70J66J9k57K03l1j37J44k20K11O0k66K7K38j20k3K47j91
$$ plain form
2651 71 -34 64 6 -44 106 -116 97 -55 -12 7 20 -93 100 -98 18 4 -109 61 87 -74 131 -73 -152
2674 -152 61 -133 -118 130 -43 52 92 -68 6 67 -59 -55 -15 71 111 -62 55 -50 48 165 132 -39 16 -47 -116
2699 -116 211 -142 1 15 -86 -25 170 -71 62 69 -159 115 110 0 70 62 10 -34 31 40 47 -134 59 118 -100 76
2725 76 93 -14 212 -32 -5 21 -2 79 184 -59 5 48 -95 73 44 -79 180 81 -87 149 -148 -59 1 -100
2749 -100 56 50 -9 -14 -15 -68 101 -56 -74 -31 76 -43 -53 -239 -158 66 -3 181 35 -77 89 25 -25 69 -42
2774 -42 -68 97 -37 171 12 -8 57 180 -78 -86 -60 -108 35 -9 -32 83 -7 -16 226 10 219 53 71 133 -9
2799 -9 -173 86 27 42 24 -64 -59 89 -26 96 116 -144 52 40 -52 72 -51 47 66 -162 32 42 -87 -17 -33
2824 -33 0 122 -126 22 84 -86 80 99 -158 45 14 -123 21 -199 12 72 -194 -167 71 -49 -72 175 -16
2847a6m1O1l6J21j18PL8K1m8o4p3J57Jk05J74l2o5K29j58J47j88J46m5J59k54
2872h2j1K24k18J48J6j50J52O1j81K0J08n3J4j90J63Mq7J19k1o7j6N1K8N1j12
2897b9K21ll42J38J38k62K20j09j34K06M8j06n0J64l7m0j86J02J40j88O1R5q5
2920c8L5m0j3O2l5l9K12j61o0K05k21J28J4l2O5K9k54K9K3J38N9j76N7PO2JM4
2947A01m1M8j17L3Q2j84P2J60n6r6j67J3K94j69q7J74j95K9L88l15j17K95n8l7
2971E0l4p7R9r6O1k0kJ09q0m4K9L0j8q6J2r4J71O3q0L8p8l7K25j48j58J25J5J12
2999H7O7k44J01P3j74m8K35j53j82M20l26J18N0K9Qj09R3r5R7J0k3k1J57l02K87
3024A55j30q8M7O9k05K69j11K7J21k38J05P0j81J19L1m4q2M1N2R2j39O2k1P5n4
$$ plain form
2847 -16 -57 4 -32 89 -29 -22 16 37 -11 -75 -148 9 10 -195 -21 -53 -118 111 -47 100 -88 58 13 172 -82
2872 -82 -93 131 -87 61 77 -73 79 140 -41 -21 87 34 48 -142 21 25 -62 57 36 -31 -47 4 32 83 -29
2897 -29 192 189 -153 -15 123 -139 81 -28 -162 44 92 -14 -64 100 63 23 -163 -61 79 -109 -48 47 -38
2920 -38 -3 -43 -56 6 -29 -68 144 -17 -77 128 -93 35 49 17 82 111 -143 -114 -91 47 106 -70 -13 -6 56 57 101
2947 101 60 108 -9 24 106 -78 -6 154 98 2 -165 -152 142 -27 -114 60 -135 -106 282 -33 -150 145 87 50
2971 50 16 -61 38 -58 3 -17 -19 90 10 -34 -5 25 7 -79 -67 -161 10 73 -7 31 -47 -84 141 -7 -165 -40 -25 87
2999 87 154 -90 11 84 -90 -138 97 -56 -238 182 -144 -26 24 53 61 -48 45 -50 47 57 34 13 170 -132 155
3024 155 25 -63 -16 53 -152 117 6 33 154 -84 21 91 -90 29 60 16 -66 -25 27 119 -20 42 21 96 42
3049D2m6Qm6NO5L0j9oN4j68L1J06r2MQ8j2j5L4j22l2J70k95K23n8n2J18j5J4j2
3078BP6j74J12M4l6J67j93J02p8j30K09j21P5M5k61K10M5k09J27J89k65M1L6p5
3102f2K04m5m2j35J29O6j01k7N8J4p0J45j42J7l5J20m3O4k25K22q8J2o9lk9J04
3128C9k7m7J86k01l1J09K0M5j27M6L3j5l5m3j5O2N9k9r0P5l3RN8j19R1m7j24J55
3156Dq5j1j6J6Q3r1M4mJ24j57J42m5j3J00N5j04J8j15KM1OJ01n3j6O3j77R3N2
3184E7o3j25K21k9j45J46On0j00LJ30r8L4J60l00J21J51j39J63j89O6o6Q1q6J43
3209I2p0j58J39n3l3J29m3jL8j34J04k7r3N4J61k28J46r0Q2j25Q0L1R2j34pJM7
3236@j00o6K08p9lR8p5m5K00l8j83J05Q2j5R1j68j77L12k21qJ50k09K00L4n8N
$$ plain form
3049 42 -4 4 -42 -37 28 58 39 33 87 -81 -50 56 -36 -32 56 44 29 63 -59 -91 79 -216 7 -51 -103 15 0 14 2
3078 2 78 -96 16 60 24 191 -2 100 22 -108 101 -20 55 100 -161 49 94 -115 12 201 -64 -23 13 -62
3102 -62 142 97 55 -80 49 115 14 -13 45 59 -11 134 -8 9 -26 94 51 115 -110 112 24 36 -33 -36 -65 39
3128 39 12 -35 151 -50 -81 28 48 93 -34 12 45 30 -5 -48 -63 -1 58 29 -61 14 -19 -10 48 -71 20 -27 -151 4
3156 4 -81 -92 -108 -92 -9 -100 -56 -60 64 -93 49 4 -9 91 146 42 60 -55 -53 -12 -6 95 42 26 89 -88 5 57
3184 57 -6 -131 90 61 -84 62 68 18 -82 -79 51 -47 -13 147 -153 -32 119 -20 143 -46 20 -46 35 -51 92
3209 92 22 -136 3 -50 -83 46 3 2 40 -94 10 -17 -110 -56 105 -123 23 -67 15 -110 -30 1 93 -41 -48 -47 0
3236 0 -100 -166 42 -37 -40 58 -17 -62 138 100 -83 22 104 89 180 12 -165 147 -74 -82 68 -141 59 93 35 40
3262D0jQn0M9k15K49K9q4R5l4j45J57j34J21r0j5J28p8k27K05j23Q4n0l2J31p4
3288e6K4oJ09k71J59K11k63L9N9n1M7Rm8j28J44K1j84L4J52j82J46P9j08NQ5r8
3314g2%L2k75M28j11p2K13j51p2J34o6j85L33j41k9N9l6J6M8l5l7P8N3j12J3p3
3340f0J55j21J6l1P4L3l0N8K0o3r9NJ3K4K21l96J14K66k82N0k1N2j08J09k7J41
3366A13j44m2K35j92J5M3j16J26o7j24L59k15r2K50l09j8K60j71J04lj06K0J32
3389E8j56J27M3k56K78m0o1N4o6l0O4N7p6Q6q2%M0J78j61j2j34J15m4J40q7p4
3415c9J45p0m2L0l9m5O4L1k2n9L2p4J90k11J01N0r6R8j23p2J59k1k01K52j27k8
3441a17O8j98J63J16k00J77r1L5R2r9k5m1J1J30M5k87K94j3j18J85j54q7J06m8
$$ plain form
3262 40 39 47 -3 46 -169 80 109 25 120 86 -59 98 -36 85 -5 -20 108 30 -197 8 -115 -31 -81 -113 18 -56
3288 -56 -32 -38 71 -200 -41 170 -93 -54 5 -46 1 10 -38 -166 -22 -1 -185 -151 1 -181 -35 44 -64 -59 26 -72
3314 -72 -72 -40 -315 113 2 -70 143 -8 -80 54 -12 -197 136 -5 -34 25 -11 5 53 18 -19 59 112 0 13 -60
3340 -60 95 -26 -10 -41 33 66 36 94 114 51 -48 -43 -30 -6 215 -181 -67 199 -83 -33 -54 -2 -110 -1 -28 113
3366 113 -31 -73 162 -30 -15 28 -88 38 -29 -153 206 -9 -101 149 -160 -178 82 -89 15 12 -94 -74 58
3389 58 -98 29 72 -184 94 54 -7 47 -19 -49 15 72 -4 82 0 0 40 218 57 45 -89 26 -18 122 35 -39
3415 -39 106 36 -6 24 -15 -60 4 35 13 -46 -14 -88 102 -109 -8 42 -54 44 -79 -151 8 -13 -214 38 -89 -117
3441 -117 -49 -247 -84 32 -168 9 -82 -47 45 -54 -79 -120 -109 21 66 -221 73 60 -58 127 -27 -114 -8 -56
3465e6K1J57j08k8R5l0K9m0j17j7K2M9J18j51L4P1j50P4N6L0P8n5j37J32j24j4
3491f1O3j5k6J19kj66J44J46j50r8n3J77k5j22K69k32qM8q1J80J3j32j60K45k47
3516a74K72j20q1K59l19Q4R1j66K00m0m0k8RM9j9R7j66J13o0J72o3j45K6J02K0
3541G3o8j00J08J45k41J48Jj09j5Q5l1j26J92k3r5Lj7K5K89k87K37k33m1J35k05
3566a50J77l8mJ56j68P4r6N2q7J80j43J40k6oK4L8p3m5J49k30J39m0L0q4k5j2
3592f8J2P7r8P2j2j3P2k13L44j20j09O6Ll4k4M1J26m1j21Q2r4m3J13l5j17J32
3618bj33K10Q8r2l3j27J71O3j73l6N5kl6J87j91O6O2j13N4l9K8R2j22Q1L1r2K8
3645B5P1j16l9K6m7J17o6M5J66k26J6J62j24pjr5J23K3j41k2J88q0Lj19P4kN8
$$ plain form
3465 -56 -35 122 14 -14 81 51 80 40 -77 -94 -72 -23 95 -56 -22 49 -101 -27 29 59 137 82 -55 77 -47 -61
3491 -61 2 -13 -39 80 78 -88 56 202 52 -46 -99 78 53 -69 200 -32 -40 8 -73 107 120 -12 -172 73 -174
3516 -174 98 -22 -103 156 -163 -79 12 -154 46 6 -34 -62 -53 -4 -23 74 -92 21 -39 133 70 -75 -49 53 73
3541 73 5 -95 13 158 -83 65 66 -43 -58 27 -4 -130 62 39 -56 -53 -70 -45 244 -43 194 -39 -80 55 -150
3566 -150 27 -11 -15 141 -27 47 -49 3 -84 96 -47 93 67 61 85 123 50 5 154 -76 63 23 53 -31 -56 -68
3592 -68 -56 21 -77 -5 -17 -30 42 -171 173 53 -56 10 13 -21 -45 -4 122 81 -40 42 -52 -95 18 -17 -134 -2
3618 -2 -135 75 163 71 38 -89 82 145 -28 -64 -9 -11 -47 140 -51 15 77 -36 18 -21 7 99 -23 58 89 -3 25
3645 25 96 -20 -59 -33 -80 37 -29 16 182 -44 -28 134 10 3 2 -93 30 53 -88 -110 78 -2 1 -118 -44 -46 12
3672A2O1nj04J6j31J04Q1m7j15J84j27o3J50l7o7J07K8o3Q7j16R9l8o0P6L4j17
3698e1N2L2R9o7J2j22K10k40J51K2o5l8RO3j36m0Q9JL2j6q2J67pk9j4J28k37K4
3726e3Mm9J03ln0J44k75J74J08j36Q0j06j9J5J31k10L6K40k65J71L8j6r0L5j56
3751a49J67J33j83o1R3j6o1J15o9L8j04N0P5n4L6m9o5K60j61j23K24j31m1k4J08
3776HJ4K6p3O9Lk7L4P6n9L4j90K36n2q4oQ5j43J78j19n9P4j5J0J56q7o0J19Q1
3804B29k16j5jJ11p9j43J04J35r6k4j34%L26j78k06J72J8K0j09J75l7j19O9J19
3828A21r6j82K61k46K87k50J06Q2j22l6P5jk2J49L9k88J58j93J42j2J8k2L1M6
3852D5J5l1JR9q9l0n2K1K8NP4J19k28J9nj5Q7R2j14J4J40k48M3Mq1P7L1r6jN7
$$ plain form
3672 12 73 68 -36 -20 -151 -47 34 -13 -128 56 -71 -134 16 -21 -88 19 47 -16 71 -45 54 16 -44 32 66 -51
3698 -51 1 33 132 65 77 -45 165 -75 76 98 33 -5 4 67 -69 -109 -20 -19 13 -3 -85 82 75 46 32 160 -77 -53
3726 -53 -49 -98 5 2 -48 96 -179 -5 103 -33 47 -59 -78 -63 68 -142 -106 134 -131 40 78 62 -28 7 -149
3751 -149 18 151 -32 -93 0 -16 -77 38 -31 7 -97 -47 28 -26 10 -39 -104 156 -5 -128 96 -35 -76 -100 8
3776 8 22 48 -25 44 47 20 54 130 71 105 -85 151 99 15 9 94 -49 129 10 -49 25 10 20 176 89 29 148 229
3804 229 13 -2 -3 108 29 -114 -10 125 29 5 -129 -129 197 19 -187 -15 3 23 -86 89 52 -67 2 121
3828 121 25 -157 104 -142 145 -105 1 83 -39 -75 0 -1 -23 126 165 -123 35 -158 -16 -28 -10 -32 -1 45
3852 45 60 29 30 129 40 10 -42 -21 7 12 86 205 -23 -4 -9 -24 63 155 41 55 195 -53 -10 -6 -87 -10 21 -75 -76 -19
3882a9kn1J29p1o6P5p3K7L9J59j78Q4J0p1o8L0P0j7J44j86R9k7r8J50j36m9J59
3909F3j14M7k0N4k5kJ2j53J85j55J39q3Q7O0j50n2J76j46J34Q2j60j5m4qQ3L8
3935C3k5J31j30m4m0KJ65o0o9J45j81J36j3O9k00J48j19L0Q0j44Q6r8J35n3j34
3960a50J33J26k55J45Mr9K9J40j91J63j69P0R2M4q2n9L3J02K6j06O2Pj08R5o2
3985a0J8np8J59j42R9L4j42J74q8M2j12M5P3r9l0J60k55K53j45j5J48j83J11P
4010A9l9M2l0J24r5p0J33k2J52k78J7j07K69K0m6j90K4J58j9j12L0J32j08o4J60
4035A00r1J03k6l6qo7k4l7Q5j41P2J6J49j28M9M2Jn5q5N8MRo4J8J00J40j56q1
4063e3O3n2O7l2L8O4k28Q8Q9m3K2n3n1R4m8r3J42j00J28n8K6J5m3j26K61j32k7
$$ plain form
3882 -19 -21 -72 57 -14 -80 -5 -78 -51 -12 147 -31 53 63 -8 -76 -46 24 7 151 -35 64 37 -61 89 -47 -96 63
3909 63 -51 -4 -24 30 5 3 15 -138 47 -108 31 -52 35 95 -55 -107 69 -77 57 139 -21 -36 -80 -88 -5 33
3935 33 8 139 9 -35 -75 -73 92 32 -37 108 -73 63 50 119 -81 67 -52 -22 58 -86 0 -98 37 -16 -150
3960 -150 -17 109 -146 -1 3 -96 -67 73 -118 45 -124 -54 38 82 0 -59 -26 76 102 -4 58 65 -43 52 -10
3985 -10 8 3 -75 84 -58 41 75 -67 107 19 61 -51 -6 67 -32 -62 98 -157 96 -49 -64 84 -99 12 19
4010 19 -20 22 -8 116 21 -49 84 62 214 -64 -47 -154 115 135 89 -101 -77 81 62 -50 -20 112 4 -60 100
4035 100 9 112 86 50 42 -25 -49 -86 -1 -142 -70 -54 95 -33 16 58 59 4 -81 -23 -19 -10 -74 -56 44 184 28 -53
4063 -53 10 -42 25 -7 31 95 -133 -45 44 1 23 -30 -81 13 -35 -128 14 -86 42 -16 10 25 -18 -144 117 -15 -42
4090d2O7L5j41Q6mP7j71j7J31q0J06q2m8O9K6p1n5M1O3O5l5l7p8K12k68K05On0
4118A0K9j17K8J19j05r9J24l7J91p7j18m6J92m1m5m1k5L6M6j62N4M9K12j61m2
4143b6l1k1J95j12N9o0j29J62J7R0k62r6L04j43O3q4m0Q4RO7n9J48k79J80k2K4
4169C8o6J19j17k2r7J81j36J58o6k8OJ04o0K2r5J5J37j91J14J14j29N3N3j72P9
4194A4k0k35L24J5r2J83j70r7J34L8j44%M0N6mJ5m6N8J0j15J00jj21J50oj48k1
4221h3R7l5l9L3P4n1j07J1R7O9o4R6J0n5j47K4O5P4k23QJ62P3j9j3j73J93J05
4248A82j70p1K62j99P5r6j30K28o4q6J32o3m1P2j7Pn2L5q1J0j18K72j66J48r0
4273b1Op0N8K7j1l7j13L60j50n3NM6p2m7O6M5Pk8j19J02j9o9MN3J16J12p4l2o9
$$ plain form
4090 -42 25 60 -81 5 1 78 -93 -110 21 -59 47 -35 -83 -14 12 -59 -114 -73 -10 55 20 -17 -95 117 -151 54 60 10
4118 10 39 -78 -50 69 -36 -135 -11 -48 143 66 -52 -98 94 53 8 -33 -58 -22 24 -138 -84 -35 177 16 -26
4143 -26 -57 -78 117 5 64 4 -125 37 54 144 -118 -214 90 -53 10 -74 -114 -30 -21 46 -13 135 -144 36 14 38
4169 38 -28 91 -26 -48 -145 36 -100 58 -8 -36 -30 74 14 36 -59 -44 93 -98 16 130 1 54 107 -65 14
4194 14 -6 -241 83 98 6 189 19 -78 56 94 -50 -50 -10 46 42 57 11 69 79 -36 64 63 -58 92 86 -62 -83
4221 -83 14 -21 -60 -27 47 -4 -111 -100 -3 66 2 98 108 53 -94 -70 -5 69 -154 -146 16 89 70 57 -116 77 182
4248 182 12 -59 203 4 79 -17 -147 81 17 -69 63 0 -41 31 14 21 -31 4 -77 -67 -185 87 -79 69 -21
4273 -21 -15 -85 -27 0 -11 -48 -161 199 49 -4 1 47 -25 -72 -6 39 46 18 -101 1 -18 -87 -83 -30 86 198 124 92 23
4302B3qq6K3R5ln8m4K06j79J12J4r0J32k40J40k6j71J84Pj24J07j24J16Q5j83
4327i2J30m3L6j50J22m2M3k3p5K66j23j5j67K51k12k8m3K29j25J01j20M9k6N3
4351dj8m5R9o9R2l6j70J87M3j58P5K7O5j27J66j33j1K0l9o4n0K19j0j02O2Nm5
4378b1o3N8JL6J1mr2P9J15k5j80J75j22N6O3l8kk5P5j67J6J54j16O7J6o4L5oj8
4407A4MKL6j44J22j16k8J98j12L6j6l8P7N3j47K2l4J9Q4n6lN1n2o4R1R9M4j14
4435B8r2KR3m8rJ61j47OR3k21J74J5j53J6J25j15N1Q3K6K8r6L0j7O4j07LJ2J2
4463A7J01j35N4j3O7o7Po6o9K48j70p8R5R6L7j78J08M2j13R7j25J57j15q7J54
4488F4n2kP2N2j64K10j39L4Qj31R7p8J10p1l2k6N7m4K50k09L9n2N6n6l1m3K8M8
$$ plain form
4302 23 15 -71 -48 47 44 -14 -58 148 -31 81 95 5 137 -103 37 11 -160 24 31 -93 14 -110 6 91 -92
4327 -92 38 -5 31 -119 3 -39 4 -19 -94 172 49 34 -133 118 -94 -122 -165 64 -61 40 -80 -31 -57 -4
4351 -4 -22 -67 32 -37 55 19 -151 36 79 -79 -4 23 88 -39 127 -6 -17 3 -36 -100 -150 69 59 -43 19 24 -21
4378 -21 -84 -26 -25 11 22 18 -74 5 120 95 -85 90 -32 24 87 49 47 22 97 -70 -54 100 -16 51 67 3 38 32 14
4407 14 18 20 56 -88 34 -82 -110 88 -24 12 -4 -42 35 88 -59 -37 -71 -52 32 -24 -27 24 -28 -92 -1 98 142 28
4435 28 -64 -62 31 -17 -26 135 -12 -6 87 -134 40 55 -98 -82 43 -72 -21 62 88 116 20 50 33 97 -10 -7 5 17
4463 17 118 -17 37 24 91 24 31 -35 -104 144 -26 -104 -9 87 124 -54 54 96 -17 80 -45 112 -3 -90 64
4488 64 12 10 82 134 -30 180 41 75 83 -48 49 -29 81 10 -22 -48 9 -35 215 6 45 -7 49 -7 -38 -81 -53 -5
4516ejj0j6p3J4J93p5j30L0k8QK06j74Q2P4n1L5j19o0J48j5j5j2j27J62O3j55
4543e1J05J7m3jr2nO3P9j8p3J22k02n7J71Q1Q9j99O2n0p2M9r3R9o6J36K4o1o8
4571e4J09j56Q1K4J27L7j51L2j30R4j11J69j15%J52l6q3J19L9j10k0j0pL7k9m8
4597d0O6k3K0j05L1JJ57o4j50M9J80j31n6K25j23n5Pr7n3J77k8N5q1J27j11J51
4623A29L3j42L4o9P3M3j18N9j63R3R3j22N2L6J5j07O5j70L26k21k1J21K7j68J46
4648D4k23K77N4j30J6r9J93j80Q4Q6L1j42J1j22o9J61P1q1J27j08K2l4P4q0J24
4673A07k61K89j21J57j98nN9o5P1j17P0P9j6j30K8J21P3n3k3l4RPJ1j54J67n3
4699A8l1M6j07nP1p1J1K10k48R3Kk5k5o2J67p7N3M3k2j4k6N5j8j35J99j71J90
$$ plain form
4516 -5 -6 -16 -32 -105 -91 102 27 -103 -73 -101 -93 113 -61 21 95 44 79 -40 -100 48 33 18 6 -121 41 104 -51
4543 -51 54 71 28 27 -65 -70 -7 72 54 -19 103 -99 -156 15 96 185 -14 48 -2 -74 -25 -118 -19 -85 51 75 14 -54
4571 -54 55 -101 -20 4 131 168 17 49 -81 13 -98 71 -44 -44 108 72 -11 108 147 37 17 7 0 37 8 -40
4597 -40 26 3 23 -82 -51 -50 107 43 -107 -58 122 -9 -65 160 37 -18 -11 -108 -161 16 -12 43 -38 89 -22 129
4623 129 162 20 54 -15 58 101 -17 42 -121 -28 65 -57 -5 31 46 -61 4 -166 160 -61 -82 39 66 -102 44
4648 44 -179 98 152 22 38 -61 132 -48 36 122 153 11 22 -100 -169 -8 63 -18 109 1 23 -11 63 -17 107
4673 107 -154 135 14 171 -27 -32 27 -38 33 -84 -14 65 49 -81 -53 68 141 88 65 31 40 47 58 -96 71 18
4699 18 -13 33 -74 -79 -8 -79 -68 142 -106 -13 -11 -36 -61 -123 44 -33 20 63 41 27 1 56 38 -97 102 -69 121
4726A21j98J14k1j50J83o8q5J27l0j09J96j22J11j01k0K4j3J03q4K01k06N9O2
4749I4j47J81p3j06J1r3J53o5j8K8p1J79p8J6j10J96k53N3J01Q4M4j75J29K4k6
4774G8j14R8o2j9j16j1J01J55j56p7R8j9L6R5r8J8J6Q2j08j6O4m9j20J01O5M0
4800H2j89L33j46j12R6j84K97j85J10p0J0k2j10J64j09j53M4J38o1n6J32L4nk36
4824a98J98q4L8P3n5Qn6R2p9J13n4n0Q5J6j52J58n1j33K54j37k0L9k8jJ05p9j58
4851a56K9J20L7M8r5%J3n3K04r9n9o5J50j63J91k63K79p0k10J27J38j68R5j62
4875a32Q9l4M9J6O1j7J23q3j71J17r4o0K41n9R2j82N7J2j4l2q5J33p2M1n3J73
4901A16j92lO7Q8p4j17R1J15r7N0j45n1K34k74L59p7j00O2r6j9J84k07J60r5M
$$ plain form
4726 121 -77 37 16 -134 49 -19 -104 23 -7 -116 80 -42 69 -32 -52 -28 -41 62 -22 179 -27 32 94
4749 94 -53 128 55 -51 -40 -133 20 -45 -63 -35 -106 73 -5 11 -99 97 -156 -103 -2 82 126 -49 80 104 78
4774 78 -36 62 0 -19 -135 -146 -45 110 -46 -123 -25 -44 -8 87 -11 7 23 105 -3 -19 45 -4 -124 -23 42 82
4800 82 -107 226 80 -32 64 -120 177 -8 102 32 42 20 -90 74 -35 -188 -144 -6 -67 -123 9 43 38 -198
4824 -198 0 -84 -46 27 -28 -20 -76 16 -63 50 -4 -54 31 47 -105 53 2 -131 123 -14 -34 5 -23 -24 81 2 -156
4851 -156 -127 -7 30 78 -17 -17 -4 -57 147 48 -11 -76 74 -89 102 -161 118 48 -162 -35 103 -65 30 -132
4875 -132 -43 -77 -28 -12 49 32 155 72 -99 18 -76 -136 105 46 138 -44 13 25 11 -21 -106 27 -45 -4 -57 116
4901 116 -76 -79 -12 76 2 -115 -24 91 -6 44 -101 -152 82 -192 167 90 -10 52 -44 -63 121 -86 74 -21 -17
4926a7N3q0R4p7M6m3Pr0J03r7K8Q1K4K1N4q0o5J5M0m0o4Q2j6j9k2k8J18k7l0L3
4956Dq6J33O6j47J05Jo7k0p9L3lK4j16J9J22p8M2p7P9o5J13j8q2J47m8lj10J96
4984H5r9j7J7k7Q3r2J23k4j36J16k1j55J8J54j12Q7P1j79J27k7L2k5l7m3J51k17
5010a47J5O7Q5j33J55k08L12j00r7J15r2J43p1j62K43j29r4P5o8K09nk4m8r7P7
5035B1qj6JJ12n0j37P4J8mO4j27J29k2j15J49l0l8n8j10J36j2q5J37n0o6J55J9
5062H7p9p6O4jP8n6m8N8k5m7O3R4j12P1j06N8j03P7L0j3P2j03j9M5Q8j41O6Q4
5090A06j39K2k9n9K19r6J00j59R0j36O8J72j44j9J6jp8J20r3K3km9Q8L1k1J6k6
5117B0j16J24k7J16j25J00m6j62K38j14j71J88j20O1J4j9R8q6q5P5n3o6K70Qk28
$$ plain form
4926 -17 36 -44 50 -27 19 -24 -17 -107 -4 -101 -73 8 32 53 107 27 -38 -23 17 -23 -87 -5 -21 -40 -62 -90 28 1 -29 4
4956 4 -82 51 117 -30 75 76 9 -11 -90 -57 -60 -36 -152 -133 -11 -89 -47 -124 -45 -110 3 -15 -97 50 2 -1 -111 85
4984 85 -14 -31 -14 -41 42 -50 73 49 -87 29 8 -147 -129 25 -87 0 71 -108 19 -8 24 -1 -38 -81 70 -147
5010 -147 -132 -65 20 -113 42 -166 146 46 -51 64 -28 115 44 -118 125 -4 -98 -23 -91 118 113 89 41 -56 21
5035 21 13 -3 -2 110 60 -77 -3 15 11 75 -52 77 55 -60 89 59 21 -37 -147 -11 -23 -108 29 -21 -87 68 87
5062 87 8 -68 -4 -5 73 17 -31 27 2 -45 18 112 0 71 -35 23 -80 -3 27 14 86 -17 -36 9 97 -44 22 106
5090 106 -33 -11 -40 -99 120 24 124 -35 55 -81 -13 159 15 -4 12 11 -67 53 -40 -17 -19 -68 20 51 30 46 20
5117 20 -96 28 1 117 -8 92 46 -116 122 8 -163 25 -95 -34 -20 -39 59 -27 -112 -37 -90 -156 114 122 -106
5142a06K17j30j22J95n4O1n8j48J0K12j25P2r5J52o8j2l7k6j28K15l5L7n3K8n1
5167d9J13o9q2N3Q6r3J68j39J58j95K0J00j52J49j26Q5j26K11j7K2j35N1NL3q9
5192a8P2q2P6Q7j10o4J87j55p4M2Pp7J50p8j6P1j02J70k02J11m3Q3r5K9N7K7K5
5219G8j9k9k3n8J06M7K0j20O1P3k8j29L7n8m8K22k05K05j51N7L8q8M4J18l6l9
5245G5n5N9j08J76j57p8J50j39K22n7j25k8J23m3mn0m3N4J66j40n4P9j0m1J06
5270G8j8j45q5K19m0PM5j19R9qj23K39p1j58J11j21M3O5J0n8J29k4n5j7J27k45
5296a15O8J04j07N8lRL0r2Rq9O5J94p2J10m6o9n1m5M1P5j00j7J57r1N1J2l2Q1
5324A35j31n3K8M2k2q0m4O9J78j34l2J23k9r2J55k96J81j18J85K1j30L1J07k13
$$ plain form
5142 -106 111 -19 -141 54 0 61 3 -145 -135 77 -48 24 -71 81 13 1 -36 -62 -190 25 -10 27 -26 2 -49
5167 -49 64 -5 -87 -34 52 -41 127 -12 146 -49 -29 71 -81 68 -58 27 -99 112 95 117 -18 33 38 71 -18
5192 -18 54 -28 48 135 25 -39 148 -7 -81 -39 -32 -109 41 -37 -53 18 -84 86 -116 -5 -48 35 -60 -31 26 53 78
5219 78 59 30 7 -51 55 102 122 2 63 136 108 -21 16 -42 -90 132 -73 132 -19 38 76 -12 32 150 114 75
5245 75 20 79 -29 147 -10 -88 62 -77 145 88 -37 -65 58 15 11 -39 -82 -28 138 -2 -56 23 13 -28 78
5270 78 60 -85 -170 49 9 16 61 -58 41 33 -90 149 78 -80 31 -90 -47 18 28 -30 99 75 20 3 130 -115
5296 -115 -47 57 -50 8 5 14 44 -48 -39 -128 -63 131 59 169 123 54 3 -42 -1 74 -26 -43 114 23 74 86 54 135
5324 135 4 -49 -21 21 -1 -81 -125 -56 122 -12 -44 79 50 -42 113 -183 -2 -120 65 86 -44 -13 94 -119
5348a19J12Q0k01NJ86p6j63P5Q7J0r9J1J51K6j02p0j6Q5P6K3k0qR0k29j5K11k9
5375H1o4m6n3M8j3J78j14o7J77j3q6M5k20N6L7m8N1rJ75j54K2qo1R8j53K1P8Q4
5403D2j01J42j34l0n9K01r6R5n6l3OJ1P3Q1q7n9J0p8K6q3J22%M6n6M3k0k8O7q3
5432c8L0k0j9p9J28j84K79J0j33K9k2r0J20j12J23N5m7j6q3o1J79J5q5qO2j69
5458a36J93j39J08M8m1Lr3j08K16j94J43O2k2Pq1r6J72k4l2K4PM6M3n6k23K22
5484D9r4L3Q7R9j46jm9J36j03M3j54P2O0o4o9P1N6p7J63p7j85J51nJ28p9j8Or5
5512f2R5J10k22P8k2L9o6O3r9Q7r8O9J90k64J91j18K5J37k04P4o6m6J70j9j46
5537a04J43k1LN5j91J13k8NJ66j47L8j6O2J0j44J60m6M4j37N1nR6j6j87M3P7j41
$$ plain form
5348 -119 -7 73 -128 -123 63 -13 -176 -101 -14 -4 -103 -92 59 85 -17 -87 -103 -18 58 81 61 53 143 -86 -101 110 81
5375 81 17 -29 -82 -34 -47 131 17 -50 127 114 28 73 -147 -91 -54 -102 -51 -60 115 -39 -17 -25 -86 12 -141 -120 -42 42
5403 42 -59 83 -51 -81 -140 61 -35 60 4 -29 -23 -12 61 142 55 -4 6 -72 -46 -129 -7 -7 39 -17 26 6 -22 45 -38
5432 -38 -8 -28 -47 -126 2 -182 97 107 -26 3 -19 -109 11 -101 22 77 30 14 -69 -130 49 64 -21 -29 33 -136
5458 -136 57 -82 26 74 33 36 -57 -165 51 -143 0 62 40 47 -34 -130 42 18 -14 10 17 63 106 50 -173 49
5484 49 -45 -12 75 174 28 27 -22 114 11 54 -100 -28 32 -32 -101 -30 26 -51 112 35 -150 1 -4 124 45 27 33 -62
5512 -62 33 143 -79 -1 -23 16 -50 13 -86 1 -97 -28 162 -102 89 -29 -4 133 -71 3 -63 -109 61 42 -104
5537 -104 39 18 21 76 -115 -2 -30 -25 141 -6 32 16 78 88 -56 104 58 102 -35 16 11 107 91 -96 -53 24 -117
5564a17Q4Rm7M8M3p1J22p0k8Oo5P1M5ll0Q7j24j6Q2j28K14j30p5M7J40q5p0J8
5592d3j11K38n5j03J19o4L4j63J11l0k7Q8J1N9j65K17j73J82o0n9L3j5L3j86J52
5617B3j73Q8J47J0p4j4j10J20K1j4N5o2k0R1J8p7n4j58J02NJ60l4l7L2K6n8r0
5644g7J60o5QQ2j29Ll8O8J4P6nq1k4L8j71l2P9Q1l6J23j55K01k49J53l8J2n2k4
5672g8N4M1P8M9j90jP6j74K41j61R2l0L7n3m3lrJ20RL6K7p1q2m1J66Qm2j14J9
5701c9J9K7k4p5K79j81J12q9n8J7M1r0r2J95M4k57P9R6%n8J06m6p8J40m5k0o5
5728f2K5RJ0n0J54j59j0J95j56m6J34j37K27j07rP7j16k9k0Q8Pm4l3LM6P8k3j06
5756e4J58q6q3k2P0K2j5p5Q6J68k43J6J96j71P0Jj02P8P5j5j39J85j06Q4l1j15
$$ plain form
5564 -117 -33 -24 -71 -23 20 -51 71 1 -27 -21 -86 -15 30 27 -3 84 -40 -56 26 -102 112 -18 -93 -46 94 9 -61 -43
5592 -43 -154 84 29 -74 45 -19 15 -148 -37 -67 -94 -6 5 64 -101 116 -57 125 65 6 39 24 57 -129 23
5617 23 -150 -62 85 95 21 7 -103 17 38 24 79 17 -3 88 106 29 -25 -183 -81 -76 84 50 13 45 71 13 -77
5644 -77 83 18 26 108 -21 -18 -56 12 26 102 97 16 -8 30 -141 -173 -94 -13 -49 74 -81 120 -129 24 -14 -2 -54 -78
5672 -78 -24 17 95 144 -46 -47 29 -145 96 -65 27 -3 34 -19 -62 -65 -74 46 55 91 118 47 -35 -76 90 98 56 -58 -39
5701 -39 -20 7 -17 -92 187 6 118 29 -29 -12 29 -61 -153 42 86 -171 -92 4 4 -54 52 6 -72 68 23 3 -62
5728 -62 -37 -28 -18 -68 86 -73 -83 112 -44 -90 44 -93 134 27 18 95 -21 -50 -70 18 25 -19 -52 -49 -3 75 52 -54
5756 -54 104 18 -65 -87 -17 5 -10 -85 1 169 -74 -58 138 -33 37 38 -64 14 89 74 -65 120 14 98 67 -48
5782d8MO0M1Rm9k3J39k82Q7J90j92J16L2r8m3Q1j41O9l0%R3Mnj05O6MQ9j51R1
5811Hq3O6L0q9L3J06j30kL1O8m5lkk0N3m9N9p1J51j73O3L2j14J66j69J03lKk7
5840ikmLM3Q7j38n6Q3O8p1PM0L7o7j12J30l8n5J08q6n2K24j07j72J64p9l4J09
5868B1N6j51N4L1M5n2j12Q9P4j12P4o8L4l8p5K30p9l7J49j47K6L9p1o1O8oR3n
5896F9p2J44r0n9L4l8J1N5Pj59Q8N3l7n6m2O9l1J57p9k6K5O1j14MJ73j74n9R6
5924A0J9m4M4j17R1J56m6q4K9l9k1K5j27J01j0O0m7J06j0n3j3q0R9m3L7l3JJ24
5952A35l5j96J26j32J69j23M9P9mp0j17J91l2K1j2j1k74J66J10j9k9O2j74J13
5976gOJ7o2n8O2r9K49j27R3r5j19K91r8j7J11J9k02P7jj03M7qm4M4N8J41j63j28
$$ plain form
5782 -48 -44 16 57 66 17 -6 133 -149 -62 128 -64 52 84 -14 -57 24 -117 -48 -78 -78 15 19 14 -91 -25 -21 68 -83 8
5811 8 -75 -9 21 -68 -35 71 -59 -61 -30 38 -7 -10 -12 -32 21 -28 31 -40 111 -62 1 33 -81 85 -84 19 16 18 -9
5840 -9 -11 -15 -12 31 118 -20 -76 7 75 4 11 51 88 21 -91 39 1 -54 54 -32 -84 140 33 -139 25 -54 -88 21
5868 21 77 -74 -20 11 56 4 -108 -19 55 -57 17 -51 -17 -55 -130 100 21 -16 133 -14 12 51 -20 -81 -13 -19 74 69
5896 69 -3 141 51 -8 26 -12 -1 54 61 -98 -10 43 6 -50 -92 -23 -54 103 24 -2 23 84 -30 -26 147 -27 -86 10
5924 10 29 -15 29 -88 3 159 113 29 58 19 -2 23 -104 -3 -13 47 0 106 96 43 30 -50 49 6 43 10 11 135
5952 135 100 -96 30 -102 67 -56 -7 72 68 -2 -119 72 40 61 49 38 -236 -70 40 21 -8 54 -120 -7
5976 -7 -1 16 -46 -104 -42 -141 108 -19 74 -21 -140 151 53 36 147 166 -36 41 40 -63 -16 -24 -68 -24 34 175 12 -116
6004a16J76p1J6m9J24r6r8PJ83j36%N5J26j16MJ56j34l6j6Q9j35J23Ok1p1J29
6030I9L6j26p9M0J16q8j91L67l40P4J27Njk8l6j54J38P7K0n4m7J7n1j7K54o3j66
6057g1pJ17J54q3k14J42Oq3j5k3O0J9L2nj41N7L0O5j47K09j39M9J50j16j04P4
6083A6r1O5N6k29J30NJ2N0j55J66R3j08J04k93J94l3K5m3J0J11r3j1rl4K35q6
6109H7p3j05P7l4n2M5k3qmQ1K5m2P0j75J37K4j33J97p9kL1O5j86Q5M8l7n5J28
6137I2j17R2k9R9j62R9k1j43M1Q6M6l03K60J12k46J00N9n8m2qO0Ol0j13J28o2
6163e4J07o2M5o1mM5q4P1L2j37O7J0k3j21J79n1p8J90j26P1j7O7Q3l15K70j58
6189e4J01j35KJ25n1l8nM8k46K06L8m6P2p1j14J21M2j00M7jQ0k7J73j72m1J57
$$ plain form
6004 -116 60 -11 5 -44 80 -16 -114 -107 76 -60 -60 -5 121 5 9 165 31 -5 -21 68 -67 56 62 41 -30 99
6030 99 135 9 -70 -30 86 -2 -193 174 -166 -92 35 40 39 11 -25 -179 -41 36 56 2 -45 -28 -79 -96 158 95 -71
6057 -71 -78 39 193 110 -104 38 44 -39 -54 -77 -17 2 34 29 -112 -55 -25 40 -107 102 -37 12 162 46 -58 16
6083 16 -75 -10 46 -183 -53 -48 -36 14 -141 25 118 10 114 -179 15 -18 7 -36 -26 85 -8 -19 -28 -62 173 87
6109 87 14 -91 -14 -48 -100 -55 -78 -86 -90 -9 16 -26 44 -131 6 30 -103 94 15 13 44 109 -77 8 56 19 -36 92
6137 92 -25 67 38 137 -25 74 53 -90 -49 37 83 -220 40 152 -94 6 65 7 -35 -43 17 23 -7 -120 8 -54
6163 -54 53 -9 36 -25 -29 16 -68 3 35 -102 -35 -25 -48 -169 10 -41 -119 71 -55 16 -1 66 149 -166 104 -54
6189 -54 47 -88 -86 39 -12 -50 -55 -7 -253 -47 -9 -55 17 -54 -168 -47 -5 -105 -58 -59 21 -6 167 -5 -46 111
6215A11k35J84J8m6N6k5lQ5l0M2o7p6ml3j8j9O0j04J80k39O4J52j96J12j7J7n6
6242h7J34m1p7J24o4N3j08K5J05q7O3K1n3j37J40j1o5RK8N3L9j17R4K9j86R9N6
6269C9P5q0L8l4m8L9pj00J30j46J58k16J28m8R6Lj31O0J0k%k3N4j9N2p1L2N2L
6298D4m4K7N4k6qn1K7j1L4j01o6j1R1N1N5r3n2k4J00R0l8L9j29P6j8N1o3j2Rj25
6328a24J64j41J8M0l3J15kn0oJ31j55L9o5K8J14j4pj07J72j17Jj1M6L8j56J17
6354C5P8q3o7j0j3J99k40J8O1R3j79J44l3j42N0K6J23j62J21q7N8L5L2j0LOl7
6381A9p7J12KN6k35R3O0Oj07M3K9M4L0M0j2r9K0J2L4k52J95r1K5R5p2O2j4nl7
$$ plain form
6215 111 -124 60 78 32 88 63 60 145 115 157 90 14 10 -23 -41 -60 0 -104 76 -163 -99 53 -143 -31 -48 -31 -87
6242 -87 47 6 -71 53 -11 42 -66 -41 64 -23 40 61 8 -129 11 0 -65 -56 -28 25 64 -53 41 70 -116 -17 39
6269 39 114 34 72 38 -10 29 22 -78 52 -94 64 -152 -24 -72 24 27 -104 -44 -34 -36 -36 -59 -5 -24 28 -43 -11 41 44
6298 44 0 27 81 55 47 -4 23 12 46 -55 -121 -132 -41 10 65 -28 -80 -104 -4 86 48 87 -42 34 16 67 4 -8 1 -124
6328 -124 40 -101 -83 -43 -76 39 37 -13 -19 112 -43 -4 -69 -41 73 59 52 -55 117 0 1 -10 36 74 -82 35
6354 35 113 30 -37 -47 -60 139 -101 -83 -22 71 -108 36 3 -139 -89 -63 60 -102 19 -68 -10 25 57 47 50 56 19
6381 19 -58 54 56 112 -123 -30 30 36 -71 -28 1 45 75 115 103 4 24 36 70 -182 13 -78 -53 42 -30 32 18 13 -24
$$ [...]
8191e5
##END NTUPLES=NMR FID
##END=
