##TITLE=1H_2ABPA1305-3
 CDCl3, 8 sc, 
 14.05.2021
##JCAMPDX= 6.0         $$ Bruker NMR JCAMP-DX V2.0
##DATA TYPE= NMR FID
##DATA CLASS= NTUPLES
##ORIGIN= UXNMR, Bruker Analytische Messtechnik GmbH
##OWNER= root
$$ XWIN-NMR		Version 3.5
$$ Fri May 14 11:22:33 2021 Russian Standard Time (UT+4h)  she@DPX200
##.OBSERVE FREQUENCY= 200.131506
##.OBSERVE NUCLEUS= ^1H
##.DELAY= (6, 6)
##.ACQUISITION MODE= SIMULTANEOUS
##.ACQUISITION SCHEME= undefined
##.AVERAGES= 8
##.DIGITISER RES= 18
##SPECTROMETER/DATA SYSTEM= spect
##.PULSE SEQUENCE= zg30
##.SOLVENT NAME= CDCl3
##.SHIFT REFERENCE= (INTERNAL, CDCl3, 0, 15.7039)
##AUDIT TRAIL= $$ (NUMBER, WHEN, WHO, WHERE, WHAT)
$$ ##TITLE= Audit trail, XWIN-NMR		Version 3.5
$$ ##JCAMPDX= 5.01
$$ ##ORIGIN= Bruker BioSpin GmbH
$$ ##OWNER= she
$$ F:/spectra/data/she/nmr/H-F/1/audita.txt
$$ ##AUDIT TRAIL=  $$ (NUMBER, WHEN, WHO, WHERE, WHAT)
(   1,<2021-05-14 11:21:08.81 +0400>,<she>,<DPX200>,
      <created by zg, POWCHK disabled, PULCHK disabled
       configuration hash MD5:
       00 E9 B6 7A A2 85 ED C7 34 08 36 98 17 FE 4E 26
       data hash MD5: 16K
       5F E3 20 AB 67 42 35 4B 89 1E B4 57 E9 A1 58 75>)
$$ ##END=
$$ 
$$ hash MD5
$$ 4E C2 F1 BD F5 D8 45 7B DE 7F CD 5F B8 B2 35 FB
##$RELAX= 
##$RELAX= 
##$RELAX= 
##$RELAX= 
##$RELAX= 
##$RELAX= 
$$ Bruker specific parameters
$$ --------------------------
##$DU= <F:/spectra>
##$EXPNO= 1
##$NAME= <H-F>
##$PROCNO= 1
##$TYPE= <nmr>
##$USER= <she>
##$AMP= (0..31)
100 100 100 100 100 100 100 100 100 100 100 100 100 100 100 100 100 100 
100 100 100 100 100 100 100 100 100 100 100 100 100 100 
##$AQSEQ= 0
##$AQ_mod= 1
##$AUNM= <au_zg>
##$AUTOPOS= <>
##$BF1= 200.13
##$BF2= 200.13
##$BF3= 200.13
##$BF4= 200.13
##$BF5= 200.13
##$BF6= 200.13
##$BF7= 200.13
##$BF8= 200.13
##$BYTORDA= 1
##$CFDGTYP= 0
##$CFRGTYP= 5
##$CHEMSTR= <none>
##$CNST= (0..31)
1 1 145 1 1 1 1 1 1 1 1 1 1 1 1 1 1 1 1 1 1 1 1 1 1 1 1 1 1 1 1 1 
##$CPDPRG= <>
##$CPDPRG1= <>
##$CPDPRG2= <>
##$CPDPRG3= <>
##$CPDPRG4= <mlev>
##$CPDPRG5= <mlev>
##$CPDPRG6= <mlev>
##$CPDPRG7= <mlev>
##$CPDPRG8= <mlev>
##$CPDPRGB= <>
##$CPDPRGT= <>
##$D= (0..31)
0 1.2 0 0 0 0 0 0 0 0.06 0 0.03 0 0 0 0 0.0002 0 0 0 0 0 0 0 0 0 0 0 0 
0 0 0 
##$DATE= 1620976868
##$DBL= (0..7)
120 120 120 120 120 120 120 120 
##$DBP= (0..7)
150 150 150 150 150 150 150 150 
##$DBP07= 0
##$DBPNAM0= <>
##$DBPNAM1= <>
##$DBPNAM2= <>
##$DBPNAM3= <>
##$DBPNAM4= <>
##$DBPNAM5= <>
##$DBPNAM6= <>
##$DBPNAM7= <>
##$DBPOAL= (0..7)
0.5 0.5 0.5 0.5 0.5 0.5 0.5 0.5 
##$DBPOFFS= (0..7)
0 0 0 0 0 0 0 0 
##$DE= 6
##$DECBNUC= <off>
##$DECIM= 32
##$DECNUC= <off>
##$DECSTAT= 4
##$DIGMOD= 1
##$DIGTYP= 9
##$DL= (0..7)
0 120 120 120 120 120 120 120 
##$DP= (0..7)
150 150 150 150 150 150 150 150 
##$DP07= 0
##$DPNAME0= <>
##$DPNAME1= <>
##$DPNAME2= <>
##$DPNAME3= <>
##$DPNAME4= <>
##$DPNAME5= <>
##$DPNAME6= <>
##$DPNAME7= <>
##$DPOAL= (0..7)
0.5 0.5 0.5 0.5 0.5 0.5 0.5 0.5 
##$DPOFFS= (0..7)
0 0 0 0 0 0 0 0 
##$DQDMODE= 0
##$DR= 18
##$DS= 0
##$DSLIST= <SSSSSSSSSSSSSSS>
$$ [...]
##$SUBNAM2= <"">
##$SUBNAM3= <"">
##$SUBNAM4= <"">
##$SUBNAM5= <"">
##$SUBNAM6= <"">
##$SUBNAM7= <"">
##$SUBNAM8= <"">
##$SUBNAM9= <"">
##$SW= 16.9725357007746
##$SWIBOX= (0..15)
0 0 2 0 0 0 0 0 0 0 0 0 0 0 0 0 
##$SW_h= 3396.73913043478
##$TD= 16384
##$TD0= 1
##$TE= 0
##$TE2= 300
##$TE3= 300
##$TEG= 300
##$TL= (0..7)
0 120 120 120 120 120 120 120 
##$TP= (0..7)
150 150 150 150 150 150 150 150 
##$TP07= 0
##$TPNAME0= <>
##$TPNAME1= <>
##$TPNAME2= <>
##$TPNAME3= <>
##$TPNAME4= <>
##$TPNAME5= <>
##$TPNAME6= <>
##$TPNAME7= <>
##$TPOAL= (0..7)
0.5 0.5 0.5 0.5 0.5 0.5 0.5 0.5 
##$TPOFFS= (0..7)
0 0 0 0 0 0 0 0 
##$TUNHIN= 0
##$TUNHOUT= 0
##$TUNXOUT= 0
##$USERA1= <user>
##$USERA2= <user>
##$USERA3= <user>
##$USERA4= <user>
##$USERA5= <user>
##$V9= 5
##$VALIST= <valist>
##$VCLIST= <CCCCCCCCCCCCCCC>
##$VD= 0
##$VDLIST= <DDDDDDDDDDDDDDD>
##$VPLIST= <PPPPPPPPPPPPPPP>
##$VTLIST= <TTTTTTTTTTTTTTT>
##$WBST= 1024
##$WBSW= 4
##$XGAIN= (0..3)
0 0 0 0 
##$XL= 0
##$YL= 0
##$YMAX_a= 196392
##$YMIN_a= -241952
##$ZGOPTNS= <>
##$ZL1= 120
##$ZL2= 120
##$ZL3= 120
##$ZL4= 120
##$ABSF1= 10
##$ABSF2= 0
##$ABSG= 5
##$ABSL= 3
##$ALPHA= 0
##$AQORDER= 0
##$ASSFAC= 0
##$ASSFACI= 0
##$ASSFACX= 0
##$ASSWID= 0
##$AUNMP= <proc_1d>
##$AZFE= 0.1
##$AZFW= 0.1
##$BCFW= 1
##$BC_mod= 2
##$BYTORDP= 1
##$COROFFS= 0
##$CY= 11.3945322036743
##$DATMOD= 1
##$DC= 2
##$DFILT= <>
##$DTYPP= 0
##$F1P= 15.9154993809931
##$F2P= -4.1035820241983
##$FCOR= 0.5
##$FTSIZE= 0
##$FT_mod= 4
##$GAMMA= 1
##$GB= 0.15
##$INTBC= 1
##$INTSCL= 1
##$ISEN= 128
##$LB= 0.24
##$LEV0= 0
##$LPBIN= 0
##$MAXI= 10000
##$MC2= 0
##$MEAN= 0
##$ME_mod= 0
##$MI= 1.114404
##$NCOEF= 0
##$NC_proc= 0
##$NLEV= 6
##$NOISF1= 3.799351
##$NOISF2= 2.8
##$NSP= 1
##$NTH_PI= 0
##$NZP= 0
##$OFFSET= 15.70392
##$PC= 1
##$PHC0= -11137.36
##$PHC1= 21.201
##$PH_mod= 1
##$PKNL= yes
##$PPARMOD= 0
##$PSCAL= 0
##$PSIGN= 0
##$REVERSE= no
##$SF= 200.130013532006
##$SI= 16384
##$SIGF1= 3
##$SIGF2= 2
##$SINO= 400
##$SIOLD= 16384
##$SREGLST= <1H.CDCl3>
##$SSB= 0
##$STSI= 0
##$STSR= 0
##$SW_p= 3612.71676300578
##$SYMM= 0
##$S_DEV= 0
##$TDeff= 0
##$TDoff= 0
##$TI= <>
##$TILT= no
##$TM1= 0
##$TM2= 0
##$TOPLEV= 0
##$USERP1= <user>
##$USERP2= <user>
##$USERP3= <user>
##$USERP4= <user>
##$USERP5= <user>
##$WDW= 1
##$XDIM= 8192
##$YMAX_p= 0
##$YMIN_p= 0
$$ End of Bruker specific parameters
$$ ---------------------------------
##NTUPLES= NMR FID
##VAR_NAME=  TIME,          FID/REAL,        FID/IMAG
##SYMBOL=    X,             R,               I
##VAR_TYPE=  INDEPENDENT,   DEPENDENT,       DEPENDENT
##VAR_FORM=  AFFN,          ASDF,            ASDF
##VAR_DIM=   8192,          8192,            8192
##UNITS=     SECONDS,       ARBITRARY UNITS, ARBITRARY UNITS
##FACTOR=    0.0002944,     1,               1
##FIRST=     0,             0,               0
##LAST=      2.4114304,     0,               0
##MIN=       0,             -241952,         0
##MAX=       2.4114304,     196392,          0
$$ Real data points
##PAGE= N=1
##DATA TABLE= (X++(R..R)), XYDATA
0@%%%%%%%%%%qJ6j6J6k4L2m0M8n6P2q8J04j20J44j68J92k24K61l01L44l92M48
32B40n12N80o54P35q26R24j032J151j283J426j578J748j936K138k356K598k865
49a502L157l478L829m218M652n138N689o316P031p862Q843j0017J1452j3252J5584
64H454j8733K3233l0205M2458o9840K28548l9876l85991M38344k51051j06760
75a61419L00481k51700M6316J96441k32343J77560j1688j76566K24097j08051
85C128r7730K01790j84256L7620J40063k14725J30449N8856k12472K22511k7544
96E7690j88939K35452q1572j23021K01063j30478l8114J49766j27999L3986O3747
107E1581j08787R3414j4752p9832J10577o5049l0178J08255j04358J6742Q5196
$$ plain form
0 0 0 0 0 0 0 0 0 0 0 0 -8 8 -8 8 -16 16 -24 24 -32 40 -48 56 -64 80 -88 104 -120 141 -160 184 -208 240
32 240 -272 308 -346 389 -437 487 -545 606 -677 749 -829 919 -1017 1121 -1235 1363 -1502
49 -1502 1655 -1823 2006 -2212 2440 -2698 2991 -3325 3706 -4156 4687 -5330 6122 -7130 8454
64 8454 -10279 12954 -17251 25207 -44633 183915 144039 -241952 196392 -54659 -161419
75 -161419 139062 -112638 -66322 130119 -102224 75336 63648 -112918 111179 3128
85 3128 -94602 107188 -77068 -39448 100615 -114110 16339 75195 -137277 85234 57690
96 57690 -131249 104203 22631 -100390 100673 -29805 -67919 81847 -46152 -12166 51581
107 51581 -57206 36208 21456 -58376 52201 -12848 -43026 65229 -39129 -22387 62809
118F2809j24144O4555N1265j31995J03877J8722j20916J22276k5252r2568J28868
129E7497o0250m9735J08181p8395L686O5915q7068M9260J9891p6535Q0692k7485
141E654m7635R4109p0661j1485Q9667r9418K6747P0376j11872O4158L6970j08221
153f1611R2338l646q4916J01351m0745m3760R0048o9444M412N9717q2343M8446
165I847J6371p1047P8923l0779m3364R0639o9558q828Q2058r2854K9781N7496
177D8685r8751O0991K3931q5730P6520j0926n7440P7268l9998k0647O1606n8673
189b3164J7829L2793o0569M6862j653m6806O5104l3917k6440O8442n6559m38N7211
202C8695o8179K3518L9309o6493L8490J8118n5029M5845l287l6436M5256k1285
$$ plain form
118 62809 -61335 3220 54485 -77510 26367 45089 -75827 46449 21197 -71371 57497
129 57497 -2753 -52488 55693 -22702 -19016 46899 -40169 9091 28982 -47553 33139 5654
141 5654 -41981 52128 -18533 -30018 59649 -39769 -13022 57354 -54518 9640 46610 -61611
153 -61611 30727 27081 -57835 43516 2771 -40989 49059 -20385 -15973 43744 -38599 9847
165 9847 26218 -44829 34094 3315 -40049 50590 -18968 -27796 54262 -38592 -8811 48685
177 48685 -50066 10925 34856 -50874 25646 14720 -42720 34548 -5450 -26097 35509 -23164
189 -23164 -5335 27458 -33111 13751 12098 -34708 30396 -3521 -29961 38481 -18078 -18516 38695
202 38695 -29484 -5966 33343 -33150 5340 23458 -31571 14274 10987 -25449 19807 -1478
214a478j3317L5518l2576Q696K0153l6486K8846J823l5087M3966j7069k5602N0054
227B7441l4280j1670M9600m5687K654M2059n0523J7578K7322m7950K9710R226
239A5480l6939L5021r023k0771L4141k4900M0K5400l6172K1777J0395l7976L8194
252A4667q258l1469M8554k6271j9005M9652m0467j326M0775m6318J5243K4913
264B0690m2848K7703N735l1604L3397j3164j3692L0281k7755P168J9665l4230
276a8654K4637M629l2760L7378j1889k4618M2178k5844j0814L8042l3527K963
288h279K7535l3789J4273J3680k8293K1415j091j6942K2201j3010l712J7954k0251
301h309Q216J0909k2912J7965J844k1647K4559p207j6107K5745j3422r836K3589
$$ plain form
214 -1478 -14795 20723 -11853 -3157 16996 -19490 9356 11179 -23908 20058 2989 -22613 27441
227 27441 -6839 -18509 31091 -14596 -11942 30117 -20406 -2828 24494 -23456 6254 15480
239 15480 -21459 13562 4539 -16232 17909 -6991 -6951 18449 -17723 4054 14449 -23527 14667
252 14667 6409 -25060 23494 -2777 -21782 27870 -12597 -13923 26852 -19466 -4223 20690
264 20690 -22158 5545 11280 -20324 13073 -91 -13783 16498 -11257 -4089 15576 -18654
276 -18654 5983 10612 -22148 15230 3341 -21277 20901 -4943 -15757 22285 -11242 -8279
288 -8279 19256 -14533 -260 13420 -14873 6542 5451 -11491 10710 -2300 -6012 11942 -8309
301 -8309 -93 10816 -12096 5869 7713 -13934 10625 3418 -12689 13056 -366 -10202 13387
314A3387j7077l036J9056j8581M029J1319j6141Q771L084j1357J1547m606n877
327e482J3112j1928J621J1258j7035Q855P561j8973J4665K696j8860J9482l510
340C462j5334K0850r577q594J8583j3383j398J3442j4726N937N885j3260J2337
353D224l586p976J5144j2011m88J4297j7703O744J1166k0900J3839N166j9983
366a2067J8343j970j4857J8911p789q285J6346j1374m18J0499j2761P108K244
379C930r714J1712o041m549J3012j2397J441J1967j6602P736P676j6911J2013
392C273K705j4372J3531j927j0227J2668n237m889R612p126O57M696o333M393
406A424m99m244O741m782j609P963q713J809P037j0271M364N490j0482N957L887
$$ plain form
314 13387 -3690 -6726 12330 -6251 -2222 9097 -7044 1727 4811 -6546 5001 395 -5482
327 -5482 7630 -4298 -2677 8581 -8454 401 7962 -11011 3654 6350 -12510 6972 3462
340 3462 -11872 8978 -599 -9193 9390 -3993 -5391 8051 -6675 -738 5147 -8113 4224
353 4224 638 -7338 7806 -4205 -4693 9604 -8099 -1355 9811 -11089 2750 7916 -12067
366 -12067 6276 4306 -10551 8360 571 -7714 8632 -2742 -3160 7339 -5422 1686 3930
379 3930 -5784 5928 -113 -4662 8350 -4047 -2606 9361 -7241 495 8171 -8740 3273
392 3273 5978 -8394 5137 3210 -7017 5651 414 -4475 5137 -1989 -1332 3364 -2969 1424
406 1424 925 -3319 3422 -1360 -2969 4994 -3719 -1910 5127 -5144 -780 4710 -5772 185 4072
421D072r927O898J772q102O823k52n277N690j490k870M302k655J99J918l348L341
437A094p80k771N152l355k019O621n537q68P578q011J449O698q545L095M649q136
453c686M718K521p133N706n18l931N188l191l11L525m697L058R41n012N863k290
469G51l892P483n321j616P464p052O33N949p508K778L762p140M757P95m738M676
485A781j923j587L584l690J204K282m710M037j64m470N942k635k936N982l840
500a143j584N386m390M4M039m330J177K050k706J432M27j438J484q82j11J199
516F54j618J268N31k315K570m45k274K894l58k813L500p04k657L642j028k466
532a619L256o51k438K828m51j889K503j293o16J415r36M3L72p93J400j289m42
$$ plain form
421 4072 -5855 1043 2815 -5287 1536 1284 -3993 1697 207 -2663 1639 -1016 -817 1101 -2247 1094
437 1094 314 -2457 2695 -660 -2679 3942 -1595 -2463 5115 -2896 -1447 5251 -3294 -199 4450 -3686
453 -3686 1032 3553 -3580 2126 1608 -2323 2865 -326 -637 2888 -1809 1249 2190 -2822 3041 751
469 751 -3141 4342 -979 -2595 4869 -2183 -1550 4399 -3109 -331 3431 -3709 1048 1843 -2895 1781
485 1781 -142 -1729 1855 -1835 -631 1651 -3059 978 814 -3656 2286 -349 -3285 2697 -1143
500 -1143 -2727 2659 -1731 -1687 2352 -1978 -801 1249 -1457 -25 402 -1036 448 -434 -545 654
516 654 -964 304 835 -1480 1090 645 -1629 1265 907 -1906 1594 890 -1767 1875 847 -1619
532 -1619 1637 986 -1452 1376 925 -964 1539 246 -370 1045 109 152 524 -269 1131 -158 -600
549f00K667l234R91K437m580K913J643n067L732J078n352M768m73l820M710k011
565a98j983L790k394l20K217k560J577j30j907L216k594m5L390m604K183K152
581A790m811L585J110n017M696o87l494M489j655j648K948j679m48J723j265O80
597C17n2p14J434j611N37J340k095J246R26k162J431P90k477J760M63j877J421
614F77K03j264N97J116j833N23J459k021O77R98j814J103M59j856J718o36p89
631f83J669j763R22O00k287K221l08k264L412k029j343L784l234K7L273m021J667
648c57J729l656K798l6k711L729k396o06L285l882J996J650m351L919l59l717
664b965N135k482j889M954m273L95L457m039J918J244l164K887n69j788K730k149
$$ plain form
549 -600 2067 -1167 -176 2261 -2319 594 2237 -2830 902 1980 -3372 1396 923 -2897 1813 -198
565 -198 -2181 1609 -785 -1105 1112 -1448 129 -1 -1908 1308 -1286 -1331 2059 -2545 -362 1790
581 1790 -3021 564 1674 -3343 1353 666 -2828 1661 6 -1642 1306 -373 -821 902 -363 317
597 317 265 -449 985 -626 -89 1251 -844 402 1328 -834 597 1387 -1090 670 1133 -744 677
614 677 880 -384 213 1329 -504 19 1478 -543 134 1132 -682 421 880 -976 742 106 -683
631 -683 986 -777 145 745 -1542 679 371 -1893 1519 -510 -1853 1931 -1303 -1276 1997 -2024 -357
648 -357 1372 -2284 514 478 -2233 1496 -900 -1506 1779 -2103 -107 1543 -2808 1111 752 -2965
664 -2965 2170 -312 -2201 2753 -1520 -1125 2332 -1707 211 1455 -1709 1178 609 -1179 1551 -598
680e98M54J758k728J798N11k617K672l91k297L219j481j452L119k136n90K246
696A487j601l24J519j037j98O20l33j95J49L38o51J22M55p56L47K06k02l24J99
715a79N83j013L50J032k013Q87J609l140J973R09l303K882o6k793L439j034k148
732b025L432k167n16K497k648J381N67k172K842j479j154L459l457P98L002m802
748b442K852J572m763M384l46l792M841j988k026M133l231K27K645l345J949M06
764A076k285K765j719o25K851l091R24K097l774K736M38l414L552p27k432L297
780A669j671j215K674k083K57J301j701R48M4o72N47l28k15O80p03J57N32q20
798e99L89K73p84L86O00p58j17J206j397J97J209j561N06J223j832J074N89j946
$$ plain form
680 -598 -144 1614 -1114 684 1195 -1422 1250 859 -1438 1781 300 -1152 1967 -169 -759 1487
696 1487 -114 -438 1081 44 -154 466 133 -62 87 425 -226 -104 351 -405 -58 148 -54 -378 -179
715 -179 404 -609 -259 773 -1240 -353 1256 -1884 89 998 -2305 577 511 -2282 1157 123 -2025
732 -2025 1407 -760 -1276 1221 -1427 -46 521 -1651 1191 -288 -1442 2017 -1440 -642 2360 -2442
748 -2442 410 1982 -2781 1603 1257 -2535 2306 318 -1708 2425 -806 -579 2066 -1279 670 1076
764 1076 -1209 1556 -163 -788 2063 -1028 -104 1993 -1781 955 1393 -2021 1531 804 -1628 1669
780 1669 -2 -1217 1457 -626 -369 932 -769 179 223 -449 98 -230 -445 235 -468 -311 221 -599
798 -599 -210 63 -721 -335 265 -493 -610 596 -801 -604 605 -956 -450 773 -1059 15 604 -1342
816a342J810n55j075K260j573k0J678k355J414Q01k744K809o30k106L673k483
832d38p04L425l317Q93K320l759K211P25k949L339j554j405L003k721Q59J839
848A767l344K388M97l318L849j623k060M052k957l08L227l553R15K288l440J957
864C37N61k412K334q13r57J870j741N92Q10j752J467J9j721K307j191r80K334
881A064j781j83J713j566K4J454j399M3J190j058N8R20o80k61Q82p50l6P79p21
900c08K63J29l93N86k67j80P28r92N26R06j855J511K22k166K610p08j923K875
918A564j485j120L097k641K8K551l068J558P56k415K244n93j608K659k115L0K191
935A633l133J853P40l075L194o98k479L667k167j046L439l004L36K282l199J635
$$ plain form
816 -1342 468 -87 -1162 1098 -475 -495 1183 -1172 242 1043 -1701 1108 478 -1628 2045 -438
832 -438 -1142 2283 -1034 -141 2179 -1580 631 1356 -1593 1746 192 -1213 1790 -931 -72 1767
848 1767 -1577 811 1308 -2010 1839 216 -1844 2208 -749 -1057 2170 -1383 -468 1820 -1620 337
864 337 898 -1514 820 7 -950 920 -821 -229 581 -1171 296 315 -1406 901 -290 -1270 1064
881 1064 -717 -900 813 -753 -729 725 -674 -631 559 -499 -441 479 -201 -462 420 -330 -366 413 -308
900 -308 -45 84 -309 277 10 -170 558 -434 92 998 -857 654 876 -1290 1320 612 -1311 1564
918 1564 79 -1041 2056 -585 -557 1994 -1074 484 1240 -1175 1069 476 -1132 1527 -588 -558 1633
935 1633 -1500 353 1093 -1982 1212 514 -1965 1702 -465 -1511 1928 -1076 -740 1542 -1657 -22
951b2Q85k454K269o59j384K540j886l6J839k495J621M67k202K321o38j603K362
968I25j156o98K191k144M61J249j721J004M44j148R32Qq70R12j45m50O68m96R2
987E8N13p35K34M67n20J2P12j001M28N11j132O34L63j062J034J63j388J429o02
1006A18n82J330j103p3J206j564O72P83k022J900l19j426K430j890m51K247k332
1023a076O91J455k552J558N77k251K431q90j250K405j953K61J374j915J384K46
1039D95j947K345p94j380K558j917k01K214k638R77J408k358J566M01k054K197
1055H72n20j198J756j151j71J301j397P01L98j122J300p12m13J308j058l6J009
1072H67j229K25J117j518O75O57j278P91L09j138Q08K26r76O54J75q76P27j49
$$ plain form
951 -22 863 -1591 678 19 -1365 1175 -711 -747 1092 -1403 218 685 -1517 804 166 -1437 925
968 925 -231 -929 1262 -882 -421 828 -893 111 555 -593 339 347 -523 389 244 -206 462 -34 58
987 58 571 -164 70 537 17 29 741 -260 168 679 -453 181 544 -518 516 679 -709 720 118
1006 118 -464 866 -237 -310 896 -668 4 787 -1235 665 346 -1080 1350 -540 -991 1256 -1076
1023 -1076 -385 1070 -1482 76 653 -1598 833 -57 -1307 1098 -855 -594 780 -1135 249 495
1039 495 -1452 893 99 -1281 1277 -640 -841 1373 -1265 -288 1120 -1238 328 729 -1325 872
1055 872 352 -846 910 -241 -412 889 -508 193 591 -531 769 57 -356 952 -106 -142 867
1072 867 -362 -137 980 -538 137 794 -484 307 616 -522 286 512 -464 190 365 -511 216 67
1090F7l80M87j07o5L70n88Q4L94r62Q81J05q88J006o07n29J309j193n0J505j771
1110i32N54J031j848J329K08j419J535k25j263J763j173k44J514j470N33P37j609
1127i79J371j24j198J966j073p75K049k022N44J381k036J261M97j786J658l33
1143D01j230J892j193k81J518j772P54P06j539J093R0j155J381n53n68J396j209
1160b69j33J038j112O45L91j147R09m7r78J228o01k86Q95p87q5P45q76K73O11
1179D14j025N09M41r48O84N9p34N85J12n30M98k73l93Q81m41j96P82p85K61M78
1199C79r00O56J37p36Q25k82n86J143j055K00R24j210M64J008j678J002L61j475
1217h23J443l79q41J307p93j72J235j221K71O71j362J246l58r16J706j262k1J164
$$ plain form
1090 67 -313 174 67 2 372 -216 -132 262 -700 181 286 -602 404 -203 -732 577 -616 -666 839 -932
1110 -932 -378 653 -1195 134 342 -1077 458 233 -1030 733 -440 -684 830 -640 -107 630 -979
1127 -979 392 268 -930 1036 -37 -812 1237 -785 -241 1140 -896 365 862 -924 734 401
1143 401 -829 1063 -130 -411 1107 -665 89 795 -744 349 439 -716 665 112 -456 940 -269
1160 -269 -402 636 -476 169 560 -587 322 275 -703 525 -76 -362 533 -254 -339 406 -470 -197 414
1179 414 -611 -102 339 -609 75 134 -600 -15 97 -433 65 -208 -601 280 -161 -357 425 -360 -99 379
1199 379 -521 135 272 -464 361 79 -507 636 -419 -219 705 -505 -41 967 -711 291 652 -823
1217 -823 620 241 -600 707 -86 -258 977 -244 27 698 -664 582 224 -692 1014 -248 -269 895
1235H95j444M48J024j794J260J90j537J580l85r81J314o11m40J259j178N2R96
1252F48j284P20L4q12R69n20k49J015r07N7Q11j229Q08O9r78R39j68n30Q65k93
1272c5n68R57m96j97Q12o86J30K88l30k9K79k02J85M6l53K91J23j89R9q9mL70
1294D02l85m9L94m80K24K59m90K58K23o68N73M9o07J012p61j91Q58q10J5Q30j041
1315c85M40L43r38R39l57o76J183p59j87J048j099M20M36r02O67q5q86J221o49
1334b26m11J242r98J28Q07j182O52M14j225J219l01r08J362q62k79J011r00L75
1352h2O29r93N88P7o30R31n51j37O87p57J70M52p97O28K0o57P36j82m53P54l66
1373F7k38P46m86k26L98l37K8L26j73L3k8m8p0M4JN7R8k25J19k2j17J81k52l7
$$ plain form
1235 895 -549 -101 923 -871 389 579 -958 622 237 -744 570 -41 -481 778 -400 -348 648
1252 648 -636 84 118 -694 275 -245 -494 521 -386 -329 482 -747 61 130 -848 91 -77 -607 258 -35
1272 -35 -603 354 -142 -339 473 -213 -83 205 -125 -154 125 -77 108 154 -199 92 215 26 125 36 32 402
1294 402 17 -32 362 -118 106 365 -125 133 356 -312 261 310 -297 715 -46 -237 621 -189 -174 656 -385
1315 -385 55 398 -540 399 42 -634 549 -210 -397 651 -448 -28 408 -494 173 88 -798 423 -226
1334 -226 -637 605 -393 -265 542 -640 12 426 -799 420 119 -789 573 -289 -568 443 -457 -82
1352 -82 547 -446 142 219 -411 520 -31 -168 519 -238 -68 384 -413 215 235 -422 314 132 -321 433 67
1373 67 -171 575 89 -137 261 -76 -48 278 105 138 110 62 -8 36 37 94 192 -33 86 64 -53 128 -124 -161
1397a61L50k62j43M91p32M90N1o52O28R7n22N43k96k53Q04o42j79O45o59L88K34
1418B20n98N89j84m41Q41o61M0N91q31M57M05r55P05k1p56J006m51k85Q94p94
1438b29O5P16q67L60J47n29O52l24k01O29l96l9N54p84M62R5p41P06j92l30P50
1459E04n09k8M64n55M9K10l80M14pl67M89l26Oor2L9J80j91P8p0M0j17O3P4k02
1484b40J99K1nM2j69J01J18l20J58J34m26M22ok07K66k43j25N05n47K39L79n77
1506b81K66L00p69P59k40k75O06l82r9M81o11K46L99o90O30k05l75N37k16k03
1526a22O05o61L90J54p24P72j76n50Q28o55n5Q03p46q2N55p04M20J31m94O40l48
1547a9j75K87k98K26J68m13K96k7l79O11m70j12N49l88l9L07k72J66N2l05K39
$$ plain form
1397 -161 189 -73 -216 275 -457 33 84 -568 60 157 -365 178 -118 -371 433 -209 -388 257 -402 -14 220
1418 220 -378 211 27 -414 427 -234 -194 397 -434 23 428 -527 178 157 -599 407 -44 -329 565 -229
1438 -229 -164 552 -315 45 192 -337 315 -9 -210 419 23 -16 538 -246 216 311 -430 276 84 -246 504
1459 504 -5 -33 431 -124 -75 135 -245 169 162 -205 284 -42 -36 -42 -134 -95 85 -106 -28 -98 -58 -175 -112 -38 -240
1484 -240 -41 -20 -25 17 -152 -51 67 -253 -95 39 -387 35 29 -178 88 -155 -280 225 -322 -83 296 -281
1506 -281 -15 285 -484 275 35 -240 366 -16 -115 366 -245 1 400 -290 340 135 -240 297 81 -122
1526 -122 483 -178 212 366 -358 414 238 -312 516 -139 -194 609 -137 -219 336 -368 52 183 -311 329 -19
1547 -19 -194 93 -205 21 189 -224 72 45 -334 277 -193 -305 244 -144 -183 124 -148 18 70 -235 4
1568Dlk11K46j18J09j12jlk6J38n0k14K11J39k26K00j00q8K74k33mJ42j71J34
1592C7p3M4R2l66K97J43m75N12k44l6M32k90j45N37o94K34K87l95K45J75o32O94
1614C79l06j40J14k89L51J83n12K75O6l56N23m49MO46p86K24J93m16L56J52m61
1635b49L97j16k69M48m41J77P4j79J55q3j52L57k71O7K01l10J91O2l11K40P5k48
1657a85K40j28l3K09k79K96p4n5J21p4J69p2j57J17p1K4Q6j58j29K54k86M16p9
1680A52j50K43k75PJ45k00J53P9l35L48j5l10L62l43P6L66n25M30M2m96L34r8
1702a0k83N53k61j32L80m30K28P4j42J07r8j91L68j55k36K39k32P1K74m98N08
1723A34k08r9L62l88N2L48m82J80J30l75L97k0j04Q3j07R0N5j45J51N5j65N9m4
$$ plain form
1568 4 1 -210 36 -82 27 -85 -86 -89 -115 23 -27 -241 -30 109 -117 83 -17 -105 169 -64 -68 74 -97 37
1592 37 -36 8 100 -266 31 174 -301 211 -33 -69 363 73 -72 465 -229 5 292 -103 142 317 -315 379
1614 379 73 -67 47 -242 109 292 -220 55 121 -235 288 -161 -157 489 -297 -73 120 -296 60 212 -249
1635 -249 148 32 -237 211 -230 -53 21 -158 -3 -86 -238 119 -152 -85 116 -194 -3 59 -252 -12 63 -185
1657 -185 55 -73 -106 103 -176 120 46 -9 112 38 207 135 -22 95 24 48 134 -24 -153 101 -185 231 152
1680 152 2 245 -30 -23 122 -78 75 154 -181 167 152 -158 204 -139 -63 303 -222 208 250 -246 88 -10
1702 -10 -293 260 -1 -133 247 -183 45 119 -23 84 -14 -205 163 8 -228 11 -221 -150 124 -374 134
1723 134 -74 -173 189 -199 -147 201 -281 -101 29 -346 51 31 -73 10 -97 -7 48 -97 54 109 -56 3 -41
1746d1n2J94j09J29r9j20L41k13j15K30j63M5K0j00M2J19o9M4n3J51j22n4P9l
1770H1j65K11k17Q8J51j69P2K7k50L33k38j32M39l03n5K14k14K46k2m08M35j20
1792Dk1J53j97J61P8k96K13n1l93N21j20j44L12k62r3K15j63o2J17l5J05k7j04
1815h9L01k31J1R8j20J03N1k64L48k53q6K65k66R1K06l17J00J97j61J99o7k21
1837a05Q9p2J85J13j83L7L3Ln9K4l5N0j94K04L9j59N4p8N4P2j83R1p2L4Q9l0j08
1864a07J36j49J29J2k47K69l1j94J80j07K03K5l04J04j1p7K08K6j18J16j85J53
1886C1K05l69J20J17k27L46k93J36J05j55J0J91l61J71R9l27N28m56l2L34k41
1907f8o8L63l57J78J97j80j18J88k23J64k0j45J56k38J19J05k40K20L1k49L01
$$ plain form
1746 -41 -93 101 -8 121 22 -98 243 30 -85 145 -18 27 47 -53 -11 108 39 83 30 181 59 5 84 81
1770 81 -84 127 -90 -2 149 -20 52 79 -171 162 -76 -208 231 -72 -127 87 -127 119 97 -311 124 4
1792 4 -17 136 -61 100 178 -118 95 44 -349 172 52 -92 220 -42 -135 80 -83 -145 -28 -63 42 15 -89
1815 -89 212 -19 -8 90 -30 73 124 -140 208 -45 -131 134 -132 -41 165 -152 -52 145 -16 183 116 -105
1837 -105 -16 -88 97 210 27 64 97 100 41 65 30 80 -114 90 129 -30 24 -54 0 72 -111 -20 -92 -58 31 1 -107
1864 -107 29 -120 9 21 -226 43 12 -182 -2 -109 94 119 -185 -81 -92 -169 39 65 -53 63 -122 31
1886 31 236 -133 -13 104 -123 223 -70 66 171 16 26 217 -144 27 126 -201 327 -129 -161 173 -68
1907 -68 -136 227 -130 48 245 65 -53 135 -88 76 56 -89 67 -171 -52 53 -187 33 64 -185 116
1928A16n4j15P1j17M2Oj47J61K0n9l3J16j7nk2J01k42J44Mk5Q5R9j09p5J04n0
1954aP0n6nK4n6L6O4p1O5l16L36k54J4M10k35j21J95q7mJ04l26K58Jo5J67q0n5
1981A2O0k35K03J13k56L24n1j75M3M2k54J97L5j62K00j59J79m4k21L20j90j30
2003a49J93p1k3J8O0r1K96k91M4J7k7O5j65P3N6Rr5J16j33M8R4j60J36m8j69J69
2029b8l1L2k9J34k19J74j22J42m6M0o2j1o5Q4K2p1R9n0L0K3k8K3J4j77R9j4O1
2056B4j6O2j45K29o7j10J53J6j08N5J7j47N8m6%J02j86P6R8r0l8p7M9J10l8j15
2082a34K69j90L8J52k21M9J35k49K60k09j4K41k74k2L58j76p1J01k96K01P4m7
2104b5j6M0n9K04l56J21J01j8k6J64k23M2O4k59J51N8M1L0l2J07P8j65O9k04p
$$ plain form
1928 116 62 -53 18 -99 -57 -51 -198 -37 -17 -76 -109 7 -10 -15 -37 64 -178 -34 -30 -55 30 129 20 -55 49 -1
1954 -1 69 13 8 32 -24 12 76 5 70 -246 90 -164 -150 260 25 -96 99 12 8 112 -214 44 45 -20 147 67 12
1981 12 72 -163 40 153 -103 221 170 -5 38 80 -174 23 58 -104 96 -63 116 72 -149 171 -19 -149
2003 -149 44 -27 -50 -32 28 -63 233 -58 -14 3 -24 41 -124 -51 5 14 -81 35 -98 -50 44 -116 20 -28 -197 -28
2029 -28 -59 -27 -56 78 -141 33 -89 53 7 47 -15 -26 -91 -7 15 -56 43 -7 23 46 18 41 55 -122 -23 -37 24
2056 24 8 70 -75 154 87 -23 130 146 38 93 110 -37 21 -25 -25 77 -109 -33 65 -25 -63 -140 -91 19 -19 -134
2082 -134 135 -55 -17 135 -86 -37 98 -151 109 -100 -114 127 -147 -169 189 13 -58 43 -253 -52 22 -25
2104 -25 -41 -1 -60 144 -212 -91 10 -8 -34 130 -93 -51 13 -246 -95 -37 4 34 2 109 187 22 91 -113 -120
2129a20J98J3j14J21q5R7n5j35O0N1r3K06r4q4J51j25rO6J9q5k3J09r1m4N3j22
2155a35N6K8j9J49k10Q3N7m7NJ00m9J97j01j74K73k14k46M09j95mJ38n9Q1j15
2179Hj55K9J05j8O9r7k0J96k38K28j25m0K48n6l28L27j62mK09r1m0L7j71J54J06
2204A71l44L47j67j39K00n3n3R8o3J02j18OO8kM4j16j27M7J66q3PO0K3j2n9LL9
2231D5k1p0J2M5j6L2qj7rj54J3J81n8M0j36J19p7m0J80j9P5j90K1j13J26J03n7
2258Gj28J98p1o8J03j07j1J29o5R7kj71J00j12J11M1k51L06n9j43J43k09L3K20
2282I1j20j03K63k45N5J00n0R5m0j13K26n9k26J98k29K53m7k6r2J57Oo9j01M0
2306c6ok0j5J63k83Q9J41o1L6r2J3P9P3j97J28j03K1J75k01O8Q0j38K08j11j67
$$ plain form
2129 -120 78 91 -23 98 13 110 55 -80 -20 31 -62 144 50 -34 117 -8 -17 49 68 -17 -40 69 -22 -66 -13 -135
2155 -135 -79 -51 -70 79 -131 -48 9 -38 -33 67 18 215 114 -60 213 -1 -247 162 -33 -37 101 42 123 8
2179 8 -147 -118 -13 -31 38 -59 -79 117 -121 107 -18 -58 190 134 -194 133 -29 -33 176 85 45 82 -89 65 171
2204 171 -173 174 7 -132 68 15 -38 60 -3 99 -19 -13 55 53 97 -19 -146 -99 67 -16 -9 51 74 62 3 6 45
2231 45 24 -46 -34 11 -5 27 19 2 -7 -161 -148 33 -25 15 -121 -2 -79 -119 61 42 117 -73 -52 -165 -39 64 7
2258 7 -121 77 6 -62 41 -66 -77 52 -13 84 82 -89 11 -101 10 51 -200 106 47 -96 47 -162 -129 91
2282 91 -29 -132 131 -114 -59 41 -9 86 46 -67 159 100 -126 72 -157 96 49 23 -69 88 94 25 -76 -36
2306 -36 -42 -62 -77 86 -197 -108 33 -28 8 -84 -71 8 81 -116 12 -91 -70 105 -96 -28 52 -86 122 11 -156
2331a56K09r3J2m8Jm6J39J35n3p3j24J15p7J56k49K66k28q9K20j39J70r6J4M5
2355A1%m6R0n1O6J8j98J06j4j3J06j61L9N8jj38J55l2k0P8q2J3q0j22J35Q8p2
2382f7oJ4Q0P5l13J50J17l03K36O5j75J10K3k25J88k19J71K21k06j12J84q5J1
2405f6K00j09j02Q0Q3j35P6l2p1k5J10L0r0J29q3l0J33p8o2L8m7J65p6l9k57L71
2431A13rj22l8J45j02j01J24n8Q1J6Q4j07o0M8J9n6p2lJ51J7p2Q1R1k15J16j35
2457f4N6L8q3Q4Q2j45j5J13p1J39j93O3r4pJ56j07J33j45k0O2n1p9K35n5L2M0
2483A04j32j0P6L4j65J44J32k10J03Lj27M0m5Q3j4m0J04j24r4J11L0k8R1j10K3
2508b1l0m3J65m3j9N1POj13L2O4j20N1k4N8J17n1k84J54q0L1J3J47k5k0M2Qr8
$$ plain form
2331 -156 53 -40 -28 -76 -75 -121 18 153 100 27 -97 18 -59 97 -152 114 -114 -203 17 -122 48 -48 -34 11
2355 11 11 -35 55 4 70 88 -110 -4 -18 -31 75 -86 -47 11 10 -128 27 -5 -25 53 -29 -16 -96 -218 -83 5 -67
2382 -67 -73 -59 21 96 -217 -67 50 -253 -17 48 -127 -17 6 -219 -31 -250 -79 142 -64 -176 8 -77 -66
2405 -66 134 25 -77 3 86 -49 27 -5 -76 -101 9 39 -51 78 -5 -35 98 20 -42 -4 -51 114 38 -1 -258 113
2431 113 104 -18 -56 89 -13 -114 10 -48 33 49 133 26 -34 14 33 -23 -95 -98 53 70 -2 79 170 -45 71 -64
2457 -64 -8 30 -53 31 113 -32 -47 66 -5 134 -59 4 -90 -97 59 -48 85 -60 -80 -18 -69 -148 87 32 64 104
2483 104 -28 -38 38 72 -93 51 183 -27 76 79 -48 -8 -53 30 16 -24 80 -44 -138 -27 3 -25 66 -44 -21
2508 -21 -51 -94 71 28 9 60 67 73 -40 -8 56 -64 -13 -37 21 138 87 -197 -43 -123 -92 -79 68 43 23 65 73 -25
2536b5q7j5O8Q8rj03r8J44J7K6k8J12r4J9j1J3j18K58p1p4m4m3%K03k73R8J41
2563I4j54NO5o1J79j29J6K09j85p1J16j37N2M5k0K2p1j8K19j93PK4p1J60Oj84
2589g5J45l6j33N5p4Q2M8p8J40j58MK9J23j28J00Kj77Q2m0m6J93j84l2J90j07
2614g5J67j29k33J25K49L8R8k72J12k60L30J60m32n8L9j51n4M61J24J40m24m66
2636e11N61O41m28p0k05K79l60j76L1L66j09l13K67j09J74l54O19m04L71k62q2
2657g4rK96k38R0j82l1J4K36L76N2m05l27O21j87n01L3K5J52K32k12j74L56J5
2680A58n43M41O61q02L6M20r06M79J36o1J94j81j23n5J82j29j13Q8k42N21l06
2701a45lj24j74L66m51Q85m19J00l31L94K08p28O70m40J07K96jJ94m95K41j73
$$ plain form
2536 -25 -112 -127 -59 29 20 -83 -181 -37 -20 6 -22 90 -4 15 4 17 -101 157 86 12 -32 -75 -75 128 -145 -47 94
2563 94 -60 -55 10 -51 128 -1 15 224 39 -32 84 -53 -1 44 24 46 -25 -43 176 -17 -10 14 -57 103 109 -75
2589 -75 70 34 -99 -44 -118 -36 12 -66 74 -84 -80 -51 72 -56 44 46 -131 -49 -89 -135 58 -126 -158 32 -75
2614 -75 92 -37 -270 -145 104 142 240 -32 80 -180 150 310 -122 -180 -141 -292 -346 115 239 379 -45 -511
2636 -511 50 691 263 193 -12 267 -93 -269 -238 128 19 -294 -27 -136 38 -316 303 -101 270 8 -74
2657 -74 -83 213 -25 65 -117 -148 -134 102 478 530 125 -202 419 232 -269 -236 -211 -59 173 -39 -213 143 158
2680 158 -385 56 717 -85 -49 371 -535 -56 80 19 213 32 -91 -146 36 -93 -206 -118 -360 161 -145
2701 -145 -148 -272 -446 -80 -531 354 -65 35 -296 98 306 -422 248 -192 -85 211 210 404 -91 150 -23
2722b3l64L86j9K6k65P05r0j79k07m25J17M74j19J46k9m30J27M10l97O0j42N21
2744B83n52K09P7L45j98j99K12q62R05k88m00J13K58q0K28q6j39P11o37J55L1
2765H6l99K03P3K58l28j21L46m2J73m08n35P44j13K3q2L77k96L4J00k57J17k05
2787b52J63k16J17L25k75P4K18j93K71J96j05p67Q47l1o29K76n94Q19j39p2n1
2808a8K77m19J57p6j7R2l1J37j71R7j1J11j54l3K1J25k04J08q5J49J14j69J9j04
2832h5R2k9p9o1K01M1p8J21k28K3L9PJ70j33j2L4P1j23P8R9k35O2R2o0k7q9J82
2859G3p9q0K63j37N6O7k16M2J06j72R5m4Q4j36N0m2N2P9mQ2j90J00R2j61M3j9
2885Dq7K07J4j68J24j62O7O3l9m1J6n7L2J04j69j9R2KJ14r2p8J35j36J21J10j53
$$ plain form
2722 -23 -387 -1 -20 6 -259 446 356 177 -30 -455 -338 136 17 163 134 -296 -169 241 -156 -96 -238 283
2744 283 -269 -60 17 362 164 -35 177 -685 220 -68 -468 -355 -97 -177 51 -35 -174 537 -100 55 86
2765 86 -313 -110 -37 221 -107 -228 118 76 249 -159 -694 50 -63 -40 -122 255 -41 -7 93 -164 -47 -252
2787 -252 -89 -305 -188 137 -138 -64 154 -39 232 428 323 -444 403 372 -257 19 -575 244 105 33 -18
2808 -18 259 -160 -3 -79 -96 -4 -35 102 -69 28 17 128 -26 -59 -38 87 -117 -9 -94 55 169 0 19 -85
2832 -85 7 -22 -101 -162 39 80 2 123 -105 -82 -43 -36 134 1 -11 23 94 -29 49 148 -87 -25 67 7 -20 -109 73
2859 73 -6 -86 177 40 96 163 -53 -11 95 -77 18 -26 58 -78 -28 -70 -18 61 57 139 -51 49 141 -20 23 4
2885 4 -83 124 138 -30 94 -68 -1 62 23 -18 -2 -59 -27 77 -92 -111 -19 -17 97 5 -73 62 -74 47 157 4
2911Dlj9KP5p1J0r8J98j65Q7k8J5Q6j75J70l5r2O1Q0q9K0M0l7O8j35p1J67k55
2939a90K21r4N4J71j83J7P9k7j1jl7j1Jn7k4K9Q3o4J70j34J48j31K8L4L6j65J45
2966H7o4p4M3j63J66K5p9KO8j43K15j32P2K2q7m2Q4j18K17j22l4l9N9OQ8j91N8
2993g6J57j65R6l0J32j52K56k14J02j51O5L9j61rJ15K4ML9q6J24p2n7j22J44R8
3018A00L9j59k3o4J18J01k09J46O4j33m4K41k02j13L24l5k42K13j49o3J37n9Q5
3041G3P8k84J7K40j90J53k04M7J31p0r5J86j59J42j1j56N0r6J03J64o5j70J29
3064A3j50J12P%j35K51j03lP9j43J74j18K4q1J64j39R5p8P3r3o0K16k3l6J8K0
3090H4j2J6n8j66J15P6N8j2k7j00j19RJ92l1j45J72J65k17j0J56l08Q7nM6R5j70
$$ plain form
2911 4 1 -18 -16 59 -12 -2 -100 98 -67 20 -8 7 93 -82 88 53 -39 22 102 13 33 73 36 104 -31 -102 65 -190
2939 -190 31 -63 -9 162 -21 -4 75 48 37 36 -1 -12 -11 -68 -92 -63 20 -44 126 -8 140 9 37 71 107 -58 87
2966 87 23 -51 -8 -171 -5 20 -59 -57 11 -132 83 -49 23 45 -42 -84 0 -118 99 -23 -57 -96 -37 -31 57 -134 -76
2993 -76 81 -84 12 -18 114 -38 218 4 106 -45 20 59 -102 -111 4 28 32 71 -15 109 37 -20 -142 2 100
3018 100 139 -20 -43 -107 11 112 -97 49 113 -20 -64 177 -25 -138 186 151 -91 122 -27 -90 47 -12 73
3041 73 151 -133 -116 124 -66 87 -117 -70 61 -9 -104 82 -77 65 54 -102 -52 -148 -45 119 54 -116 13
3064 13 -137 -25 -18 -18 -153 98 -5 -8 71 -72 102 -16 8 -73 91 -48 47 -31 42 -51 -111 105 82 46 64 84
3090 84 72 88 30 -136 -21 55 113 101 74 -26 -145 -136 56 25 -120 52 217 0 -10 146 -162 -75 -80 -34 61 -109
3116a09m8J70R9n4J4P7m7j73o3J54J6O9p8n7Q9o8R6o9K1q4O5j67J57J01q5j69
3142a43J15L0q8L5J3M1O6p5R9j15K7Q6k24R4J34m5q3P8l09L25o5m7N7l0N4K7k1
3169C6q1J78k05J2J8q1K32j01k8M7Jk3K05j52j03J11n0j14J84j45J24OOl1N2k01
3195a03Q9l1L5j7k16L20l4q4l3J95r2N8j13J30nj33jj43L99l75L9J13j12L72l35
3220g7J41j78O6K29k40P4K1o8J29l8j21P0O0o3L28n96O9L53k54R1K42l14J03k59
3244b32J54K30n0M8k45N6R5j12K70j53q7J94m4k34J82mm6k48M71j15l11L07n2
3267G4j3j17P2J55k6k76R4J96l19K86k56j22K80n4L7Q8K96m42K7J15p1O0P1k14
3291e9K53m12QK33o5M0j14O1n6J97j35j05J29J85j30k10L46k9l58O6J03J97j39
$$ plain form
3116 -109 -157 13 112 58 72 149 102 -71 -134 20 36 105 27 -30 59 -9 87 18 39 -45 20 -147 10 111 26 -143
3142 -143 -28 2 -86 -51 -38 3 69 -6 93 -22 5 91 -133 -39 95 50 -33 45 -264 61 -4 -51 6 -24 30 57 36
3169 36 -45 133 -72 -60 -42 -123 109 8 -20 27 28 5 210 58 -45 66 16 -98 86 -59 65 71 77 46 98 -103
3195 -103 -14 -45 -10 -27 -243 77 43 -41 -74 121 29 87 -26 104 99 -34 -35 -178 221 -154 -115 -2 -114 258 -77
3220 -77 64 -114 -48 181 -59 15 36 -32 97 59 -62 8 68 5 333 -263 -194 159 -95 -4 238 -76 27 -232
3244 -232 -78 152 102 150 -95 -39 56 -56 214 61 -26 168 124 -110 72 68 22 -226 245 130 -181 126 74
3267 74 61 -56 16 171 145 -131 -37 159 -160 126 -130 -252 28 -26 11 99 395 -47 -20 95 24 84 155 -59
3291 -59 194 -218 -210 23 -42 -2 -116 -55 -111 86 -49 -154 -25 160 30 -180 166 137 -221 -155 -52 145 6
3314Fo2R1O5q1o3n9N3L7P8k10K53m0o4J71j47R1k4M2j36J33k04K7M0o1J98k25
3340i1j5J91j39J34j30r7J40o5R4K07k71j87K61o4M7n2j14J20j0m1P3J6l5J01
3364G3j20M2J1J30j10K0j5J40r1j40J86p0l6N2nj05j7J07K9p7p5J89j38j30J53
3389Cn2J01L1Kj65K22k24J18r3k9R5P4r6Kj01K35j79J12j20j01J2J52l3l1k9J9
3415g5O6n6M9j5J55k05o5O7%J15M9K9j81L5L5l9L2KM5rr2J09l7KJ12j79k0l4J39
3444C4j03L2R0Pn9J2J42k00O7J05k91L57n8j6j19J15n8QK7j93K16p9j86J82k7
3469Ej5M2JJ13r9rj42O0N8j23MP8Lm0J69j79J65j03P3Qr6Ko2J61j12M8M1j19J32
3498F4p3L9J4r1q1OmJ14j47J99K9P5q7k2n5N5p2R8J5j13M1O1l8j03O9l4M8o7P5
$$ plain form
3314 6 -56 35 100 19 -44 -103 -50 -13 65 -145 108 68 4 175 28 119 95 137 1 134 -70 -43 -3 -64 134 -91
3340 -91 -106 85 -54 80 -50 -147 -7 -72 22 229 -42 -229 32 -32 15 -37 -151 -31 -41 -82 -9 7 -28 73
3364 73 -47 -5 6 136 26 46 31 171 80 -60 126 56 20 72 67 -38 -55 52 81 4 -71 118 -20 -150 3
3389 3 -49 52 83 85 -80 142 -82 36 -57 -86 9 83 -13 -11 -112 123 -56 56 -64 -165 -153 -1 -34 -65 -94 -75
3415 -75 -9 -65 -16 -31 124 -81 -146 -79 -79 36 85 114 -67 -32 3 -36 -4 -2 43 34 -58 51 14 16 128 -51 -71 -105 34
3444 34 -69 -37 53 60 1 13 155 -45 22 127 -164 193 135 119 0 115 57 65 92 -101 115 36 -150 32 5
3469 5 -10 32 33 146 47 38 -104 -44 14 -109 -105 -27 -24 -64 105 -74 91 -12 61 69 -27 -25 -87 74 -38 10 51 -68 64
3498 64 -9 30 44 -47 -128 -122 -126 -12 -159 40 69 144 57 35 -20 35 -37 61 76 -37 4 65 27 -76 -7 -41 7 -60 15
3527A5q2pK9k5P8l1p2L7K3Nj35J08O1M0o6k2J66r9L8k2m8j14N0O7J51k06n0J89
3555G8J6Pj40J6R0j23o5J62q2R0M0n8J0m0M2j5n6M4Ql5J8n6o2R0Q9j11J39o3q9
3584e6L1N4j09J92p3m1m0Q7r3qL2M9Q9p4J0j27k6J98R6j23j03M7L5k13J94j46
3610a18J08l6R7o4j36J35L1o8J84Kj32M8L5j74J23j04P8L4nj23Q7l0L8K5j05O8
3636bp2j8J38o4r0J41n2J17j51j3O5j09j5K33j89K04q3j1o1J0J50j53j5K2J18
3661A00o1J9P1k69J03Q0m9n0R2o4qj48J56J20o1q1O1jj5R7l0j61J98j68K0O4R9
3688A14j08m0KP6o9j8M6n1p3R3J74p4l4q9J74q2o3P5j08J4o5Q5M7l2j8j4J3p1
3716i6OJ75j47J80k04R2L0Q9j08j4j7L2Q1qo6j3j45J78k06J34M5q1P5j06m1lJ08
$$ plain form
3527 15 -67 -74 -45 -70 8 -23 -95 -58 -35 -30 -165 -57 4 44 -22 -44 122 23 61 39 -9 -123 -73 -6 145 -61 -111 78
3555 78 94 101 -39 -23 67 -56 -121 41 -41 49 89 31 41 1 43 28 -28 16 24 -11 7 -49 -111 -21 68 -43 96 33 -56
3584 -56 -25 29 -80 112 39 -2 -42 45 -48 -56 -24 25 114 40 50 -77 -103 95 191 68 -35 12 47 -166 28 -118
3610 -118 -10 -46 51 -13 -149 -14 17 -51 133 135 3 51 86 -88 35 -69 9 43 38 -85 2 -28 10 35 -70 -2
3636 -2 -74 -92 46 -18 -108 33 -19 98 -53 -66 -1 -110 -125 108 -81 123 40 29 -32 -22 128 -25 -40 -18 100
3661 100 39 58 129 -140 -37 43 -6 -56 36 -28 -36 -184 -28 92 31 -50 11 10 -5 92 62 -99 99 -69 -49 15 114
3688 114 6 -34 -32 44 -25 -43 3 -48 -121 -28 146 72 38 -51 123 41 -22 53 -55 -41 -106 -21 26 -6 -24 -38 -25 -96
3716 -96 -90 85 -62 118 -86 6 36 125 17 3 -14 18 99 91 25 12 -133 45 -161 -27 18 -63 12 -94 -135 -138 -30
3743c0n1l5K94j17l7o0k2O1J02m6j16q5J63M5j18J94q4k8L7n2k8J02o3k4K6o1
3769c3L5Q6j17O6J47k06J13r3M6N3l2r5J67j66k2J60j51J63n2j8n4P5p4nM6M2
3795H1pj21Q6jn8j62J07P0Q7N5j30J76k20m1Q1k01J59j4J61j56L6l6M0O7j80J62
3821D1L6j2rq5mk7m6K42j63Rr9R4J78r2M7j57J27n5o2J16j19M5K9j70J64J6j04
3848f0K6m1m8K33j72P2J69j84l7Q9k25L14j49L3J41k0j22j23J02j1jp7J56K3j70
3873h2O4ok3L2J63j65R7k3p4J35j03M3k03Q2q0J04P6P4j03j91K28P8p8J0O9j48
3899b4j25J80o0J01k1k56L38l07K27j5p4Lj6j9J76l0j10QP2j15P7q9Q1j81O9O3
3925d7k3Q0k3j14J16M7J8O1j79n7K69j79P7Q2k87J59K8l2M8j5p0J14n0k2J23r9
$$ plain form
3743 -30 -81 -116 178 61 24 -36 -58 3 105 59 -57 -142 21 66 -52 142 58 30 67 15 -13 89 26 2 28 -33
3769 -33 2 88 -29 37 184 -22 91 -2 44 97 65 -30 137 -29 -51 109 -42 121 69 51 -3 72 -2 -7 39 81
3795 81 74 -47 39 38 -20 -182 -75 -5 82 137 7 183 -37 -78 3 -198 -39 -53 108 -48 -12 -48 -8 59 -121 41
3821 41 77 65 56 -29 -33 -60 -106 136 -27 -18 -117 -23 155 63 110 -47 80 25 -37 79 -40 5 34 -136 28 44 -60
3848 -60 -34 -75 -123 110 -62 10 179 -5 -42 47 -178 136 -13 20 161 141 19 -104 -2 -13 -14 -91 65 88 -82
3873 -82 -18 -24 -47 -15 148 -17 80 57 -17 118 15 58 -145 -63 -143 -39 37 111 8 -183 45 123 45 55 124 -24
3899 -24 -149 31 -29 72 51 -205 133 -174 53 38 -36 -33 -49 -68 108 78 -32 -24 48 -67 10 -79 2 -179 -110 -47
3925 -47 -70 10 -13 -127 -11 36 54 115 -64 -121 148 -31 46 128 -159 0 28 -4 44 29 -41 73 23 1 124 25
3951B5n6M3OJ8lj5l4O3j07J82l0n0j20K04j88J55j8m9M7r6r5K05k1Jl0o8J25j38
3979d4J01k2J0j12J54j46O7j2Q5j11J76j80L3p1J56op1O1j67J27J04n5o2o4J18
4004F9j12j5R0p5K77o9k65K05o5j43R2n3J49q2j18j2J45j9L5m8k0Q1O9j14J28
4029A30j61m5J49m5P1k23q6J30J08l8M0p5o1J14j04O8L5qP3l0M9M5j12QM5j16
4055c9J88m3j79Q8j32J12J1j7J6k3jJJ41o5o4l6j20K03k3jJNj05L2N0L1j8q7J80
4084A06j14n1M6j33Q2P6j7o5r3K60j12Q3j16J77o3q3K6m9M1L9n7Qj13j5J15J8
4110dl8q3N0J14j52J80k47J35K1q7N4N3RL4q4J20L8j94J15l9q8J85j16J29n5j24
4136g4J07J9q3J20p9J9Ljp5l4N3r5K20p2n4J91k13J72n6j60J84lr6J03j2j86j6
$$ plain form
3951 25 -31 12 18 36 33 18 -16 47 -60 122 92 42 -78 126 -62 93 75 26 73 -23 -118 87 66 67 37 -31 94 -44
3979 -44 57 35 45 -67 87 -59 8 -4 81 -30 146 -34 -1 -72 84 78 7 68 -99 28 132 77 15 -49 69
4004 69 -43 -58 32 -43 234 165 -100 105 40 -103 -11 -64 85 3 -115 -127 18 -1 34 -14 -34 47 116 2 130
4029 130 -31 -76 73 28 99 -124 -210 -80 28 -10 30 -45 -106 8 -96 -28 7 -1 72 42 91 136 24 32 77 -39
4055 -39 149 106 -73 15 -117 -5 6 -11 5 -18 -19 -18 123 58 -6 -42 -162 41 18 17 18 23 -82 -50 0 31 13 -74 106
4084 106 -8 -59 -13 -146 -64 12 -5 -70 -163 97 -15 68 -48 129 66 -17 9 -40 1 40 -17 -9 -122 -137 -22 -4
4110 -4 -42 -125 -75 39 -113 67 -180 -45 -24 -111 -57 -4 5 39 -45 75 113 -81 34 -5 -93 92 -24 105 50 -74
4136 -74 33 52 -31 89 10 29 32 31 -44 -78 -25 -120 100 28 -26 165 -48 124 68 -92 92 89 -7 96 84 -102 -118
4163a18J16J48j71j67J47m9O7P7Nr9J5kM2n0m3J29j75J15Rj7J7j9o2N3k7J20k3
4190C8o2m3J1R8m9lnj54J08L5M4k2o9K1J32j02N1J11p0n2P8j40q8J05N8K5k5o0
4218b9P3L8k4J3n9R7J9q3j5q4K9K35j94j12R7R1k3n5o3J35L8J4j88P2m1LJ6Ko8
4247f6N7k9P7O2j12J37k64K6J29n4Q1j4k7m1J79k27jR6J03n3j14N0J10n2Q1k16
4273h2O5J09j49j3J79j02J01j16j93K35kM4k22J94q8N6l7P3J0p7L3L5L4j74k2
4298a09J64K7p3j17J74J1j88j3N2O6J57k15p5K45m8l4J47k25P9J09r1r4J56j37
4322c2l4JJ14m1l5J39K7Kk17M7J40j25M3rK3j43j16L36k61J40J46k60J64K8j19
4347d2L4M7j5mn7J88p4q4J17k6p1o3M1j19J36J2r8J62m8l0J4n7P4K0r4MJ19K7
$$ plain form
4163 -118 -2 146 -25 -192 -45 -94 -27 50 55 -44 -29 -31 11 -39 -82 47 -128 -13 -4 -21 -4 -23 -85 -32 -59 61 38
4190 38 -24 -67 -56 42 -7 -10 -15 -169 -61 -26 18 -4 -73 -52 80 -22 29 140 70 18 96 -44 -132 -27 31 56 31 -29
4218 -29 44 82 58 71 12 109 128 45 30 -54 -25 210 16 -96 1 92 69 14 -49 86 124 138 -50 22 -19 -16 0 2 -66
4247 -66 -9 -38 39 101 -11 126 -138 -112 17 -37 44 30 3 -38 141 -86 -87 9 112 59 -55 -5 105 53 134 -82
4273 -82 -17 92 -57 -70 109 7 108 -8 -201 34 32 76 -146 48 -40 16 -21 52 62 -15 18 53 87 -87 -109
4298 -109 55 82 9 -108 66 77 -111 -124 -72 -6 151 -64 -139 106 58 24 171 -54 25 134 43 -51 105 -32
4322 -32 -66 -65 49 8 -27 112 139 141 -76 -29 111 -14 29 20 43 -100 -216 120 -141 -1 145 -115 49 77 -42
4347 -42 -8 39 24 20 -37 151 77 -7 110 84 13 -50 -9 -128 8 20 -78 84 36 6 20 -37 37 57 -37 -33 86 113
4375A13o0N6j17J05K6k6K2m3j12O9Q3j21q9J74o9J10k55k0K74j98M1p0J89j72
4399i0J06k9J66j00J2n0q5O2n2K0R7j47J34Jj11qmJ75k27M1k3O5L6j03J43j32
4425a03J37k03O1R9J5l3nO4q8J20j51Q8L8n1j51M01k49J7J38j55Q6p0j05K22k20
4450i8N1J81k32j2N0KQ9Lj35K30j45J2N9J09j51O9M2k47Q7R1o2J4j61j9J59k8
4476d2J33j19q0R5K0J2K8j25JJ86k48J10q1L6qJ05n6N4L4M7q1k9N7m4O2j76J51
4503D2NO8o5J0kNM9kp9Q6j01o2m2QJ50j7M7j43O1M0j26Q9j10K34r3J15j80J91
4531A78k37L0R2JM1r7j5j13R8J5O8j3j63K20qk8K6j18J67j63P6l4m4l2K0lJ6O9
4559D9j12lJ28j2j01M8LM6j38O4l7J22o8J60k84J77Q2p8n1J18n3j06Q9r4J05O9
$$ plain form
4375 113 53 109 -8 97 123 97 119 76 -36 33 116 -5 -94 80 11 121 -134 -154 120 -78 -37 -107 82 -90
4399 -90 16 -13 153 53 65 15 -70 -8 -60 -40 57 -90 44 45 -66 -74 -78 97 -130 -89 -112 -47 -11 -114 29 -103
4425 -103 34 -169 -108 -9 6 -27 -32 32 -56 64 -87 1 39 -12 -163 238 -11 6 144 -11 75 5 -100 122 -98
4450 -98 -47 134 -98 -110 -60 -58 31 34 -101 129 -16 -4 55 164 13 82 124 -123 -36 55 -7 7 -154 -173 -14 -42
4476 -42 91 -28 -108 -13 7 19 47 -78 -77 109 -139 -29 -110 -74 -82 23 -33 21 55 102 21 -8 49 5 67 -109 42
4503 42 47 115 50 60 58 63 112 110 31 117 16 -46 -88 -80 70 53 100 -43 18 58 -68 21 -89 145 52 167 -13 178
4531 178 -59 -29 63 64 105 8 -7 -120 -22 -7 61 48 -115 105 97 69 95 -23 144 -19 57 23 -21 -53 -33 -36 -20 49
4559 49 -63 -66 62 50 -51 -3 0 46 -92 -28 -65 57 -11 149 -135 42 124 46 -5 113 60 -46 43 -51 54 123
4585A23j64R7j02J33Oj58J55j48J10lq3J7k4q8K14p1l2pO6j25K9K21k33L0J84
4610A47j98j5P6NJ2j8J4O2j94O2M7j3K01j66j54K9Q7J2l6J25q6k4q7J33jj10j8
4637a08P9k6Q5P6j07pl8J45l11K13j1mj15J96k97J68J88k21O2J4Lj0J86k77J96
4662G9J9o1j5J17j92J09m3N7j13j9J39j88j1P3O1K7o1M7m9P1j5M3j56Q6m7R9j46
4689h9P1q4O9J33j52P1m7q5R6R6j08J5J13j17k1k1N2P9p7p0J4p0K18j02o9J8O5
4716bj17M3R8J0m8N0m0J3J05j48P6j70J47j43l8K53k12R8L4o4N4l7O2p0R3k4l4
4743a1M8Ll2Q9j31J99k57J51J25k24L4j36K61k28q5j64J61L56L38j20r20O37l62
4766b68P7q9J9J21K00m22K98M13n09M45m73R2L38m34J84q8L07k33J85o9kn6n11
$$ plain form
4585 123 -41 56 -46 87 93 -65 90 -58 52 49 -34 -17 -41 -129 85 14 -18 -25 41 -84 -55 166 -67 -37 147
4610 147 -51 -66 10 15 27 9 23 85 -109 -47 0 -13 188 22 -132 -103 -16 -4 -40 85 -1 -25 -112 21 20 -90 -108
4637 -108 -29 -55 30 106 -1 -8 -46 99 -212 1 -10 -14 -129 67 -230 -62 126 -95 -33 -19 -16 -26 160 -117 79
4662 79 98 37 22 139 -53 56 13 70 -43 -62 77 -111 -122 -49 12 39 -22 25 -24 47 32 75 -81 5 -42 57 -89
4689 -89 -18 -102 -33 100 -52 19 -28 -113 -17 79 -29 -14 99 -18 -39 -60 -8 71 -6 -76 -62 -132 86 -16 -85 -67 -2
4716 -2 -119 -76 22 32 -16 34 -6 7 112 -36 40 -130 17 -126 -164 89 -123 -25 9 -55 -1 -38 24 -46 47 23 -11
4743 -11 37 40 8 97 -34 165 -92 59 184 -40 -6 -142 119 -109 -194 -358 -197 159 497 377 -543 94 -268
4766 -268 -191 -280 -261 -140 60 -362 -64 349 -160 285 -188 -96 242 -192 -8 -96 211 -22 163 94 92 36 -475
4789d75P71M34q92M70m81L72k06K0j20QL91m01K29N7q0q4l2k14L81L9k58Q1n2
4812d2K50k11j73QJ22K1K65n7l96J13rJ68l22o1L54J97O3j07j87K41k77L47j92
4835A15J16j92m12K63L75l25l0P5K62J6m90j14L65o48j5R61j47k81J14q8m9L19
4857A90k22J33k21M5P6o4j0J37q1j50Q0J49j91K34m5j64R6j6m6J47k06k0K09j38
4881g8KJ30r7Q2pk71J59P0J18r9L9Poj09J57o3Q3r1Q1l3j02K34k06l0O2k1N9l3
4909C7o3MN3l4RL6j22J80o9k9%j72R0O0J9j13J17L8q0K8l4J50l1j16J1R7k61K68
4937G3j62J94j64j4J31q5%K6O7j73kM1J03l6m2N7p4RP1J0k4L2j9r8O7M8lo9o2
4966i8O0l0N8J74j26m2j9N6O9o2m2O4j6PK0K3j77J32p6J08q3R8q0k0O2j8n5R6
$$ plain form
4789 -475 296 730 -162 308 -173 199 -7 13 -107 -99 292 -109 120 177 97 13 -19 -233 148 187 -71 10 -42
4812 -42 208 -3 -176 -168 -46 -25 240 183 -213 -100 -109 59 -263 -324 30 227 290 183 -4 237 -40 307 115
4835 115 231 39 -373 -110 265 -60 -90 -15 247 263 -227 -341 24 -624 -639 322 175 -106 8 -80 -129 190
4857 190 -32 101 -120 -75 1 -63 -73 64 -17 -167 -87 62 -129 105 60 -104 -8 -24 -70 77 -129 -149 60 -78
4881 -78 -76 54 -43 39 32 -239 -80 -10 108 9 48 55 49 -60 97 34 117 26 107 74 -28 206 0 -30 32 11 70 37
4909 37 -26 -22 31 -3 6 42 -80 100 31 2 2 -170 -80 -20 -1 -114 3 41 -39 -11 -45 105 74 -42 -31 66 -195 73
4937 73 -89 105 -59 -73 58 -27 -27 -1 66 -107 -109 -68 35 -1 -43 14 -60 -51 20 30 6 38 19 -79 -12 36 33 -36 -98
4966 -98 -38 -68 -10 164 38 -4 -23 33 102 40 -2 62 46 53 73 96 -81 51 -25 83 0 98 18 -2 60 42 -13 83
4994H3n6J48j5j34j49K08K1k67K95k39KJ4J33m8mP6k4j07k5K7RP3j27J68r3j44
5020a75R9J96j25nM6Q5l1m7q3N3j8r6M9n9J17n1m2J67o9n8K61j95K1J0j04P9j17
5047i2J18jl7J04r4qm7Q8l4p2L1LM6R8%m3K3j9j9N0k60J48M1jj9rQ7q5L2j25P2
5078b4k6O5j70O8J37n0p5M2P2l7J21o3r1K5q4J71k22J22n6nP0MPo2Ko1K11l3o5
5107gL6o6m7J15pj69K70k54J82n1L2j13K24o4j71J77m5l4J17r2r2N5L0r4QJ52
5133I2q0J92k38O9p3N7j9K50l10P4P4j04J16j30PQ0k2j40K07o6qM6j29J53p3n8
5159c3j32J52O7K0M6j04M3J7j53L9K0j1pmNj4J1K7K8o4K6rL9j97J83O8p1L0o1
5188c9J0Q1l5Or7R0pj5%O0O2k51J22P0j45J02Mp1J94k41K0J02R9j41L4o6M7L9
$$ plain form
4994 83 27 175 160 26 -123 85 106 -161 134 -105 -103 -89 44 -4 -8 68 44 -63 -88 -61 -52 21 -106 62 -31 -175
5020 -175 -76 120 -5 -10 36 121 90 43 -40 13 -5 -101 -52 -111 6 -45 -87 80 11 -47 214 19 40 50 -54 25 -92
5047 -92 26 25 -12 92 -2 -10 -57 31 -3 -75 -44 -41 5 103 103 60 83 64 45 95 -165 -17 24 23 4 -5 82 -3 29 -96 -24
5078 -24 -50 15 -155 -87 50 0 -75 -33 39 2 123 60 -31 -6 -90 81 -141 -19 -75 -80 -10 -6 1 -61 -59 -120 91 58 -7
5107 -7 29 -37 -84 31 24 -145 125 -129 53 2 34 -79 145 81 -90 87 42 8 125 33 -59 -4 26 -68 -60 92
5133 92 12 204 -34 35 -38 19 0 250 -60 14 88 -16 100 -30 -23 57 35 -105 102 36 28 74 -55 98 25 -33
5159 -33 -165 -13 54 74 120 16 59 76 -77 -38 -18 -29 -36 -40 -35 -49 -38 -11 17 -47 -21 -30 9 -188 -5 63 -8 22 -39
5188 -39 -29 52 17 23 -74 16 9 -6 -6 54 116 -135 -13 57 -88 14 18 -53 141 -100 -80 22 121 -20 14 -52 -5 34
5216C4j33J20R7n3j84K12j55J32l3r1J26j94R9n4k2J61n3O3j13J21j51L0p9J49
5240B9K2n0N5L3j90J45q8J25j88L0K4OL6l6J46m5j08J23j42J24P2j82P4K5n6P1
5266E5j2L3j87J18R6j09K7JR9k6j03K01j70j74J74O8p8k8km3l9Q4J52m8k15J95
5292F9j38N2L2R3j12J12p7o9J54j49L9j34QJ29J00j02J6k41J58j4J78k16n1J65
5316Bk4L0l4j9l0N8L8onm6r4J3N9J05j56J06%o0J32k9J11j36j0J3R4j60J47q4
5344A5o7K04k16L4J41j9n3j7j22j6J25j74L02j19k1J46j83K52n8k62L4J57q6K0
5368A7p8j5l0Q8L4q1kJ31N5k11K0L4O6j6P6r5r0J62j38J91j94J38L4j50R7j30
5394h7j9J0J43n5P8m3k1j5l7j2J40j49K0M8J08j7j19N3r8N5M8j00kJ69jj57K9
$$ plain form
5216 34 -99 21 118 65 -119 93 -62 70 37 -54 72 -122 -23 -77 -99 62 9 72 -41 80 -71 -41 -120 29
5240 29 51 1 56 89 -101 44 -44 81 -107 -77 -53 -47 -11 -47 99 54 -54 69 -73 51 123 -59 15 40 -16 55
5266 55 43 76 -111 7 103 -6 21 22 121 95 -8 193 23 -151 23 91 13 -15 -17 -60 -99 -15 137 89 -126 69
5292 69 -69 -17 15 108 -4 108 31 -38 116 -33 6 -128 -120 9 109 7 23 -218 -60 -74 104 -112 -163 2
5316 2 -22 8 -26 -45 -75 -17 21 15 10 -36 -130 -117 -58 47 -109 -3 -3 -63 69 40 151 15 5 18 112 -48 99 15
5344 15 -52 152 -64 -30 111 92 39 22 -100 -116 9 -165 137 18 -3 143 -40 212 154 -108 -74 83 -3 17
5368 17 -61 -76 -106 -18 16 -65 -67 64 119 -92 -72 -38 28 12 88 -7 -97 65 -73 118 -76 62 96 -54 43 -87
5394 -87 -106 -96 47 -8 70 27 6 -9 -46 -58 82 -67 -47 1 109 92 -27 26 -72 -17 31 -69 -71 98 97 -60 -31
5421c1L5J34j09O2j16J31p0q3J88q0j02R4l8L9Jo8NO5j46J00m3N5j32K7J11J18
5447A47j75O7n0p3O9p2l0J22ll0J7p5K6N1m4rO8m5ML1Q3j84R1K1K1K9N3r4J2m2
5477a4k4n0OJ71j65J9J53k23J32q7%j5o2K78j31P6j51J71j23nK0R2p7q7Q9j27
5503a34kJ91j45J31j13P6o3J03O6n6J40k81J05R0j99Nk5J49J18r6l8J1m8j7J16
5528H4K7o1j01j2L3O3q4O2n8N0k1m0o0J80j89J49K7j75J01M7QK7l7j3N3l0M8K7
5556A05j38L1o8J1N0o5N4n1Q5k4P3k5j16K09j98J13m1j24J13J04j78M5l6J16J9
5581F4j17R0j8j0lJ26k29m2J94j03N0Mp8L4M1oNNj5J21j81n9K2L31j75j42J10
5608A9P%m0k3o3Q0k0R6k09K65j00p9P6p2J43no1j60K18j10j04J58j26J83J2l5
$$ plain form
5421 -31 4 138 29 91 -25 106 36 -47 141 61 -41 53 15 54 55 -13 -8 57 -89 11 -32 23 -109 -82 29 147
5447 147 -28 39 -11 -84 -15 -87 -117 5 2 -28 -11 -86 -60 -9 -53 -62 6 -39 -35 -4 79 -105 -14 7 28 57 110 16 28 -14
5477 -14 -38 -88 -82 89 -76 -57 96 -127 5 -82 -82 -97 -159 119 -12 64 -87 84 -39 -44 -24 68 -9 -96 -7 -134
5503 -134 -136 55 -90 41 -72 4 -59 44 110 54 194 -87 18 108 -91 -86 -111 38 156 60 22 33 -15 -32 84
5528 84 111 50 -51 -63 -30 33 -51 11 -47 3 -18 -58 -118 62 -127 22 49 -126 -25 22 30 57 20 7 60 30 78 105
5556 105 -33 -2 -70 -59 -9 -74 -20 -71 14 -10 63 38 -78 131 -67 46 5 -119 -6 98 -80 -35 -71 45 64
5581 64 -53 37 19 9 6 132 -97 -139 55 -48 2 6 -72 -38 3 -3 2 7 -8 113 -68 -127 -105 226 51 -91 19
5608 19 26 26 -14 -37 -100 -20 -40 56 -153 112 12 -67 9 -63 80 75 14 -146 72 -38 -142 16 -110 73 85 50
5634E0K9r6L9mk9l7r0J43m9OM0J5l6j4M5Nq3J70j16P1j17J07J12j45j63K41J5
5661A09j75J64r9P3rq5O8j09KM2P0J17n5j34J23r7pJ16Kr2P4j02N4O1j89M1J97
5688A60j60p0KN5j9Q9j02J2J53k97R5j0N3k1N6j3k9J05j00L5k9J66p4o9O9j0j6
5715C1j6k3m4P0n4J02m3k6L2j52N6m4L11l03J46n5Q4Q2j55O8j67J13K9j0N1J30
5741B13j38j22K82k25J4j0J9J7j23J67j46J39j94J18Mq1O8k0k1N5o3LO3k22O5
5766a38J47j16J57r6k1R4rN4j45k3J6N5o9Q1R8j34l4J48n7n5p0K05rnj26J34j05
5793b3L5q2J20n2r6j8J77J7j46qN9J8l2J9j44J91P7L5k27J61nP6l37K31Lj28J67
5820H8p2ql8K4J21o3Mo8O8j47N4J9J6P7o1j01KK4M8m8N6l8M0lJ05j90J0J78j00
$$ plain form
5634 50 79 -17 22 18 -11 -48 -138 5 -44 -38 2 17 -19 -33 12 17 -66 104 -12 59 -58 49 161 16 -147 94 109
5661 109 -66 98 -1 72 63 -22 46 -63 -61 -19 51 168 113 -21 102 5 -2 114 116 24 98 -4 50 111 -78 -37 160
5688 160 0 -70 -68 -13 -32 57 -45 -33 120 -177 -82 -92 -39 -60 -4 -17 -46 59 -41 -6 -35 131 57 -12 57 47 31
5715 31 15 -8 -52 18 -36 66 23 -3 29 -123 -67 -111 200 -103 43 -12 72 154 -1 67 -100 13 42 32 83 213
5741 213 75 -47 235 10 24 14 33 50 -73 94 -52 87 -107 11 15 -66 2 -18 -39 16 -47 -44 19 -203 -138
5766 -138 9 -107 50 -46 -67 27 18 72 -73 -96 -80 -25 -94 -13 85 -49 -83 65 8 -47 -117 88 79 74 -52 82 -23
5793 -23 12 -70 50 -2 -98 -116 61 78 -68 -76 -17 1 -31 -12 -156 35 112 147 -80 81 76 152 -185 46 49 -79 88
5820 88 16 8 -30 -6 115 52 56 -12 56 -91 -37 -18 -2 75 14 -87 -85 -61 -13 -61 -5 -43 -3 -6 99 -91 -81 97 -3
5849cj8n6J28j47J07k8jJ15j75M6J4q4K68p9j86J63j00R2nl1L6k0l8K9j56O0R4
5876B5J2m8J18M2j50J52k52P3N5k0J38k01J46o1r1oK33j46J7p3k5N0O3Pmr1m3
5903h0j4N2lrQ7j52J98j62K25j08j55J13RL3K2r1k1Q0j8l8M0j16P7J42J0q1j16
5930g6L4Kr9J24j1K0j42J81o2p9J89j78P5rpJ01P3j47Q4j10K2J68k30Q6j5NJ20
5957A19l6j06j08K48k44K06j12J7K1K1k3j9j0j06R1nL6L1Mj98J94J4j17P0k2P0
5983C6q9J58j88r5K13m4J04Ol8M3J1j87K40j18L1j23m0J39m9n0P5r2l8J53j3j18
6009g3J96q2q9O6j54J46P4j28O9p9J07j23J5J56j44J18j15m4J36j20K3k8k5J06
6033Hr4M7J35qm4J19l68J63J79j48R1j22P1R5j39j13j0K21j62J23n2O6l6j6m9
$$ plain form
5849 -3 -21 -77 51 -96 11 -17 -18 97 -78 -32 -18 -102 166 87 -99 64 -36 56 51 20 56 36 -2 27 -129 -69 25
5876 25 37 -11 107 149 -1 151 -101 -28 27 7 145 -56 90 29 -62 -68 165 19 36 -37 -62 -12 51 58 54 -37 -80
5903 -80 -94 -42 -45 -54 33 -119 79 -83 142 34 -121 -8 1 34 56 -35 -56 24 6 -32 8 -108 -31 111 121 40 -76
5930 -76 -42 -40 -139 -15 -26 -6 -148 33 -29 -108 81 -97 -22 -31 -38 63 136 -11 73 -37 -15 153 -77 9 -6 -1 119
5957 119 83 -23 -131 117 -127 79 -33 -16 5 26 3 -16 -26 -132 -41 -46 -10 21 25 -173 21 35 -82 -12 -34 36
5983 36 -53 105 -83 -178 35 -9 95 101 63 106 117 -70 170 52 83 -40 -80 59 10 -40 35 -57 -95 58 45 -73
6009 -73 123 41 -48 18 -136 10 84 -44 25 -54 53 -70 -55 101 -43 75 -40 -84 52 -68 -45 -73 -98 8
6033 8 -86 -39 96 88 44 163 -205 -42 137 -11 80 -42 29 124 -15 -128 -138 83 -79 44 -8 58 22 6 -43
6058d3rm7K9J52J17k59L0J33n3j07J30Jj51J2J2N8n8k4rK39j83J37j3p6o3K35
6084A90k60J35k9j47J05j11J09J81k47L9N7k2k4N2j11K9J1J4r5J45l0J48j78l5
6108g4l5J26Jj7Jj37J40M1M1r6J0q8N0J36m4q9K2j97J69J00n2m6kmj34K68j21
6135c1N1m3J13n9o3l0K6J15j01pn3J5J14k3j82J37Jm0K05j35o0KOP3o9j0L4KP5
6164F3J70k81lk2k2O1J0r9O9O6O6l2j83J07j1m0M4j1J02j23P0o7J32n4j6j30J44
6191A0K5j29O0L6J47j47K5po5J37p2j6P2k9j21N0L1rp6J6M9J9o7m8M2LJ49j20
6219c5%k4K8k5O3r4O9j6J27j40K2L0J81l36M7J92k24K32j03K8M3k5l0N6k3o6J49
6246A26m7j31J30j35N6p6J8N3p0j05J61P2o4J25q3P3p4m3P7L9k22J17J1l6K8l8
$$ plain form
6058 -43 -52 -99 -70 82 199 -60 -30 103 50 -57 73 74 -77 -65 -53 5 -53 -77 -86 153 -30 107 94 18 -45 190
6084 190 -70 65 36 -111 -6 -117 -8 173 -74 -35 22 0 -24 28 -83 -54 -43 -29 -124 21 -9 139 -39 -74
6108 -74 -109 17 18 1 2 -135 5 46 87 -9 1 -87 -37 99 55 -34 -12 -209 -40 60 8 -38 -40 -44 -178 90 -31
6135 -31 20 -23 90 31 -32 -62 -36 79 -22 -29 -82 -67 47 24 -158 -21 -20 -60 145 10 -50 -48 -42 31 -38 -48 -14 -12 63
6164 63 233 -48 -51 -73 -95 -34 -24 -123 -54 12 78 46 -137 -30 -41 -81 -37 -48 54 -69 1 -66 66 12 -4 -134 10
6191 10 35 -94 -34 2 149 2 27 20 -45 92 20 4 76 47 -74 -24 7 -2 -78 -62 -13 6 -61 -109 -67 -64 85 -35
6219 -35 -35 -59 -31 -56 7 -87 -18 -34 93 -47 -25 5 186 -150 -103 89 -135 97 -6 22 65 40 10 66 43 -23 126
6246 126 79 -52 78 -57 -1 -77 -59 -6 -76 -181 -20 52 -12 113 30 103 29 -14 63 102 -120 -3 8 -28 0 -38
6272c8J36j12J09j58J97j34pk2ll2QO4J47j77l0J2K7k2Q2j88L4J00k1M2k10J78
6298a8k5R9j42J39j95J46o0M8r8N4J05m1Qj31K63j41p4P6P1m0j46J80r6R6j99
6323a21J95p9k8J3J22j34M1qm1N6P0j20R1L7j63K24j09k3J36q9q9nR8m2P0j52
6349e0J9j6N4J05p0n5N4O2j31NJ31r1l7R6lo2J03N3j76M2o1j6R4o2k4L4R1k22
6377a33J91r1J34m8r1K6l0J17j08J7J3J2J13n4K2m3o6q7Q4LN4ML3r1Q1o4R1j86
6405i7O7K2j49J40l5K33j81j67K58r8p5N6L2R6q0L1n0M5j42J06P8q6N7j1n6J4
6431HJr3J51l6q4O7n5K1J30j11N0j29J02P1p4l7kj02K06q6M2K8k0p1o3Q1J8j43
6459a30J27O1n9n4o3K04o6o6O6p6R9P6j97J20J27j78K5k8O4j0J06Jn4o0O8p1K0
$$ plain form
6272 -38 98 -14 95 -63 134 0 -7 -29 -32 -64 -56 8 155 -22 -52 -40 -13 -35 47 -141 -107 -7 -28 14 -196 -18
6298 -18 -43 56 -86 53 -142 4 -56 -8 -106 -52 53 12 20 -111 152 11 -63 13 84 44 -102 78 -18 78 -121
6323 -121 74 -5 -33 -20 102 -32 9 1 -40 16 86 -34 57 94 -69 155 46 23 159 70 -19 -24 74 32 102 -50
6349 -50 -31 -47 7 112 42 -13 41 103 -28 -23 108 17 -20 76 73 11 114 167 -9 33 -28 -44 50 -12 -36 -2 89 -133
6377 -133 58 -33 101 53 -38 -12 -42 75 -33 -16 -3 9 122 68 90 47 -19 -106 -22 -19 35 39 72 -19 62 -2 89 -97
6405 -97 -30 -8 -157 -17 -52 181 0 -167 91 -7 -82 -26 6 102 22 53 3 48 -94 12 90 4 61 50 -6 8
6431 8 9 -84 67 31 -53 14 -41 -20 110 -1 49 -80 22 93 19 -18 -20 -122 84 -2 40 68 48 -23 -86 -5 13 -130
6459 -130 -3 58 -1 -55 -118 86 20 -46 20 -56 43 119 -78 42 169 -9 16 -12 52 42 148 149 95 35 103 32 52
6486E2n7l5M0o7J6J03j04k5J17M3J0Jj72J38l9m1n1J47r5kmn7J9O4R9n6q6n2Q3
6515a1Pq8J53j27L9K14nj48m1qJ10Mj78R8j33K14j59N5R0j14j6m8M6J7J7o8J05
6542B5MP6k9j06O8L7o6l9L5o5l5J85o2P4m4j14J14j18J06j55J00J02k33K54m4
6567G0m4q0J42n9N7j25J03j20P3M5j28J02l2j07J56j5j2k5j1J03j20j26J33Q3
6591F3j2j66O7N4j2n3p6J65rp7J22m9K6R5j61PMK0j2J26j95o8Q7j1P8j19N0kr6
6620a54K25p0l4K6j51J21m7J66k4l6K4r4J33m0O0j37qJ19p4M4r9J09j4M3n6r1
6646e9j7J99Rk11M4J19R2k42PN1Rj4J16r8L4j38R2Q9j32J9k6K9P5R7j29M2L3j99
6674a09J94m0k53J75j78J23K74j0j05o6R7j28M8l0O4o8R9j85Q2J13m8R3j25J21
$$ plain form
6486 52 -5 -40 0 -67 -51 52 -52 -77 40 83 93 94 -78 60 21 -20 -71 76 -19 -21 -25 -82 -63 1 100 44 -42 -94 -11
6515 -11 -4 -92 61 -66 -27 187 182 34 -7 -15 95 99 -79 19 -114 100 -59 -4 86 -28 -44 -92 -46 -29 -12 -80 25
6542 25 29 105 76 -30 38 75 9 -30 5 -60 -95 90 28 102 58 -56 58 -60 46 -109 -9 93 -140 114 70
6567 70 26 -54 88 29 86 -39 64 -56 17 62 -66 36 4 -103 53 38 26 1 -10 93 -27 -153 -20 63
6591 63 51 -115 -48 6 -6 -59 -135 30 21 -56 66 17 43 138 -23 -16 -12 8 -4 122 -73 -141 -54 -65 13 -106 -56 -58 -154
6620 -154 71 1 -33 -7 -158 -37 -84 82 58 22 46 -48 85 45 105 -32 -40 79 5 49 -50 59 45 88 32 -59
6646 -59 -76 123 132 -79 -35 84 176 -66 -59 -8 1 -13 103 5 39 -99 -7 82 -50 -31 -57 -28 47 144 15 57 90 -109
6674 -109 85 45 -208 -33 -211 -88 186 176 71 5 102 -26 22 -8 56 -12 87 -98 -16 97 49 142 17 138
6698A38j73O3p3O9O9j05j35J22m2k8J92j23r2J00O5k51K62r5%Mk5j4J99k02O5
6723a0q6J33O8n3J5R7j05p0JJ13r4j17N9J54n6q9J18k10J69j39l7Q6N0j34K0k2
6749a39K23Q2k76P5J64j02K1K9j19J43j23J1r8JJ25J03j18o7L8L7P6m4O7l5j56
6774h2O8M4j62P7R4n6NM7j02J00r2J23J0j26P9rkp7N6O4m5l2o5o6J11n0K00o0
6802E2lm9J55k30l1j29J81J08j47K6L4J5j81J89mMl3O2J1k62K79k6k5P2q7k6N0
6829El8M9Q0r0r7K0J5j4J01n8L7Q5j63P2M3j15J05Q0k3k00o4J09K2k0J12j24k8
6856i9N3M5Q0j76JJ84J3J6k35P2K7r7J54J26j48l7o8J69j12oj97J30K70k48J12
6881B9M0J4j21j43N02o9l13K56j83l0j63M08m0j19J12j2k35J44l31O99m14K98
$$ plain form
6698 138 -35 28 -45 24 93 -12 -147 -25 -67 -95 97 -26 -118 -18 47 -204 58 -37 -37 -33 -58 -72 127 -75 -10
6723 -10 -96 37 105 52 67 164 59 -11 -10 103 9 -108 -49 105 49 -40 78 -132 37 -102 -139 -53 -3 -137 -117 -139
6749 -139 84 166 -110 -35 129 27 48 77 -42 101 -22 -11 -109 -108 17 120 2 -65 -27 10 86 42 109 74 -82
6774 -82 -14 30 -132 -55 39 -17 -12 35 -67 33 -59 64 74 -52 27 18 16 -61 -5 59 14 -18 -83 -149 -38 -88 112 52
6802 52 49 0 155 -75 -106 -235 -54 54 -93 -67 -33 -18 -199 -10 -14 -10 -43 19 30 -232 47 21 -4 68 -19 -45 5
6829 5 -33 16 96 6 -91 -71 -56 -70 31 -27 10 95 -68 4 47 -68 37 117 94 -106 -170 -61 -39 -59 53 -71 -99
6856 -99 -46 -1 79 -97 -96 88 101 117 -118 -46 -19 -116 38 164 16 -21 -89 80 -32 -38 -235 -105 165 -83 29
6881 29 69 83 -38 -181 321 252 -61 195 12 -18 -181 227 187 68 180 168 -67 77 -254 445 31 329
6903C29k01j98J46n04O00p7M4l72L85k43l19R71n51J17m3p7K38j41L22k77J39
6924B88j36m90K61j74J48N27k9K46n41n2j4p9p3k61k48O40k85L38N9j53J9l5J06
6947F2pr1m3o2J32Pj07J03q9R4O9j1j20j3O5j23J37N6k4k7K7j54N6R9m4q8J23
6974B7PQ9q6k5n6J24j02k7K6Q8n1r1mj0J36k33J77p3R3l5K0K0O8r5K5r3J26M5
7002I0k09J90j20J37j29M3J42k10K8M2J02j20o3NJ90j18L3p9PR6j34J57j26j04
7026a50K34p4M0r6jJ0n7l2J22J9O3p8q0R9j02Q2j0j02J81r9K6j07J28j04P6K0
7052Hr5K07n9n3K5o4L1O7q3n1P3rQ6k51Q4o4K72N4j74N3j55J08k0lp3J68j52J72
7080A02k03J31n2N9L9j6K3m0k4qp9n8qJ31K9n3M6n8M0l6%jP2J8q4P9n6R3k27K68
$$ plain form
6903 329 128 -70 76 -428 172 95 139 -233 152 -91 -410 561 10 127 84 7 245 104 426 149 288
6924 288 152 -338 -77 -251 -103 424 395 641 100 48 34 -45 -118 -379 -627 13 -272 66 125 -28 -9 -44 62
6947 62 55 -36 -79 -141 -9 -2 -109 -6 -95 -1 68 57 -63 -76 -11 -134 3 59 35 8 35 -119 -63 36 -8 -96 27
6974 27 34 123 37 12 -44 80 -22 -49 -23 65 14 -77 -81 -91 45 -188 -11 -84 9 -26 -6 14 82 -13 12 -81 45 90
7002 90 -119 71 -49 88 -41 2 144 -66 -38 4 106 -14 -77 -72 118 0 33 -46 -39 57 -77 80 -46 -150
7026 -150 84 10 50 -46 -47 -37 -94 -126 -4 15 78 0 -80 19 -83 -1 -11 -113 68 -31 -5 -112 16 -88 -12 8
7052 8 -87 120 61 8 33 -31 0 67 -16 -67 6 -3 83 -168 -84 -148 124 178 4 57 -98 10 -10 -13 -86 82 -70 102
7080 102 -101 30 -22 37 76 60 83 43 19 11 -68 -126 -134 -3 26 -27 19 -39 1 -35 -35 -36 36 54 -30 49 -7 86 -141 127
7110A27k20J06m2J6R1N4q7j02M9pN3m6p0J23j41L0R0k4k7N3K1j17N5j05N7rN7
7137a5m6P5q9K9J1J10p5o0M4k2L2r5Q1Q1j96J74N3o9oK8r8K0n8M8n1O1N1K6M1
7166H5n4n6Km7n3J78p0l8J0J0R3Q8j48L0k6n5O6K5m9l8Q5k9K6p5o6J94o3j75L10
7195A60j85J34k38R8k1j9kO5L7q8n0J28j16kJ60j4m7p5J33j86P4J16q1P1o3k8
7221c9l4jJ52%j55J02j59J56jj04R9M5Lm0J3J1o9J68p9Mp1p7M1Q2J3K4j74J42
7249E2M7k01J29j7Mk1J0l8kN5M5nj14P8M8rj0j60L1Q8k0J03j62r3Q9Q7l4pP7J3
7279F3j15l7Q5M0l2pk1j28Q7K06n4r3P3l7L2Oj20J5J48j44R9j68k8M8Q3k9O4m1
7307ej05N1q7O3R4j00j66K83R5j31kr3J55k2m2n9n7O2J86p4j15J18k13J0J35j70
$$ plain form
7110 127 -93 13 -29 -13 78 132 45 -57 -8 -15 38 -8 -78 45 -96 -66 24 0 -27 26 47 -70 -15 -120 -63 -72 -15
7137 -15 -61 14 -75 -46 -35 75 0 -60 -16 -38 -6 -101 -20 61 -135 39 92 23 17 45 -53 -33 -91 -43 -94 -33 18 44 85
7166 85 31 -25 -23 -70 -123 55 -15 -53 -43 -33 60 148 0 30 4 -51 15 40 -9 -47 38 9 35 -40 -106 88 25 -150 160
7195 160 -25 109 -129 -31 -52 -71 -73 -8 29 -59 -109 19 -97 -99 61 47 0 -75 58 -128 -54 62 -19 52 -11 -39
7221 -39 -73 -74 78 78 -77 25 -134 22 21 -83 16 61 64 24 37 48 -21 147 68 72 1 -76 -35 47 60 84 -90 52
7249 52 99 -102 27 10 14 -7 3 -35 -37 18 63 58 -56 22 70 61 51 -109 -78 10 -10 93 -69 -162 -73 14 -20 -27 50 63
7279 63 -52 -89 -4 36 4 -3 -24 -152 -65 141 87 -6 67 30 62 68 -52 -37 111 -33 66 -102 -130 -82 1 -28 36 -5
7307 -5 -110 -59 -146 -83 11 -89 -255 28 123 -8 -10 -103 52 30 -12 -71 -128 -66 120 46 -69 49 -164 -154 -19 -189
7333a89K60j01L9j80L0J34o9NjJ34j21O2M9j78N4N5Qn9J83q8j48J46o2J9Q0j6
7359D6p4jJ0N2J5o9j04K35j36R7N4j38k7L3P2r8J09j84Q0Q6q8qJ2M7o8l7m9J55
7387B2O9J2r2P4l9j7j57M7J04J9N2p9RJ02j52N1J1j04J06k2O3L2n6l7Q8j73J72
7414A05J5n5km0j02j9K59k25Q3Q3j47O4J66j96Lj13K79j80M9m7N4m5q3O5nj39
7440a73K72j35P5Jk7k8k9J06q7k8Q3p7M2Q9j07Nq8l0R7l7Q3o3K3m8R6P8j34RN6
7469B4j6o0P8p2r2J90Qn2o7R1oL4j7J1p2M4M1j58M0J06j93J54m4K8qO2j06J49
7497I7q3N1j43l8J25j16R5P9r7N0j16P5j2p3O5k2P4m9l7J13n6J9p8J82q7L1Nj85
7525a31J56j08J48m6J1n7j10lJ74J5j04K6OO5n4l6J09J5j20M2K8q1K0n8p3J28
$$ plain form
7333 -189 71 -30 9 -171 -141 -7 -76 -71 -72 62 -59 3 52 -126 -72 -17 -9 -68 115 27 -121 25 -37 -18 62 46
7359 46 -28 -29 -19 33 48 -21 -125 110 -26 71 125 -13 -40 -7 65 -33 76 -108 -28 58 -30 -38 -26 21 -47 -84 -133 22
7387 22 91 103 11 85 46 29 -128 -81 23 42 94 15 24 126 -26 25 36 -68 38 16 79 111 55 18 106 -67 105
7414 105 120 65 63 23 -79 -98 161 -64 19 102 -45 19 185 -11 -8 -121 158 -22 27 -20 34 -11 -94 -29 -34 -173
7440 -173 99 -36 39 40 13 -15 -44 62 -25 -53 30 -47 -5 84 -23 -18 -106 -136 -39 -76 7 -56 -33 -81 15 93 -41 -32 24
7469 24 8 -52 26 -46 -138 52 60 8 -59 32 26 60 43 54 -18 26 67 -91 -51 55 -138 16 -28 0 -8 54 -52 97
7497 97 14 65 -78 -116 9 -107 -12 67 -30 20 -96 -21 -33 -106 -41 -63 11 -38 -75 38 -18 1 -77 105 18 49 54 -131
7525 -131 25 -83 65 19 30 -27 -137 -140 34 49 -55 -29 -23 42 -12 -48 61 76 -44 -2 26 -55 -35 -93 -166 -38
7551c8M7o7O0K05k08q2N7J26j00k7l4lQ1mj4R6j52J90k69K75j61J0p1P7K8j19
7577i7J04n3jQ6J0q5p3O4k9P6k3omO0l4p2P9r4q2J51M4l5KK1jk9R2J28k91m6J54
7608A6qj8ko6P8o3R2o8J21j37J89r9N4j52J60j69J5O3J7k9L9j54Q6q9K2J32p0
7635d0J66j13r5m9N1J17o7j4K1M7o1R8m5j34J62L9j28J9k1L3j69K1J18r9K81r2
7661D6n7M9r9rjN4J01k28N1J04j43O1O9l4P3q6J74o1N5k03J72N2k18J33q0k3K9
7688a9K1R2q4J06k49J38M6M4j93M3J11lJ16l34J62j07P0j13Q4J21l1k7J25j88
7712f9P1J29j90Ro7J62j58J63j05L4R1l0oj25J40M3j13n2J49j52J36j09L1N9j07
7737f6MR5m6j46J50r3J12L8j69O6P5o6K3P2j9j6j46K13j86O5KM1l6N7jJ6j20n5
$$ plain form
7551 -38 9 -58 2 207 -1 -83 -26 100 0 -27 -61 -64 17 13 -1 95 -57 133 -136 139 -22 -12 -83 -6 22 -97
7577 -97 7 -46 -47 39 49 -36 -109 -45 -74 2 -21 -27 -31 29 -5 -77 2 -92 -174 -23 21 -14 -12 9 8 -21 71 199 -92 -138 16
7608 16 8 -10 -12 -78 0 -63 29 -39 82 -55 134 35 89 -63 97 -72 -57 6 23 -6 33 -121 -35 -124 -102 30 -40
7635 -40 126 13 -82 -131 -80 37 -30 -44 -23 24 -37 61 16 -118 44 83 -45 -26 -47 -14 -183 -162 -44 -143 138 46
7661 46 -11 38 -61 -70 -71 -17 84 -144 -93 11 -132 -71 -2 -36 37 -49 125 64 119 -84 88 140 -78 55 -25 -48 -19
7688 -19 2 94 10 116 -133 5 51 95 -98 -55 56 53 169 -165 -3 -110 -40 -153 -69 52 21 -6 119 -69
7712 -69 2 131 -59 -50 -117 45 -113 50 -55 -21 70 40 34 -91 49 92 -21 -73 76 -76 60 -49 -18 41 -66
7737 -66 -62 33 -13 -159 -9 -102 10 48 -121 -55 20 -46 -23 49 30 14 -132 81 -105 -40 -38 3 -33 24 23 39 -81 -136
7765a36J88M1k28K56j28M9j1p0kR7Q6r4l3K2jN2k49J82K4N8p2Kn0J67j07l9O9
7792G3j27O9l7Q4j4p8L3m4J63j50p6K07k7j39l8Q8K3j04J36K4j31Q2Q1p9k08K62
7818G3k4kj00J30j87J44j89pJ10K9j18J65r4L1K5J77j80K8j10P5Jn5N8m8J3O9
7844A4kn1J42j12o9O6j93J63M3q0M3J9k2K52j69j16O3K0Kq7j2J42M9lj20N1R2
7871A25m7K7p9OL4p2l4J60k16K59j80n0o1J73l1Q3j23N4j3p6k4J76qj54J05j02
7897f8J48m0k8p2m8J4J82j01k4l9J15q1P0o2N4O8o7q2K5J02k0Kk9k00P8J49k5
7924B1k7J8l5L5MMj8%KQ2j39m2K7K7K08j19l0Q6n0j98J46j17nN9M7n4J35k0j4
7953C3J10n9n0q8L3N4n2N5nJ51k47J51Kj47K79l55R2J80m7j67J1O3l1j5J30k27
$$ plain form
7765 -136 52 93 -135 121 -7 42 31 -39 -41 56 142 48 15 37 36 88 -161 21 45 103 31 33 -17 150 43 4 73
7792 73 -54 15 -22 62 48 -30 3 -41 122 -28 -104 103 76 -63 -101 -13 10 -94 42 66 -65 17 98 19 -189 73
7818 73 49 47 -53 77 -110 34 -155 -162 -52 -23 -141 24 -70 -39 -14 163 -17 11 -99 -24 -23 -78 -20 -68 -55 14
7844 14 12 -39 103 -9 -78 -12 -205 -42 1 -79 -36 -17 -39 213 44 -72 -9 11 13 -74 -86 56 105 102 -18 33 125
7871 125 78 105 26 32 66 -6 -40 120 -96 163 -17 -67 -128 45 14 97 -26 28 15 -61 -85 91 83 -71 34 -68
7897 -68 80 40 12 -60 -108 -94 88 -13 -37 -76 39 -42 28 -34 20 88 21 -61 -36 66 46 48 19 -181 -103 46 21
7924 21 -6 12 -23 12 16 20 2 2 4 86 -53 -95 -68 -41 167 48 18 104 54 -144 2 -115 -120 -61 -14 -68 67 47 33
7953 33 143 84 34 -54 -21 33 -19 36 31 182 -65 86 88 -59 220 -135 -43 137 90 -77 -66 -3 -34 -49 81 -146
7979a46J71o5J67j3k27J31k9l7p3K9K29j35M5q0N3p7m4J16m4QRj00K3M0Nk8J14
8006D2L5q3L9j59J56j54J6J80j95R7J31j21L8l0j40J05J03m1R2j22n7J27m6Nr8
8031h0K3k3J17Lj01J3K1L1J05r8q1J29l1j12N2j1J00m0J1k9j44J66O1k3j16J08
8057E1n0lK9K6r5Q7pm7J7MN2j17J16j99R2k7K25r1q3P8n0J97l05J65N2j48PJ8
8085fN1km1Q2Rk0j33O9j09N6J48k4p7J0m0J2q4J11n6N2r1M0L9l4j43J48J7O6r3
8114d3LJ51j82l8J62r0J45j04n1N9K8j13n3J04L1K8j0r3N7l4P8K8r8n7J5m4n4
8141a75J64k0J00J1j05N5N5l9J0J25Rj05l0m1p2K5kP5K9Qq5m9Q4j75J12N8LK8
8169E3k8j20J95k82J88n5J13m1Pj35J36j4Q2m9K9j05kP4j18k7J17n5
$$ plain form
7979 -146 25 -40 127 114 -113 18 -11 -48 -121 -92 137 2 47 -33 20 -57 -101 15 -29 -21 -12 -112 -89 -49 -44 -72 42
8006 42 77 -6 33 -126 30 -124 -108 72 -123 -26 105 -16 22 -8 -148 -43 60 19 111 -11 -68 59 13 18 -80
8031 -80 -57 -80 37 40 -61 -48 -27 4 109 11 -70 59 28 -84 -32 -43 57 17 28 -1 -145 21 82 59 -57 51
8057 51 1 -2 27 53 -42 45 38 -9 8 12 64 -53 63 -136 -44 -71 154 63 -20 58 8 205 -100 65 117 -31 -24 -6
8085 -6 45 43 2 84 93 73 -60 9 -100 -44 104 80 3 13 -27 -15 -99 12 -44 8 -83 -43 -4 -38 -181 -33 -16 50 -43
8114 -43 -40 111 -71 -109 53 -37 108 4 -47 12 40 -73 -126 -22 9 37 27 -66 -9 -43 35 63 -35 -92 -77 -121 -175
8141 -175 -11 -31 69 80 -25 30 85 46 56 181 190 85 55 14 -58 -33 -35 40 69 77 -8 -57 27 -148 -36 22 25 53
8169 53 25 -95 100 -182 6 -49 64 23 30 -105 31 17 99 50 79 -26 -28 46 -72 -99 18 -37
8191c7
$$ Imaginary data points
##PAGE= N=2
##DATA TABLE= (X++(I..I)), XYDATA
0@%%%%%%%%%%%Mj2J6j6K0k8L2m0M8n6P2q8J04j22J46j71J96k27K64l06L51l99
33b12M53n13N80o55P36q25R22j028J146j274J413j567J736j919K117k333K571
50A348k833L122l438L787m176M610n098N649o282P012p864Q880j0112J1640j3596
65g351J6200j9863K5472l5565Q7665k51276K93283P3460l76111L51432j50338
76G008j52446K68943j88136k096J63766k29934J72542M5715j95690J99317o0714
87B8275j16942K06199j72081j1665J72518k14480R9498J24106k50958J69143O1851
98I5464k16610J79371j4021j46492J77372o9939o5723J23116j00112K3769O2852
109D9047j12780Q3570J0255q9842J10769m5968n9909J19132q8504j5261J10369
$$ plain form
0 0 0 0 0 0 0 0 0 0 0 0 0 4 -8 8 -8 12 -16 16 -24 24 -32 40 -48 56 -66 80 -91 105 -122 142 -164 187 -212
33 -212 241 -272 308 -347 389 -436 486 -542 604 -670 743 -824 912 -1007 1110 -1223 1348
50 1348 -1485 1637 -1801 1986 -2190 2420 -2678 2971 -3311 3701 -4163 4717 -5395 6245 -7351
65 -7351 8849 -11014 14458 -21107 66558 -184718 108565 182025 -194086 157346 7008
76 7008 -145438 123505 -64631 -66727 97039 -132895 39647 85362 -110328 88989 28275
87 28275 -88667 117532 -54549 -66214 106304 -108176 -8678 115428 -135530 33613 95464
98 95464 -121146 58225 44204 -102288 75084 5145 -60578 62538 -37574 -13805 49047
109 49047 -63733 19837 30092 -59750 51019 5051 -54858 64274 -24230 -39491 70878
120G0878j20886L1597R3784j37741O4378N8762j32921R6847J7545j09658J08110
131D0695k3583o3491R3698o2042r189P0076q2785L9569L3235q3845P7676j2873
143A7141o8806J00664n3622m0845J06037q5520m909R3754j08141L4713O4901j11377
155e6010O7837K5392r1233Q5293j9330n4401Q4859n8407o830O5405p9367M0721
167C929K7720q0157P7245j5095o4201R5802n2505l3337R4890q1231L239P6015
179E2314r2407L4987M4989q4350N8110Q742o2098O7191k7005k7379O0510n2661
191a9057J0029L8992o1449M2503R885n9093O4689j8442m3459P1630m2776k0183
203b6731O6270n6698J281N1347n8581J9398L0512n1822L2615P539l6981L7892
$$ plain form
120 70878 -50008 -18411 75373 -62368 2010 60772 -72149 24698 42243 -67415 40695
131 40695 17112 -46379 47319 -14723 -23912 46164 -36621 2948 36183 -47662 30014 17141
143 17141 -51665 48999 -4623 -45468 60569 -24951 -29860 63894 -44247 -9534 55367 -56010
155 -56010 11827 37219 -54014 31279 11949 -42452 42407 -16000 -22830 42575 -36792 3929
167 3929 31649 -48508 28737 13642 -50559 45243 -7262 -40599 54291 -26940 -23701 52314
179 52314 -40093 -5106 39883 -44467 13643 22385 -39713 27478 473 -26906 33604 -19057
191 -19057 -9028 29964 -31485 11018 20903 -38190 26499 8057 -35402 36228 -6548 -26731
203 -26731 39539 -17159 -15878 35469 -23112 -3714 26798 -25024 7591 15130 -21851 16041
215A6041j4046j6876L4507k9590M840K5749m0975K5585J2533m4227M1601m567
227A0575l8894N1591k0485k9062N3842l3194j4459M8043m1594K694L4814m2413
239a8542J7746J6614l5768K8665l314k2815L3851k3630l423L0989l8327J6745
251a209J9895m4064L4877M198m2526M7368j3272l1722N0820k8912j4751M4326
263B5028l7436L274L0102l8356J9153J1209l1062K9715r801j5513L1704k7092
275i075K607K5716l6557K0014J4146l9255L3835p00l3129M0221j4903k0910L7691
288A9701k3799p073K9600k7738N990J6956k5380J6261J867j6974K0543j1034o476
301g556K0048j9703M031J6138k5353J4145R173k5369K0337J470k1746K2814m744
$$ plain form
215 16041 1995 -14881 19626 -9964 -5124 20625 -20350 5235 17768 -26459 15142 10575
227 10575 -28319 23272 2787 -26275 27567 -5627 -20086 27957 -13637 -10943 23871 -18542
239 -18542 -796 15818 -19950 8715 5401 -17414 16437 -7193 -10616 20373 -17954 -1209
251 -1209 18686 -25378 9499 13697 -28829 18539 5267 -26455 24365 -4547 -19298 25028
263 25028 -12408 -9134 20968 -17388 1765 12974 -18088 11627 1826 -13687 18017 -9075
275 -9075 -6468 19248 -17309 2705 16851 -22404 11431 10731 -22398 17823 2920 -17990 19701
288 19701 -4098 -11171 18429 -9309 -3319 13637 -11743 4518 6385 -10589 9954 -1080 -7556
301 -7556 12492 -7211 -3180 12958 -12395 1750 10923 -14446 5891 7361 -14385 8429 3685
314C685j6291K2474j0517q588J8588j3372o81J1843j3258N832M437j1690J1678
327D140l530q164J5381j1804j862J5678j7158L961J3806k0717R956R945k1704
340a2072J5368L516j8316J7848l389j2172J7152r062m303J3347j2954M615O654
353F232j3665J2218k152j0460J6871j0450n456J8509j7085J294J6435k1098Q543
366b64J0750k0708J3574L854j6699J5337k715j0147J4271q879j726R946j1705
379e111O565K771j0966J2138m666p754J5254j1007k881J5320j5656K885J1843
392H735j6359P052P368j4703R188K838j0948R949k423n155P664n178L47M025o121
407c721M877M9n793Q188m319m014R909p466j613R620q993N27Q520r588K035O885
$$ plain form
314 3685 -12606 9868 -649 -9237 9351 -4021 -4702 7141 -6117 -285 4152 -7538 4140
327 4140 610 -7554 7827 -3977 -5839 9839 -7319 -3358 10448 -10269 -313 9632 -12072
340 -12072 3296 6812 -11504 6344 2955 -9217 7935 -1127 -5430 7917 -5037 -422 6232
353 6232 -7433 4785 2633 -7827 9044 -1406 -6862 11647 -5438 -4144 12291 -8807 -264
366 -264 10486 -10222 3352 7206 -9493 5844 3129 -7018 7253 -1626 -3352 6594 -5111
379 -5111 1454 4225 -6741 5397 731 -7023 8231 -2776 -5657 9663 -5993 -3108 8735
392 8735 -7624 -572 6796 -7907 1281 4119 -6829 3120 697 -4458 3206 -1972 -1625 2400 -3721
407 -3721 1156 1205 -4588 3600 -719 -4733 5176 -2290 -3903 5717 -3276 -2749 5771 -3817 -1782 5103
423E103r020L432M253p117L853K136n111L762k37k364L392k760Q61J809l875L472
439A589J95m558N858j742m915P797l976l901Q786n925k087Q020o925M2O529p509
455b722K400L796o318M069o7l424M398k838m46L772n275K890K100o500O214r68
471A081n872Q074l402l975P831n095j949P061o287O50M870o177L015J586m238
486b827M053j407j851M103l864R42L287n522L880J164n295N220o43m567N650j799
502E24l074N245k971j267L804k750J04J883j847P35M40j125J418r52j19J736k586
519h02J161J313k756J812J210l268K045J065l522K651N18l095K411P85l139J927
535C16J061k782J897K17j967J871o26p37J094r35O60j31j397K488j595j310L867
$$ plain form
423 5103 -3917 -485 3768 -3349 504 2640 -2471 1291 1054 -1310 2082 -678 183 1992 -1883 1589
439 1589 1784 -2774 3084 1342 -3573 4224 248 -3653 5133 -792 -2879 5141 -1784 -1742 4787 -2722
455 -2722 -322 3474 -2844 1225 1158 -2266 2132 -706 -1152 2620 -2655 235 2335 -4165 2049 1081
471 1081 -4791 3283 -119 -4094 3737 -1358 -3307 3754 -2533 -1883 2987 -3190 -175 1411 -2827
486 -2827 1226 -181 -2032 2071 -1793 -851 2436 -3086 794 1958 -3337 1883 1240 -3327 2323 524
502 524 -2550 2695 -276 -1543 2261 -489 -385 1498 -349 386 826 -299 1119 167 48 1784 -802
519 -802 359 1672 -1084 728 1938 -1330 715 1780 -1742 909 1427 -1668 743 1528 -1611 316
535 316 1377 -1405 492 709 -1258 613 -13 -750 344 -591 69 -62 -1459 1029 -566 -1876 1991
552A991l312k79M047m706J108L708n287K054L017n391L365J012m100L701m99k309
568a880L012j690n1J661k630K366l66k275L917k808p54M320m388Q49L916n272
584b073K184K493m761L121P17l471L085m50j835K181p84m76J057j313J140l09
600E06r74J700j480J0J714k106L73J949k561N67J801k339N85J152j361J00J221
617H57j248m23J719j415l42J478j315P1J424j872P20Q18j704J601q19m96J621
634F75k029P99J588k807K076L74l099L690j210k371M141k488r00L500l186P89
650d58K378l906K593M14k819L705k226p93L577l849J249K586m848L411Q04m410
666b592M893j564k737M729k923r00L423l289Q69J786k975K281m29j728K715k003
$$ plain form
552 1991 -1321 -1600 2447 -2259 -1151 2557 -2730 -676 2341 -3050 315 1327 -2773 928 429 -1880
568 -1880 1132 -558 -609 1052 -1578 788 422 -1853 2064 -744 -1498 2822 -1566 -717 3199 -2073
584 -2073 111 2604 -2157 964 1681 -1790 1295 845 -990 1191 407 -69 988 -325 815 506
600 506 -468 1232 -248 -238 1476 -630 -257 1692 -869 -302 1499 -840 -255 897 -464 -364 857
617 857 -391 -814 905 -510 -852 626 -689 -618 806 -1066 -346 472 -1232 369 -450 -946 675
634 675 -1354 -555 1033 -1774 302 676 -2423 1267 57 -2314 1827 -661 -1561 1939 -1247 -458
650 -458 1920 -1986 607 1021 -1798 1907 -319 -1112 2465 -1384 -135 2451 -2397 1014 1818 -2592
666 -2592 2301 737 -2000 2729 -194 -1094 2329 -960 -91 1695 -1280 1001 572 -1156 1559 -444
682d44K3K286l048J166J664l302K216O41l062K878m34k131K422q27j179J592p03
699b42o06R90l28k91K29L20m51l28Q15n57m2M84k76l9O6M16n67l26J126r31l62
720i00K251k365J1K710l218J084K105l477K089J247l391K691P5k518L164j602
736d4n84K294k580J438O44k549L079j234k067M266l330m97M349n002J947K488
752B618n149L552R06m399M137r51k564L922k678j19K527l212J909K78k465L077
768A389j461j383L284l142M80K737l801J637J539l281K392K38k641K815p05j554
784a457K246j330j58J195j224N83J03n27P11m67k20P73o52jO88n82j25O93m13
803a64m12J261o36o96J514j013l67J637j456o6J621k072R78R10j906J592j14j271
$$ plain form
682 -444 -421 1865 -1183 -17 1647 -1655 561 1202 -1860 1018 584 -1547 875 48 -1131 461 -242
699 -242 -848 142 -186 -477 -248 72 -379 -707 108 -449 -491 -7 -283 -322 -256 160 -407 -733 393 -538 -900
720 -900 1351 -1014 -1003 1707 -1511 -427 1678 -1799 290 1537 -1854 837 912 -1606 1558 -44
736 -44 -628 1666 -914 524 1168 -1381 1698 464 -1603 2663 -667 -1164 3185 -1817 130 2618
752 2618 -2531 1021 1927 -2472 1665 714 -1850 2072 -606 -725 1802 -1410 499 777 -1688 1389
768 1389 -72 -1455 1829 -1313 -833 1904 -1897 -260 1279 -2002 390 628 -2013 802 97 -1457
784 -1457 789 -541 -699 496 -728 -145 -42 -569 142 -325 -545 228 -424 -425 263 -319 -444 249 -164
803 -164 -576 685 49 -647 867 -146 -513 1124 -332 -398 1223 -849 129 1039 -867 725 611 -660
821f60K011j449k68K184k698J068J437l116K639k32k722L683j743j498L644l106
837h26J23K791l512J743R01l037K910r43j551K951k438J26K483l634K091J123
853A301l761L518n67k867L935j998j394L552k708j00K384k805J364R77k362K145
869F14p76q42J740j473M00J178k102J557M26k147K277n92j358J900o29r77J713
886I09o38r03J490o78m57J023m55n61Q94l12p22J022m45l34O56m67K98O4o12P70
906E42m76k17J068j299K62J486k384J164J156k866K256K17k836L003p42j984L175
923A525j913o64K651k585O87J354k562K021k34j807K720j892l78K724l402J596
939a59J506l502K642K61l003L423j085k106L623k390k43K533k751J174J097k408
$$ plain form
821 -660 1351 -98 -366 1818 -880 188 1625 -1491 1148 916 -1806 1877 134 -1364 2280 -826
837 -826 -703 2088 -1424 319 1220 -1817 1093 150 -1401 1550 -888 -762 1721 -1913 178 1301
853 1301 -2460 1058 491 -2376 1559 -439 -1833 1719 -989 -1089 1295 -1510 -146 831 -1531 614
869 614 -162 -1004 736 -737 -337 841 -1261 296 722 -1425 852 260 -1098 802 173 -804 909
886 909 271 -632 858 180 -277 746 291 -270 624 312 -410 612 167 -167 489 22 320 384 -228 542
906 542 66 -151 917 -382 -120 1366 -1018 146 1302 -1564 692 909 -1927 1076 334 -1650 1525
923 1525 -388 -1052 1599 -986 -299 1055 -1507 514 280 -1527 1193 -699 -1077 1647 -1755 -159
939 -159 1347 -2155 487 748 -2255 1168 83 -2023 1600 -790 -1033 1500 -1251 -77 1020 -1388
955a388J959J9j841K556j723j54K008k359J058R87k288J772K35j999K339q80j056
972g55J926j293l1J153j290L60O80q73M85J02p92P71j64m26N48k02l73N92l86
991C2l70P43n17j98P93p14j15Q65j025K51P87j353Q59N58j482J321m76p55J523
1010G27j164k84J460j691Q15Q95k185J970k19j763K450j230j007K508k109J79
1026f48J984k530J181R51k392K146n36j261K358j677j85J881k067J071Q35k501
1042a390K368m90j772K798j535r81K711k122j4K014k511J047R26j953J560j53
1058E03j142J424p38l59R70j092N50L78j100J196m10r16J310n45p07J529j095
1075b44k56J267j352K15J027j152K14P17q65J07O13q27L11L86m85L33p0l36M09
$$ plain form
955 -1388 571 590 -1251 1305 -418 -572 1436 -923 135 1122 -1166 606 841 -1158 1181 301 -755
972 -755 1171 -122 -153 1000 -290 70 750 -123 362 464 -328 443 279 -147 401 199 -174 418 32
991 32 -338 405 -112 -310 483 -231 -346 519 -506 -255 532 -821 38 596 -886 435 -41 -796 727
1010 727 -437 -721 739 -952 -137 758 -1427 543 324 -1439 1011 -219 -1226 1282 -827 -648
1026 -648 1336 -1194 -13 938 -1454 692 156 -1105 1253 -424 -609 1272 -795 276 1111 -1390
1042 -1390 978 488 -1284 1514 -21 -1002 1709 -413 -427 1587 -924 123 1049 -904 656 503
1058 503 -639 785 47 -312 658 -434 116 494 -606 590 180 -736 574 29 -678 851 -244
1075 -244 -500 767 -585 -370 657 -495 -281 436 -429 -322 291 -536 -225 161 -324 9 -61 -397 12
1094A2k12q0O85q98J62N95j099J020J63j246J421m19q95J656q91p50J936j645
1112d85P9J262j688Q96R26j849J295O8j292J759j026l95J457j516M93R74j640
1129f82J103J23j408J875q64r02K030j610l6J653k127Q87Q07j824J438J9j454
1146i72J781q91l95J583j675K69J057j533Q11L79j316J320m68p69J343q60j68
1163e04J023j053M00M81j069O86J34o74R58n11n65J030n17k22P65p76J51O20o52
1182b95J29O10p91L60M09p07L06L45p15N85J28n42O69l07l78P95p68J12O38q94
1202c11N33M19j204J251l95p76J250p63m74J430j096p3J183j635P73L98j276J130
1220C64J11j292J478o68n83J304j313M13O92j440J290j19j164J528p36p75J896
$$ plain form
1094 12 -200 -280 405 -493 -331 264 -835 185 348 -898 523 104 -791 865 -26 -776 1160 -485
1112 -485 -406 856 -832 64 990 -859 436 504 -788 971 -55 -450 1007 -509 -16 958 -682
1129 -682 421 544 -864 1011 147 -755 1275 -335 -371 1282 -845 42 849 -975 463 482 -972
1146 -972 809 -82 -477 1106 -569 -300 757 -776 35 414 -902 418 -50 -819 524 -336 -504
1163 -504 519 -534 -134 347 -722 -36 98 -576 382 -129 -694 336 -181 -403 362 -414 -263 357 -295
1182 -295 -166 444 -347 13 422 -285 21 366 -349 236 364 -178 491 184 -194 601 -167 -55 583 -311
1202 -311 222 641 -563 688 293 -483 767 4 -470 960 -136 -209 974 -661 112 510 -766 364
1220 364 475 -817 661 -7 -590 714 -599 -186 506 -934 356 237 -927 601 -135 -910 986
1237I86j495j6J373j672P66O62j561J220Nj288J479n70n30J199r57N8Q31j191
1255g01P27K78q59R59l59n29J012o44k00R17j098M56M33p78O06K04o78O99j06
1274C39o47P58l25k77N84m22p6L34k74J41L23n93K76K12l81K33n2j86L50j71l11
1295a65M71j78l34O23n61J6M67p50L62L73r01P18j24n56Q58l91l65Q78q11j56
1315e26Q78r24M61M47r85P83j9q34J116p41k45J221j071J59Q28j067O35K65j066
1334f85J165l35o68J191p46k65J022j021K96O55j159R25L4j004J307n90n50J011
1352E83p20J99M32p35M62J57p38Q26l74l46Q27p91K6O41p30M61J39p55O84r3n02
1373c47N88j12n45O90k23k17L98k89Q5J11q1j03K1N6k06O2J3o4J6j9K49k27J2
$$ plain form
1237 986 -509 -525 848 -824 -58 604 -957 263 268 -1020 459 -111 -641 558 -399 -341 490 -701
1255 -701 26 304 -555 404 45 -484 528 -116 -316 601 -497 -41 392 -386 220 424 -254 445 339
1274 339 -308 450 125 -152 432 10 -66 268 -6 135 458 -135 141 353 -28 205 153 -33 317 146 -165
1295 -165 306 128 -206 417 -144 -128 339 -411 -49 324 -577 141 17 -539 319 -72 -437 441 -370 -526
1315 -526 352 -572 -111 336 -649 134 115 -719 397 -344 -589 632 -439 -280 548 -519 116 381 -685
1334 -685 480 145 -523 668 -78 -343 679 -342 -46 609 -550 375 409 -595 712 122 -428 583
1352 583 -137 62 494 -241 221 378 -360 466 92 -254 573 -218 -192 449 -281 180 319 -436 248 155 -347
1373 -347 241 129 -416 274 51 -166 232 -57 28 139 58 -45 -24 32 -174 -112 -99 -163 -147 -166 83 -144 -132
1396a32K11k05R2J51l56mO01p55L20M19p95L99L22p75N84P4n11P29m87j61N98
1417C19n54K14L40n83O20j89l81P89o28j47P88r39M20N38j091O93K79r52J038
1436E74l63n42J123r46j40Q30q67M22K54n98M81k6n30O50m67R3N16p29J72L31
1456B38n16L43J2n11N99j75k72N33m33O1K72m09J34K01l87L30M8l58L48r0k81
1477c13J03P4K14j06ll9J9nk7L6o8MJ72n6k01L11k30lK95l06J93J38m94M85o2
1502A31k62N19l52q7M36o15L56J93p13O51q6n42O09k72L2L13m61J80K93o42N50
1523B31j10l40M23k05l82Q09q16K44N05q76O85j40o00P88l48j84P24o87J61M11
1543B93o66K41L26n01N06k19j75L75l25K1K37k45K53j58j95K88k15j49O37l81
$$ plain form
1396 -132 79 -126 -34 117 -239 -243 358 -397 -77 342 -453 -54 268 -507 77 151 -360 369 -118 -279 319
1417 319 -235 -21 319 -264 356 167 -214 575 -53 -200 588 -351 69 607 -484 209 488 -464 574
1436 574 211 -331 792 -154 -294 536 -331 91 345 -253 228 202 -328 322 -145 -52 464 -265 -93 238
1456 238 -278 65 77 -434 165 -10 -282 251 -182 -121 151 -258 -124 77 -310 20 68 -290 58 -32 -313
1477 -313 -210 -136 78 -28 -31 -70 -51 -56 -83 -47 -115 -111 61 5 -196 115 -115 -118 177 -129 64 202 -292 193 131
1502 131 -131 388 36 -51 385 -230 126 319 -394 257 171 -371 238 -34 -2 311 -150 30 323 -319 231
1523 231 121 -219 204 -1 -383 426 -390 -146 359 -517 168 28 -572 216 -132 -316 408 -279 -118 293
1543 293 -373 -132 194 -307 199 -20 -195 180 -145 -124 113 -132 121 -37 -232 56 -159 -308 329 -52
1563e2j26L52m33K40J21k80K44j09KR2m4J89j19M4M8k29J63P8k87K30o2o7K49
1586B44k11m9J85k61K36j43m8J33k13J24K61n45L12J13m23N12j34l70N68m23j28
1607b60M52n25K46M07o01K77Oj07L25l56k1J79j62Q2K47o07M86ml27N06l68j08
1629b33O03o88N4M63n51J28L60l58L11m0k34N33l69m6K54l94K84j2j33K69k73
1650g2j11L26k27J38J12l83L50n0j10J16K3j7O7j55J64j3j54J48k42k2J67n8J98
1673A95k48L2J47j31K4K13l47J61O2k69J53m1r0K67l71J72L37l34L3R6k83L32
1695A10j50j23K29l03K74K5l74M62n0l47M31l70L4L89l08J71K6l38K26J14j66
1716c8K11j76k36M44l76K12J46l28K56j41j56K97k26N5L87n05L46%m40L47P6k86
$$ plain form
1563 -52 -178 174 -259 -19 102 -178 66 -43 -41 51 7 196 77 121 169 -60 103 181 -106 124 62 -5 244
1586 244 33 -16 169 -92 144 1 -47 86 -127 -3 258 -287 25 138 -285 227 93 -277 291 -132 -260
1607 -260 192 -333 -87 320 -281 -4 2 -105 220 -136 -157 22 -140 -58 189 -418 68 64 -263 243 -125 -233
1629 -233 370 -318 -264 199 -352 -224 136 -222 89 49 -185 348 -21 -67 187 -207 77 65 -68 201 -72
1650 -72 -183 143 -84 54 166 -217 133 83 -27 89 112 95 162 7 171 158 4 152 -90 -112 55 -3 195
1673 195 -53 -21 126 -5 19 232 -115 46 108 -161 -8 -49 -139 128 -243 -71 266 -68 -35 61 -222 110
1695 110 -40 -163 66 -237 37 62 -312 150 100 -247 184 -186 -152 237 -71 100 126 -212 14 128 -38
1716 -38 173 -3 -239 205 -171 41 187 -141 115 -26 -182 115 -111 -56 331 -174 172 172 -268 79 155 -131
1738a31J99n2k0J94k85j8P7l3M7J09j1p6N2k66K26j0M2K4Nl9j47J55o4%P9j45
1764h8J95n9j23J49K1k13J15k0r6K21k93J05J99k93NK00j51J26j35j7K66k75J62
1787AM6k14K37m3j85K64j47j38L22j00J1J20k37N0P9j83K64o8j96K65j78q6K83
1810A67k05Q9N2k03K96j55j46J68q1LJ85k47J44J12k56K48l1k55P4L7k51K11j12
1833a56J73K24l01l9J63m3p5n2J37Kj15R1j5j79J00J09j32J07n3rJ16j74o1J99
1857A7l2Mm3O5M8j59K48k65J09J07j31J22k9j55K10j49j07L08j99OJ74k87Q9J14
1881F5j40J28nk35K56j31O9J46j32K25r8l21L19j44j46L68j79J0O8k21Q6J77k70
1904a05K31m0j18K14l57Q9J80j66O1P8j14NK4j3K28l10J16J42j67P2l4j48J20
$$ plain form
1738 -131 68 16 -4 190 -95 -113 -36 -69 -22 87 76 0 52 -214 12 2 44 68 73 34 -113 42 -22 -22 57 -88
1764 -88 107 48 -75 74 95 -118 -3 -23 -119 102 -191 -86 113 -180 -175 25 -126 0 -135 -152 114 -161 1
1787 1 47 -167 70 27 -158 106 -41 -179 143 43 54 174 -63 -13 66 -117 147 79 -117 148 -30 -116 167
1810 167 -38 51 103 -100 196 41 -105 63 -18 -15 170 -77 67 179 -77 171 140 -115 -41 -4 -255 -44 -156
1833 -156 17 241 -60 -99 64 21 -54 -106 31 33 -82 9 -6 -185 -85 24 -108 -1 -54 -63 53 -121 -182 17
1857 17 -15 -11 -54 11 59 -100 148 -117 -8 99 -32 90 61 -94 116 -33 -140 168 -31 -25 149 -138 -49 65
1881 65 -75 53 48 -187 69 -62 7 153 21 246 148 -173 146 2 -144 224 45 55 123 -98 -12 165 -105
1904 -105 126 86 -32 182 -175 -86 94 -72 -11 67 -47 -42 -18 -31 197 -113 3 145 -22 50 16 -132 -12
1927a2pj09J4oK5L6L9j58K23k17J12J18j52P0qr1J42j7P3K3o4L5%j26J52O3r0
1954F8Q5l9j14j16J44O8k10J60n8l3J52j73R2J99m09L64L4k16L0M3q0L7j3J5K17
1979B47m11L31j01q9Q6k8j12K25k80J22L4j97L01m5k13J79k12qK19k53J3J72o4
2002h4K6J04j80K37n5k10J21j14R5R4j24R3n3J27j35J59j86K19j43R3L7j36J4
2025aJ68j17k1Q0n8j60J19r4Q0r7K24J2p3Om0O7k24J66JJ74j22n9%j0LMm5L7j2
2054Hm3J69j05r9o7J73J0o6P0j0m6J63j42p7P4m2LJ3J51jj76K1J74k38J15K1j58
2081a05J04N8o1R9pm6Q1j62n9J60k32K22J0k03P3n6o6L51j16J05j59j37K50j57
2105e3N0j5P2r6N4K3rJ04l2nJ0j76O0P2j21J16j02k9M7M7l5R9q0m3J55j60Q6l8
$$ plain form
1927 -12 -19 -128 -114 -120 -95 -59 -20 -178 45 -172 -60 58 -94 -24 -32 -123 19 2 75 98 34 69 69 -57 95 158 68
1954 68 153 114 0 -116 28 96 -114 46 -12 -45 107 -66 26 225 -184 180 214 -2 28 71 -9 28 15 30 247
1979 247 -164 167 66 -23 63 35 -77 148 -132 -10 24 -173 128 83 -130 49 -163 -171 48 -205 -192 -20 -84
2002 -84 -58 46 -134 103 48 -162 -41 -155 -60 34 -90 3 -50 77 -58 101 -85 134 -9 84 121 -15 -1
2025 -1 167 50 29 109 51 -109 10 -84 -4 -101 123 135 62 68 28 95 -129 37 38 212 90 31 31 21 24 28 -17 20 8
2054 8 -35 134 29 -70 -137 36 46 -20 50 40 -6 157 15 -62 12 -30 -27 -14 137 136 -40 -19 155 -83 32 53 -105
2081 -105 -1 57 -4 95 88 42 123 -39 -98 62 -170 52 62 -141 -68 -124 -190 161 45 150 -9 -146 104 -53
2105 -53 -3 -18 54 -42 12 35 26 130 98 93 103 -73 -13 59 -62 54 -48 -77 -30 17 -18 81 1 -42 113 -47 39 1
2133Ap0Q9o4o6J07q5M8K04j66K5j53K05q4k7O4R1o8k18J84m7J19p7j10R8J38j67
2159b9l1J78j17L4J26k90K02m2j54l1K86k68L00l63J82j5kO6P0k16J97Mj62K1
2183e4m6L6J43j35K3M2j65J18J76n3j0j4j94K45j5j57J45j28J41o5J9P8j25p7
2207g2K7J7n1J32r2j3J84j72J66m4q5R5l3j96J81q1q0J06l7K2R8j42l1J63j18
2232e6L1L0j14J92n5l6q1J18j19Q8Pm0M4n1M8k1ok3M0Q1o8r6k03K98Pj52M4j0
2260a03J75J2j02p7K48j75M1l1PO3K2r3o7J18j20J59r3J46kk12J33Kj45J57p7
2285a4M1j6l7r4J60j4JO2n5k1j73J12J35j16N1Km9l6J08j24J69k8k63J23k2J60
2311F2Q4k41R6J18o0L3o3j29M2k7M7J21j31qM0J02j80J29j1K6N8j77Q5q4M1J06
$$ plain form
2133 1 -69 20 -44 -110 -3 -88 -40 164 -2 23 -130 75 -9 -36 28 119 51 -167 17 -30 89 12 -98 0 138 -29
2159 -29 -60 118 1 35 161 -129 73 31 -123 -154 132 -136 164 -199 -17 -32 -34 32 102 -114 83 87 -75 -54
2183 -54 -100 -64 79 -56 -33 9 -156 -38 138 85 75 61 -133 112 97 -60 85 -43 98 33 52 130 5 -72
2207 -72 -45 -28 -79 53 -39 -52 132 -40 126 82 -3 92 59 -137 44 -37 -117 -11 -48 -26 72 -70 -101 62 -56
2232 -56 -25 5 -109 83 28 -8 -89 29 -90 -2 5 -35 9 -42 6 -15 -21 -44 -4 77 9 -87 -290 8 15 -137 -93 -103
2260 -103 72 84 -18 -95 153 -22 19 -12 -5 58 80 -13 -80 38 -82 77 -16 130 128 -84 49 51 -94 63 -14
2285 -14 27 11 -26 -120 40 26 27 89 34 13 -160 -48 87 -29 22 24 -25 -61 47 -77 92 64 -199 -76 -98 62
2311 62 146 -95 1 119 59 92 29 -100 -58 -85 -38 83 -48 -56 -16 86 -94 35 24 50 108 -69 16 -68 -27 79
2337G9l2o1J15j52J82r7j1K6j34J68r1M0j71J27N9P7j8k19K7J08p0K20o2j34R9
2362G5l0j22K45r5j16P9n8q0N8J0J42q9M8p1Q9j51J10j6l7j10J8n1J25K1m0L2
2388a4o5r0K02m4k8R6j04J05p0n4%J04q0J33k86J48K6J64N2j13j29J53j33Q6m0
2413A9j05O9K8M7qK0l6N2j06q2J47M9o2N9m3M1k09N0n3Q0%n1K92k37R8n9M9l7
2441A2n5j08P5L1qP1J41j11M0j70P9N9l9n7M4N1o1m9M8N0K7o1J78k58J3L0j09
2468a37K29J6Jp3j10K1R6l4N6l2L1j26J28o7R3j00N6Q9j70R4j00o1Q5m1R8L8n2
2495B8j94K44r2M5Q9k68J03O1m4R7nj72J62j02q8J59j09J7J17p2k00K45m1n7J21
2520D4j1K6l9l3K7rn1M0o8K9O2O4n9j1k0L5n4J47j05Nn6J87j75m8J32J2j11L8
$$ plain form
2337 79 47 -14 101 -51 131 34 23 49 -85 83 -8 32 -139 -12 47 124 106 -113 -86 22 -48 172 110 -24 75
2362 75 45 -77 168 73 -43 36 -22 -102 -44 -34 108 19 67 -4 85 -66 44 28 -9 -119 -101 -152 -27 -6 -46 -14
2388 -14 -79 -169 33 -11 -39 57 -47 58 -12 -66 -66 38 -42 91 -195 -47 -21 143 195 82 -47 106 -27 59 19
2413 19 -86 -17 11 58 50 70 34 86 -20 -102 45 94 32 91 48 89 -120 -70 -123 -43 -43 -94 198 -39 59 0 49 12
2441 12 -43 -151 -76 -45 -53 18 159 48 88 -82 -3 56 17 -40 4 55 -6 -55 -7 43 70 9 187 -71 -58 -28 -137
2468 -137 92 108 109 36 -74 -53 43 9 65 33 64 -62 66 -1 92 -8 48 137 -33 61 -39 -100 -15 -56 42 80 28
2495 28 -166 78 -14 31 120 -148 -45 16 -28 69 64 -108 54 -48 -136 23 -86 -69 48 -24 -224 21 -20 -77 44
2520 44 33 59 20 -13 14 5 -46 -6 -74 -45 17 81 22 11 -9 26 -28 119 14 19 -37 150 -25 -73 59 71 -40 -2
2548bp1j51L48k01J14j46J86n6J23k52L09j29n2P8j09Q2n0m3MQ1j77J01L3j2O4
2573G2j23O3J47k89N9J22j73J38n1j1J17p2k4Rj16J93k9q7N2k2K9L7nM3j08J1
2599a8L7j28J21L7j31M0k9J50k30P3j40J35K37j55j6l9j96L72j7j5k97J44J89
2622A24m16L50q2L68o13K71k0J52M1m7m2m07Q33k84m56K01j42R3K39l03j79L84
2644F5K41q86M67J01K7N7o2m98M08O2J70M7J91o93K67K03l27J20j47j82M43J32
2666B06O1p56K62K90m62K44P4K37o51L21j89L48k32J05N55q35L52j89M83p06M16
2687f6l94L69J25j00J38J04K91n34K5rN69n71k08j76M96m48N25N0k78L69k80O1
2709E8l42k64N16L7j42m72Q95j90l8N7m55O97J9l77m12M69l91J05J32M7Q1M6l88
$$ plain form
2548 -2 -73 -224 124 -77 37 -109 77 21 144 -108 201 72 20 98 -11 71 21 -22 -18 63 -114 -13 20 8 72
2573 72 -51 12 159 -130 -71 51 -122 16 -35 -46 71 -1 -25 -16 -132 61 32 -55 -3 -25 4 41 36 79 -29 -18
2599 -18 19 -109 12 49 -82 -42 -71 79 -151 -78 -218 -83 154 -1 -17 -56 -252 120 103 88 -209 -65 124
2622 124 -292 58 -24 344 -269 2 -18 134 175 128 86 -321 512 228 -228 -27 -169 -76 163 -140 -319 65
2644 65 306 -580 -113 -12 15 72 10 -488 -80 -18 152 199 390 -303 -36 167 -160 -40 -187 -369 74 206
2666 206 267 -489 -227 63 -399 -155 -81 156 -495 -174 -363 -15 -247 -142 413 -422 -70 -259 224 -482 -66
2687 -66 -460 -91 34 -66 72 176 467 -67 -42 -51 518 -53 -261 -437 59 -389 136 186 -92 277 -3 58
2709 58 -284 -548 -32 5 -137 -609 286 96 58 115 -340 357 376 -1 -413 56 -335 -230 -98 -51 30 76 -312
2732c12L98L75n8l10Jk60J76L01q34Q94o77jO59m76M99n21O21m64k52L34k32J43
2754Dp0j35Q69k87o40K53J18r5j11J90q9M70m48J55n86r5O13j26K67p4o45N23
2776F1K21j95R5m98O03p34M01k33K65j41kK87m1kl0J59l89P6M01J74j98m88M1
2799a67QK33M19n04Jk78J81L6J61l3l59M73L7j40J7j23j2P9l2m3o1J07J39j58
2823a9q5P8J68k04O6l2m4j0N0P3q3L3k2r9R8M3j06J20n4O5o9Q1k04K36K8j1o5
2850C2K2M9n1K0l3M4o2nL9R5j88M9n6O8q0j15J73n6J19p5k5q1P2P1l6j6Q1l5J2
2879C2l9n7L2M8o4R5M9M1j13k7n8j8J35L1j15k9k0J60j11j83L28j62J62j54l2
2904f9J06K3r0l0O6k7K6RRJ06p2k23J07pJ76j19n9K0m5J47n0K2l6J30r6lK1j04
$$ plain form
2732 -312 86 461 403 93 94 -166 10 311 -523 371 -306 -307 352 -124 375 -146 475 11 -241 93 -139 4
2754 4 -66 -201 668 381 -259 -6 112 17 -94 96 7 477 29 184 -402 -497 116 -10 257 183 -462 61
2776 61 282 87 182 -316 287 -447 -46 -279 -14 -155 -157 130 89 87 57 216 -173 -97 304 478 280 -208 -167
2799 -167 -159 74 493 -11 -10 -288 -107 -71 90 57 -302 171 208 68 85 -38 -50 29 -3 -46 -107 0 139 -19
2823 -19 -104 -26 142 -62 4 -28 -72 -82 -32 41 -42 -9 -31 -130 -32 11 -95 25 -29 36 -33 48 -156 80 108 97 32
2850 32 54 103 52 72 39 83 21 16 55 150 -38 11 -45 23 -57 -172 1 -55 64 -11 -36 -117 -45 26 -10 -26 55 20 32
2879 32 -7 -64 -32 16 -48 47 96 137 24 -3 -61 -79 56 87 -28 -57 -77 83 -28 -211 117 -45 117 -37 -69
2904 -69 37 60 -30 -60 6 -21 5 14 23 129 57 -166 -59 -66 110 -9 -68 -48 -93 54 4 26 -10 120 24 21 42 -62
2932f2n2J22R3l4k3p7J06o7Q4j58J06k01j1K47j74N7J09j29J77l8k00O1R3j88
2956a59J96j50J77p6K2K2l0O7k16J74r8J11P4Nj06K6r8J05j63Q7j4nK9J8o6J67
2982I9j26O6j18j68K91N7j35J87k14p7K57k40N3J17J3j11J51k04k6N6j12J55J36
3005A07j88J16J27k05J09j0K7j04M4P9j8j3M4r2K8r1K3p8l4L50k43J44k09K3M2
3030b2M8j1N4O2j22Mj7R3l7o6O4k8l3N5o4P0P2j68J13j97O7K12o0j29R3k5k5Q6
3058H9j98n3K11j55J47p1J0k6N8Qn5j44L23J93m87K74l7j45L7J96k71K59%k08
3082d5M9p2J06J28j43k8K5o2J87l37J65K9j18j7J90p6J1L3j11lJ9J65k09O9K2
3107b3l4J62j17R1L5q8j9o3j2mR6n3j59J76N2%l2p7J65j73R1Nn2J29j99M0J13
$$ plain form
2932 -62 -114 8 101 67 44 -33 73 6 90 -68 38 -163 -174 73 -101 -44 65 -64 113 75 -125 -64 29 -159
2956 -159 37 -113 64 -12 10 32 2 69 -147 27 -71 40 114 119 13 39 -59 46 -117 -30 -44 -49 -20 -2 -68 99
2982 99 -27 39 -79 -247 44 101 -34 153 -61 -138 119 -121 -68 49 62 -49 102 -102 -128 -72 -184 -29 107
3005 107 -81 35 162 -43 66 56 83 -21 23 102 84 71 115 23 51 -40 -17 -95 -129 221 -22 122 -87 -64 -22
3030 -22 26 15 69 131 9 13 -4 89 52 -14 50 22 -11 44 -20 50 122 -46 67 -130 -63 149 89 -40 53 28 3 89
3058 89 -109 -162 49 -106 41 -30 -20 -46 12 20 -35 -179 144 337 -150 124 87 -58 -21 175 -96 163 163 -45
3082 -45 4 -68 38 166 23 -5 20 -42 145 -192 -27 2 -116 -133 57 -19 -8 25 -86 -89 -70 95 -114 -45 -23
3107 -23 -57 105 -12 79 114 26 7 -56 -68 -72 24 -29 -188 -12 40 40 8 -69 96 -77 14 19 -33 96 -103 -63 50
3134E0l5r1J54j49pJ3P8j21J49j20J37O4j56O3q5J3M9K9o5M4q0J85r4o2N5l8L3
3161A3j42Q7JK28j75J00j72Jj4j07R6M1J80j64J53j18J0k8j29R4J61j59Q8l3J52
3186A64j5q0L5Rq0N7r1N5o3J13l9j54J24R7p1k03M9M3pQ1n9L7p4M8J27k9J9j05
3214a2Mj1j08J86j50k8K47k29l7K31k04K05q0l2j21j31L17J29r2n3k6k50K32Q6
3238G3J25o2r5Q7k14j31J07K49l54K17K7L02k99l6P0K83k70k74K87k9n8K98n73
3261b70L37l06lK46J33M9k81Q3j25rK77o0p6J99or0l06J55L47j94J92k79q4J91
3285A20j03j00n6l56N73k8M2j46rj97J86j16J2K36M7j83J55j2M9l7j37P2M9k2
3309C9L7O1j44j9J39j43p7n0J29j43J06K49j09j77J73j83K5P2Q7j37J0K0J56j17
$$ plain form
3134 50 15 -76 78 -71 -78 -65 13 -108 41 -79 58 122 -34 29 -56 -43 6 35 -30 14 -66 119 25 -37 18 -20 13
3161 13 -129 -42 -41 187 12 112 -60 -59 -73 -180 -84 -43 137 -27 126 8 18 -10 -139 -45 116 -43 45 12 164
3186 164 149 69 104 113 33 90 -1 54 -9 104 65 -89 35 132 61 -142 -93 -50 -57 24 -35 2 -72 -24 103 74 93 -12
3214 -12 -8 -19 -127 59 -91 -119 128 -101 -138 93 -111 94 14 -18 -139 -270 47 176 84 31 5 -245 -13 73
3238 73 198 136 41 128 -86 -217 -110 139 -215 2 29 331 32 -4 66 349 79 -195 92 63 5 303 -270
3261 -270 67 -239 -242 4 137 186 -95 -12 -137 -146 131 71 -5 194 188 98 -208 -53 294 100 292 13 -71 120
3285 120 17 -83 -139 -495 78 50 92 -54 -63 -260 -74 -190 -178 58 105 -78 77 65 114 77 -60 12 61 39
3309 39 76 137 -7 -26 113 -30 -107 -157 -28 -171 -65 184 75 -102 71 -112 -87 -15 72 -65 -55 -35 121 4
3333Dj08k6K03j01R3j77NJ31L1r9L6K8j92K47j11n2J08L8J10k30n4Q0r2J53L2
3358E7m4pJ29k28K16j05J3J14j73q5K48j23l2M0m4J01K0m0Oj19P1j45J3J56j44
3383a05J16l5O5j39J79J9j40K29j55lj36J09o3N4Q1Q2j54Q4o0R3r2L6j1j16J7
3408d5L2J37j80J41j3j43J1M5J03p7N6Rj60K04j25m0J04ok00K37r6O6o2n7M7j
3434a3R5k04K62k50Q0N5r1N8k7MJ50kj54R6r3J04j35P6q8O9J3J21j98J84j94j
3460h3Q3K0k17K07M0j71K45j30J55j09L3q2Q7j66J84j30M9q0J6J31J23j34j50
3483g9J82j83J64r8j25K61j88m3O8Q6n6r5K03m0k5k46J03J50J09j82p4J28j06
3506h6J07j9PM8Kn4mP2j00J1J04r8j5K2N3n3P5l5r4J6K0K6K08j46n7o6P0N9j46
$$ plain form
3333 4 -104 -130 73 -28 65 -112 -107 24 55 -44 -8 20 -172 75 -36 -88 20 58 168 -62 -116 -36 -128 25 57
3358 57 13 6 135 -93 123 18 31 145 -28 -113 135 12 -20 20 -24 77 97 57 63 -56 15 -130 -117 39 -105
3383 -105 11 -24 41 -98 81 100 -40 189 34 31 -105 4 -59 -5 76 158 4 88 28 121 29 65 54 -62 -45
3408 -45 -13 124 -56 85 72 -71 -60 -15 88 11 67 76 -84 120 -5 -45 59 53 -147 90 -6 60 -2 -59 -12 -13
3434 -13 82 -122 140 -110 -30 25 -66 -8 -35 -31 119 117 -37 59 -34 70 -65 11 -77 -8 5 126 -72 112 -82 -83
3460 -83 0 20 -197 10 50 -121 124 -6 149 40 73 -9 78 -88 96 -34 15 -65 -49 82 205 71 -79
3483 -79 103 -80 84 -14 -139 122 -66 -109 -41 45 -11 -106 97 57 32 -214 -111 39 148 -34 -108 20 -86
3506 -86 21 2 9 57 59 5 1 73 -27 -16 88 -10 -25 -3 50 -3 72 37 -57 -41 -21 5 213 67 10 -56 14 73 -73
3535g3p7K88K7j31Q2k17K9R3j13Q3k2j21K32QN7j71K8J9J0r4K6J7N7j99R5P5j49
3562a41R2j00L04k03PO8j33J11o1O6r8J60j9l3K0j00M2Ln9P1M2M2M9j98L8pK7
3589a0P9j79J06J69k09j7Q8N1p1M0j13J00j1l6J1M2n3l5K01j63J02j34j23K75
3613A10r9R7j40L2rJ01k25K91j98n3J62j32J14Nm2R3k0l0q2N4r4J39l46J83J17
3638B8j4k9j23J11Q9L7j86O3l2j23L23j72J27j5l9NOp2M6J19j00L6N0j29R8jj45
3665d2J60j79J12q0R5k0p9P3m7n8J26m1Ml2M4o9j34J54LJJ43p4j94J22oJ13q7
3692Hj48L84k71J0J92k32M1RL3j45j0j0J28l0P2l7l1k6pJ21q4Q6kp1k7j23J35
3719c5J39k19J34l5O6k2j1m8P9k8j8M4j44J20J0j51O6O2j15P4ll4J36r9J0J24
$$ plain form
3535 -73 -150 138 165 34 116 -101 -72 21 -92 -9 -31 -152 80 88 145 -26 2 21 31 -63 -37 -20 37 -162 -67 8 -141
3562 -141 -49 -149 155 -48 -41 27 -106 5 -56 10 -88 72 53 20 40 -60 -18 -15 -74 -3 39 81 130 -68 -30 -37 -10
3589 -10 69 -110 -4 165 -44 -61 27 78 7 47 -66 34 23 -13 -2 40 -13 -48 153 -10 92 -42 -165 110
3613 110 11 108 -32 0 -9 92 -133 158 -40 -93 69 -63 51 56 14 107 87 57 -25 29 -65 74 -272 -89 28
3638 28 14 -15 -138 -27 62 99 -87 -24 -56 -179 144 -28 99 84 45 50 56 -16 30 149 49 85 135 6 104 103 -42
3665 -42 118 -61 51 -29 66 46 -33 40 -7 -65 61 20 24 -8 36 -33 -167 -13 -10 -9 134 60 -134 -12 -18 95 8
3692 8 -140 244 -27 -17 175 -57 -16 -7 26 -119 -129 -139 -11 -41 31 -6 -37 -63 -70 51 -33 53 51 -20 -47 -170 -35
3719 -35 104 -115 19 -16 50 28 17 -31 48 20 2 46 -98 22 32 -119 -53 9 -106 -32 -35 -69 67 -32 -22 102
3745A02j62P5n2l1L55k81j58K18jj09J82j38Q6j74J85j41R4j11kK0o0J55p1ML6
3770B1J5l7K4Qj2r6J24j97M1J53q2Q3m9n3p1P3J22k4o8J17oj27KN0j30K18j00
3797aj33J31j08K12o5j01O1o9J00nJ0M7o7R9nr2m4Q9j33R5j08J19J4M8r6J1QP8
3825I5j55O9k0n4j8K1J36k08J52m3j9J23pj61J68K0k01K10k08L27q6j66j2q1P7
3850d1J06J2m6j8o7R6L5r0N2j25M7K5n3K5j3J17j80J65No8L6j28J17N1N1q5j1
3877A5k7Q5o4l7J94k79J10R4p9j23K02j61Q3J02k69J86N2L8j44oJ6K3J4K9N7j39
3903b8L7nqj6L0j39J51j02J37J34j96j16K54Qk27K53j11j93K39j64J02j49J12
3926CJ04m1q4L4oR1l7N8j90R2Q6L7k11%L0O0q9k3L1%O4N0m8nl7P5j57k0J34m6
$$ plain form
3745 102 -60 15 -37 -68 287 6 -152 66 65 -44 138 0 86 -88 97 -44 50 -61 -63 -43 -103 52 -19 -15 21
3770 21 36 -1 23 31 19 -77 47 -150 -109 44 -38 45 -4 -57 -128 -55 67 43 -25 92 86 -41 -39 11 -119 99 -1
3797 -1 -134 -3 -111 101 36 -65 -4 -73 27 22 32 79 12 111 106 14 -30 59 -74 21 -87 32 46 94 -2 9 17 95
3825 95 -60 9 -11 -65 -83 -62 74 -134 18 -25 -44 79 72 -89 79 99 -102 108 -100 227 141 -25 -37 -118 -41
3850 -41 65 77 31 13 -54 42 77 -13 39 -86 -39 -14 -67 -42 -55 62 -118 47 52 -16 20 -108 9 60 111 26 15
3877 15 -12 73 9 -28 166 -113 -3 91 12 -111 91 -70 13 115 -154 32 84 122 -22 -28 -12 11 25 54 111 -28
3903 -28 9 4 -4 -20 10 -129 22 -80 57 191 -5 -121 133 141 -86 167 56 -137 102 -62 40 -109 3
3926 3 107 66 -18 16 10 101 64 122 -68 24 110 147 -64 -64 -34 26 -63 -86 -55 -55 9 59 11 6 -31 44 -113 -133 1 -45
3956d5O3n7L1lk1o1J74QJ6j48J49j80M9N1J2j6l3O6Oj09J79j51L0L4j01R7P3j37
3984b4M4P2p3n2j5RO0k9o8J00kj20J91M8j39Q2j63N6q0J29m4Jn5J07J4p6J41j27
4012a3O7jK9k40K66k31J27q1L4P9K0l6J5l1R0j20R5k14J33O6l0q4m8R8oL8o3N8
4040A7j20K43k97J44R3j3j24J99j55k5K8J09k9lL2k3q5k9Q4k8J6J08p3KO1j16
4066A6KK1M4r2J8KJ45k30J58j63J57m3k9Jj5oq4O9l8J1R7r5k9R2M5n7N3L0p1J3
4096B2M9k05Q5L7r4n3K06L5j84J28lj98K35j07oO8j05O3q3K7J43r7q6L16j14j19
4122d0j4J0J90j62N7L0Kj31P5o9L1q9J23j39J93m3n8L1m3L7m3J32j57Q1j35K19
4148H8p6o9qK3r9K5J57K9p3j1Nk4p2K09j79O5L3o5n8K7M1J02k7N5r7j3J00j54
$$ plain form
3956 -45 18 -39 -8 -11 -32 -93 81 89 105 -43 106 -74 -25 26 38 22 -11 55 61 -48 131 -20 10 44 -57 40 113 -24
3984 -24 20 92 19 -33 -48 -39 21 -8 -76 24 22 -98 93 141 2 84 -79 -23 -103 26 -18 -17 -72 35 49 -27 114 -13
4012 -13 54 53 82 -158 108 -123 4 -77 -43 36 56 20 35 4 94 -26 69 -145 -12 54 24 -60 -108 -10 -16 22 -41 17
4040 17 -103 140 -157 -13 80 67 -57 142 -13 -38 -10 99 70 67 99 76 -9 -38 46 18 34 142 69 71 132 16
4066 16 18 39 83 -9 9 11 156 -74 84 -79 78 35 6 7 -8 -14 -98 -29 -67 -56 41 -54 -83 9 54 -3 50 80 9 22
4096 22 71 -134 -49 -12 -106 -159 47 82 -102 26 23 -175 60 -47 -53 15 -90 -27 -110 -83 60 -37 -123 193 79 -40
4122 -40 -54 -44 146 -16 41 71 73 -58 17 -52 -21 -110 13 -126 67 24 -34 -3 -46 -9 -52 80 -77 4 -131 88
4148 88 12 -57 -65 -42 -141 -116 41 70 -3 -14 -9 -33 -105 104 -75 -10 23 -42 -100 -73 -32 70 43 98 1 -12 88 -66
4176f6N5j51K75p3p2P7p6n5K5O5l9R5j80N7R6j06J07k6m3J07j29R3j67J17O3m0
4202IJ3J7R3j21m3k1N0j12LJ17J11j22Rq5K9K6J3oj04J66k42K18j6j5Qj1m2J39
4230H1r3J63j44j5N0l9j08M8N1pQj78J70j57J23J5j4pJ81j19o6P2P5j22M7j0P6
4257H1j17K1k3K0m6K2K7O4J82j23n4lj47J11qk01J76J49j74J19jj36J36j07J07
4282G5qk34K00n7J17j36m5Q5K8M9jl2j19P3J33q6j11J00o3j1J15j24MP2p7rJ00
4309C8p4J06q5j35K26j58J32J2q4Q7r2J6m3KJ55k09J78l6m0j2l3P5j89J40l4K
4335e5N8Kk3O0q2R9K2J2o7J23p9j20n7R0j22K27j00K1j99P8R9L7Pn6q2J95j25
4362c7J00J0j62J37M4j29j77K89j25k6J96n0j31n7J73r6n4J53j09R0J2l9R6p0
$$ plain form
4176 -66 -11 -162 113 40 -32 45 -31 -86 -61 4 -35 60 -120 -63 33 -73 34 8 -35 72 -57 36 -131 -14 49 9
4202 9 22 39 132 11 -32 -53 -3 -115 -112 5 116 -6 3 -82 -53 -27 -14 -20 -124 42 -200 18 2 -13 -5 -16 -58 81
4230 81 -12 151 7 -8 42 3 -105 -57 -6 -13 -5 -183 -13 -170 -47 -32 -46 -53 128 9 -57 15 90 -32 15 5 81
4257 81 -36 -15 -38 -18 -64 -42 -15 49 231 108 54 51 -96 15 7 -194 -18 131 -43 76 75 -61 75 -32 75
4282 75 67 -167 33 -24 93 -43 -88 -3 25 74 73 41 -78 -5 128 42 -69 31 -32 -43 72 -52 -48 24 -53 -62 38
4309 38 -36 70 -15 -150 76 -82 50 62 -22 65 -27 -11 -54 -52 103 -106 72 36 -4 -16 -49 26 -163 -23 -57 -55
4335 -55 3 5 -18 42 -40 59 81 93 26 149 70 -50 -107 -17 -139 88 -12 9 -190 -112 -13 24 31 -25 -107 88 -37
4362 -37 63 73 -89 48 92 -37 -214 75 -50 -76 120 70 -61 -118 55 -41 -95 58 -51 39 51 12 108 38
4386C8j9q7J31lj61K8J66j50J41Nq3j9o9R6K6l3Qj9j46K69k8L1k09R0L5K8j69
4413a03Q0M6K0r1M3l1M2J56j79N2R8j04k1m8M4j0j18J28K27k66M6ro2N8Pp6J31
4440F0q8p4J79m7L4j9K6j4LKp6m0q2J14K7j15P7%J3k5Qo0J48j33K99k42O0J24
4468A59q8N1j22K15k12n1p5Q8om7O3J05j39qJ40q5J5j30J71j17M8J20o2k8mo3
4494f2j6Q0J7P6M9j32J05o7j0N1K6l51K63p2m1J78j33p5K53j11rJ42j31N3K5j50
$$ plain form
4386 38 19 -68 63 60 -101 -73 93 -57 84 89 6 -13 -82 14 40 7 15 -4 -150 119 91 122 -87 3 38 66 -103
4413 -103 -23 23 43 -48 -5 -36 6 162 -17 35 133 29 8 -40 4 -6 -124 4 231 -35 11 2 -60 -2 5 -71 60
4440 60 -28 -102 77 30 64 45 71 57 60 62 -14 -54 -136 -22 5 -110 -33 -33 -20 -45 -37 -97 51 -82 217 -25 35 159
4468 159 71 122 0 215 3 -48 -123 -35 -41 -88 -25 80 -59 -67 73 -12 3 -127 44 -73 -25 95 33 5 1 -62
4494 -62 -78 2 19 95 144 12 117 50 40 91 117 -234 29 -43 -84 94 -39 -114 139 28 19 161 30 83 108 -42
$$ [...]
8191i0
##END NTUPLES=NMR FID
##END=
