##TITLE=1H_2ABPA-20906
 D2O, 8 sc, 
 10.06.2021
##JCAMPDX= 6.0         $$ Bruker NMR JCAMP-DX V2.0
##DATA TYPE= NMR FID
##DATA CLASS= NTUPLES
##ORIGIN= UXNMR, Bruker Analytische Messtechnik GmbH
##OWNER= root
$$ XWIN-NMR		Version 3.5
$$ Thu Jun 10 10:16:38 2021 Russian Standard Time (UT+4h)  she@DPX200
##.OBSERVE FREQUENCY= 200.131506
##.OBSERVE NUCLEUS= ^1H
##.DELAY= (6, 6)
##.ACQUISITION MODE= SIMULTANEOUS
##.ACQUISITION SCHEME= undefined
##.AVERAGES= 8
##.DIGITISER RES= 18
##SPECTROMETER/DATA SYSTEM= spect
##.PULSE SEQUENCE= zg30
##.SOLVENT NAME= D2O
##.SHIFT REFERENCE= (INTERNAL, D2O, 0, 15.7039)
##AUDIT TRAIL= $$ (NUMBER, WHEN, WHO, WHERE, WHAT)
$$ ##TITLE= Audit trail, XWIN-NMR		Version 3.5
$$ ##JCAMPDX= 5.01
$$ ##ORIGIN= Bruker BioSpin GmbH
$$ ##OWNER= she
$$ F:/spectra/data/she/nmr/H-F/1/audita.txt
$$ ##AUDIT TRAIL=  $$ (NUMBER, WHEN, WHO, WHERE, WHAT)
(   1,<2021-06-10 10:15:18.29 +0400>,<she>,<DPX200>,
      <created by zg, POWCHK disabled, PULCHK disabled
       configuration hash MD5:
       00 E9 B6 7A A2 85 ED C7 34 08 36 98 17 FE 4E 26
       data hash MD5: 16K
       28 DB 05 92 09 3F 91 74 85 A5 9A A8 F8 41 A7 34>)
$$ ##END=
$$ 
$$ hash MD5
$$ D7 A0 49 F6 14 9A 85 67 43 AD A1 1A 39 3B 7A BF
##$RELAX= 
##$RELAX= 
##$RELAX= 
##$RELAX= 
##$RELAX= 
##$RELAX= 
$$ Bruker specific parameters
$$ --------------------------
##$DU= <F:/spectra>
##$EXPNO= 1
##$NAME= <H-F>
##$PROCNO= 1
##$TYPE= <nmr>
##$USER= <she>
##$AMP= (0..31)
100 100 100 100 100 100 100 100 100 100 100 100 100 100 100 100 100 100 
100 100 100 100 100 100 100 100 100 100 100 100 100 100 
##$AQSEQ= 0
##$AQ_mod= 1
##$AUNM= <au_zg>
##$AUTOPOS= <>
##$BF1= 200.13
##$BF2= 200.13
##$BF3= 200.13
##$BF4= 200.13
##$BF5= 200.13
##$BF6= 200.13
##$BF7= 200.13
##$BF8= 200.13
##$BYTORDA= 1
##$CFDGTYP= 0
##$CFRGTYP= 5
##$CHEMSTR= <none>
##$CNST= (0..31)
1 1 145 1 1 1 1 1 1 1 1 1 1 1 1 1 1 1 1 1 1 1 1 1 1 1 1 1 1 1 1 1 
##$CPDPRG= <>
##$CPDPRG1= <>
##$CPDPRG2= <>
##$CPDPRG3= <>
##$CPDPRG4= <mlev>
##$CPDPRG5= <mlev>
##$CPDPRG6= <mlev>
##$CPDPRG7= <mlev>
##$CPDPRG8= <mlev>
##$CPDPRGB= <>
##$CPDPRGT= <>
##$D= (0..31)
0 1.2 0 0 0 0 0 0 0 0.06 0 0.03 0 0 0 0 0.0002 0 0 0 0 0 0 0 0 0 0 0 0 
0 0 0 
##$DATE= 1623305717
##$DBL= (0..7)
120 120 120 120 120 120 120 120 
##$DBP= (0..7)
150 150 150 150 150 150 150 150 
##$DBP07= 0
##$DBPNAM0= <>
##$DBPNAM1= <>
##$DBPNAM2= <>
##$DBPNAM3= <>
##$DBPNAM4= <>
##$DBPNAM5= <>
##$DBPNAM6= <>
##$DBPNAM7= <>
##$DBPOAL= (0..7)
0.5 0.5 0.5 0.5 0.5 0.5 0.5 0.5 
##$DBPOFFS= (0..7)
0 0 0 0 0 0 0 0 
##$DE= 6
##$DECBNUC= <off>
##$DECIM= 32
##$DECNUC= <off>
##$DECSTAT= 4
##$DIGMOD= 1
##$DIGTYP= 9
##$DL= (0..7)
0 120 120 120 120 120 120 120 
##$DP= (0..7)
150 150 150 150 150 150 150 150 
##$DP07= 0
##$DPNAME0= <>
##$DPNAME1= <>
##$DPNAME2= <>
##$DPNAME3= <>
##$DPNAME4= <>
##$DPNAME5= <>
##$DPNAME6= <>
##$DPNAME7= <>
##$DPOAL= (0..7)
0.5 0.5 0.5 0.5 0.5 0.5 0.5 0.5 
##$DPOFFS= (0..7)
0 0 0 0 0 0 0 0 
##$DQDMODE= 0
##$DR= 18
##$DS= 0
##$DSLIST= <SSSSSSSSSSSSSSS>
$$ [...]
##$SUBNAM2= <"">
##$SUBNAM3= <"">
##$SUBNAM4= <"">
##$SUBNAM5= <"">
##$SUBNAM6= <"">
##$SUBNAM7= <"">
##$SUBNAM8= <"">
##$SUBNAM9= <"">
##$SW= 20.0188882624521
##$SWIBOX= (0..15)
0 0 2 0 0 0 0 0 0 0 0 0 0 0 0 0 
##$SW_h= 4006.41025641026
##$TD= 16384
##$TD0= 1
##$TE= 0
##$TE2= 300
##$TE3= 300
##$TEG= 300
##$TL= (0..7)
0 120 120 120 120 120 120 120 
##$TP= (0..7)
150 150 150 150 150 150 150 150 
##$TP07= 0
##$TPNAME0= <>
##$TPNAME1= <>
##$TPNAME2= <>
##$TPNAME3= <>
##$TPNAME4= <>
##$TPNAME5= <>
##$TPNAME6= <>
##$TPNAME7= <>
##$TPOAL= (0..7)
0.5 0.5 0.5 0.5 0.5 0.5 0.5 0.5 
##$TPOFFS= (0..7)
0 0 0 0 0 0 0 0 
##$TUNHIN= 0
##$TUNHOUT= 0
##$TUNXOUT= 0
##$USERA1= <user>
##$USERA2= <user>
##$USERA3= <user>
##$USERA4= <user>
##$USERA5= <user>
##$V9= 5
##$VALIST= <valist>
##$VCLIST= <CCCCCCCCCCCCCCC>
##$VD= 0
##$VDLIST= <DDDDDDDDDDDDDDD>
##$VPLIST= <PPPPPPPPPPPPPPP>
##$VTLIST= <TTTTTTTTTTTTTTT>
##$WBST= 1024
##$WBSW= 4
##$XGAIN= (0..3)
0 0 0 0 
##$XL= 0
##$YL= 0
##$YMAX_a= 317444
##$YMIN_a= -340556
##$ZGOPTNS= <>
##$ZL1= 120
##$ZL2= 120
##$ZL3= 120
##$ZL4= 120
##$ABSF1= 10
##$ABSF2= 0
##$ABSG= 5
##$ABSL= 3
##$ALPHA= 0
##$AQORDER= 0
##$ASSFAC= 0
##$ASSFACI= 0
##$ASSFACX= 0
##$ASSWID= 0
##$AUNMP= <proc_1d>
##$AZFE= 0.1
##$AZFW= 0.1
##$BCFW= 1
##$BC_mod= 2
##$BYTORDP= 1
##$COROFFS= 0
##$CY= 11.3945322036743
##$DATMOD= 1
##$DC= 2
##$DFILT= <>
##$DTYPP= 0
##$F1P= 15.9154993809931
##$F2P= -4.1035820241983
##$FCOR= 0.5
##$FTSIZE= 0
##$FT_mod= 4
##$GAMMA= 1
##$GB= 0.15
##$INTBC= 1
##$INTSCL= 1
##$ISEN= 128
##$LB= 0.24
##$LEV0= 0
##$LPBIN= 0
##$MAXI= 10000
##$MC2= 0
##$MEAN= 0
##$ME_mod= 0
##$MI= 1.114404
##$NCOEF= 0
##$NC_proc= 0
##$NLEV= 6
##$NOISF1= 3.799351
##$NOISF2= 2.8
##$NSP= 1
##$NTH_PI= 0
##$NZP= 0
##$OFFSET= 15.70392
##$PC= 1
##$PHC0= -11654.69
##$PHC1= 26.80101
##$PH_mod= 1
##$PKNL= yes
##$PPARMOD= 0
##$PSCAL= 0
##$PSIGN= 0
##$REVERSE= no
##$SF= 200.130013532006
##$SI= 16384
##$SIGF1= 3
##$SIGF2= 2
##$SINO= 400
##$SIOLD= 16384
##$SREGLST= <1H.CDCl3>
##$SSB= 0
##$STSI= 0
##$STSR= 0
##$SW_p= 3612.71676300578
##$SYMM= 0
##$S_DEV= 0
##$TDeff= 0
##$TDoff= 0
##$TI= <>
##$TILT= no
##$TM1= 0
##$TM2= 0
##$TOPLEV= 0
##$USERP1= <user>
##$USERP2= <user>
##$USERP3= <user>
##$USERP4= <user>
##$USERP5= <user>
##$WDW= 1
##$XDIM= 8192
##$YMAX_p= 0
##$YMIN_p= 0
$$ End of Bruker specific parameters
$$ ---------------------------------
##NTUPLES= NMR FID
##VAR_NAME=  TIME,          FID/REAL,        FID/IMAG
##SYMBOL=    X,             R,               I
##VAR_TYPE=  INDEPENDENT,   DEPENDENT,       DEPENDENT
##VAR_FORM=  AFFN,          ASDF,            ASDF
##VAR_DIM=   8192,          8192,            8192
##UNITS=     SECONDS,       ARBITRARY UNITS, ARBITRARY UNITS
##FACTOR=    0.0002496,     1,               1
##FIRST=     0,             0,               0
##LAST=      2.0444736,     0,               0
##MIN=       0,             -340556,         0
##MAX=       2.0444736,     317444,          0
$$ Real data points
##PAGE= N=1
##DATA TABLE= (X++(R..R)), XYDATA
0@%%%%%%%%%%%%%%Qj6J6j6J6k4L2l2M0m8N6p0P8q8J04j19J35j56J78j98K23k53
36a34K84l16L54l98M41m89N44o00O61p34Q12q93R83j084J196j318J452j602J772
55I31j962K179k428K717l060L470l977M617n453O604q285J0983j6023K8590j17906
70i9003k41553J36581J87913K00794J28251j32621l08553j39798L5397J59992
80g2600K59094J30950j57061k30641j59828m5411J76108K89893R6534j16898j93318
91b3178j99734n8117J85984K40618J08556m8883j97730k27728m0282J52013J98401
102H9920J53833n648k18521k24589l7175J11327J87505J79926j114j99871j97661
113a62068o8922O9624J98212J88252j984j62046j79509j14095M3984K13783J83871
$$ plain form
0 0 0 0 0 0 0 0 0 0 0 0 0 0 0 0 8 -8 8 -8 8 -16 16 -16 24 -24 32 -38 40 -48 56 -63 72 -84 94 -104 119 -134
36 -134 150 -166 188 -210 231 -258 286 -314 347 -387 425 -468 515 -569 627 -691 761 -841 931
55 931 -1031 1148 -1280 1437 -1623 1847 -2130 2487 -2966 3638 -4647 6336 -9687 18903 -99003
70 -99003 -340556 -203975 -16062 184732 312983 180362 -128191 -267989 -232592 -72600
80 -72600 186494 317444 160383 -70258 -230086 -275497 -99389 190504 287038 170140 -23178
91 -23178 -222912 -281029 -95045 145573 254129 205246 7516 -220212 -260494 -108481 89920
102 89920 243753 238105 19584 -205005 -242180 -130853 56652 236578 235464 35593 -162068
113 -162068 -230990 -161366 36846 225098 223114 61068 -118441 -232536 -188552 25231 209102
124B09102o1j24315j70778j42501L4242K03498J67565K6557q7424j83086j54601
135b21802L4839J69306J54944P6190p2255k03776j41244K9226J23275J61757J10686
146B21146p6702j92085j22008j0539R6591J85221J10453p1972j51508j33019n7124
157b01546J06124J92996Q7451m2236j15348j62566p2841J14942J64749Q6777L858
168A62360j13206j79972o0418R1669J31042J19686L0245j30543j66230n1519M7576
179a19310J21287J50425K7055j26402j36067p1588J1766J33330J53612K1148r3451
190G1805j23021j06918N428J40507J33448L1004n4724j30555j26052J1551J24110
201b3417J15202N9799l5363j41638j22101P736R2738J17243Q8102l5499j41190
$$ plain form
124 209102 209041 84726 -86052 -228553 -194311 9187 176752 203309 115885 -67201 -221802
135 -221802 -186963 -17657 137287 213477 141222 -62554 -203798 -174572 -51297 110460 221146
146 221146 144444 -47641 -169649 -180188 -83597 101624 212077 140105 -11403 -144422 -201546
157 -201546 -95422 97574 185025 142789 27441 -135125 -207966 -93024 71725 158502 162360
168 162360 49154 -130818 -191236 -99567 31475 151161 181406 50863 -115367 -166886 -119310
179 -119310 1977 152402 179457 53055 -83012 -154600 -142834 -9504 144108 165256 71805
190 71805 -51216 -158134 -152706 -12199 121249 152253 97529 -33026 -159078 -147527 -23417
201 -23417 91785 151584 116221 -25417 -147518 -139782 -47044 70199 158301 122802 -18388
212a8388j06087j3195O4979J32292R8164l9774j18524r9478m5737N6695J43460
223E4407Q9591k7877r0348j12664o6831O2524J33484Q0315J604p5965j30795o6877
235a49432N9996J08229Q8262L0276p8849j34237n8787L8638Q9540J07934M1111
246A42681q2907j18280o0666Q414Q8158J21924L6102p0757r8840p8846j0273R5208
258b8082J17251L4213m4996r2043r9348j2449R2919J02094M6379k0912r8705j05375
270a09054r541P5225R1250O8816j1305j04006r7392j6244N1515R4362Q4546j2110
282A06062r6469q7230l3915L4053J04186Q6418j2042p6217q5114n6322L1564J06413
294B1387P7583J244n5963r5363o7311L4152R3828P2513K4009m7641j05821o3868
$$ plain form
212 -18388 -124475 -137670 -72691 59601 157765 117991 -533 -100011 -145748 -89053 54407
223 54407 143998 116121 25773 -86891 -153722 -91198 42286 122601 124205 48240 -82555 -149432
235 -149432 -89436 18793 107055 137331 58482 -75755 -134542 -95904 -6364 101570 142681
246 142681 59774 -58506 -119172 -110758 -22600 99324 135426 64669 -34171 -113017 -123290 -28082
258 -28082 89169 123382 78386 -13657 -113005 -125454 -32535 69559 115938 95026 -3679 -109054
270 -109054 -118595 -43370 47880 116696 105391 1385 -96007 -112251 -60736 33626 118172 106062
282 106062 9593 -77637 -111552 -77499 26687 113105 101063 24846 -60268 -116590 -85026 21387
294 21387 98970 100214 44251 -51112 -118423 -84271 9557 82070 106079 58438 -47383 -111251
306a11251K8212P3394Q0375M2656n0704j02352n7016Q017O1068R5156M5976n1212
318F2319q5888o1538j4593O3314J00047M0017l6524p1388p6678k4918O6728R1091
330E1989M0683j3975o9076q9390k3091O0293P6576N3628K052p4390q8976k0569
342i4246M1256P0500P0648N403p5045p8109k9677K2892P5387P7652L193o3367
354B6487o9700m5967J3283Q0612P3404O666m4315p2417o0183J4487P6701O4767
366F3825K1456l0980q1030o2630J4899O2003O3547L8479k8729q3599n6148M282
378g4625M6801P2300M7669l1595p3916n2764j3900M0976Q0761M5520k6774n9200
390A253o0297k7343M3656P8640M0710j0764n1332p0899l0267M3330O6607M5739
$$ plain form
306 -111251 -83039 -9645 70730 113386 62682 -39670 -96686 -88669 -27601 67555 113531 62319
318 62319 -23569 -85107 -99700 -36386 63661 103678 67154 -4234 -80912 -105830 -39102 51989
330 51989 92672 78697 9621 -79769 -102860 -42567 34009 87637 89689 15299 -73677 -94246
342 -94246 -52990 17510 88158 93561 18516 -59593 -89270 -66378 9009 86661 89854 26487
354 26487 -43213 -89180 -75897 4715 78119 84785 40470 -31947 -92130 -77643 -942 63825
366 63825 85281 54301 -26729 -89359 -74460 -12457 51090 89569 60840 -22759 -78907 -74625
378 -74625 -27824 44476 92145 60550 -13366 -66130 -80030 -39054 41707 87227 60453 1253
390 1253 -59044 -86387 -42731 35909 76619 65855 14523 -56376 -86643 -43313 23294 69033
402F9033N249n2142p5517k7070L2148N7779N6881J2491n3662o9732k9294J6848
414e6988N6588O4825J3372m8693o1209l8591N435N9418O5938J3595l6807n7799
426b0916m9076J427N9082O0308J9246k3486n9646n6258J406N2192N5397L0332
438G0008j5551o3069n5607j111M0221N5490M1322j4378o1707n0313j0461K8971
450c6185O1651M5890j5183n2434m8483k3819K5708O5006M2741q956m0935n4010
462c9009l2315K7804O0141L9073M177l4721o2175l2226K5705M9591M3457J5880
474F5382l6488o2424k9220J5516M1791N3212J9275l7471n4078l1573J546M2810
486a1722N8138J6917l0598m6332m0530n444M5738N4470J7863j8778m5326m8248
$$ plain form
402 69033 74282 22140 -53377 -80447 -48299 9480 66361 78852 25190 -44542 -73836 -56988
414 -56988 -400 64425 77797 29104 -32105 -70696 -65261 -5843 60095 73690 36883 -20916
426 -20916 -69992 -68565 -9483 50825 70071 46585 -13061 -69319 -67913 -15721 39676 70008
438 70008 54457 -8612 -64219 -65330 -25109 30381 71703 57325 -4382 -54695 -65156 -36185
450 -36185 25466 71356 56173 3739 -44744 -68563 -42855 22151 64892 55936 15001 -39009
462 -39009 -71324 -43520 16621 55694 59871 25150 -37025 -69251 -43546 6045 49502 65382
474 65382 28894 -33530 -62750 -47234 -5443 47769 67044 29573 -24505 -56078 -54532 -11722
486 -11722 46416 63333 32735 -13597 -54127 -59571 -13833 40637 58500 39722 -5604 -53852
498e3852n404M2499M7505K5600r009m8602m9843n117L3057M4653L5572o143m9861
511A055m5238r718K2849M6828M0717o083m4097m1887j9576J7106N0857M0277m293
524D8797l3953m3726k8185J6685M9733L6792L411k6704m7874l1732J6405M2446
536B095L7052J3486k4609n0664k9632J0869L4585M1950K0762k6296m7397k7874
548d5673J077L0551M6967K1019k3063m0276l2509p199L2112M7021J9482j5019
560C4490l5703l9429j0281L2197M2425K1963o035l5929m2450j0073K6329L8263
572A5767K8613j220l6542m1258j1656J8936L7050L4287K62l4399l8100j6792J2335
585c2717L8109L6223K004k9687l5397k3235Q453L8818L5157M967k2183l6979k8009
$$ plain form
498 -53852 -59256 -16757 30748 56348 47339 -1263 -51106 -56223 -23166 21487 57059 50916 1055
511 1055 -44183 -53901 -31052 15776 56493 50410 6313 -35574 -55150 -38044 12813 53090 48797
524 48797 14844 -28882 -57067 -40382 9351 46143 49554 22850 -25024 -56756 -40351 2095
536 2095 39147 52633 28024 -22640 -52272 -41403 -6818 35132 55894 29598 -17799 -45673
548 -45673 -44596 -14045 32922 53941 30878 -9398 -41907 -49106 -16994 30027 49509 34490
560 34490 -1213 -40642 -50923 -18726 23699 45662 39627 3698 -38752 -48825 -22496 15767
572 15767 44380 43160 6618 -34640 -46296 -27360 9690 43977 44239 9840 -28260 -45052 -32717
585 -32717 5392 41615 43619 13932 -21465 -44700 -36247 2571 37728 42695 20512 -16467 -44476
598d4476O520L7188L2441J0417j6118l9163l0340O560L0678L2406J7597j4361
610B9349m0359k8250K534K3318L5932K2768j5583l6519k5666p027K0364M0127
622B0988K1406j3340k8440k9664j4111K2984L8608J9065n308k4771l6857j3524
634d2964K2527L1844K2793L255k7822l6910j1663J5356K7845K9162N791k8822
646A0392l2324j4181P222K9902L2853L596k4002k9161k0187L590L1294L0526N596
659C5116j6130l0122k5388M105K9081K7820J1085j2509l1837k5427K038K4118
671h050K7913J6386j0835l1285k5149j182J9900K8707J9265r170k8479k4914o044
684c2937J5895L0931K0525o847k5535k5315j0745J4695L0305K1054l852k1822
$$ plain form
598 -44476 -37956 -768 31673 42090 25972 -13191 -43531 -36971 -6293 26113 43710 29349
610 29349 -11010 -39260 -36726 -13408 22524 45292 29709 -6810 -32476 -39503 -19139 20988
622 20988 42394 29054 614 -29050 -43161 -20177 18431 37496 32188 7417 -29440 -42964
634 -42964 -20437 11407 34200 37455 9633 -27277 -38940 -23584 4261 33423 39214 10392
646 10392 -21932 -36113 -28891 1011 33864 37460 13458 -15703 -35890 -32300 -1006 29520 35116
659 35116 18986 -11136 -36524 -32419 -3338 24482 35567 23058 -8779 -34206 -32168 -8050
671 -8050 19863 36249 25414 -5871 -31020 -32202 -12302 16405 35670 26500 -1979 -26893 -32937
684 -32937 -17042 13889 34414 27567 2032 -23283 -34028 -19333 10972 32026 28174 6352
696F352k6475j4538J3615K8860K0568J445j8701k9642j5209J2318K4687K2127
708B5407O903j9046l0197j4079P702K1543K5667Q989j8757k6581j5719J243K2056
721d869K8162P928j5419k3162j9892k199K3472K6192Q395r022k2880k4487j003
734b8784K1208K2765J2978n085k4932k4082j161J6036K1993J8010m348k4897k1856
747b2155m766J1349K4830J9501m689k1305k0918j0401J0161K6144J8360k111j6475
760G525k2594j3972J0152K3781J8078J989j4207k4791j3847Q326K0717J9133O556
773B6846j3985k4803j3991N194J7767K1331R274j3763k2872j4547J194J6548K3433
786A7626R342j1961j9933j6786k872J7271K3228R146p727j8836j9766m261J6581
$$ plain form
696 6352 -20123 -34661 -21046 7814 28382 29827 11126 -18516 -33725 -21407 3280 25407
708 25407 32310 13264 -16933 -31012 -23310 -1767 23900 32889 14132 -12449 -28168 -26925 -4869
721 -4869 23293 31221 15802 -7360 -27252 -29451 -5979 20213 28608 19586 -3294 -27781 -28784
734 -28784 -7576 15189 28167 23082 -1850 -25932 -27093 -11057 10936 28946 24598 -299 -22155
747 -22155 -26921 -15572 9258 28759 24070 2765 -18153 -28554 -18393 7751 26111 24000 7525
760 7525 -15069 -29041 -18889 4892 22970 24959 10752 -14039 -27886 -19560 1157 20290 26846
773 26846 12861 -11942 -25933 -20739 -2972 18359 27633 13870 -9002 -23549 -22355 -5807 17626
786 17626 26968 15007 -4926 -21712 -24584 -7313 15915 25061 17334 -1502 -21268 -25529 -8948
799h948K1308J0873l249j8717k1395m260J3364J9404J4761j343j9496k0463n347
812b3508R544J9367J7372n58j8893j7889q463O549K0712J7743o02j4488j8709
825a1823j1687N467K1149J6073J795j0822j9859j3920N532J8418J5951N541r471
838A2344k0677j3655M050J5043J7003Q975r618j9757j3136J57J3138J9056J0157
851B3080q944j7589j4161k755J1825J9970J0007o543j5087j6084n360J2290J8814
864I463J0112l147j3876j8169n946J1462J6609J1956P7j4546j8443n557P913J5309
878C217J4559J551j4123j6861p527M738J5687J6478J813j2919j5485j0234L152
891a5954J6131J5737K602r462j5703j2266J955J5503J5002N020p011j6868j3282
$$ plain form
799 -8948 12360 23233 19984 1267 -20128 -24388 -11024 8380 23141 21798 2302 -18161 -23508
812 -23508 -13964 5403 22775 22217 3324 -14565 -23028 -16479 4233 21976 21374 6886 -11823
825 -11823 -23510 -18043 3106 19179 20974 10152 -9707 -23627 -18095 323 16274 21815 12344
838 12344 -8333 -21988 -17938 -2895 14108 23083 13465 -6292 -19428 -19271 -6133 12923 23080
851 23080 14136 -3453 -17614 -20369 -8544 11426 21433 14890 -197 -16281 -21641 -9351 9463
864 9463 19575 16428 2552 -15617 -21563 -10101 6508 18464 18541 3995 -14448 -20005 -12092 3217
878 3217 17776 19327 5204 -11657 -19184 -14446 1241 17719 19532 6613 -8872 -19106 -15954
891 -15954 177 15914 18516 9054 -6649 -18915 -16960 -1457 13545 18565 11554 -5314 -18596
904a8596K346J3073J3993Q102o031j7021j2589K73J0518J5601R468n854j5641
917b358j2070k818R057J6872R773m982j2990j3105n509Q661J6825R186k051j1554
931B937j4864o571Q756J4490J0337O85j1045j6111n866O625J2664J2138K865j1460
945E580j5140o369L697J2130J3868K894j0278j3215q603J500J2619J4399K738
958A5820p789j2687j0715N56J2969J2783M439n454j3275j1834P46J0910J2215
971H684P198m360j3891j1063q51Q719J2665Q599l844j2972j0952k662P299J3373
985E942R465l210j1339j1002m614O218J3437R141j507r999j1590o161N701J2913
999C395R280O41q647j3029o398N246J1059R995K442q068j2957p063L624R835J1236
$$ plain form
904 -18596 -16250 -3177 10816 18918 12887 -4134 -16723 -16450 -5932 9669 19137 13283 -2358
917 -2358 -14428 -17246 -8189 8683 18456 13474 484 -12621 -18130 -9469 7356 16542 14491 2937
931 2937 -11927 -18498 -9742 4748 15085 15770 4725 -11386 -17252 -10627 2037 14175 17040 5580
945 5580 -9560 -15929 -12232 -102 13766 16660 6382 -6833 -15436 -13936 -1317 13082 15820
958 15820 8031 -4656 -15371 -14815 -1846 10937 15376 9922 -3353 -15187 -14441 -3531 8684
971 8684 15882 11522 -2369 -13432 -14283 -5564 7101 15700 11856 -1116 -12068 -14730 -7431 5942
985 5942 15407 12197 858 -10144 -14758 -8540 4897 14038 12531 2532 -9058 -15219 -9518 3395
999 3395 12675 13316 4669 -8360 -14758 -9512 1547 11542 13984 5916 -7041 -14104 -10480 -645 10591
1014A0591L833q029j2079p361J413R556J2055M324p085j0879q654n86R830J2073
1028I002M187m840r916j0527j259R988J0534N418k411j0852j0752r70P473R914
1042D989Q097k164j1035j0018j836N286J0730R086j867j0401r233m213M554J1499
1056C474Q652j012q256j0084n722M368J1208Q070N41o713j0745o412L698R666
1070G33Q502K926o623j1172o050K392Q463R654L166n929j0493o656R37P948J0176
1085G974M401n674r423p411o90P598J0431M020l754q525q496j746P183R953N336
1100A1177k707q308r448j964O827R036N848o13r185q937k492M766Q497P883n13
1115I867q311q658l642L869Q855Q077j06p110q701m646K373R376P913M26n423
$$ plain form
1014 10591 14424 6395 -5684 -13045 -11632 -2076 9979 14303 7218 -3661 -12315 -12901 -3071 9002
1028 9002 13189 8349 -1567 -12094 -13353 -3365 7169 12587 10176 -676 -11428 -12398 -4925 4989
1042 4989 13086 10922 -113 -10131 -11967 -6681 4049 13135 11268 867 -8366 -12579 -8025 3474
1056 3474 12126 11114 2858 -7226 -12948 -8580 2628 10698 11239 4526 -6219 -12631 -8933 733
1070 733 9235 12161 5538 -5634 -11684 -9292 -829 8825 11991 6062 -4431 -11087 -10150 -2202 7974
1085 7974 12375 6701 -2722 -10133 -10823 -3225 7206 11226 7472 -1053 -9549 -11295 -4112 5841 11177
1100 11177 8470 162 -9286 -11250 -4423 4613 10461 9848 663 -8274 -10766 -6000 2497 10380 9867
1115 9867 1556 -7102 -10744 -6875 1980 10057 9951 2841 -5860 -10506 -8133 1243 9156 9582 4159
1130D159q768n901K091R102P257K100m688r368o080J546P468P777L698m605r243
1145c455o112P97O581Q304M338l961q510o114j489O039R048M787l546p472o949
1160g714k031N348R161M486j662o688q047l104N650Q056N336m67o952q347k641
1175i616M232P475O369M30o708p973l136K538P484P094N91o232p042m221J317
1190g398P700P361P09m362p325n463J080P709O439J894l314p735o102R76O667
1205a164O645L264l005p967n562J60N045P273M255k936p429n637p61M443P453
1220D077M725k566o238o519k039M324P922M252j294n292p270k477M063P144M373
1235G185%n449p051k984L417O180N780L54n022o850l847K564O512O000J181m805
$$ plain form
1130 4159 -4609 -10510 -8419 683 7940 10040 5352 -4016 -10096 -8550 -1082 6695 10393 5788 -3455
1145 -3455 -9567 -8770 -2189 6115 10453 6492 -2018 -8132 -9621 -3582 5466 10253 6707 -765 -7714
1160 -7714 -9745 -4397 4764 9250 7588 900 -7147 -10251 -4601 3455 8791 8324 1372 -6975 -9616
1175 -9616 -5384 2091 8460 8890 2182 -5791 -8927 -6389 1095 8189 8780 2548 -4494 -8715 -7398
1190 -7398 302 7663 8372 4010 -3315 -8778 -7698 11 6450 8344 5030 -2705 -8807 -7831 -1164
1205 -1164 5481 8745 5740 -2227 -7789 -7629 -2584 4689 8944 6008 -1421 -7058 -7819 -3376 4077
1220 4077 8802 6236 -2 -6521 -8560 -4236 3686 7938 6644 1352 -5918 -8395 -4332 2812 7185
1235 7185 7185 1736 -5315 -8299 -4882 1298 7078 7432 2410 -4440 -8287 -5723 789 6789 7970 3165
1251C165o788m143J696N841O037J897l942o232m765K46O118O472K023l098o428
1266a901n081K0N689N947K623k050o188n892j23M696N769M309j982o769n263p24
1282f920L852O143M440j685n746n610j567L258O942M021j414m568n781l051L023
1297d663O705M206k29l954o062l287K808N388M625J013l763o486l225K133N102
1312C11N019J934m479n670l504J223M355N758J988l548n385m126kM716N893K236
1328F719k459n388m842k37M780N173K747j807n194n469J0L425N492L225r80n596
1344d01m770q83K998N574L661n26n132n101j661K346N398M349k46m638m688k662
1360f382K485N210L840L58l515m829l619K224M619M615M72l005n562k494J256
$$ plain form
1251 3165 -3623 -7766 -6070 -229 5808 7705 3763 -2469 -7234 -6988 -870 5602 7625 4527 -1901
1266 -1901 -6982 -6962 -1273 4674 7297 5247 -941 -6833 -6956 -2260 3509 7818 5836 -933 -6196 -6920
1282 -6920 -3068 3075 7515 5830 84 -5526 -7093 -3835 3107 7128 5714 1146 -4635 -7686 -4663
1297 -4663 2042 6248 6019 2065 -3997 -7284 -4476 912 5537 6550 2787 -3699 -6924 -4791 311
1312 311 5330 7264 2785 -2885 -6389 -5166 -811 4947 6935 3387 -1998 -6124 -6126 -1410 4483 6719
1328 6719 4260 -1128 -5970 -6207 -1427 3746 6493 4686 -508 -5977 -5967 -2542 2950 6175 5195 -401
1344 -401 -5171 -6054 -3056 2518 6179 5653 521 -4580 -6241 -3895 1503 5852 5606 968 -3720 -6382
1360 -6382 -3897 1313 5153 5511 1996 -2833 -6452 -4228 391 5006 5478 2473 -3089 -5583 -4327
1375d327M298M228J929l248n122l242N04M227M931J816k900m956l140k66L348
1390a920N849J660j728m581m085p65L541M949K756j536m153m874m30L283M086
1405B052L085o42m277m405j280K815L843L949k19l791m712j639J766M336L590
1420D471ll118l947k534J692M243L667P29k822m935k959J394M421L897J015k588
1436B623m748k907R06L984L463J731k054m600l420P42K789M395K190k333l843
1451a082k733m07K771M243K127j756l882l139r94K695M270K703j050l307l985
1466c526j412K787M147K164j40l110m473p02J587L924L110L3l278m187j464J438
1482c102L675L266N96l109l626j791R65L099L591R30k805l628k378M83L705L649
$$ plain form
1375 -4327 -29 4199 6128 2880 -2242 -5484 -4980 -753 4178 5994 3094 -1862 -5002 -5268 -1920
1390 -1920 3929 5589 3861 -720 -4805 -5570 -2029 2920 5676 4140 -13 -4887 -5317 -2034 2052
1405 2052 5137 4495 218 -4187 -5467 -2652 1191 5140 4921 1130 -3582 -5221 -3455 881 4471
1420 4471 4468 1350 -2597 -5131 -3439 804 4471 5200 2378 -2557 -5516 -4122 299 4196 5211 2623
1436 2623 -2125 -5032 -4126 -142 3321 5052 2998 -1602 -5022 -4280 -1491 2904 5094 2761 -1082
1451 -1082 -3815 -4222 -1451 2792 4919 3163 -719 -3858 -4852 -2157 2113 4816 3766 459 -3526
1466 -3526 -4938 -2151 1996 4160 4020 910 -3563 -4265 -2678 1246 4356 4389 1111 -3076 -4540 -3102
1482 -3102 573 3839 4435 1326 -2300 -4091 -3126 -27 3564 4494 1689 -1939 -4317 -3834 -129 3520
1498C520N08j744l593k863R2L698L236J508j810l870k758L1L116L407J939j130
1514C287m119k902j06K041M053K063j258l387k932n45J939L610K514j058k824
1529C76l603q58K110L318J857M31k957l165j161J072L499K459M29k624l751j381
1545c949J056L287K822L17k162l631j577P23L014K891J022k011l341k544J113
1560b970K441L378R00j362l333k455K21K329K976J293j105l192k189k19K549L195
1576B457R57n30l133l256NK128K758K022p11k649l165l97J407L570K190j233k482
1593f2k330j169J176L403J944q1k062k481j654Q63L004K172M42j821l064j608
1609c328N82K682K490N50j620k917j545L44K079K690J263j931k179k111l90K642
$$ plain form
1498 3520 4028 2284 -1309 -4172 -4080 -382 2854 4362 2552 -1318 -4076 -4045 -929 2478 4417 3287
1514 3287 -832 -3734 -3840 -1799 2254 4317 3059 -328 -3260 -3805 -1866 1744 4258 3200 376
1529 376 -3227 -4085 -1975 1343 3200 3631 674 -2491 -3652 -2580 919 3378 3807 1183 -2568 -3949
1545 -3949 -2893 394 3216 3533 1371 -2260 -3837 -3114 -100 2791 3813 1802 -1539 -4083 -2970
1560 -2970 -529 2849 3749 2387 -946 -3401 -3180 -851 2125 3418 2313 -879 -3068 -3287 -738 2457
1576 2457 3414 2884 -249 -3505 -3500 -1372 1386 3408 2697 48 -3117 -3514 -2107 1463 3653 2420 -62
1593 -62 -2392 -3561 -2385 1018 2962 2881 819 -1662 -3316 -2453 551 2723 3165 1344 -1720 -3328
1609 -3328 -2746 -64 2426 2976 1356 -1561 -3106 -2762 -683 2007 3270 1339 -840 -2951 -3341 -699
1625f99K576J268q39l054k267J45K027K891R81q68k706k138k10J778K101J848
1641B834J88l409k247n26J920K124K152l35k594k264l05O45K586J795k14j756
1657E94k424j365J810K128J925J73j829k251j659M05K906K299N38j803k658k039
1673c250J010K045K232P69j793k052j205j09J824K307J259j561k545j603N49J126
1689i97K466J518j091k011k318o65K251K154J321p49j973j628j035J634K284J628
1705B789j070j475k299m09R55K162J711J83k266k371n46N72K434J843L70k362
1721B21j268j395L06K255K354M91j729k422j432Q70J715J487M97n85k925q24M13
1738a971J329K668M39r66k201j642M59J173J771J947j172k291j462m61J232K407
$$ plain form
1625 -699 1877 3145 2306 -748 -3015 -2870 -843 2048 3029 2161 -545 -2683 -2893 -1115 986 2834
1641 2834 3022 -387 -2634 -3160 -1240 884 3036 2701 107 -2157 -2462 -1817 769 2564 2350 594
1657 594 -1830 -3195 -1385 743 2668 2841 1012 -1239 -2898 -2493 413 2712 3250 1447 -1211 -3250
1673 -3250 -2240 -195 2037 2806 1013 -1039 -2244 -2353 -529 1778 3037 1476 -1069 -2672 -2123 -997
1689 -997 1469 2987 1896 -115 -2433 -3098 -847 1307 2628 1879 -94 -1722 -2757 -1123 1161 2789
1705 2789 1719 244 -2055 -2464 -1509 653 2364 2547 281 -2090 -2636 -2064 370 2213 2583 221
1721 221 -1047 -2442 -2136 119 2473 2964 1235 -1187 -2619 -1749 -34 1453 1950 1365 -1560 -2384 -1971
1738 -1971 -642 2026 2465 1499 -702 -2344 -1885 -712 1059 3006 1834 -457 -1919 -2380 -1148 1259
1754A259Q47k52k452r75k51N93K574J403j398j746j476l61J275J789J264j75j618
1771C00k051n40J271J747J230Q7j729j254j172Q38J104K002N49j875j708r11O72
1788a440J286J767N38j367j511j312K66J646J533J141j310k110j193K92J710J568
1804A504N52j144j779j380N46R35J535J717q69j762j771l80J846J482J109o95
1820A446j596j628j18J169J564J287o02r96k105l77J056J660J171k96j459j687
1836a511l28N92J620J277K93j637j042p93J84J377J648L49q94k099p85K36J489
1853b4J623L92j097j485j173L09J329J382L96p64j285j284m4J180J751J003p80
1870A429j684j382k02J475J169R65l75j669r73p31J403J176J208m87j613q57o32
$$ plain form
1754 1259 2106 1854 -598 -1573 -1824 -1231 1343 2746 1348 -398 -1874 -2235 -960 829 2093 1918 300
1771 300 -1751 -2291 -1020 727 1957 2044 315 -939 -2111 -1273 -169 1833 2382 507 -1201 -2112 -1440
1788 -1440 -154 1613 2151 784 -727 -2039 -1773 -127 1406 2547 1237 -873 -2066 -1774 -64 1504
1804 1504 2056 912 -867 -2247 -1701 -766 769 2486 1617 -145 -1916 -2296 -450 1032 2141 1446
1820 1446 -150 -1778 -1896 -727 837 2124 1522 526 -1579 -1956 -900 760 1931 1635 176 -1511
1836 -1511 -1839 -1247 373 1650 1943 306 -736 -1529 -1345 32 1680 2029 1135 -964 -1749 -1513 -24
1853 -24 1599 1991 894 -591 -1764 -1455 -126 1256 1652 888 -397 -1681 -1725 -545 1206 2209 1429
1870 1429 -255 -1637 -1839 -364 805 1770 1395 -274 -1247 -1978 -575 601 1809 1322 -291 -1148 -1780
1887a780Q73J281J264j82j039j519o88L70J740J716l40j525j201o46O59J102J205
1904A290N89r70j782q29M42J122J649K19r83j325j057J71J194J610N33j016j496
1921f39o63m43J422J596O31n97j565j052l86J362J192N69n35j241j416K67R86
1938e12J204M69j55p85j637n24J376J122Q59n4j063j403m16K46J375J707o41q66
1956C02j562n4J1J657Q42J22p98j309p01N81P29J077L43n36j435o37M46N85J642
1975A305J48n68j379p75m45J449J380N7j44j650n76K79R50R27R81q92j104j141
1993a198j28N70J232R07l00j101r57m26R93Q89L61N2j030j163J5N85P61J357j83
2012A236j151q96o28O04J387P24K2p77j384n42j3J469P23L23l47j252n56QR90
$$ plain form
1887 -1780 -907 374 1638 1456 417 -1102 -1790 -1420 320 2036 1696 171 -1030 -1676 -1017 85 1290
1904 1290 1879 909 -873 -1702 -1260 -138 1511 1730 747 -578 -1635 -1464 -270 1340 1873 857 -639
1921 -639 -1302 -1745 -323 1273 1904 1307 -258 -1310 -1696 -334 858 1427 892 -349 -1765 -1498 -512
1938 -512 692 1161 1006 221 -1416 -1940 -564 558 1417 1363 300 -1103 -1519 -1273 102 1809 1168 302
1956 302 -1260 -1314 -1303 354 1196 1318 520 -789 -1490 -909 -180 897 1240 704 -731 -1368 -922 -337 1305
1975 1305 1453 885 -494 -1269 -1714 -265 1115 1172 1028 -622 -1198 -919 31 958 1939 1047 -57 -1198
1993 -1198 -1326 -756 476 1383 1083 -18 -975 -1401 -408 481 842 894 -136 -1299 -1284 -699 62 1419 1236
2012 1236 85 -811 -1439 -835 552 1276 1298 521 -863 -1405 -1418 51 774 1097 750 -502 -1058 -1050 -60
2031f0J305L4m13j316j027J107L39J045N96q13j342n35o8N20J018O77k51o26j048
2050h58r4M17J137P30k59j261r70L76L54J119M27o31m4j198q04J017J199K76M13
2069A346q98j424K84K21R43P92j98j119q01k73O53O83O43K50r32j109l6L0R40
2088eP63L59r64o07p13L39R44O47P08q60r49o47L3Q59R43K38n02j335m99N13N26
2109b09O26M63j61j096n49O3M57O84J035k3j354p94K50j16J429J53l1m05p40n82
2129i00k5J603J24j04l85q97m29O9J553M94m66n22n55p07p9J220J245n11j48j198
2149f18k08n2R49K62N69l96r78q13P52K54Q70R3n02o92m81J55R13O18K52K0j329
2170c62n83Q6N37Q87j77Q35q83j679Q78k10R23Q73J17q81r78k3K23O41M98k43
$$ plain form
2031 -60 1245 1279 866 -450 -1477 -370 -31 1014 1610 797 -545 -1080 -1148 -628 390 1067 816 190 -858
2050 -858 -952 -535 602 1332 1073 -188 -1158 -782 -428 691 1118 487 443 -755 -1559 -542 657 933 1346
2069 1346 448 -976 -692 -471 472 1264 1066 -53 -854 -1127 -474 209 852 1102 170 -939 -975 -945 -5
2088 -5 758 1117 153 -454 -1167 -828 116 763 1471 611 -338 -985 -952 -93 850 1088 586 -749 -1248 -735 -209
2109 -209 417 880 719 -377 -926 -863 -406 278 1313 1290 -64 -858 -608 -724 705 858 827 422 -318 -900
2129 -900 -925 678 802 698 313 -584 -1013 -944 609 1103 637 115 -440 -1147 -1226 -6 1239 728 580 -618
2149 -618 -826 -878 71 333 902 506 -472 -1285 -533 -279 591 684 182 -510 -991 -836 77 695 947 967 -362
2170 -362 -945 -859 -322 565 388 1223 340 -1339 -461 -671 252 1125 1242 361 -617 -640 -417 224 722 479
2190D79n58m12p87J401L05L64k71l43o12J4J11K82P76j00o38o06j88J47N37J081
2210I82j04m43n26p02L16O92J6J67m8n08q81M98M30j32J019p8n10m15l16P92R53
2231A202p77p4m63l58l36K06J330O04m90r84n05pJ47O85O06m95k10j046J83K21
2251e61N43O28j97Q1j079l00M75J29P03L06m92l60q70L65M34R82Q4m38n44p13
2271h24K20P01J76M28M0o71l93m70O68P05Q9n04n14m00J28O34L23J07N67r80J61
2292A91n51r1R54L89k96k27r97n60R97N40K54K93o90p22j92P25k38J030l61o54
2312b06Ro39M10P77L38J29o74n22n1J40N58M61o52N29r80k64l6N60N56J4l74n93
2334e10j90J26Q37L18j68j06n20j93l70M49L49O71k06o28l79j02J46P23K77j15
$$ plain form
2190 479 -79 -491 -1278 123 428 792 521 178 -434 -420 -309 -27 749 649 11 -595 -783 -636 -99 982
2210 982 878 435 -91 -793 -477 215 231 398 350 -158 -1039 -541 -111 -243 776 698 188 -227 -543 249 1202
2231 1202 425 351 -112 -470 -806 -600 730 1334 844 -140 -645 -652 -505 180 786 291 81 -965 -782 -561
2251 -561 -18 610 413 494 -585 -885 -410 -281 422 728 236 -124 -994 -629 -195 787 871 433 -111 -824
2271 -824 -604 97 273 701 741 70 -323 -793 -125 580 669 165 -349 -749 -621 13 336 443 1010 30 191
2292 191 -360 -451 503 892 596 369 -628 -1188 -191 349 603 896 206 -516 -708 17 -221 809 448 -206
2312 -206 -197 -836 -426 351 689 818 144 -378 -429 -289 269 730 78 607 -373 -637 -673 -113 443 457 83 -510
2334 -510 -700 -574 263 581 413 307 -213 -406 -776 -327 22 693 487 -141 -520 -622 -476 247 524 409
2354D09k52o27L41L00K37N3R8l79q40p8O39M57L21j28o80j87l10K32J005k48L0
2375C93l48m32k51k68R27L96l1K37j016l46Q03k09N55j64L88p81j48r2O71J45
2395D29n4l07Q0o42K76p3L06L89K33j202J79j8K93M02Qj79P1q01j07M14P11J25
2417E33l52L48j515N60j62O21N15n19K69l33j61o6J86P82m7n63j41l14K61j79
2437b77J052n15k7n45k25k10Q92K23K1l3m95l16m73O17P60k58L63o60n49O91m56
2458d20R03L23l58l65n14O2J85Q72q3m24l29J01p34K96M83N20oo55l10j56N22
2479h7K21L50n3q60M16m34N53n7K93n1k20n6q40N66J75M15p1K2l76n77J53M27
2501i1oN75n36L04o62k2J91M00J09O8l23r19N30k4J034k3l86k43o15M91j96J150
$$ plain form
2354 409 157 -470 -129 171 408 461 559 180 -660 -738 -99 358 679 551 -129 -316 -626 -394 611 363 393
2375 393 45 -387 -638 -906 21 417 386 623 -393 -739 64 -145 410 246 634 -147 -295 -387 284 429
2395 429 375 68 148 -494 -218 -291 15 404 637 -565 -386 -404 -111 291 299 120 191 -610 -717 -303 408 533
2417 533 181 529 -986 -426 -588 33 548 29 298 -35 -196 -262 -76 706 659 96 -45 -359 -98 -277
2437 -277 775 260 233 -312 -537 -747 145 368 389 356 -139 -455 -928 -311 449 191 554 -106 -655 36 -420
2458 -420 483 806 448 83 -431 -369 -184 688 605 181 -148 -47 -781 -485 -2 518 512 -143 -453 -609 -87
2479 -87 134 484 431 -429 -13 -447 106 49 342 291 71 15 -825 -259 -84 331 260 282 -94 -671 -518 -91
2501 -91 -97 478 -58 246 -416 -438 -247 153 262 330 7 -912 -382 -406 628 605 219 -24 -639 -148 -344 806
2523H06m7n75m55K41P06r29P22L01p75m94K80m3J65M83J98j003L71m39k42O97
2543c2j8Q40n53l92q3m93L9Q99K91m82J68k31l67n2N94M45l64M86j015O6l63P23
2565A06J24J18j50m87J37k46J24P12p87M82n07k59K53L12M32K00k43k86r16M23
2585d58O68k90L91O1j44o23L18M9J40P9J35k99m85j01K47K62J24M66k14k50o55
2606e79N91L87J27j46m01q27N53j43J49L79k63K87p59N1J78J24J006L43o38j45
2626B74l50n50P24N53n39l89Q6n14N46J20R9K87j05m32o29L24O00P03j067O74
2646D15m95j9J77n21N82k12O66j63l66l38J79l8J179n27k99m52n3M45K6K73l07
2667A52p32O74l95R9M82J63j63j48m86m17q6R35j18K0J43k32J93m16o4Q32N7l42
$$ plain form
2523 806 759 184 -271 -30 676 -253 469 770 -5 -499 -219 -262 -97 386 584 -419 -48 -487 -729 -32
2543 -32 -50 790 237 -155 -238 -731 -692 207 498 16 184 -47 -414 -466 128 573 209 695 -320 -254 -617 106
2565 106 230 348 198 -289 -152 -398 -274 438 -349 133 -374 -633 -380 -68 364 564 321 35 -881 -458
2585 -458 210 -80 311 372 228 -395 -77 -28 112 191 326 27 -458 -559 -312 -50 74 540 326 76 -579
2606 -579 12 399 526 380 -21 -848 -295 -438 -289 90 -173 114 -645 -594 -416 -292 714 1057 419 274
2626 274 -76 -626 98 651 112 -277 -191 -705 -159 -39 60 347 242 -190 -819 -495 105 808 -259 415
2646 415 -80 -99 78 -443 139 -73 593 430 64 -274 -95 -133 1046 519 220 -232 -285 160 186 459 152
2667 152 -580 94 -301 -202 280 443 280 132 -354 -771 -857 78 -40 -20 123 -109 84 -332 -396 436 493 151
2689A51j56K4O3L18m91l8P57j460L21O27l33m33J569j020J99k63q8K76J30j13
2709D0J125j372L50n95P78l9l02J132j080l19L3n6N86k29J62M1m0l88M99K28n6
2730D98o76M08l45j61N56n4M61p66M93o21K78K74m06K10M24J75k90n26N5j73M64
2751B78j30J3q08M06J81l93K10L3Q64r10P7j14J96L26K94p83M47j18j25m36Q09
2772C17l94L1k5K00m54K58M24n63O74l90j79q7k40K49M49N33l37m00o70q3O85
2793bl85M99m9n70R79n67J69r9j11K4J81j20n34M67J8M08J7o42L38j94j55Q70
2815E42m68j71M94k98o55M93o6K38P8p29J0oL39J06J21j72L63m07l47J73J14L00
2837E2M11m70j01j03j34K78K18l25P4J5J83l05L09j76j75R1k52J21l53P66k97
$$ plain form
2689 151 -5 19 82 400 -91 -129 628 -832 -511 116 -217 -650 919 -101 98 -165 -253 23 153 40
2709 40 1165 -207 143 -452 326 287 -15 1117 37 -282 -249 -305 281 52 214 255 215 -173 326 554 498
2730 498 -178 230 -115 -276 280 226 687 -79 414 -207 71 345 -61 149 573 748 458 -68 -13 -186 278
2751 278 148 161 -647 -241 -60 -453 -243 -210 654 -256 -179 -293 -97 229 523 -260 187 69 -56 -492 317
2772 317 -77 -46 -71 129 -325 -67 357 -206 468 78 -101 -188 -428 -179 270 803 466 66 -604 -687 -2
2793 -2 -387 112 63 -507 472 -95 74 -25 -136 -112 69 -51 -585 -118 -100 308 325 -317 21 -173 -328 542
2815 542 74 -97 397 99 -556 -63 -129 109 187 -542 -532 -538 -199 -93 28 -144 219 -188 -535 -362 -248 52
2837 52 463 -7 -108 -211 -345 -67 151 -174 -100 -85 98 -207 102 -74 -249 -158 -410 -289 -642 124 -173
2858a73J93J71l29J6K83K29m9k92K27l88J03r6Q1n9MN5l1l96L5L92k24o2M02K17
2882C09l35J86j26p8j5J90m12Q04n69n0J8QQ3L37k33m15L58K11L2k94K93j66n39
2905d03L42K50j74P5l94k72O18j90K1K20M97l44k56q3r88J237k44M51j00K24r5
2926C92n08mN58n7j74m05Q0q1q1L59R5L95q48k6J44M62L23q16L24j64k82j73N74
2949H7K69l53RK22r48j4K79M58L4jK40p7N4k85J97K39o8l23j91k93M46l57O27
2972B51J09o09M53m51J53N2j91K98M17k40n56j71M01n02R14m93j33L55n6M36J85
2993F22l80L21k20l37J17n08O63%j34M59q17m3o5L24J90j60K48r22M86j93M9J88
3015a12k4J72j97L84m13k59O47J6m18N7R4j77P0N9m7J83J12j57l56O51m16L1J52
$$ plain form
2858 -173 20 191 -138 -122 161 390 341 49 276 -112 -9 -105 -24 -83 -79 -24 -55 -451 -416 -24 -248 -310 92 309
2882 309 -26 160 34 -44 -59 131 -281 523 -46 -96 -78 -70 13 350 117 -298 60 271 303 9 302 136 -403
2905 -403 -61 189 15 90 -304 -576 42 -148 -127 93 590 246 -10 -93 -1081 156 -88 363 263 487 392
2926 392 -116 -120 438 381 207 -198 -118 -199 -280 79 174 569 -279 -305 -161 301 624 -192 132 -32 -314 -487 87
2949 87 356 3 12 234 -714 -728 -449 9 43 42 282 205 259 -26 171 410 342 19 -172 -465 -19 -376 251
2972 251 360 -249 204 -247 -94 -42 -233 65 482 242 -314 -485 -84 -586 328 -165 -298 57 1 437 622
2993 622 242 563 343 6 123 -385 278 278 144 603 -214 -257 -322 2 192 32 280 -642 -156 -349 -300 -112
3015 -112 -136 36 -161 223 -190 -449 198 214 -204 -147 -53 -230 -160 -101 -148 35 147 -10 -366 285 -131 -100 52
3038E2J06o60N02k3l4Q6L13l30K56l27J36K00l96j08N40q02M60r2J55K24R0m50
3060a02Po7K60K44o30M51q8k47M38m03R2J32J52j63J29j22J71k25K95j97k22M27
3082C32m33L94j73L5p2n59N31M17l24J09k31L00l18j98L87j38j62J24J60m83K31
3103g1j02p3M52L1q8k14K85j08l71l3O22k90K37m15j41K40j53K27L48j74j74J94
3125B29l07o5M91n50p5R8M21m82j15L20P6N9L7j2l17N7K7Q3k18K34K65j31j30
3148eJ03J98k38l13L13l13K03J9r2M52k11o03N47l66M8P5L19L65m49k00J61P7
3170I0l92L89R3J10k77O6k90J42L41p67K11K41O9j04K35k74K76l37MNp4j49N30
3193A38l57N01o01L31k52M99kk03J30k59J89k08J34M81l60N9l96J12JK44Q8q4
$$ plain form
3038 52 158 -502 0 -23 -57 29 342 12 268 -59 77 277 -119 -227 313 -489 -29 -121 34 258 348 -102
3060 -102 -95 -162 98 342 -288 163 75 -172 266 -137 -45 87 239 76 205 83 254 29 324 127 -95 332
3082 332 -101 293 120 155 83 -476 55 472 148 257 26 326 8 -190 197 59 -103 21 181 -302 -71
3103 -71 -173 -246 206 237 149 -65 220 112 -259 -292 330 40 277 -138 -279 -39 -192 35 383 209 35 229
3125 229 -78 -143 348 -202 -277 -179 242 -240 -355 -35 41 100 137 125 -192 -135 -108 -25 -243 -9 256 125 -5
3148 -5 98 296 58 -255 58 -255 -52 -33 -125 327 116 -487 60 -306 -258 -183 136 501 52 -148 13 90
3170 90 -302 87 180 290 13 79 -211 -69 272 -495 -284 -43 26 -78 157 -117 159 -178 -174 -169 -243 -392 138
3193 138 -219 282 -319 12 -240 259 257 54 184 -75 114 -94 40 521 161 220 -176 -64 -63 181 269 185
3215A85K44j35l58J45k03J52O5L45o01K71k87r7j28j52R71m94K71m55J79R8M55
3236D71o23K08R4l59P7J12O1p2N3q1K75N5k74J25K91m49K62n0j55o6K85m8L86
3259E78o17k08J8K78M4J03Ml14j70K61P0m0p6j45o10Q26P4L6j13P8o75L72N2J19
3283e5l93L84J52K41m47k34L96j24L61l65l4J43K68j22j83O66k29p44K79J59k43
3304a24N46o82l10O82n57L30j90M92j65K02j30K86k87m1n65k09P36j0N87p08Q6
3325c1l54RP65l17NO81r46l55K21L89n9O49m46m59r2l1M05M02k92m33r9L46J90
3348A48o3j21J10K65rk5K06k79l98K41J90j157Q68L93n97J82j56M39k29n07P5
3369d24J26J76j84J52K58m93P91k4P7j88n60L92q28O03m2O18q44N40r38J408l70
$$ plain form
3215 185 429 294 -64 81 -122 30 95 440 -161 110 -177 -274 -402 -554 417 -77 194 -261 -82 16 471
3236 471 -152 56 150 -209 -132 -20 41 -31 22 -59 216 271 -3 122 413 -36 226 176 21 -45 240 192 578
3259 578 -39 -247 -229 49 93 196 200 -114 -284 -23 47 7 -69 -214 -824 2 76 112 -1 77 -598 -226 -174 -55
3283 -55 -448 -64 88 329 -118 -352 44 -80 281 -84 -118 25 293 171 -12 654 425 -319 -40 119 -124
3304 -124 422 -260 -570 112 -445 -115 -305 187 22 224 94 380 93 52 -513 -722 14 4 591 -117 -31
3325 -31 -385 -376 389 72 77 758 -188 -543 -322 67 8 657 211 -248 -340 -371 34 436 144 -289 -388 -42 148
3348 148 85 -36 74 339 330 305 511 232 -166 75 265 -892 -24 369 -228 -46 -202 237 8 -499 -424
3369 -424 -298 -122 -306 -154 104 -389 402 378 455 267 -293 99 -729 -126 -168 450 -394 146 -792 616 246
3390B46j10j24L43n46M53k02k82k35M36k4M25k41q06O41k99q5K25m0r8N20n58
3411c61J77M09k09K65j095J059k00J38q4m93P14k66q17K90L4N04M91n16L33l0
3431C43k62K4o74L66N49l08l08M82j008N88J41N7L21l97L23o82J7R68k92m57k95
3452e04M58J26j22K78n91O60o5j1p35N38j44L16n98Q8l11N45p2K29n13L63k60
3473c25K1k19J86J15L95k84O6K52j48o8M28n98Q54o39J89j71j72M74l20p2n17
3494e53N29K0N2n68O42J58l09K55o08p6l67J247n19K51l15O87j40m60j35J35M81
3515D07l08K85o47J049j086m6N46k53j08j10M59l97K29M75q42Q41q48M21l38J77
3535i4l3M48R8p73O77J05k35j81k21J73n7j42L44j01J60m34J03J29K3J31K81k85
$$ plain form
3390 246 136 12 355 -191 262 60 -222 -457 -21 -45 380 139 -667 -26 -325 -410 -185 -225 -323 197 -361
3411 -361 -184 225 16 281 -814 245 45 183 99 -394 320 54 -763 -473 -439 65 556 40 373 343
3431 343 81 105 -569 -203 346 38 -270 212 -796 -208 -67 -10 311 -86 237 -445 -428 540 248 -209 -504
3452 -504 -46 80 -42 236 -355 305 240 229 -506 32 -112 204 -394 -306 -617 -72 -144 85 -428 -65 -325
3473 -325 -304 -523 -337 -222 173 -111 -45 207 59 -9 419 -179 675 36 225 54 -118 356 36 -36 -553
3494 -553 -24 -4 48 -520 122 280 -29 226 -382 -458 -825 422 -97 154 -161 526 386 -74 -209 -74 407
3515 407 99 384 -263 786 -300 -346 200 -53 -161 -271 188 -209 20 495 -347 494 -354 67 -271 -94
3535 -94 -127 321 419 -354 323 428 193 12 -209 -36 -93 -235 109 8 168 -266 -163 -34 -11 120 401 116
3557A16J99p84R1J69L49L74p29J39J45k23J46l03M67j98O5j8k48K45j58N56j98
3578B02p52N87p2K12k23R7j8K66m32L56k30M2j80j25l1N08m19M76k23Q2k21N0
3600d8O97p94N18o9m87K22k80O48j66J00pn39L46m32L14Q61l36l78M8p35R41n56
3622a32l90M70K00k30k31L14J44j80k5J48K3K8k58N47m92K94m88N21J71J08k72
3643B70l43L94L3k75J7l80Q42k65J66r92N93M25l97k08q8L02L61j49k15J20k76
3664f5J24o50P34l50N54n95L02j69J06k73K27j50M3j72K68K2K73k29J2p1R2l45
3686c12M30j17j92L8O30k08n42K48n15P52l88R0q1O03m97l06N99p9J0l08K74n66
3708d37L96l1J84j18K57j57j56m45P67m19J49k1q7j35Q09m75l8m10L73L64p9k09
$$ plain form
3557 116 315 -469 -378 -209 140 514 -215 -76 69 -154 -8 -311 156 -42 23 5 -243 2 -156 400 202
3578 202 -550 37 -35 177 -46 51 33 299 -133 223 -7 35 -145 -270 -301 207 -212 264 41 123 -98 -48
3600 -48 649 -145 373 304 -183 39 -241 407 241 341 334 -205 141 -291 23 884 548 170 218 -517 424 -132
3622 -132 -522 -52 148 -82 -313 1 145 -35 -60 88 111 139 -119 428 -64 230 -258 263 434 542 270
3643 270 -73 321 354 79 96 -284 558 293 459 -533 60 485 88 -120 -208 94 455 306 91 211 -65
3664 -65 59 -591 143 -207 347 -248 54 -115 -9 -282 -55 -205 -162 -334 -66 -44 229 0 12 -59 33 -312
3686 -312 118 1 -191 -153 477 269 -273 -25 -540 212 -176 -86 -167 436 -61 -367 232 153 163 -145 129 -437
3708 -437 -41 -72 112 -6 251 94 -62 -507 260 -159 -10 -31 -118 -253 556 81 43 -367 6 370 291 82
3730H2J96l15k71J44J09r5N18q83K20K69N13j15m48l98O22j3o8j50m15P67j55
3751A14j15j54m6L31J70K0k82l26J61l32M28q9j60K78M50o0q77O45j90J13J12
3772A91p5Jn23O3j91P67Nn26j37K30k58K09M80n0l86J88j9J64J14j34k96O9j59
3795b73O16n08j5M36m6j99j12k28L77M25n60k1N43j66r57J021k86l48M05m36M24
3816I2J58m18M85j64j06L61L46q43M29p04P8M86j2k8o61L47K42k69K51L95l78
3837H7r62P48K91m14j13J97o8j99O89l51m92L93K13m94J000m17k92J84K2M17j22
3858C17qq5J04j68j58K15r4O1j79n65N07K57j25r2p3k32J82O61r76L79k6J55r0
3881c3k65Q67k86M56r53L0J09p5k57R6O87L2j28o4o91O84j11j29L83L55n45j92
$$ plain form
3730 82 278 -37 -308 -164 -55 -150 368 -515 -295 -26 487 372 -76 -474 148 135 67 -83 -498 269 114
3751 114 -1 -155 -201 130 300 320 38 -288 -127 -459 -31 -120 -280 -2 448 388 -489 156 -34 79 191
3772 191 116 117 -406 -343 -534 233 238 -288 -425 -195 -453 -244 236 186 -200 -12 -31 133 247 113 -183 -114 -273
3795 -273 343 -165 -180 256 210 11 -101 -329 48 473 -87 -108 435 269 -688 333 47 -301 104 -332 92
3816 92 250 -168 317 153 47 408 754 -89 340 -364 -286 200 188 160 -501 -154 88 -181 70 465 87
3837 87 -875 -127 164 -250 -363 -166 -234 -433 256 -95 -587 -194 19 -475 525 108 -184 0 22 439 317
3858 317 309 224 328 160 2 217 123 184 5 -560 -53 204 79 -13 -86 -318 -136 525 -451 -72 -98 57 -33
3881 -33 -298 569 283 739 -214 -184 -75 -150 -407 -311 376 408 280 216 -475 209 98 -31 352 707 162 -30
3903c0K00K56k94p9N4M8l00J61J7K3o0K12P1o98K09j28K04l05J163k81l87p3J27
3926A10N31k42o27M91n96L00o2j86K06K45k06M10q69K85n62O65L73p00P77o13
3946b70R41q27K65n33J74M43k36J80j70N42q29K36K73n09j64L21O95o75L23n7
3966A23M73m73L84o34J13J01k92M66l27q9K98Qk53M73l23K64l73j46O1K12n17
3987d51M03K00J4j56j94O25k25k84k39j85J024n66M3j26k33M84n06M69L18k69
4007A46K62n81m0J08l7M62m57l87O53n28M98QK1m9j26q8L99l51J46L59l68mL84
4030D30l46k54K42K09o4Q2k36p4r4j56L32j28R5K3J14l81r6P33j32l75n8L40o08
4053d02P13j20l50K19m2l57M37q6K3M72k06m10k2L10p0o8jJ1k85J60o2L9k9R2
$$ plain form
3903 -30 170 426 132 53 107 155 -145 16 33 56 -4 208 279 -419 -210 -338 -134 -439 724 443 56 -17 110
3926 110 641 399 -228 263 -333 -33 -95 -281 -75 170 -36 374 -495 -210 -772 -107 266 -434 343 -270
3946 -270 671 -156 109 -424 -250 193 -43 137 -33 509 -320 -84 189 -320 -484 -163 532 -143 180 123
3966 123 596 123 507 -127 -14 87 -205 261 -66 -155 143 151 -102 371 48 312 -61 -207 -146 66 -451
3987 -451 -48 152 166 10 -184 441 216 -68 -307 -492 532 -34 9 -117 -350 134 -372 97 415 146
4007 146 408 -173 -213 -105 -142 320 -137 -524 129 -399 99 107 128 79 -47 -135 264 -87 59 418 50 46 430
4030 430 84 -170 72 281 217 299 63 -11 -105 -261 71 -57 38 61 175 -206 -302 431 299 -76 -134 206 -402
4053 -402 311 191 -159 60 18 -339 98 12 35 507 301 -109 -131 179 109 41 40 51 -234 -74 -136 -97 -126 -34
4077c4N70l0n39n83J21N98J84J44l98m98O75l04K1j32Nk13M29k73K00K94l07O50
4099E80l39l68k41O05j98j01K14j86J2j06O9j21M93l90n86N67N5j78N7M4K62m44
4121c00K14J8Q9M64m57J07R6m35K14K93o83O05j47j5k40K27p1J14m37L50j19o2
4143a75J33j83M05l78J54J20j53J82l49L43j33J14k4j33n4j10r4J87R3j33L81
4164A93r5n1j83J13r7M67m52m2K38J34l24om0M79k80k7Q8M9l89j89N7N54l09M6
4188f6rk51K28M5o4P1j56j10L52k40L74J07j60L07k53n6K00k28j78L00l72J45
4210a4m25O47m76N30j88l98q2o0K43J31K38n6J44l23J03J62O7m61L47jj05J08
4232A31N0k09j73K70O9j54j58K40o0K51K4j31r6l55J77l1L27j79j73L89j36j31
$$ plain form
4077 -34 536 506 -33 -616 -495 103 287 431 33 -465 210 -94 -73 -205 -200 -413 16 -257 -57 237 -70 580
4099 580 241 -127 -368 237 39 -62 152 -34 -22 -128 -59 -180 313 -77 -663 -96 -41 -219 -162 -118 144 -300
4121 -300 -86 -68 21 485 28 135 231 -204 10 303 -380 225 78 63 -177 50 -21 93 -344 6 -113 -175
4143 -175 -42 -225 180 -198 -44 76 -77 105 -244 99 -34 80 56 -77 -131 -241 -335 -148 -55 -188 193
4164 193 98 47 -136 -23 -120 347 -105 -147 91 225 -99 -105 -145 334 54 27 115 164 -225 -414 -357 197 -112 -66
4188 -66 -75 -326 -98 -53 -117 -46 -202 -312 40 -200 174 281 121 428 175 119 319 91 -87 213 -159 -14
4210 -14 -439 208 -268 262 74 -324 -406 -466 -223 -92 146 90 234 -89 14 176 243 -218 129 128 23 131
4232 131 181 -28 -201 69 138 -16 -174 66 6 257 281 150 54 -301 -124 -155 172 -7 -180 209 73 -58
4254e8J27K15r6m38j37M88n13N89J29l26J34q6N9n3l39J78J70N5k49K98j21Q7
4276A13p2m77N16r5o65O62N2K44P2n85J74L55j59J87J85p75O37p11p0P63n30n
4298a84M8K7L57m03L84l95L27p1m32N57k90j22L92m31J65n1l4O28j92k59L18m85
4320a46k3P5k36M03j20L42j60q4k3J78l16L02m00J18J3r8K55L53p18j79R18o49
4342a95oK99N8K1R5j99j91Q3K01r8k78M78m21J7J52N21k27m73J29J60l29L21l92
4365b74K74O31p88N53q2n07N10n77J18K70k9L43L31q90K1j1m9J95O7L8k65K08
4387H7l01O26L0k89J84r26M29L3j50L84k16K77m74O01j87l09K83j64r0rJ72l1
4409d0J91R2P8n17k56N89l49K92o97L39P04J8m71K09n8k02J51K65j74k85K22j94
$$ plain form
4254 -58 69 284 188 -250 -387 101 -412 177 306 -20 114 28 87 34 -305 -127 43 98 -151 147 26 113
4276 113 41 -436 80 -15 -680 -18 34 278 350 -235 -61 294 135 322 507 -268 369 -342 -412 351 -179 -184
4298 -184 -136 -109 248 -155 229 -166 161 90 -342 215 -75 -197 195 -236 -71 -122 -156 472 280 21 339 -146
4320 -146 -169 -94 -330 73 -47 295 135 51 28 206 -110 192 -208 -90 -77 -175 80 433 -285 -464 454 -195
4342 -195 -201 98 156 177 272 73 -118 -35 166 68 -210 268 -153 -136 16 537 310 -163 -34 126 -203 118 -274
4365 -274 0 631 -157 396 314 -193 317 -260 -142 128 99 442 773 -117 -96 -107 -156 39 106 144 -121 87
4387 87 -214 412 442 153 337 -589 -160 -127 -277 107 -109 168 -306 295 108 -201 82 -82 -172 -181 -9 -40
4409 -40 151 243 321 -196 -452 137 -212 80 -617 -278 426 444 -27 182 124 -78 73 338 164 -121 101 -93
4431i3r9j2j80j0M59Kk19J83L99q66L44PL6p6J80J00N7k82q9O8K52J7k48k80L60
4456A0r5P4j89K19k1J54j07l2m50O94K43m78r9K25j11j3J41m3N8L18k49n02J30
4479a23o2j45M18j19J83r4J23j99M6j08N08m41j83N33k00k11J60j45M59n41O9
4500g2K98o00o3M84O7Q6k71K43k29o5j78J48K57m21L55k67L26M1l21j1p6K91P0
4523I2J65m07o8J8JK96m94K42L15k48k4p3L0j65L59j38N67l26M0k70J81K28k71
4546E0l64M20k51M5l42M95L4k30N62p24N25n89L88k12j29O59m73K66k17J74M2
4567A29P9r5r7Q4n18P10k43j57J39l2j54K80o1k83M95j44l50L14m22J77M8K09
4589A08l56j14P23l93M4N4l8J69j48n14M65k5J10L4qj53M7n8k21L34j32Q2j65
$$ plain form
4431 -93 -192 -204 -384 -394 65 67 -152 31 430 -436 -92 -85 -49 -125 55 155 212 -70 -159 -91 161 178 -70 -350 10
4456 10 -85 -11 -200 19 -2 152 45 13 -437 257 500 22 -77 148 37 24 165 122 180 498 249 -253 -123
4479 -123 -185 -330 88 -31 152 58 181 -18 28 -80 428 -13 -196 337 137 -74 86 -59 400 -141 -72
4500 -72 226 -374 -437 47 114 200 -71 172 -57 -122 -300 -152 105 -316 39 -228 98 139 -182 -193 -269 22 92
4523 92 257 -150 -218 -200 -199 97 -397 -155 160 -88 -112 -185 -155 -320 39 -99 468 142 182 -88 93 321 50
4546 50 -314 106 -145 -100 -442 53 87 -143 419 -305 220 -369 19 -193 -322 337 -136 130 -87 87 129
4567 129 208 113 16 100 -418 292 49 -108 31 -1 -155 125 64 -219 276 132 -218 96 -326 -149 -101 108
4589 108 -248 -362 361 -32 12 66 28 197 49 -465 0 -25 85 119 111 -42 5 -53 -274 60 -72 10 -155
4612a55k31N49k18K26j03L95o13L02Q3R1m79J42J19j09J50P4q2k01j35M8L4K21
4634A08Mj8j54Q9J54j53J3R5n60L23J21j02O01n34n2k10Q6R9L8K56m05J94J5m
4658DJ49L4k39m5P9K94q1l67Q2R4P0M1r4o6k67M36l59J57k8N8M12n52R2M04k43
4683F5m2j10Q6L48n60J38K28j01j62K32m98N02r2q0j0J1q3J28K98l92j0p9L84
4706B01k26J14O6n21P98n26J46J84n4J45l9l55J38l9j04R9jJ82q7j82K25o4l08
4729b08j9K21k2j39L35Q0j41l56K19N92n26k78N02o41N76o73M73M8J18l25J8J89
4751D3k38Q1J74L41n40n6j6L00o5K54n54O5j03O1J56j69K52q5q5Q3pJ11K0L59
4775C82p45M96o7m59K3K02l8N17k28l53j28K02J97Q9j95n11J112p76J30K62k58
$$ plain form
4612 -155 -386 163 -55 171 68 463 -150 152 235 326 -153 -11 108 -1 149 223 141 -60 -195 -147 -113 108
4634 108 112 94 -60 29 183 30 43 138 -422 -99 22 -80 521 -13 -65 -275 -189 -90 -52 204 -201 -7 8 4
4658 4 153 187 -52 -97 -18 276 195 -172 -90 4 74 115 21 -45 -312 124 -235 -78 -106 -48 364 -188 -96 308 65
4683 65 23 -87 -1 347 -213 -75 153 52 -110 122 -376 126 34 -46 -56 -45 -128 0 298 -94 -104 -183 201
4706 201 -25 89 155 -366 432 -94 52 236 182 327 288 -67 71 32 -72 27 26 208 121 -61 164 100 -208
4729 -208 -227 -6 -28 -167 168 248 107 -249 -30 562 36 -242 260 -381 195 -478 -5 43 161 -164 -146 43
4751 43 -195 -114 60 401 -139 -195 -211 89 24 278 -276 -211 -314 -253 -97 -266 -14 -99 -184 -101 -108 3 23 382
4775 382 -363 133 66 -393 -370 -168 -206 311 83 -270 -398 -196 1 90 -105 -616 496 -280 -150 112 -146
4796a46N37l29m67O26m28J89L34l50n3M53m10J96j76j92L69q0m8J48k33j11K72
4817A01n2k99K08L26m60K01J94l0m70L08m62L61k41K75M62l09N5Q9j21l32r6L50
4839E8j34J08k39N65l96M9k46K56K84l70J36m5k55K66L03j60mJ2o7n62K56J93
4861HJ88L76n04m77L45J52k22L2J32O2rp1k09K67k92J53L13j39k24n4M82J22j14
4884C17l80M48m22j41K46k14L56k37P2j60j00J81q0J20J36J34o61O74k07K1K76
4905C79j03k88l5l51J43L84n6p6l43O39r9m10N72n30p1M97k45L22j33K40j23N
4927C18m59J75J06l68j34O81m58K24q7K57j47J31j03j53j76N6N68n26P6O1l8m74
4949d70P14k94l43O26O5j14j86J28k13K84o15O26m26J57L64m56j80N1K60P0l83
$$ plain form
4796 -146 391 62 -405 221 -207 -18 316 -34 -87 366 -44 152 -24 -216 153 73 25 173 -60 -171 101
4817 101 49 -250 -42 284 -176 25 219 189 -281 27 -435 -74 -315 -40 422 113 168 257 136 -196 -292 58
4839 58 -76 32 -207 358 -38 11 -235 21 305 -65 71 26 -229 37 340 180 176 188 121 -441 -185 8
4861 8 196 572 68 -409 -64 88 -134 -102 30 92 83 12 -197 70 -222 -69 244 105 -119 -173 309 431 317
4884 317 -63 385 -37 -178 68 -146 210 -27 45 -115 -215 -34 -114 6 142 276 -385 289 82 103 379
4905 379 276 -12 -47 -398 -255 129 73 -3 -346 293 194 -216 356 -174 -245 252 7 329 196 436 313 318
4927 318 -141 34 140 -228 -362 319 -139 85 -2 255 108 239 136 -17 -193 -137 431 -95 -19 42 4 -470
4949 -470 244 -50 -393 233 298 184 -2 126 -87 197 -418 208 -218 -61 303 -153 -333 -282 -22 48 -335
4970c35l2K41M11n02K67o5L6j26O6K3j78M45j62p5K21m83L25j95J94n8M2l64L13
4993IK73l16N87n49m95O39J39m19J06k42O88k61m42O97k61j4J41q63J01PK75L17
5015A17j53K40n0P7k51J95n44j46R05k14p67R38p98N04k6R2j05J30K72l37j82
5036a03J59j55n8M06l93j2k91P68l06L57k07j32j68L6j77K6L89k82j71J55M8O06
5058D95n08l55o5L68L93k84k62L9J80o3q5M13n50o1J80M45p05K27O02J05r30K6
5080c95N83l8m37k5M58K84j59n55R72o40j66n03R29j72J7j35J19m65J34M1N9N15
5102D21q20R7N9j98P62q33K70K11K88q5j26K2l62K7O84o49J12M21j49P4j76k7
5124B3j17J4J72J15p57N66j53J67N25o36m04M66m83m4Q05J26l27p9K11L16k40
$$ plain form
4970 -335 -367 -126 285 -217 50 -15 21 -105 -39 -16 -194 251 89 14 235 -248 77 -118 76 18 60 -304 9
4993 9 282 -34 553 4 -491 148 287 -132 -26 -268 420 159 -283 414 153 139 280 -583 -482 -475 -200 117
5015 117 -36 204 154 231 -20 175 -369 -515 390 176 -591 347 -451 53 27 119 14 144 416 79 -103
5036 -103 56 -99 -157 249 -144 -156 -447 321 15 372 165 33 -135 -99 -276 -250 139 -143 -314 -159 -111 495
5058 495 -13 -368 -433 -65 328 44 -218 -179 1 -62 -147 266 -284 -345 -165 280 -425 -198 404 509 -421 -395
5080 -395 188 150 -287 -312 146 430 271 -284 688 48 -118 -621 308 136 153 18 137 -328 -194 -153 -94 421
5102 421 -399 -302 -243 -441 321 -512 -242 -31 257 172 46 68 -294 -267 417 -232 -120 301 152 226 50 23
5124 23 -94 -80 92 207 -550 16 -137 30 555 -81 -485 -19 -502 -546 259 385 58 -21 190 506 266
5145B66n91M35l98j30J104p57O30L51j017R5m46P71k34j62k27K40L80m55L15L04
5165D74m34l65M76j48j76O5L71J57n51N36n41K27M7o13P61J98k6k97n21N84l30
5186a06N1L80o2n4k55l03M16l18K24k79M75r32O38q76J167J79l53J35o9L74j073
5207f41Q74j00R3k12l00O9J45J26j21J57l39%m58Q17k84L30m79r7O03M77k92k19
5229A49o9K90m37N3j34P0k20J98K75ok43r8L6n21P55m3m3o06N99k54J29j4L28
5252A94m89l2J93M66k71K78l70l11O45o44j46L92Q4mk6k02L01j1m08K30L13k84
5274a02m96MJ044j90m02m70Q54m37O28o51K32L7J1J89m37Q22m10m85M80o2l9m43
5296c23K48J70j48K45K19l98J03m87J49ml3O12o07K38K6L34q0n63J05Nn39J077
$$ plain form
5145 266 -325 110 -288 -418 686 -71 559 910 -107 -12 -458 313 79 -83 -310 -70 310 -145 170 474
5165 474 40 -325 151 3 -173 -108 263 420 -131 405 -136 91 138 -475 286 484 458 161 -360 224 -106
5186 -106 -55 325 263 209 -46 -349 67 -251 -27 -306 169 -763 -125 -1001 166 345 -8 127 58 432 -641
5207 -641 233 133 226 14 -286 -217 -72 54 -67 90 -249 -249 -707 110 -174 156 -323 -420 183 660 368 149
5229 149 80 370 -67 -14 -148 -78 -298 -100 175 169 -74 -172 -136 -657 98 55 12 -594 5 -249 -120 -134 194
5252 194 -295 -327 -134 332 61 339 -31 -342 303 -341 -487 -95 -11 -15 -41 -243 58 47 -361 -131 182 -102
5274 -102 -598 -594 450 260 -142 -612 242 -195 433 -218 14 51 62 251 -186 636 226 -259 221 159 120 -323
5296 -323 -75 95 -53 192 411 13 116 -371 -222 -226 -259 353 -254 -16 10 344 264 -299 -194 -189 -728 349
5318C49j33J70J51l51p0K17k78J05j80m22K72L08J23n73J75Q1L34M1j18n84R7
5339b86M05j30k60K02K37K79k31n50K25M25R9k13K97k67N3j53L60n20J6J94j23
5360E9K38l19j71K21j23L18l16M79j46l21L86k74M63k74J03m26j92N19l48L32
5380B08k29j08N47o47J82k79K69o5k47M32m4M46l77k05L75m11L03n39L83N97m63
5401A28L21j30r0J69l75m83L73m16l9L37M77l13L8J79k7k30j77K17L01p7m32M13
5423A64n50L59j16J50k3k01J53K60m61J66K30J04K62l12k00k24N49l60q6J96L1
5444I1K59m00k5l09O77l88j7L18j86O2k24K9K18Mk69N23j60n72jK4P90p20L63
5467H7j37K3l1j86L18K05k04j61M05O3J73p02R5J5K8q4K29J8J91n44j78M85j38
$$ plain form
5318 349 216 386 537 186 116 333 55 160 -20 -442 -170 138 261 -312 -137 -56 278 319 201 -383 -286
5339 -286 119 -11 -271 -69 168 447 216 -334 -109 316 415 202 499 232 285 132 492 -28 -12 182 59
5360 59 297 -22 -193 28 -95 223 -93 386 240 -81 305 31 494 220 323 -103 -295 224 -124 208
5380 208 -21 -129 418 -229 -47 -326 -57 -122 -369 63 19 465 88 -117 258 -153 150 -389 -6 591 128
5401 128 449 319 229 398 23 -460 -87 -503 -542 -205 272 -41 -3 176 149 -81 -258 -41 260 183 -249 164
5423 164 -386 -27 -143 7 -16 -217 -64 196 -265 -99 131 235 497 185 -15 -239 310 -50 -136 60 91
5444 91 350 -50 -75 -384 293 -95 -112 206 20 82 -142 -113 105 109 -160 363 203 -369 -370 -346 444 -276 87
5467 87 -50 -27 -58 -244 74 279 75 -86 319 382 555 -147 -52 -37 -9 -93 136 154 345 -199 -377 108 -30
5490c0L2J6o8J64r1k01J13m1j1m1M41n60J74k24P71n77j53J31J98L0n87M15K3
5513g6j45M05K57r56L79J93j77l63M82J79j13K3j27j63K09j93O37m37j95l4L93
5534A78j82L5J90q15K71K27K10m4m05J89p3K60J31j82qP8J43j71K82m61njj89
5557c42J46L63l15P4J62l9k39L48K88p84O47p0l60k17N23j57Ll06P34O0o45K62
5579A36mm1L19k25j70P6q8n1N7j34K46K8j6n1k70N64m51K20k83j66J56J46M48
5602D46m43K8k87J96M61j72K0j0k43j70RM0n3K45L22j71l17L04k78L4j20J72K07
5625B20o9n58O45m9l94O3J26Q5Q9j98k23O05j92j27r5K19l13M59k83o3K26m7m60
5648c34L57r1K94k97L2P3N9R9k98j31J72J69j93j95K03J47j65J00n4m6l5q2L88
$$ plain form
5490 -30 2 18 -50 114 23 -178 -65 -106 -117 -158 283 -277 -103 -327 444 -133 -286 -155 43 73 -514 -99 -76
5513 -76 -221 184 441 -515 -136 57 -120 -483 -1 178 65 88 -39 -202 7 -186 451 14 -181 -215 178
5534 178 -4 31 221 -594 -323 -96 114 70 -335 -146 -219 41 172 -10 -18 60 203 32 314 -147 -152 -153 -342
5557 -342 -196 167 -148 -74 88 49 -190 158 446 -338 309 239 -121 -338 185 28 31 -275 459 519 -126 136
5579 136 132 91 410 185 15 91 3 -48 9 -125 121 149 133 82 -188 376 -75 145 -138 -304 -148 -2 446
5602 446 3 31 -256 -60 401 229 249 239 -4 -174 -165 -125 -178 67 389 218 -99 205 -73 -39 -159 13 220
5625 220 151 -407 238 189 -205 -142 -16 69 158 -40 -263 342 150 23 -72 147 -166 293 10 -53 173 126 -334
5648 -334 23 -68 226 -71 -39 34 93 192 -106 -237 -65 104 -89 -284 -81 66 -99 1 -53 -99 -134 -216 172
5671A72kl18K87l76M79l08l9K9J18K80k85j58J68k64M56l92K20l36N7J54M94p51
5693c15k62M09R5K27j02j47L40r9n67M29j28J38K58n6j77l63J71N2o8j47K9M67
5715A84O0q9n01P58p37K51J24J9j77J1J18k12M38j71J28m5L02l76M7M0l69L93
5737A96p5m05L09J77k95K28j92j6N4m4j30N39l52m3J08J27k0K4K14k38j33q4K33
5760A82l2k01k42L93L3r3j87L13K9k33k8R9J8P7l59L18j76M8L09K6j39m8j15l42
5784c50M48j18k64L08j06J9N8O4p1P6P3k92J49J29k15J98LJ12Q0j65j21q2j0J69
5808I2Qk91L47j00j0j85K35r2Q1k04N6oj5l99M43N2L0q3k30M28j04j79K85m0J09
5833B28n77M22m2K02k18Q7k08qJ13o9K26o8m5mJ85l02J53j15q7J12J9J44n99O14
$$ plain form
5671 172 170 -148 139 -237 242 -66 -105 -76 42 322 37 -121 47 -217 239 -153 67 -269 -212 -58 436 -315
5693 -315 -577 -168 -73 154 52 -95 245 146 -421 8 -120 18 276 220 43 -320 -149 -97 -165 -312 -283 184
5715 184 244 155 -346 412 -325 -74 50 69 -108 -97 21 -191 247 76 204 159 461 85 132 172 -197 196
5737 196 121 -284 25 202 -93 135 -57 -73 -19 -63 -193 346 -6 -49 59 186 166 190 404 166 33 -51 182
5760 182 150 -51 -293 100 133 40 -147 166 195 -38 -66 33 51 128 -231 87 -89 -41 268 294 155 107 -8 -350
5784 -350 98 -20 -284 24 -82 -63 -5 59 -12 64 137 -155 -6 123 -92 106 109 221 301 136 15 -67 -77 92
5808 92 100 -191 156 56 46 -139 96 4 85 -119 -63 -69 -84 -483 -40 12 42 -41 -271 157 53 -126 159 119 228
5833 228 -349 73 31 233 15 102 -106 -114 -1 -70 156 88 43 39 224 -78 75 -40 -127 -15 4 148 -451 163
5857A63l31n5L92k33L45j13J6n0l61J94j40K45k65M55n34J94N2J21J67m79J27
5878i0k02J66K02j49L4j43J88j1K75l72O0q5j81L49j31K44j67n0K07M9k70Q2P6
5901H1R1n1n3n2J73k09k17L9K24P9J91m0l99K38j56J48j65M26k52j77l3K14N8
5924A58J27l49K28j8k01K8m4J75j50J36j97K86k93K52j80K57J91l73k9k2q0k6
5946a24Ln1J89j52pR3j92L28J6P9k67J40K6j62k39M18Q2J56On41J17j16j04N08
5970B06k88j16J1L23l52K15Q5K76m42J29N7P4k97J80n77M56j28l05J11N65m98
5991c15M63K5k91M77o41M98j83j29K49r2k90K46r6J81k02nJ07j31K21J1m4k17
6013a58q1K73k78J37l16K58J19p7L1J87K0j5l26K11j42K41J93m50r8k11L63K2
$$ plain form
5857 163 -168 -223 169 -64 281 168 184 134 -227 -33 -173 72 -193 262 -272 -78 -26 95 262 -217 -90
5878 -90 -292 -126 76 -73 -39 -182 6 -5 270 -102 -42 -127 -308 41 -90 154 -13 -63 144 193 -77 5 81
5901 81 172 121 68 16 189 -20 -237 -198 26 105 296 256 -143 95 -61 87 -78 348 96 -81 -114 100 158
5924 158 285 -64 164 146 -55 -27 -71 104 -46 90 -107 179 -114 138 -42 215 406 33 4 -18 -98 -124
5946 -124 -121 -172 17 -135 -142 -49 -241 87 103 182 -85 55 81 -81 -320 98 180 336 342 -199 -82 -198 -302 206
5970 206 -82 -198 -187 136 -216 -1 84 360 -82 47 104 178 -119 61 -516 -60 -188 -493 -382 183 -315
5991 -315 148 173 -118 359 -282 216 33 -96 153 61 -229 17 -79 102 -100 -105 2 -129 92 103 59 -158
6013 -158 -239 34 -244 -107 -423 -165 -46 -123 -92 95 115 100 -226 -15 -157 84 277 -173 -271 -482 -119 -97
6035i7p9J90K29n38K66j62K57K09k98L10k71J0J71p6k23L01j38J6l06M72m75N61
6057C29o07N78l53J81k78K99P3k58P8K95n35J53k56L34J43n53P34l01L37p43P1
6078b79M44j56kj27M2L78k07j76K93n18K77M44m03k85Q5M89m53L40l32J57L9N3
6100A03k14M3q8J46J74m25M20j58j27K65qm7l15J96Mk7m6K4j74N12l73L33j08
6123A10q9Or7K43r3J24L5O4m63L78k27R4j02J58p5r8j51J55K5K59l97M6J24p4
6147d5m5K05l58L47J11j32o3k4J95k38K46J4j69J42j12j95K89k15J54k50j95K96
6169d2j14K86j61k30K72Mj62M07o7Q7l37O9R2J03r6j2j77J12k60M14j88q6J12
6192B6K4Nj75R7K89l33k90M82l46J92j91M55m1L5k69K54k6m32K50k6N8j8j24M3
$$ plain form
6035 -97 -176 14 243 -295 -29 -191 66 275 -23 287 16 26 197 121 -102 199 61 77 -229 243 -232 329
6057 329 -278 300 -53 128 -150 149 222 -36 42 337 -198 -45 -301 33 176 -377 357 56 393 -350 -279
6078 -279 165 9 7 -120 -78 300 93 -83 210 -308 -31 413 10 -275 -190 299 -154 186 -146 11 50 103
6100 103 -111 -68 -156 -10 164 -261 159 1 -126 139 131 84 -231 -35 -31 -58 -104 -80 -254 258 -115 218 110
6123 110 21 27 -70 173 80 204 239 303 -160 218 -9 85 -17 141 66 -32 -183 -28 -3 256 -141 -95 29 -45
6147 -45 -90 115 -243 104 215 83 20 -4 191 -47 199 213 44 186 74 -121 168 -47 107 -143 -338 -42
6169 -42 -156 130 -31 -261 11 15 -147 260 193 280 -57 12 104 207 111 99 -78 34 -226 188 0 -86 26
6192 26 50 55 -120 -23 266 -67 -357 125 -221 -29 -220 235 194 229 -40 214 188 -244 6 -20 38 20 -104 -61
6216f1j69j84P35j97l6k52J64r3pM85l79O9l93L55N8j19m2k4L1k45K28J68k1J96
6240B67o16P10l10n4J41k92L11N4k2k67N02l43J25j60J33k68Q9m4K99m50M69l87
6262a13K55n64N06K68m90J22L53p5j49M00o71L18k89Kk66N13O3k38K74l58J33
6283fK00m30Q0J65m06L43K9j64j1N75l04r3j14J08k1Q1J30j85j11J15q3j7L63
6306B44k27R4j61K9K33j95LJ86k51L8j01K90k02o7J71j82J18j71J3j51M13j31
6328gJ17k38K08l01K64K19k56k97K52m61K79M37j31k34L16k00J32O3j97l9M87
6349D13l52J73k53j36K51j45K10k59M8l08L20K13j75m18J95J42K67m28J64k71
6369c49J51K34J23q6l28J70Q5o3m8J98k2O0Rj26J60J06k59k9j15P2N32n72J54
$$ plain form
6216 -61 -230 -414 321 124 88 -164 0 -93 -100 385 6 75 -318 37 95 -24 -66 -90 -59 -304 -76 92 71 267
6240 267 -349 361 51 -3 138 -154 157 211 189 -78 424 81 206 46 179 -89 0 -44 255 -195 274 -113
6262 -113 142 -422 84 352 -138 -16 337 262 113 513 -158 160 -129 -127 -393 120 183 -55 219 -139 -6
6283 -6 194 -236 -156 9 -397 -54 -25 -189 -200 375 71 -22 -136 -28 -49 32 162 -23 -134 -19 -102 -119 244
6306 244 17 111 -50 -21 212 17 20 206 -45 -7 -108 182 -20 -87 84 -98 20 -151 -138 -289 124 -7
6328 -7 110 -128 80 -221 43 262 6 -291 -39 -500 -221 216 85 -149 167 -33 99 162 -35 -74 413
6349 413 61 234 -19 -155 96 -49 161 -98 -50 -358 -38 175 0 -418 -223 -81 186 -242 -78 -349
6369 -349 -198 36 159 73 -255 -85 0 -63 -111 87 65 125 134 8 168 274 15 -14 -129 -57 475 -97 57
6392E7Q7j55k71P0J09L53l60K25j78m22K28j17J35L09j81r6Q48m09q98N34Q6m45
6414d91O22n42M50j72L08j56m8P8K4L20l80J56l80j03O48m38N9n7L09j01L1rn0
6437G8K28r4l40J88M14m64k62K41k36O12n56j39M10j17K08q1k45J21m1M2O6o0
6459b7j0M15n26K27J46m28J07p6L99k98k69K52K94k89J28l26K21M08m30J48J66
6480B32j68m7m7r3K63j33j37J30K54l21K9J7k81J28N8k7K26j01Q4q3j5O3J53j78
6504FPj45K98q1Kl15K71J37k01K46m65O9K13j35K92m69N32k72j49K73l83j12L03
6527g8J68l6k49J50K85n42L77N5n1J44l25K24K11m14j57K53j19M39j56l32K44
6548I1m00O23m65M25j72k10J48K39K5m07L06l87J89%m76O49n9m39N50M9Pl96J76
$$ plain form
6392 57 144 -11 -282 -212 -103 250 -110 115 -63 -485 -257 -374 -239 70 -111 -207 641 232 -666 -132 -46 -491
6414 -491 131 -411 39 -133 175 19 -29 49 73 393 13 169 -211 -314 334 -104 -45 -102 207 106 137 128 78
6437 78 306 212 -128 60 474 10 -252 -11 -247 365 -191 -330 80 -37 171 90 -155 -34 -75 -33 33 -27
6459 -27 -37 378 -148 79 225 -203 -96 -172 227 -71 -340 -88 206 -83 45 -281 -60 348 -82 66 232
6480 232 64 17 -30 -123 140 7 -130 0 254 -67 -38 -21 -302 -174 -116 -143 83 -18 66 -17 -32 31 184 6
6504 6 13 -132 166 85 87 -228 43 180 -21 225 -240 -171 42 -93 199 -270 262 -10 -159 114 -269 -381 -78
6527 -78 90 54 -195 -45 240 -302 75 130 79 223 -102 122 333 -81 -238 15 -104 335 179 -153 91
6548 91 -309 314 -151 274 102 -108 40 279 304 -103 203 -184 5 5 -471 178 119 -320 230 279 286 -110 66
6571F6P4k99M90j00l74K01r5J22r1j06j20O24m7n71j08N7j19N73j38k05j83N72
6593B23l56rK89J88m62lj8M91k52j63J97k61O55m95J16l8J80l22J10k62M16k14
6615A0q2M22k86m31J93j11P78k24m76N97O3m15j51J02J08j18R2J94n16N65o77
6636c63K06M67k87J78j00M2j78k58M86p82O53M19k68q7m29L04N26n05n5k58K54
6657c5k66L54l05P59n1q72L12j83L87J42j77m73R50rk91m21P13n60K60j89k51
6678b06J98R6j65j31N1O15m59K9M3l74L83k35M74o96L50N40m35k90j0L04oJ33
6700B09p5j96J95k8J20k21j48j14N92l60k24m2J28K75q9OJ7o7j45M27q16P45o28
6723d39K83J44J74k59j6K42k49K51L35n22k36k84O92L6P0j09m8L42l80J20n37
$$ plain form
6571 66 140 -159 331 231 -143 58 -37 85 -6 -112 -232 392 345 -226 -334 -277 -396 177 39 -166 -349 223
6593 223 -133 -142 147 335 -127 -130 -148 343 91 -72 125 -136 519 24 140 102 282 -40 70 -192 224 10
6615 10 -72 350 64 -367 -174 -285 493 269 -207 390 453 38 -113 -11 97 -21 71 265 -251 314 -363
6636 -363 -157 310 23 201 101 143 -35 -293 193 -589 64 483 215 128 -301 3 529 24 -31 -289 -35
6657 -35 -301 53 -252 507 456 -416 -104 -287 100 242 65 -408 542 533 242 -179 534 -26 234 45 -206
6678 -206 -8 88 -77 -208 -157 458 -1 28 71 -303 80 -155 319 -377 -27 513 78 -212 -222 82 76 209
6700 209 134 -62 133 105 225 4 -144 -258 334 -26 -250 -292 -164 111 22 28 45 -22 -167 260 -556 189 -439
6723 -439 -156 -12 162 -97 -113 129 -120 131 466 -56 -292 -576 116 152 222 113 65 407 27 147 -390
6744c90O61k72J9l29J19Q6M12j32m42K94L9j75M3J91k70k9j32L50N7jK80m24J69
6767A24j51J10l17K50N3J4j70M93n90J65O28l98l00N73L42q48n13O12j10M12k91
6788H8J31J84l89J86m60N03J18q0m35N07j82j31m60K25N50l60J36N9m44O48j81
6809B13n7j67J29j3k7m33P90k53l2J03J07q77J43O67l98m7J53j26NP0j70J96m68
6832d92O81R3j67M0j69m3J83R1k03L78m63j40L05J45n5o16P29n61L11P39m21o2
6854C03j51J16o35O91l43m03N38p98J417q90L24K30l01L4l16L24R5m62Q1J47K59
6875B60m7k01L31o47L69O8J38m6l21P62m05j95m75J36N50k94m54R10J5j85n5m12
6897a98K00l03K12m3k41L41J18J89j24q4J91l0J49k10M2k14J36p2M26m49j59r4
$$ plain form
6744 -390 271 -1 18 -311 -192 -106 306 174 -268 26 65 -110 -67 124 -146 -175 -307 43 100 99 379 -45 124
6767 124 -27 83 -234 16 69 83 -87 406 -184 -19 609 211 -89 484 826 -22 -535 77 -33 379 88
6788 88 219 403 14 200 -260 243 361 281 -154 353 171 40 -420 -195 355 -5 131 190 -254 394 213
6809 213 156 -11 118 105 78 -355 435 182 150 253 360 -517 -374 293 -105 -152 1 -125 -120 -50 -220 -24 -492
6832 -492 189 282 115 155 -14 -57 126 217 14 392 -71 -211 94 239 184 -432 297 -264 47 786 365 303
6854 303 152 268 -367 324 -19 -422 116 -682 735 -155 169 399 98 132 -184 140 235 -227 -146 1 260
6875 260 213 12 343 -304 65 133 271 225 -96 666 261 66 -409 -273 277 -17 -471 439 454 269 214 -198
6897 -198 2 -301 -89 -132 -373 -32 86 275 151 67 258 228 377 167 209 -5 131 59 485 36 -123 -217
6919b17Q2k45M74J19L28l45k59p2p7M7M9j07K51J9J6m05K84J09J45J04k42J20
6941A78m6j34l5l73p6L66N32n98l82M26l26P43L32m86k10L96n31K94j00n67L44
6962b53M48n59M39r0l34k96K95j43J52N00j9j08P26j102K33P0r9j18L47k52L42
6983A79mj59L97k46j68J40j92k99q7P73R3m44n2k78L82l34K58N15l46J15l37O2
7005c2Q6l83K63K27P5k39q8k06J92L69o29K06N34j52k21j0m20R36q39N96j16K82
7027D31q00O44j74l18K9O0K98k35O95j062N45r3n5J10o76R99m54M98k24k34K24
7048B08j151J356o32L70m06N5J71M0l90P1M87j55k19M65j41p64O50N97o48j55
7068a91K60J40o66J73J138r66J06O1N8l40M0N80N3k2m16q6m7M9J0L75o15L84j61
$$ plain form
6919 -217 -135 -380 94 213 541 196 -63 -135 -212 -165 -116 -223 28 47 63 -342 -58 51 196 300 58 178
6941 178 132 -2 -37 -410 -486 -120 412 -186 -568 -142 -468 275 607 121 -89 307 -224 70 -30 -597 -253
6962 -253 195 -364 75 -15 -349 -645 -350 -493 -341 159 140 32 758 -344 -111 -41 -140 -258 89 -163 179
6983 179 175 16 413 167 -1 139 -53 -352 -439 334 427 -17 -69 -347 35 -299 -41 474 128 243 -94 -32
7005 -32 54 -329 -66 161 236 -3 -91 -297 -105 264 -365 -159 375 223 2 -8 -428 508 -331 265 149 431
7027 431 -369 275 101 -217 -188 -128 170 -65 630 -432 113 20 -35 75 -601 398 -56 442 218 -16 208
7048 208 -943 413 -219 151 -255 -200 -29 11 -379 -308 179 24 -195 270 129 -635 15 612 -36 -191
7068 -191 69 209 -457 -284 854 -112 -6 55 113 -227 -187 393 446 424 8 -78 -125 -76 -66 309 -306 78 -83
7091h3K31L70m96M00o97Q82o26j71k16J19L34j00L19o06R86n42J09l17K11j3L05
7112C99jk63K5L33n86r8K81n42K27o9J93L76k27j72K62J65j88r7L9j8K22rN09
7135G61p04L80p44j05M98K66l59m86Q25M2l65k22O74l90r4j21Rj22L95j34k7n2
7157g5n74Q84l36l5J57l29L58L6k90J54l97O74l76J59L2o68N84L21l18PJ57j46
7179b1N68m14l47K82L74n30L54n17Q3K03l92j1N20K10q25J00J85K93o9r1j65L73
7201A63l43J89K93q9k69p9J49P8K67p68M46kJ5L2J75m8k17j72J9O4J20K15j95
7224D3K12o21L08M27k27k81N46l54K05m21M34m89N6J21j65K58k88K22J93j3o2
7245A04J58k84J08j34M6k75N07n01K64P5j34M95n31L40m08K7J00J99j10J38m30
$$ plain form
7091 -83 148 518 22 422 -275 607 -19 -190 -406 -287 47 -53 266 -340 646 104 213 -104 107 94 399
7112 399 398 135 160 493 -93 -191 90 -452 -225 -294 -101 275 48 -124 138 303 115 18 57 39 261 252 761
7135 761 57 437 -307 -412 86 352 -7 -493 332 374 9 -213 461 71 -23 -144 -135 -257 138 4 -23 -75
7157 -75 -649 235 -101 -136 21 -308 50 86 -204 -50 -447 227 -149 10 42 -626 -42 279 -39 -32 125 -21
7179 -21 547 133 -214 68 442 -88 266 -251 -168 35 -357 -368 152 362 -463 -363 -178 115 46 -45 -210 163
7201 163 -180 9 302 213 -56 -135 14 92 359 -409 37 35 50 82 257 209 -8 -180 -161 -97 23 238 43
7224 43 255 -366 -58 369 142 -139 407 53 258 -163 271 -218 -162 -41 -206 52 -236 -14 179 166 104
7245 104 262 -22 86 -48 -2 -277 230 -271 -7 68 -66 429 -102 238 -170 -143 -43 156 46 184 -246
7266b46K10m6J95l46j75N00l90K84q2j34N83n07M2k72K98J17q2K85l69L95j88
7287G2j92J87l3j10J3K49p1k32L21n8k25J33j46J80Q1p3j41J41K35k03K86j10
7309C04m79K04l1l16R2K05p1o1L24n60M64n3P8J9j9N4m40L55J18k16l8J94l35
7332b08K93P8o3l04L58j69jM1R1m53N24J1l11p4M0M4P5n4J54o5P3L35m09J44l62
7357b12K63O2k01MR2J73l04L41r9K82o51K21p2J94r0J01j03m3k92L44K10k47m83
7380e10K20M59k28j17K1J42r6M16q79O14L58l14Kj01M08n76K92k80K25J96m77
7401b25L35l60M08l08M5M4j75K85k20J18J75k5j87k03K14l2L91k56K82j36m20
7422b50j46M63r2k38O64k04M42r68Q87n98K7k60K50M6k31J42n14Q48o3r56J067
$$ plain form
7266 -246 -36 -82 113 -233 -408 92 -298 -14 -96 -230 353 -154 -112 -384 -86 31 -51 234 -135 260 72
7287 72 -120 67 34 -76 -63 186 115 -117 204 146 -79 54 -92 88 169 96 -45 96 331 128 414 304
7309 304 -175 29 -2 -318 -226 -21 -92 -153 171 -389 75 22 100 119 100 154 -286 69 187 -29 -67 127 -208
7332 -208 85 163 100 -204 154 -15 -16 25 116 -337 187 198 -113 -187 -147 -103 -28 -82 72 7 80 415 6 150 -212
7357 -212 51 113 -88 -84 8 181 -123 218 119 401 -250 -29 -101 93 3 104 1 -42 -334 10 220 -27 -510
7380 -510 -290 169 -59 -176 -155 -13 -109 307 -572 42 400 86 88 -13 395 -181 111 -169 56 252 -225
7401 -225 110 -250 158 -150 -105 -61 -236 49 -171 -53 122 97 -90 -293 -79 -111 280 24 306 170 -250
7422 -250 -396 67 -25 -263 401 197 639 -329 558 -40 -13 -273 -23 23 -208 -66 -580 268 205 -751 316
7443C16k1k38J26J72m80R1j45L37j55j94J7m64J147m17k47J96N21o43J61k51M70
7464B99j41j01K40l34m04Q8M01j25L3K67m78J71K11k56M2n2K57k49L51M3M76j028
7486b89L62M97k43l82K08J92j004N54j02M80J10n67K41q3L2m31K31j74Q36m84
7506a6N35n9j043K38M33Mm65L04J54O48p04o12N50J54m43q9N09J29p40J238q33
7527a08o2O20k53n56K53K64j47K68q1n24R09m92j9r3O24q92L1L8j64M38L58l42
7549G0q8N38p89L92P4Kk40M50k93m32L07J00k18N91o34L37M5j77n7M15r01O36
7571A28K85k20J08l81k38K79j66L37P9k45k86K0J32r3j01L0K49n8L6N35o11k30
7593d11L05M30o69k63O44K32l27q4L83O4k92L5N94o75M27j25o69M17k84L58j19
$$ plain form
7443 316 295 57 183 355 -125 -34 -179 158 3 -191 -174 -638 509 92 -155 41 562 -81 80 -171 299
7464 299 158 57 297 -37 -441 -353 48 -77 -44 223 -255 -84 127 -129 -87 -139 118 -131 220 263 739 -289
7486 -289 73 570 327 -55 153 345 -659 -105 -207 273 383 -184 57 -26 6 -425 -194 -368 468 -16
7506 -16 519 460 -583 -345 88 92 -373 -69 85 733 29 -583 -33 121 -322 -411 98 227 -513 725 -108
7527 -108 -170 450 197 -359 -106 158 11 279 198 -326 583 91 72 -21 603 -289 -258 -220 -384 54 412 70
7549 70 -18 520 -269 123 197 199 -41 409 116 -316 -9 91 -127 464 -170 167 212 35 -22 393 -508 128
7571 128 413 193 301 -80 -318 -39 -205 132 211 -34 -320 -300 -168 -261 -362 -332 -83 -141 -105 430 -181 -411
7593 -411 -106 324 -345 -608 36 268 -59 -143 240 304 12 47 641 -34 393 268 -401 16 -268 90 -29
7614b9j36K52k40O47o62k40P51n88J76J96j29j0K43j46j60P8K22k75m34N67m38
7635c55O25j74j04p6k16M85l9j06M2K39o7j53n65J12K61J77K27k54j18L07j27
7656A21n76J198m44o63j38O29k86N56j76l11j00L70n89P85m16K08J14m9q2j83
7676c2j42r4M32L53m31l17J08k6L64L2l32J54O2M78o39l52N23l51j9P53n86K35
7698A73o54K40j90O36k78m80N98l43K77r07O56K35Q8k91N18q17M06J56N72o55
7718f0L50n61P9J0J19k83N26l78m1P00p20M81k76j02o0M86m05L72J66p25J07O30
7740D15m92N47m93k63J42J91M55j66l36R0k29K20P9M53o71J48K5j57l73Q41p94
7761c68K35J86N01j57o1N86q53j43R5p2J05M36j71l91L46l62n1J28l60L86j9Q60
$$ plain form
7614 -29 -165 87 -153 494 -168 -408 343 -245 -69 127 -2 -12 231 85 -75 3 225 -50 -484 83 -355
7635 -355 270 96 -8 -84 -300 185 146 40 82 321 254 101 -464 -352 -91 86 313 59 -59 248 121
7656 121 -455 743 299 -364 -502 127 -159 397 221 -90 -190 180 -409 376 -40 168 282 233 151 -32
7676 -32 -174 -268 164 517 86 -231 -123 -149 215 247 -85 69 131 609 -30 -382 141 -210 -229 524 -62 173
7698 173 -481 -241 -431 205 -73 -553 45 -298 -21 -928 -272 -37 51 -240 278 -539 -133 23 595 -60
7718 -60 290 -271 -192 -182 -63 -346 180 -198 -239 461 -259 222 -54 -156 -216 270 -135 237 403 -322 -215 415
7740 415 -77 470 -23 -286 -144 47 502 336 0 90 -139 81 160 613 -58 90 115 -42 -415 426 -368
7761 -368 -133 53 554 397 336 922 69 -74 21 -51 54 490 319 -72 274 -88 -139 -11 -371 15 -4 856
7783H56q31K37l87j23K44m2L02k02l8k73M6l16N93k40L58N3m58K97j9k01P3P0
7805aj25Q3M25m57L13n31K23J35l62K14K04l03K48l80J49J80k90L88M45m86k99
7826b27P12q79Q72l21J88k74J72m1k46j85k96R73k34p4O2l98N79j57o6j05N0K6
7848A31k47k31J76L2Q45m05O7k22k10M82k31j10n64N77Q7l09L16k21j86L0Q0Q6
7870b7J03k15j27J93k27M34k01n12O81j31k13N06j26l48j09Q18k17k11j0P4R3
7891B28L5n78K38l15J002n83j40J95J89K48q97L28K50r5r7l22J191p37j70L93
7911C63k52J93m62Q3J23L06p38O64n14K08p4K09j96j45L3K16M60p35L62j38J73
7932A39K1k11N79m39J24o75M73l25K33N33k76p1K39k6m27K87k04m0k52K27O6o7
$$ plain form
7783 856 25 262 -125 -248 -4 -46 256 54 16 -257 -211 -527 66 -174 184 237 -221 76 57 -144 -71 -1
7805 -1 -126 -43 382 -75 238 -293 -70 65 -297 -83 121 -182 66 -314 -165 15 -275 113 558 72 -227
7826 -227 485 -394 478 157 345 71 243 202 -44 -229 -525 448 214 140 202 -196 383 226 160 55 105 131
7848 131 -116 -347 -171 -139 706 301 368 146 -64 418 187 77 -487 90 177 -132 184 -37 -223 -193 -113 -27
7870 -27 76 -139 -266 -73 -300 134 -67 -579 102 -29 -242 264 138 -210 -319 499 282 71 61 135 228
7891 228 263 -315 -77 -392 610 27 -113 82 271 519 -378 -50 200 105 8 -314 877 140 -30 363
7911 363 111 304 -158 -75 48 354 -384 280 -234 -26 -100 109 -87 -232 -199 17 477 -258 104 -34 139
7932 139 160 -51 528 89 213 -462 11 -314 -81 452 176 105 344 318 -109 178 -26 -66 -318 -91 -25 -92
7954i2k1j93N0O41j24n34K49J66k05k02M18J77l83J50Q9j37l42O46l33K3k97l30
7976e84M09q5J87J68j6m04N28n06J55M23j92m7l23N5M61l75J12j4j69K47j28L7
7998f1Q3j96P6J54N32n26q1j34j46P32j57j06J03K56j96l20l75M68J26l00J52
8019H4j49O2k48L18R1J42j75M3n51L85m4K28n39J45L51n3k65J02N0k16J79L7k51
8042b74k14M25j11P16j006K80M62j23l90K66J32j94l88J71O63n50N18l81r4M11
8062C19q7k59L2r7K35j33L29o55L30p6k80J441j607K23N55k74L69L02q24K69l68
8083b56J01j59M7K67k32M38o75j79J36M68k64Q0k28N32k61L93P5p79O03J1J98
8104C16o90K56J87J94Q7J70l81j74L5o1r5M64r9l13L9n3N04r83P26o51J57N83
$$ plain form
7954 -92 -113 -306 -256 385 261 -273 -24 142 -63 -265 153 330 -53 97 186 49 -293 353 20 43 -254 -584
7976 -584 -175 -260 -73 95 79 -325 203 -303 -148 275 83 36 -287 -232 229 -146 -34 -48 -217 30 -98 -61
7998 -61 22 -174 -98 56 588 62 -19 -153 -299 433 276 170 273 529 333 13 -362 106 232 -68 84
8019 84 -65 -3 -251 67 158 300 125 168 -383 2 -42 186 -353 -208 143 90 -175 -73 -23 -239 -60 -23 -274
8042 -274 -488 -63 -174 542 -464 -184 278 155 -235 31 163 -31 -419 -248 415 -135 383 2 -92 319
8062 319 232 -27 5 -92 143 10 339 -316 14 -62 -342 1099 -508 -285 270 -4 365 667 -157 112 -256
8083 -256 -155 -314 -267 0 -232 206 -469 -648 -512 -44 -308 -228 -456 76 -185 208 283 -496 107 118 316
8104 316 -374 -118 69 263 350 520 139 -35 0 -61 -156 308 209 -104 -65 -118 386 -597 129 -522 -365 218
8126B18L29p71j37Q22n23k28L44K8j1J54j4n68K63j07n6O39Jo86K64J42k3p7M60
8149D63o25j9M82J43o05K95m54N05n5j28L02l37r7L4J04p1J62m8O8m78K83N5P9
8172E8m92R72o52p7N48j03l91j25M32k19k6O26k98n30j76n4N19K40q
$$ plain form
8126 218 547 -224 -361 461 -62 -290 54 82 71 225 211 -357 -94 -201 -257 382 383 -303 -39 103 80 3 463
8149 463 -162 -181 301 444 -161 134 -320 185 130 2 304 -33 -130 -96 8 -63 99 51 119 -359 -76 -21 58
8172 58 -434 538 -114 -191 357 254 -137 -262 170 -49 -75 551 253 -277 -453 -507 12 252 244
8191B44
$$ Imaginary data points
##PAGE= N=2
##DATA TABLE= (X++(I..I)), XYDATA
0@%%%%%%%%%%%%Qj6J6k2L0l2M0m8N6p1Q0r5J16j33J52j76K05k37K70l07L51l96
34b09M47n05N67o37P13p95Q87r87J094j213J343j484J638j807J994k199K421k665
52a397K937l238L575l954M385m876N442o106O893p849R041j0571J2615j5504J9931
67A1324k7651M4963j54678M2801L02146L0211k8102k36272k59363j8682K22935
78g0368J95769J52187l2515k57298k36572o867J20512K25897K04381m6334k56476
89g684j91424o0431R5554K45678J91949m5738j85818k02588j13796J00630K43203
100F9535J58406K930j38273k37089j37385J09641K15151J53486M3298j26505k41235
111a28040j26438P8007J75602J76518P3519j28269k23619j19598K9947J49669
$$ plain form
0 0 0 0 0 0 0 0 0 0 0 0 0 0 8 -8 8 -14 16 -16 24 -24 32 -39 41 -54 62 -71 81 -95 110 -127 143 -164 187 -209
34 -209 238 -267 300 -337 376 -419 468 -519 575 -638 705 -779 859 -948 1046 -1153 1268 -1397
52 -1397 1540 -1698 1877 -2077 2308 -2568 2874 -3232 3661 -4188 4853 -5718 6897 -8607 11324
67 11324 -16327 28636 -126042 -83241 218905 249116 221014 -15258 -274621 -293303 -70368
78 -70368 125401 277588 245073 -12225 -248797 -255664 -135152 90745 295126 248792 -7684
89 -7684 -199108 -259539 -163985 81693 273642 227904 42086 -160502 -274298 -173668 69535
100 69535 227941 230871 92598 -144491 -281876 -172235 42916 196402 239700 113195 -128040
111 -128040 -254478 -176471 -869 175649 249168 120899 -102720 -222318 -192371 -42702
121d2702K08658Q7031j30354j99028j18816q778J36515K18894Q6204j08043j67789
132c8208j39641l9218J39835K06204Q2029n9745j50818j77723m3516J45163J72184
143I6546R1468j2441j54855j91536l3096J13872J47167J27046N130j63422j68898
154a43019m3030O2968J55685J57737q406j48636j36766p8776L2475J75879J51141
165A77252j1478j04648j34569j15797L5180J71544J26517K1143o9620j60825j23722
176a89023M6811J36730J17188O4316o3557j74216j06138K9995R9527J34346Q7018
187A82997p0362j55930r7677r141Q6572J57047Q1835o6283j23661j07800m1972
198a64375R0792J58183P0589l8955j01483j29759n3252R2748J38691P4757m311
$$ plain form
121 -42702 165956 252987 122633 -76395 -195211 -203989 -67474 151420 237624 129581 -38208
132 -38208 -177849 -217067 -77232 128972 211001 151256 438 -177285 -220801 -75638 96546
143 96546 188014 175573 20718 -170818 -203914 -90042 57125 184171 189301 25879 -143019
154 -143019 -186049 -123081 32604 190341 181935 33299 -103467 -182243 -149768 26111 177252
165 177252 165774 61126 -73443 -189240 -154060 17484 144001 165144 95524 -65301 -189023
176 -189023 -142212 -5482 111706 176022 112465 -61751 -167889 -137894 -38367 95979 182997
187 182997 112635 -43295 -140972 -150113 -63541 93506 175341 109058 -14603 -122403 -164375
198 -164375 -73583 84600 155189 116234 14751 -115008 -168260 -75512 63179 137936 133625
209A33625j01215j44660m6644P8902J13675R6113J7443j09302j37576m3317M6850
220i6106J05393J19704K0103j06552j18562n7449J8130J13340J26365J4285q3203
231E5448j04895q4553P935J19905J14179K1182n2570j09186j03746J1549J09186
242a5566R8827M5906l4440j21725j01270J1287Q1906R9145P1281l4010j21510
253b0169q9530p210N9694J12468Q0505l6633j04170q5267l4071N3479J21614P4136
265A24846k6237q1713r5875n2186N6266J15395O8173l806o9001j10388n4411N4044
277g4893R6405P4390K0103o9991j14676m9889L8451Q0785Q9576L1834p3067j04266
289e5238n0365J3732P7022J03515K9603o5573q8075o4243m167Q2405J02193K7719
$$ plain form
209 133625 32410 -112250 -158894 -79992 33683 129796 147239 37937 -99639 -142956 -96106
220 -96106 9287 128991 149094 42542 -76020 -133469 -115339 -1999 124366 138651 55448
231 55448 -49447 -134000 -126065 -6160 108019 129201 76631 -32555 -136301 -124752 -15566
242 -15566 83261 129167 94727 -26998 -128268 -116981 -35075 64070 135351 101341 -20169
253 -20169 -109699 -116909 -57215 55253 135758 99125 -5045 -90312 -124383 -70904 50710 124846
265 124846 98609 16896 -78979 -131165 -74899 40496 108669 104863 35862 -74526 -128937 -74893
277 -74893 21512 95902 116005 46014 -68662 -118551 -80100 685 90261 122095 49028 -55238
289 -55238 -105603 -91871 -14849 88666 118269 52696 -35379 -99622 -103789 -21384 80809 108528
301A08528m4793q0420q2796q980Q3718Q9916L6223k2079q5665r1003n706O9464
313c3593P9094N6090j1565r2662q4652r244M6911Q2118P1958j4090q6599p3841
325g0075k6829L1960R2036P3807j4337o8571p3190m7156L0631R4424O5675k350
337H6025n0511q3458n6544L2984Q3042O2467J8060m4483r1797n4042K7012O6702
349d543O8950L3791m6467q9143m9172J0214N6272Q0948L7704m5762p6586n2867
361g6661q631N6392Q6482L4076l4832o3894o6006j8568N9906P9684L4613j5765
373F6796o1199p7151j8599N5184O7853M5187j199o6438p7111j6457L9091O2556
385A8513O0336J649o7412o8224k3429K1967O7709O7047o88n6646o1512l8801J4887
$$ plain form
301 108528 63735 -16685 -99481 -108461 -24743 65173 101396 79317 -6348 -97351 -103057 -33593
313 -33593 45501 101591 90026 -2636 -87288 -96532 -49621 32497 104455 90365 3766 -70075
325 -70075 -96904 -64944 27092 100899 86562 17991 -55199 -102355 -71724 22700 88375 86025
337 86025 35514 -47944 -104488 -71504 11538 74005 92065 47582 -44215 -98257 -71245 -4543
349 -4543 64407 98198 51731 -37412 -86584 -76370 -20098 60850 98554 52792 -23794 -76661
361 -76661 -85292 -28900 57582 91658 56826 -7068 -73074 -91642 -31736 47948 82561 66796
373 66796 5597 -71554 -90153 -34969 32884 78071 76872 10434 -66677 -83134 -44043 18513
385 18513 78849 80498 13086 -55138 -78567 -56600 11109 78156 77468 20822 -40690 -79491 -64604
398f4604P2634O2683K936m0640o4291n0661J5806O8285N5922J6624l0384p0989
410b6679n2487J4458N6150N6466L0853k8368p2687m8755N570M4341O3823L7362
422H0047k8552o5736m7102q398L9282O8879L8443k4225n5317n1964j9935L9301
434c5277O8987L6006j3089m7594o0136k5267L8896O1798L8490Q0m5820o5616k3606
447g2148L1932N2520M6931R376m8452o3062k3360J9078M9104N6492J0790m6444
459B2757n4945l0156O885N2701N8506Q550l5250m9656m2054K381N5038N3379J3060
472F1196k2687n2394m9490M512M8883M7413K4288j5888n7266m6923K187L6342
484a9827M9218L5588j6834n6128m1801o804K7334N5346L8192j7031m6929m2218
$$ plain form
398 -64604 8030 70713 73649 33009 -31282 -81943 -66137 2148 58070 74694 44310 -26679
410 -26679 -79166 -64708 -8558 47908 78761 50393 -22294 -71049 -65479 -21138 42685 80047
422 80047 51495 -14241 -61343 -69741 -30459 38420 76863 52638 -2679 -54643 -74578 -35277
434 -35277 33710 69716 56627 9033 -51103 -76370 -37474 24324 62814 62894 17074 -48542 -72148
447 -72148 -40216 12304 59235 68611 20159 -42903 -66263 -47185 1919 58411 69201 22757
459 22757 -32188 -62344 -55459 -2758 55748 64298 29048 -20608 -62662 -60281 -5243 48136 61196
472 61196 38509 -13885 -63375 -58863 -9980 37433 61721 45833 -11433 -58356 -56169 -19827
484 -19827 29391 64979 48145 -7983 -49784 -56588 -29254 26092 64284 47253 324 -41894
496d1894j8544K6349N7026L4859r762l7613m8280k5247K7667N2848L3705J119
508E2233l3770n4028k5627K4562M5227L7398J0335l4405n3745k3830J5227L9364
520a059M5188J4467l4645m8293k6418M218L9023M9804J3806k9543m1892l3142
532d8486k494M0773M7653J4825j9109m0506m1593k397L8594M1756K1115j0185
544C9946m3786m3041k113L0845L9412K9449p593m4126l9383p089K1444M2274L4589
557E0828p579l9904l6489j6291J7849M5987L3208n409l1778l8022k2942J6479
569c4063M4128L1780J879k5822m2347k5641J5395L8509L2698R759k4328m4117
581b2170k4367J0864L2787L5811J4577k2685m1988k5212M093K8923L9636J7327
$$ plain form
496 -41894 -60438 -34089 22937 57796 48034 10421 -37859 -63106 -35439 17409 51114 52233
508 52233 18463 -35565 -61192 -36630 8597 45995 56330 21925 -31820 -55650 -40423 -1059
520 -1059 44129 58596 23951 -24342 -50760 -46542 -7519 42285 56091 26548 -15344 -48486
532 -48486 -50980 -10207 37446 52271 33162 -7344 -48937 -51334 -12740 29016 50131 39946
544 39946 -3840 -46881 -48994 -18149 21263 50712 43119 -1007 -40390 -47479 -26035 16239 50828
557 50828 43249 3345 -33144 -49435 -31586 14401 47609 42200 10422 -27600 -50542 -34063
569 -34063 10065 41845 43724 17902 -24445 -50086 -34691 3818 36516 46275 21947 -22170
581 -22170 -46537 -35673 -2886 32925 47502 24817 -17171 -42383 -38290 -9367 30269 47596
593D7596k1042l8147k6885l268K8538M0979J6824j6078l2749l1768q281K8953
605a5328L8534J7585q213l0604l7635q368K6457L4364K1824r47l3019l7811p588
618d0749J9313L0429L0256Kl3148l3185j1634J0508L3917L3372j653k8045k8884
631a9501k0390Q044L7041K9631O30j8837l2553k5103R499L3018K6634R260j5062
644B2311l7247k3930Q119K5943K9105J5494j6256l5636k2018J486K1459L3703
656B2533J7423j5732l0598k4017n141K1747L4341J6097j1332k6328k8041q033
668c7081K1789L1783J7404n019k5736k9981r730J8670K9116K0706n44k5121l0484
681b4228j0714J4372K7414K3945J903k3701k9314j2995R962K5749K6537M632k2125
$$ plain form
593 47596 26554 -11593 -38478 -41746 -13208 27771 44595 28517 -4232 -36000 -44281 -15328
605 -15328 23206 40791 32578 1974 -35661 -44029 -17572 16792 38616 37669 4650 -33161 -40749
618 -40749 -21436 8993 39249 39251 6103 -27082 -38716 -28208 5709 39081 37428 9383 -19501
631 -19501 -39891 -31847 5194 34825 35455 16618 -15935 -41038 -31539 1479 28113 37373 22311
644 22311 -14936 -38866 -30747 -4804 24301 39795 23539 -12097 -34115 -32629 -11170 22533
656 22533 39956 24224 -6374 -30391 -35532 -13785 20556 36653 25321 -1007 -29048 -37081
668 -37081 -15292 16491 33895 28876 3140 -26841 -36571 -17901 11215 31921 31377 6256 -24228
681 -24228 -34942 -20570 6844 30789 32692 8991 -20323 -33318 -23356 2393 28930 33562 11437
694A1437k8196j5174N389K6405K7483M643j7399k5866k0195K552K6751K6014P036
707C0880j2504k6167k3289K197K3924K4108J1808q688k8461k3017J596J8144K4734
720A5265J7205r511k7686k0232k830J3922K7257J8433q556k3520k0704r395J3777
733a6575K9019J6117n052j8185k4659j2031J4693K5971J5812J042j7769k6982
745a8599j1637J2613K1849J9579M856j9064k5691j1290O949K0587K2809N330j7460
758A0831k2968j3683K593K0929K3919N760j4067k1390j7139K23K1133K2398P304
771B5843q900k1843k0222j15J9572K0485J1031o380k2778k0274j298J6291K0039
784A1451J4735n165k2454j9092m003J1756K1988J6453m649j9728j8561p530R725
$$ plain form
694 11437 -16759 -31933 -26544 -139 27344 31987 14588 -11278 -31473 -28921 -2170 23844 30880
707 30880 18376 -7791 -31080 -28883 -4959 19149 30957 22269 -6192 -29209 -27613 -9469 15265
720 15265 32470 22959 -4727 -24959 -27789 -13867 13390 31823 23267 -253 -20957 -30352 -16575
733 -16575 12444 28561 23509 5324 -19335 -31366 -16673 9298 25110 26152 8383 -18599
745 -18599 -30236 -17623 4226 23805 28661 9597 -16094 -27384 -20435 152 22961 28291 10831
758 10831 -12137 -25820 -23227 -2298 21621 27381 13314 -8076 -25215 -24992 -3859 18539 25843
771 25843 16943 -4900 -25122 -25237 -5665 14820 25851 19471 -3307 -23581 -24879 -8588 11451
784 11451 26186 21021 -1433 -20525 -24528 -12772 9216 25669 21020 1292 -17269 -24799 -15074
797a5074K3151J5813k991j6038j9700j0940R300K2359J5425R91j3748k1855j1949
810b5256Q696J8976J6538M872j3194k2786j1505O093J6526J8413P192j3292k0830
823i557j1739J626J5479K0785P301j1551j8161j4498j171J5995K0497P478q259
836A4225j6848j6788k880J5612J8942R165m201j7670j8717k324J3196J6921J2231
849B0864k379j7700j7721l954R548J7343J4742j354j7214j5905p199P002J8504
862D577J5426j112j4205j6252r491N742J8214J5064Q44j0894j7267j1721N452
875a5623J6885J4073M047q999j8606j2060M183J4500J4950P271r094j8705j0835
888a8013J246J2139J6950Q070q327j6382j2077j779J1844J7957P893o759j3990
$$ plain form
797 -15074 8077 23890 20899 4861 -14839 -25779 -16479 5880 21305 22296 8548 -13307 -25256
810 -25256 -16560 2416 18954 23826 10632 -12154 -23659 -17566 -1040 17373 24565 11273 -9557
823 -9557 -21296 -19670 -4191 16594 23895 12344 -5817 -20315 -21486 -5491 15006 22484 14225
836 14225 -2623 -19411 -22291 -6679 12263 21428 17227 -443 -19160 -21484 -8288 8633 20864
849 20864 18485 785 -16936 -20890 -11342 6001 20743 19389 2175 -13730 -20929 -13927 4577
862 4577 20003 18891 4686 -11566 -21057 -15315 2899 17963 18807 7913 -9354 -21075 -15623
875 -15623 1262 15335 19382 10383 -8223 -20283 -16100 -1600 13350 20621 11527 -7178 -18013
888 -18013 -16767 -4628 12322 20392 12065 -4317 -16394 -18173 -6329 11628 19521 12762 -1228
901a228j4289m017J2274J6739Q611l654j3383j5835m421J0899J4833J0483j072
914A5940j3390j6290m364Q004J4261J2744k93j3161j5189n452N262J4142J4161
927A6375K82j1919j3838p976L361J4954J3928R34q768j4074j0547K931J4218J2988
941A2849L260o608j5172j0888K510J1996J2670O309o164j5460j0431R00R715J3723
955I209Q323o444j4054j0351j850Q376J5464P964n169j2062j1665m158R135J4412
969G130Q040k825j0797j2878m838P994J3340R067q12j0371j3414n255O681J2205
983C267J0371Q32j0485j2929n761M477J1556J1354K107r747j2162p129K465J1632
997a52J2189K354q009j1634q707J793J1024J1851L259n988j1701j0220R67J0796
$$ plain form
901 -1228 -15517 -19534 -7260 9479 18090 14436 1053 -14782 -19203 -8304 6529 17012 15940
914 15940 2550 -13740 -18104 -10100 4161 16905 16612 3451 -11738 -17190 -11928 2214 16375
927 16375 16657 4738 -9100 -17076 -13715 1239 15167 16101 7333 -6741 -17288 -14357 -139 12849
941 12849 16109 9501 -5671 -16559 -14049 -2053 10617 16926 10762 -4698 -15129 -14229 -4514 9209
955 9209 17532 11088 -2966 -13317 -15167 -6791 8673 16637 11468 -594 -12259 -16417 -7282 7130
969 7130 15170 12345 1548 -11330 -16168 -8174 5166 14233 13421 3050 -10364 -15619 -8938 3267
983 3267 13638 14470 3985 -8944 -14705 -10228 1328 12682 14789 5042 -7120 -14249 -11784 -152
997 -152 12037 14391 6382 -5252 -13959 -12166 -1142 10709 13968 7980 -3721 -13941 -12974 -2178
1011b178J0914N136m540j1864j0554N08R023J0493O918l508j2181r497j279O589
1025f020J1852Q062l568j0670r418l421N592J2760Q027k835q582j0378n543O409
1039g733J1839P336j90p712j1998n163N266J0496Q684J452p765j2191m994L943
1053h730Q908R993K990q211j0781n860J625R135J0762K451o507r686p484K34R736
1068a425J0125L149m591r393r300rQ902R676M460l011j0012r081m34O738R774
1083E568N759k111j0168q485j673O090R365P376k004r152q664l075M635J0163
1097C624P278j054q031q848m574M271R837P672l12o399r447n349L862R116P337
1112H983J755o146r930n652L046Q048P904L030n769r873n727J549P455Q941L572
$$ plain form
1011 -2178 8736 13872 9332 -2532 -13086 -12578 -3555 6938 13856 10348 -1833 -11330 -12609 -6020
1025 -6020 5832 13894 10326 -344 -9762 -13183 -7591 5169 13196 10361 1779 -8599 -14142 -7733
1039 -7733 4106 11442 11252 3540 -8458 -13621 -8355 2141 10825 12277 4512 -7679 -12673 -8730
1053 -8730 178 10171 13161 4950 -5831 -11691 -10066 -931 9831 12282 5775 -3911 -11395 -11161 -1425
1068 -1425 8700 11849 7258 -2135 -11435 -11444 -2542 7134 11594 8583 -1429 -10510 -10944 -4206 5568
1083 5568 11327 9216 -952 -9437 -11110 -5020 4345 11721 9717 565 -8099 -11174 -6539 3624
1097 3624 10902 9848 1817 -7031 -11605 -7334 2503 10175 9863 3464 -5983 -11332 -7470 1646 8983
1112 8983 10738 4592 -5338 -10990 -7944 104 8008 11038 5269 -4604 -10331 -8782 -1327 7614 11186
1127A1186n510q673o189o80P567R208L376l754q176p182j018P059Q694L728k134
1142G502p916q381j029O174Q234N147j445p999q192j772M899Q002O387j048p463
1157A100q198k246L560Q014P182n62p150p262l713K659Q216O943j2n391p920m961
1173i741K411Q508O262J516m755q193n655K435O976O626L102m326q549n435J240
1188g578N679P667L882m483p379n782k17N443Q102M051l807o381o357j781N737
1203c204Q089L364j627o548p189j577N005P224M511n56o513p500j608L556O695
1218B122O010l07o677o526k907L016O764O367K3n748o534l774K097O931O077O91
1234G625m482p009m268J466O724O182J358l409p217m833J281N681O594K184l256
$$ plain form
1127 11186 5676 -2997 -9186 -9866 -2299 6909 10285 6531 -1645 -8827 -9845 -2786 5908 9636 7502
1142 7502 -414 -8795 -9824 -3650 4584 9731 8286 287 -7905 -9677 -4778 3224 9611 8563 1100
1157 1100 -7098 -9344 -5784 2230 9412 8850 1700 -5562 -9275 -6616 1600 8543 8531 3140 -4780 -9741
1173 -9741 -7330 1178 7440 8956 4201 -3992 -9647 -7212 -236 6390 9492 5166 -3383 -8818 -7578
1188 -7578 -1899 5768 9650 5167 -2212 -7994 -8211 -2768 5334 9385 5578 -803 -7160 -8941 -3204
1203 -3204 4885 8249 6622 74 -7115 -8692 -3687 3537 8048 7492 979 -6521 -8129 -4573 2122
1218 2122 8132 7825 1148 -5378 -8285 -5269 1495 7862 7885 2137 -4397 -8171 -6074 857 6934 7625
1234 7625 3143 -3866 -8134 -6668 56 6238 7596 4187 -3030 -7863 -6582 -901 5693 7877 4621
1249D621o681n266K59N279O219L498k844o482n333n76M726O701L722k310o577
1264a044m965j341M095O734M088j999n124o052k088L820O849L840m15n246o148
1279d996k504L634N862M314L98m667o905k365K729N212N426J164m927o377k824
1294f826J484N185N930J169m339n484l771M70N751N689J175l053n289m601N03
1309f007N277N003K227k261n575n349O51M470N244L441k298n791m747k89L296
1324b708N722L904j678n349m921j230K970O060L752j323m384n445k041L037N804
1339B170L694l90l985n406k617K752N189L989P79m268n490k513J716M993M466
1354E079Q84l576m974l141Q68M445N166J319l081n109l754O03M656N245J613k945
$$ plain form
1249 4621 -2060 -7326 -7067 -1788 4431 7929 5085 -1397 -6730 -7306 -2580 4121 7843 5533 -1044
1264 -1044 -6009 -7350 -3255 3479 7567 5568 444 -5608 -7696 -3876 2973 6813 6398 1152 -4996
1279 -4996 -7500 -3866 1996 6310 6708 2041 -4864 -7229 -4500 712 6138 7302 2375 -4002 -6826
1294 -6826 -5342 -157 5773 6942 2603 -2881 -6652 -6182 -431 5258 6433 3380 -1909 -6510 -6007
1309 -6007 -730 4273 6500 4239 -1336 -6685 -6034 -1564 3680 7121 4823 -968 -5715 -6004 -2708
1324 -2708 3014 6918 5240 -109 -5030 -6260 -3290 2770 6522 5199 815 -4630 -6671 -3634 2170
1339 2170 5864 5474 1489 -3917 -6534 -3782 1407 5396 6175 1907 -3583 -6096 -4380 613 5079
1354 5079 5963 2387 -2587 -5728 -4860 -415 4751 6070 2989 -2120 -5874 -5271 -615 4630 6243 3298
1370C298m807m023K80M070N081J808j910m500m588l03L972M476K828q85n218m688
1386e109j44K683M744L650p28m799m581j496K599N187L435q23m054m098k420K347
1402c607N084L650k51l335m458k550J882M480L842N16k937n012k710J368M472
1417D34L611O99k410m864k224O51L671M342J929k925m746k893j34L360N019J757
1433E277k304l763l992k52L447M309K271j373l852m018m81L100L868K465p11m238
1449b47l972l81K075M224L254m89l953l989j526K434M144K791k52k993m057j715
1465d652J274M167L735j96l026l616k496J317M099L333L83k034m241k950J265
1480c638L860K856J485k347l715k934J358K683L193J783j799m385k484m6K884
$$ plain form
1370 3298 -1509 -5532 -5252 -1182 3899 5707 3797 -703 -5291 -5594 -1622 2854 5682 4797 -421 -5109
1386 -5109 -5253 -2570 2174 5824 5096 297 -4284 -5780 -3181 2006 5441 4618 564 -3534 -5954 -3607
1402 -3607 1477 5127 4876 1541 -2917 -5467 -3585 895 4737 5253 2316 -2696 -5406 -4038 434
1417 434 4045 4744 2334 -2530 -4754 -4103 -432 3910 5839 2914 -1832 -4725 -4859 -1499 3520 5277
1433 5277 2973 -790 -4782 -5034 -1587 2722 4993 3620 -232 -4250 -4731 -1631 2237 4702 3991 -247
1449 -247 -4219 -4600 -2525 1699 4953 4464 511 -3478 -5004 -2570 1574 4365 4113 1120 -2937 -4652
1465 -4652 -3378 789 4524 4328 1302 -2314 -4810 -3493 606 3939 4322 2288 -1953 -4903 -3638
1480 -3638 222 3078 4563 2216 -1499 -4433 -3075 -392 2801 4584 2785 -1600 -4084 -4130 -1246
1495a246M090J276j314l105l102l06K026M313J531j577k779l459n11K144L851
1510A832K081n98l018l289j344K193L960K308m76l060l644j094J931K954K831
1525C567M27l186l291j600J162L292K929M04k655l058k215J019L496K680R72k442
1541A501l222k476J298K659L035Q20j251l670k360N31K391L093J544j345l322
1556g74k579k65K453K999J960j166l070k373q22K002L758J886j201l142k753k93
1572c380J466K933K584m33k764k715j169J969K677J940O4k236l711o35R96K648
1588B34K527Q99k597k673j637P86K518K956P29k614k804j124J25K505K772P94
1604C396j374l070k201K57K685K893J222j510l031k644r9K824K196J936r91k846
$$ plain form
1495 -1246 2844 4120 2806 -299 -3401 -3707 -1681 2632 4163 2586 -193 -3652 -4163 -2019 1832
1510 1832 3913 3315 297 -2992 -4336 -2143 1817 4125 3649 589 -3055 -4149 -2218 736 3567
1525 3567 3994 808 -2483 -4083 -2921 371 3300 3704 1049 -2009 -4224 -3205 291 2971 3943 1501
1541 1501 -1721 -4197 -2899 -240 2795 3615 2364 -1306 -3666 -3135 -744 2349 3893 2548 -774
1556 -774 -3353 -3618 -1165 1834 3794 2628 -442 -2815 -3637 -1635 2123 4009 2808 -334 -3087 -3380
1572 -3380 -1914 1019 3603 3170 406 -2309 -3478 -1509 1168 3108 3172 936 -2775 -3410 -2414 234
1588 234 2761 3660 1063 -1610 -3247 -2461 57 3013 3742 1128 -1676 -2800 -2675 -170 2602 3396
1604 3396 2022 -1048 -3249 -2992 -307 2586 3808 2298 -733 -3377 -3476 -652 1544 3480 2489 -357
1620c57k493Q1J672K562J799j329k138k749n03J866K755J722n01k425k355m92
1636b885J334K337J908l3k230j959j776J386K060K571j54j441l068j127J149K225
1652B97J957Q71k062k685j276L86K421K239Q56j575k799j194J96J615K380J167
1668B794j315k291k029L21J820K517J691j580k397j851k30J587K176J812o58k215
1684A52k029j091J937K338J075Qj823k606k06Q24K320J554q2k431j942m49J259
1701a192K352J123N44j946k396j590J363K334J402O27j948j849j442O07J838K204
1717B031M05j088k701j020M29J847J612J455j334k556j271l03J987K333N55o94
1733A687k258j862J42J602K099J133m93j871k010p40J553J832J601l68k257k035
$$ plain form
1620 -357 -2850 -2769 -1097 1465 3264 1935 -203 -2952 -3455 -1589 1166 2888 2387 -38 -2393 -2885
1636 -2885 -1551 786 2694 2661 431 -1528 -3304 -1918 142 2713 2559 1118 -1950 -3077 -1928 297
1652 297 2254 3125 1063 -1622 -2898 -2512 -91 2148 3004 1429 -1370 -2564 -2368 -753 1627 2794
1668 2794 1479 -812 -2841 -2520 -700 1817 3508 1928 -469 -2320 -2550 -963 1213 3025 2367 152
1684 152 -1877 -2968 -1031 1307 2382 2390 567 -2039 -2245 -1421 899 2453 2371 -60 -2002 -2451 -1192
1701 -1192 1160 2283 2827 881 -1515 -3105 -1742 592 1994 2621 673 -1176 -2618 -2011 -173 2031
1717 2031 2436 1348 -1353 -2373 -1944 -97 1515 2970 1636 -920 -2191 -2494 -507 1826 2381 1687
1733 1687 -571 -2433 -2291 -689 1410 2543 2050 179 -1831 -2571 -1018 814 2415 2047 -210 -2245
1749b245k15J000J896J630j27j734k123k60J287J271J901N07k054j571j568J184
1765a221J558J870q9j263k421j000R33J780J747O56j292k225j860J208J880J258
1781A519P31j713j726j185M42J316K317N63o75k189j753M17J278J984P07j016
1797A017j061j521o79J279J974N63l6j473j473m16Q22J949J278q70j230j825n31
1814b233J041J984P48N30j513k266k50M54J745J586O1j337j661m13N45J057J665
1831A743M74j660j559q96K29J510J861K11j098j590q40P3J301J895N17p98j629
1848b56j585M68Q49J930L83o32j525j144l62J674J179J148q23j538j078m60N13
1865a259K051P85k27j303j403m40Q75J614Q72j26j159j268o46P12J455J333Q2
$$ plain form
1749 -2245 -2460 -1460 436 2066 1939 205 -1918 -2178 -891 380 2281 2788 734 -837 -2405 -1221
1765 -1221 337 2207 2118 855 -1566 -2566 -1633 147 1894 2550 1258 -967 -2827 -1619 261 1519
1781 1519 2250 537 -1189 -2374 -1932 -616 1701 2264 1589 -600 -2353 -1936 -658 1326 2033 1017
1797 1017 -44 -1565 -2244 -965 1009 1572 1536 63 -1410 -1826 -1004 945 2223 1353 123 -1702 -2233
1814 -2233 -1192 792 1540 2070 557 -1709 -1959 -1505 240 1826 1887 550 -1111 -1524 -979 78 1743
1831 1743 2217 557 -1002 -1898 -1669 -159 1702 1913 815 -775 -1615 -1542 -241 1654 2171 1373 -256
1848 -256 -1841 -1373 -524 1406 1789 1157 -368 -1512 -1874 -200 979 2127 1304 -234 -1312 -1772 -1259
1865 -1259 792 1577 1350 47 -1356 -1796 -921 693 1565 1439 280 -988 -1634 -922 533 1866 1948
1882A948j885j568k94P12J657J153J97j517j290j65l24J659J130O67j256j484
1898f60j045K43J510J417J66p63j492q63j07J397J421K94l17j352j034o80J586
1915b79J298O98p49j538p96m31J229J351J008m28j475j315j53J010J027J113j00
1932A470j294p17r61Q65J188Q88j81j256j086m32O22J189J058j22n15j613m09
1949a306N85P98J437k17n75j610n44L89O39J598L44j231j137o56J67J467P73N43
1967A464n68j532o09K43P02J214M77m41p06j409m8Q57J444K95n2r33j396l24P46
1986e76J180M61O2q02j345j37N69J019Q12mp95j315m61N96J214J033j78q86j177
2005g30k24J20O88J104K73o27j156r59P13P39J274l01j89j065o84K47P43P94O38
$$ plain form
1882 1948 63 -1505 -1799 -1087 570 1723 1920 403 -887 -1052 -1376 283 1413 2080 824 -660
1898 -660 -1705 -1462 48 1465 1631 868 -624 -1487 -1594 -197 1224 1518 1201 -151 -1185 -1865 -279
1915 -279 1019 1717 968 -570 -1366 -1797 -568 783 1791 1363 -112 -1427 -1580 -570 457 1570 1470
1932 1470 176 -541 -1502 -637 551 1439 1258 2 -1084 -1516 -894 295 1353 1231 716 -897 -1306
1949 -1306 -721 77 1514 1297 722 -888 -1432 -1043 -404 1194 1538 307 -830 -1486 -1319 148 921 1464
1967 1464 896 -636 -1245 -1002 -300 914 1391 950 244 -1165 -1213 -356 1088 1383 1331 398 -998 -1322 -576
1986 -576 604 1065 1127 325 -1020 -1157 -588 431 1243 1239 444 -871 -1332 -736 478 1511 1333 447 -730
2005 -730 -954 -834 -146 958 1231 604 -552 -1511 -798 -59 1215 914 725 -340 -1024 -777 -34 760 1398
2024A398k24j589r48L05J034N56N57k53q96r03J02M59O59P92N3q85j107j64O58
$$ plain form
2024 1398 1174 -415 -1363 -1058 -24 532 1089 836 -60 -963 -861 -402 257 1049 1102 217 -890 -1054 -396
$$ [...]
8191C8
##END NTUPLES=NMR FID
##END=
