##TITLE=1H_2ABDE0906
 CDCl3, 8 sc, 
 10.06.2021
##JCAMPDX= 6.0         $$ Bruker NMR JCAMP-DX V2.0
##DATA TYPE= NMR FID
##DATA CLASS= NTUPLES
##ORIGIN= UXNMR, Bruker Analytische Messtechnik GmbH
##OWNER= root
$$ XWIN-NMR		Version 3.5
$$ Thu Jun 10 10:09:56 2021 Russian Standard Time (UT+4h)  she@DPX200
##.OBSERVE FREQUENCY= 200.131506
##.OBSERVE NUCLEUS= ^1H
##.DELAY= (6, 6)
##.ACQUISITION MODE= SIMULTANEOUS
##.ACQUISITION SCHEME= undefined
##.AVERAGES= 8
##.DIGITISER RES= 18
##SPECTROMETER/DATA SYSTEM= spect
##.PULSE SEQUENCE= zg30
##.SOLVENT NAME= CDCl3
##.SHIFT REFERENCE= (INTERNAL, CDCl3, 0, 15.7039)
##AUDIT TRAIL= $$ (NUMBER, WHEN, WHO, WHERE, WHAT)
$$ ##TITLE= Audit trail, XWIN-NMR		Version 3.5
$$ ##JCAMPDX= 5.01
$$ ##ORIGIN= Bruker BioSpin GmbH
$$ ##OWNER= she
$$ F:/spectra/data/she/nmr/H-F/1/audita.txt
$$ ##AUDIT TRAIL=  $$ (NUMBER, WHEN, WHO, WHERE, WHAT)
(   1,<2021-06-10 10:08:32.59 +0400>,<she>,<DPX200>,
      <created by zg, POWCHK disabled, PULCHK disabled
       configuration hash MD5:
       00 E9 B6 7A A2 85 ED C7 34 08 36 98 17 FE 4E 26
       data hash MD5: 16K
       DB 45 6B 61 39 43 D0 F9 C4 4A AC 9D 44 68 22 55>)
$$ ##END=
$$ 
$$ hash MD5
$$ 17 45 CF 23 3A DE D8 80 C3 73 4E C3 8A 34 BA 3E
##$RELAX= 
##$RELAX= 
##$RELAX= 
##$RELAX= 
##$RELAX= 
##$RELAX= 
$$ Bruker specific parameters
$$ --------------------------
##$DU= <F:/spectra>
##$EXPNO= 1
##$NAME= <H-F>
##$PROCNO= 1
##$TYPE= <nmr>
##$USER= <she>
##$AMP= (0..31)
100 100 100 100 100 100 100 100 100 100 100 100 100 100 100 100 100 100 
100 100 100 100 100 100 100 100 100 100 100 100 100 100 
##$AQSEQ= 0
##$AQ_mod= 1
##$AUNM= <au_zg>
##$AUTOPOS= <>
##$BF1= 200.13
##$BF2= 200.13
##$BF3= 200.13
##$BF4= 200.13
##$BF5= 200.13
##$BF6= 200.13
##$BF7= 200.13
##$BF8= 200.13
##$BYTORDA= 1
##$CFDGTYP= 0
##$CFRGTYP= 5
##$CHEMSTR= <none>
##$CNST= (0..31)
1 1 145 1 1 1 1 1 1 1 1 1 1 1 1 1 1 1 1 1 1 1 1 1 1 1 1 1 1 1 1 1 
##$CPDPRG= <>
##$CPDPRG1= <>
##$CPDPRG2= <>
##$CPDPRG3= <>
##$CPDPRG4= <mlev>
##$CPDPRG5= <mlev>
##$CPDPRG6= <mlev>
##$CPDPRG7= <mlev>
##$CPDPRG8= <mlev>
##$CPDPRGB= <>
##$CPDPRGT= <>
##$D= (0..31)
0 1.2 0 0 0 0 0 0 0 0.06 0 0.03 0 0 0 0 0.0002 0 0 0 0 0 0 0 0 0 0 0 0 
0 0 0 
##$DATE= 1623305312
##$DBL= (0..7)
120 120 120 120 120 120 120 120 
##$DBP= (0..7)
150 150 150 150 150 150 150 150 
##$DBP07= 0
##$DBPNAM0= <>
##$DBPNAM1= <>
##$DBPNAM2= <>
##$DBPNAM3= <>
##$DBPNAM4= <>
##$DBPNAM5= <>
##$DBPNAM6= <>
##$DBPNAM7= <>
##$DBPOAL= (0..7)
0.5 0.5 0.5 0.5 0.5 0.5 0.5 0.5 
##$DBPOFFS= (0..7)
0 0 0 0 0 0 0 0 
##$DE= 6
##$DECBNUC= <off>
##$DECIM= 32
##$DECNUC= <off>
##$DECSTAT= 4
##$DIGMOD= 1
##$DIGTYP= 9
##$DL= (0..7)
0 120 120 120 120 120 120 120 
##$DP= (0..7)
150 150 150 150 150 150 150 150 
##$DP07= 0
##$DPNAME0= <>
##$DPNAME1= <>
##$DPNAME2= <>
##$DPNAME3= <>
##$DPNAME4= <>
##$DPNAME5= <>
##$DPNAME6= <>
##$DPNAME7= <>
##$DPOAL= (0..7)
0.5 0.5 0.5 0.5 0.5 0.5 0.5 0.5 
##$DPOFFS= (0..7)
0 0 0 0 0 0 0 0 
##$DQDMODE= 0
##$DR= 18
##$DS= 0
##$DSLIST= <SSSSSSSSSSSSSSS>
$$ [...]
##$SUBNAM2= <"">
##$SUBNAM3= <"">
##$SUBNAM4= <"">
##$SUBNAM5= <"">
##$SUBNAM6= <"">
##$SUBNAM7= <"">
##$SUBNAM8= <"">
##$SUBNAM9= <"">
##$SW= 20.0188882624521
##$SWIBOX= (0..15)
0 0 2 0 0 0 0 0 0 0 0 0 0 0 0 0 
##$SW_h= 4006.41025641026
##$TD= 16384
##$TD0= 1
##$TE= 0
##$TE2= 300
##$TE3= 300
##$TEG= 300
##$TL= (0..7)
0 120 120 120 120 120 120 120 
##$TP= (0..7)
150 150 150 150 150 150 150 150 
##$TP07= 0
##$TPNAME0= <>
##$TPNAME1= <>
##$TPNAME2= <>
##$TPNAME3= <>
##$TPNAME4= <>
##$TPNAME5= <>
##$TPNAME6= <>
##$TPNAME7= <>
##$TPOAL= (0..7)
0.5 0.5 0.5 0.5 0.5 0.5 0.5 0.5 
##$TPOFFS= (0..7)
0 0 0 0 0 0 0 0 
##$TUNHIN= 0
##$TUNHOUT= 0
##$TUNXOUT= 0
##$USERA1= <user>
##$USERA2= <user>
##$USERA3= <user>
##$USERA4= <user>
##$USERA5= <user>
##$V9= 5
##$VALIST= <valist>
##$VCLIST= <CCCCCCCCCCCCCCC>
##$VD= 0
##$VDLIST= <DDDDDDDDDDDDDDD>
##$VPLIST= <PPPPPPPPPPPPPPP>
##$VTLIST= <TTTTTTTTTTTTTTT>
##$WBST= 1024
##$WBSW= 4
##$XGAIN= (0..3)
0 0 0 0 
##$XL= 0
##$YL= 0
##$YMAX_a= 466445
##$YMIN_a= -493423
##$ZGOPTNS= <>
##$ZL1= 120
##$ZL2= 120
##$ZL3= 120
##$ZL4= 120
##$ABSF1= 10
##$ABSF2= 0
##$ABSG= 5
##$ABSL= 3
##$ALPHA= 0
##$AQORDER= 0
##$ASSFAC= 0
##$ASSFACI= 0
##$ASSFACX= 0
##$ASSWID= 0
##$AUNMP= <proc_1d>
##$AZFE= 0.1
##$AZFW= 0.1
##$BCFW= 1
##$BC_mod= 2
##$BYTORDP= 1
##$COROFFS= 0
##$CY= 11.3945322036743
##$DATMOD= 1
##$DC= 2
##$DFILT= <>
##$DTYPP= 0
##$F1P= 15.9154993809931
##$F2P= -4.1035820241983
##$FCOR= 0.5
##$FTSIZE= 0
##$FT_mod= 4
##$GAMMA= 1
##$GB= 0.15
##$INTBC= 1
##$INTSCL= 1
##$ISEN= 128
##$LB= 0.24
##$LEV0= 0
##$LPBIN= 0
##$MAXI= 10000
##$MC2= 0
##$MEAN= 0
##$ME_mod= 0
##$MI= 1.114404
##$NCOEF= 0
##$NC_proc= 0
##$NLEV= 6
##$NOISF1= 3.799351
##$NOISF2= 2.8
##$NSP= 1
##$NTH_PI= 0
##$NZP= 0
##$OFFSET= 15.70392
##$PC= 1
##$PHC0= -11640.49
##$PHC1= 10.40101
##$PH_mod= 1
##$PKNL= yes
##$PPARMOD= 0
##$PSCAL= 0
##$PSIGN= 0
##$REVERSE= no
##$SF= 200.130013532006
##$SI= 16384
##$SIGF1= 3
##$SIGF2= 2
##$SINO= 400
##$SIOLD= 16384
##$SREGLST= <1H.CDCl3>
##$SSB= 0
##$STSI= 0
##$STSR= 0
##$SW_p= 3612.71676300578
##$SYMM= 0
##$S_DEV= 0
##$TDeff= 0
##$TDoff= 0
##$TI= <>
##$TILT= no
##$TM1= 0
##$TM2= 0
##$TOPLEV= 0
##$USERP1= <user>
##$USERP2= <user>
##$USERP3= <user>
##$USERP4= <user>
##$USERP5= <user>
##$WDW= 1
##$XDIM= 8192
##$YMAX_p= 0
##$YMIN_p= 0
$$ End of Bruker specific parameters
$$ ---------------------------------
##NTUPLES= NMR FID
##VAR_NAME=  TIME,          FID/REAL,        FID/IMAG
##SYMBOL=    X,             R,               I
##VAR_TYPE=  INDEPENDENT,   DEPENDENT,       DEPENDENT
##VAR_FORM=  AFFN,          ASDF,            ASDF
##VAR_DIM=   8192,          8192,            8192
##UNITS=     SECONDS,       ARBITRARY UNITS, ARBITRARY UNITS
##FACTOR=    0.0002496,     1,               1
##FIRST=     0,             0,               0
##LAST=      2.0444736,     0,               0
##MIN=       0,             -493423,         0
##MAX=       2.0444736,     466445,          0
$$ Real data points
##PAGE= N=1
##DATA TABLE= (X++(R..R)), XYDATA
0 0 0 0 0 0 0 0 0 0 0 0 0 -8 8 -8 8 -8 16 -16 24 -24 31 -35 40 -48 56 -64 75 -88 100 -115 131 -147 168 -188
34 -188 212 -237 266 -297 332 -369 407 -453 502 -554 611 -674 744 -819 900 -993 1093 -1204
52 -1204 1329 -1469 1627 -1807 2015 -2254 2539 -2883 3301 -3829 4517 -5444 6771 -8804 12264
67 12264 -19190 38012 -185474 -465808 283679 87488 -269270 307671 139948 -493423 83621
78 83621 358664 -271911 -46713 292592 -311799 -172535 466445 -12449 -326847 182545
88 182545 -36070 -299051 316639 245342 -376371 -26608 217794 -228173 11296 322557
98 322557 -221950 -231546 286189 14902 -175980 211843 -28676 -336919 162214 251409 -177440
109 -177440 4883 120138 -241182 -31189 298273 -69991 -168976 144961 -29911 -133056
119 -133056 199353 65004 -238700 19067 132895 -80423 58649 132581 -172307 -114768
129 -114768 160508 27906 -58320 91888 -28032 -136475 86152 107707 -85277 -22381
139 -22381 46660 -62173 12134 126632 -25556 -109797 14727 27196 -13637 64250 38231
150 38231 -90748 -42264 65174 12345 -23974 28851 -15375 -62309 43114 72277 -49206
161 -49206 -47537 27015 -27137 -12878 92947 2421 -105531 12509 43625 -53629 29012 67279
173 67279 -90311 -43996 100188 -20450 -66419 71809 -19786 -102341 89096 71420 -110857
184 -110857 5970 65488 -102871 -145 134446 -70074 -84645 108418 -21244 -96594
194 -96594 111087 24791 -142647 62669 93097 -115338 15727 107984 -119911 -44253 152743
205 152743 -44913 -90488 122411 -14851 -128462 111010 62063 -140108 48020 99070
215 99070 -122855 4852 136106 -98177 -67649 139507 -32948 -93939 125654 8952
225 8952 -137430 83931 75258 -125285 34518 106318 -114964 -22476 133835 -68846 -75288
236 -75288 122855 -21278 -105535 106587 34540 -128272 53992 78030 -113503 11446 109458
247 109458 -91039 -45951 116047 -43914 -82162 102636 1564 -108245 71493 50668
257 50668 -108543 26118 80634 -91394 -17839 99725 -57160 -60877 91779 -14904 -84669
268 -84669 71776 27613 -94773 34423 61448 -82541 -4131 80496 -57386 -42163 81765
279 81765 -20413 -67428 65675 17222 -78721 38472 49750 -73307 1871 68629 -51592
290 -51592 -29597 75114 -20365 -56943 62370 12812 -69859 39421 44906 -66523 8243
301 8243 65666 -50570 -26078 72174 -22769 -51286 65432 11228 -66805 42119 40211 -68549
313 -68549 12075 64472 -52866 -19550 73182 -28832 -50342 66356 2937 -66435 49039
324 49039 35837 -70556 17971 57948 -61300 -14718 72041 -36203 -43018 69636 -7332
335 -7332 -66080 51481 23891 -71787 27125 52034 -64747 -6104 64941 -47362 -36759 68622
347 68622 -16018 -57765 57251 13491 -71281 32105 40270 -67533 5545 61746 -50999
358 -50999 -25997 65685 -28183 -51468 59803 4107 -63854 42377 32293 -68335 13177
369 13177 53488 -56144 -14262 67019 -32896 -41279 62744 -6358 -60577 48283 25491 -63957
381 -63957 25685 49621 -58472 -5750 61672 -39483 -31169 66314 -11236 -51784 52982 15485
393 15485 -62996 31497 42338 -57996 6163 59548 -43895 -23625 62462 -21389 -44830 57930
405 57930 8801 -56988 38020 31606 -60776 13131 52659 -47556 -12943 61633 -29049 -38449
417 -38449 57104 -4890 -54766 44158 23505 -58039 22246 42005 -56614 -6024 56064 -36890
429 -36890 -28055 58151 -16253 -49610 48062 10052 -58731 29476 32920 -55999 7563 49338
441 49338 -47021 -21288 53676 -24469 -36849 52528 -2151 -54080 34846 21434 -53198 16546
453 16546 39146 -47841 -6938 50702 -30217 -28501 46074 -11481 -39979 41976 14080 -47755
465 -47755 18685 27486 -42420 5402 43211 -31358 -18665 42265 -11869 -28263 37093 2979
477 2979 -39880 24879 26545 -33874 6101 29216 -30975 -9254 41369 -8999 -24448 28902
489 28902 1033 -29911 25394 20145 -33510 2820 28477 -20466 -5809 32670 -15958 -27152
501 -27152 29216 9500 -25388 17155 13119 -34778 4271 34168 -19397 -15394 26930 -11815
513 -11815 -23011 33488 6853 -38960 10732 20526 -28561 7405 31841 -33316 -21999 36668
525 36668 -6555 -25561 31602 -2454 -43918 24837 28224 -38475 990 28312 -36712 -7742
537 -7742 49658 -20084 -37122 34043 -2479 -35679 39245 16760 -55562 10132 36513 -36653
549 -36653 1608 43316 -40023 -27319 55492 -5733 -37761 38431 -1348 -51532 38810 36245
561 36245 -51659 4569 37213 -43081 -1049 60012 -31244 -37680 48814 -4764 -35935 48923
573 48923 8396 -60707 26131 39632 -42303 9902 39925 -48914 -13419 60631 -16551 -32474
585 -32474 41896 -10012 -41257 47164 20972 -51752 13988 28370 -39484 11507 44610 -40095
597 -40095 -22934 43192 -11908 -21961 39469 -8899 -45116 30022 21572 -33933 11735 18600
609 18600 -39448 2791 39227 -21934 -18862 24749 -15092 -18426 33821 1378 -34299 11071
621 11071 10787 -21104 12543 16902 -27639 -8197 21895 -7289 -7149 14996 -10606 -18002 16097
634 16097 8968 -13209 2055 2081 -12580 4404 14301 -5580 -8864 2775 297 -611 7020 2444
648 2444 -8451 -4455 7268 5330 -2625 968 1002 -7529 2222 14280 -3474 -9154 7948 584
662 584 -7933 13982 6573 -18428 3321 15528 -11415 711 18621 -14829 -11959 24552 -1076
675 -1076 -17542 18957 2606 -25188 16841 18510 -26607 2567 22846 -23425 -5073 32658
687 32658 -16565 -21923 30052 -3454 -27637 27753 8118 -37827 15753 23819 -34130 2842
699 2842 31254 -31385 -12744 39161 -16730 -26994 34904 -4241 -36676 30126 13617 -41945
711 -41945 14504 26371 -38023 990 36930 -30917 -17137 40277 -15067 -29394 37205 -367
723 -367 -39365 27642 17557 -40856 13146 29362 -36869 -2773 39129 -25783 -19342 39447 -11084
736 -11084 -30377 35243 5364 -37986 23854 20850 -37096 9763 31707 -31882 -5919 37756
748 37756 -19252 -19851 36400 -5778 -29528 30058 9743 -34128 17690 22454 -31408 4424 30637
761 30637 -24649 -10347 32982 -12302 -21439 29340 235 -28019 21140 12823 -29182 8828
773 8828 21852 -24340 -3067 26577 -15636 -14783 24693 -4549 -21696 19697 6030 -24894 10418
786 10418 15672 -22540 -623 19997 -15998 -10282 21332 -6485 -17939 16395 2875 -20993
798 -20993 9974 11681 -20048 159 16855 -14534 -8313 18832 -6919 -15270 16211 2650 -18558
811 -18558 9442 9936 -18517 1765 16925 -13738 -7102 18115 -6705 -13534 16804 2215 -17973
824 -17973 10983 10581 -17503 3625 16426 -14699 -5116 19500 -6908 -12400 18033 820 -17133
837 -17133 13172 9680 -18147 5829 16256 -15129 -2710 19594 -9149 -10910 18926 -1379
849 -1379 -16347 15144 7024 -18438 7949 14002 -17331 -356 18553 -12287 -8624 18784 -4716
862 -4716 -15426 16320 3439 -18804 9776 11223 -18843 1863 16338 -14715 -6390 18448 -8356
875 -8356 -13688 16562 -465 -18331 11820 7629 -19038 4598 13866 -16545 -3835 17415 -11395
888 -11395 -11420 17061 -3237 -16798 13386 4588 -18732 7358 11640 -17134 -510 15727 -12638
901 -12638 -7816 17454 -5514 -14057 14931 2560 -16732 9281 9779 -16637 2297 14831 -12635
914 -12635 -4819 16762 -6623 -11011 15621 569 -14491 11460 7518 -15477 5696 12781 -13135
927 -13135 -1484 15784 -7757 -7873 15976 -1547 -12199 12312 4871 -14420 7286 10584 -13446
940 -13446 387 14165 -9433 -5869 14541 -3750 -11106 12425 2338 -13715 7647 8256 -13114
953 -13114 2118 11796 -9910 -4580 12784 -5329 -9407 11098 703 -12327 7129 6070 -12516
966 -12516 1979 9590 -10023 -4173 11133 -5284 -8838 9695 -186 -11164 5971 4992 -11935
979 -11935 1530 9226 -9289 -3780 10438 -5059 -7985 9843 314 -11329 5828 5707 -11326
992 -11326 1352 9367 -9471 -3923 12049 -4194 -8376 10844 1324 -11958 7670 7769 -11996
1005 -11996 2090 11794 -9802 -3817 14366 -5271 -10040 13610 1201 -13117 10728 7569 -15362
1018 -15362 4779 13711 -12947 -2410 16320 -9197 -9166 18032 -1307 -15169 14004 5385 -17704
1031 -17704 9863 13127 -18205 176 17446 -13754 -6309 20543 -7961 -15228 18538 1244
1043 1244 -18638 14431 7966 -22705 6566 16871 -18544 -2276 19177 -15252 -10818 23470
1055 23470 -5652 -19021 18102 2354 -21970 14722 11853 -24784 2928 18217 -19148 -2902
1067 -2902 22461 -15504 -14559 22751 -3423 -17984 19280 2076 -24686 13570 14708 -22316 2834
1080 2834 16910 -19467 -3957 24268 -11973 -15048 19809 -3856 -16236 19872 4626 -23445
1092 -23445 9144 13267 -16826 5462 16503 -18307 -5933 21322 -6762 -9320 16895 -5318
1104 -5318 -15561 17184 7505 -16627 6883 7563 -14868 5958 16229 -12294 -5942 12498 -5421
1117 -5421 -4260 15435 -3082 -14011 8814 5822 -7429 7139 4114 -13272 1587 11115 -4279
1130 -4279 -1951 4525 -7797 -3681 10984 1331 -6959 628 -1453 -3253 6274 3507 -6193 -3742
1144 -3742 646 974 3326 1340 -4672 -4334 -488 2711 3852 -1978 -5319 -1427 -204 1940 4969
1159 4969 -2873 -8663 1490 3520 -1133 3810 29 -10967 -128 9805 -2529 -2100 4064 -9006
1173 -9006 -4778 13874 2114 -10335 4209 110 -9669 11001 9103 -14195 -2353 9643 -7863
1186 -7863 1996 15054 -11384 -11879 15322 1454 -8783 12586 -664 -19325 11355 14205 -13525
1199 -13525 2183 10698 -16395 -531 22720 -8521 -12252 14408 -4513 -11969 20281 3562
1211 3562 -22465 8101 11376 -15330 7828 15346 -21187 -5842 21683 -7904 -8521 17649 -8833
1224 -8833 -17783 19601 6429 -18816 8666 6820 -20493 7923 18769 -18309 -6509 16258
1236 16258 -11726 -7090 20939 -7090 -18954 14710 3695 -16041 12458 6590 -21981 4528
1248 4528 16620 -14468 -2237 14269 -14364 -8442 19852 -3445 -13944 12204 -189 -14964
1260 -14964 13137 8587 -17302 2225 10925 -11901 1209 14613 -11286 -8529 13851 -2139
1272 -2139 -8113 11895 -514 -13195 9240 7427 -10106 3095 7230 -10294 968 11839 -5181
1285 -5181 -4850 8208 -2837 -4838 9554 953 -8205 4672 3376 -5462 3644 4458 -6511 -407
1299 -407 5926 -2192 -1176 4284 -2369 -3113 3952 941 -2746 1321 210 -2666 1709 1976 -1919 -1077
1315 -1077 807 -841 359 156 -817 -774 -1116 -212 1017 -1138 -1763 997 -1211 -1508 1914 -316 -3361
1332 -3361 1162 973 -3601 750 2395 -4372 -939 3660 -3337 -2028 3921 -2155 -4358 4496 80
1347 80 -5627 3740 2396 -5786 2136 4508 -5298 -417 6192 -4276 -2915 6889 -1835 -4950 6295
1362 6295 848 -6585 4806 3911 -6726 2629 6257 -6280 -428 7324 -4162 -3312 7974 -1220
1376 -1220 -5600 7072 1682 -7161 4693 4568 -7124 2194 7052 -6006 -1572 7654 -3279 -4143
1390 -4143 7586 -999 -6623 5858 2296 -7308 3430 4781 -7079 271 6326 -5200 -2486 6971
1404 6971 -3386 -4790 5993 -25 -6705 3834 2672 -7085 1535 5055 -5930 -1380 5905 -3939
1418 -3939 -3777 5912 -1571 -5671 4365 1326 -6172 1935 3702 -5688 -155 4829 -4429 -2657 5436
1433 5436 -2050 -4182 4869 525 -5458 3074 2921 -5381 827 4558 -4362 -1748 5964 -2129 -3407
1448 -3407 5002 94 -4825 4017 2963 -5165 2048 4817 -4521 -565 5561 -2496 -2718 5573 -290
1463 -290 -4467 4456 2071 -5004 2508 3961 -4350 10 5189 -3327 -1947 5780 -1286 -3866 4768
1478 4768 757 -4909 3165 2989 -5098 1019 4542 -4247 -1268 5048 -2986 -3478 4697 -430 -4690
1493 -4690 3395 1657 -5091 1814 3190 -4664 -487 4382 -3426 -2597 4573 -1223 -4395 3370 366
1508 366 -4894 2462 2346 -4851 68 3647 -3604 -1878 4011 -2147 -3135 3557 -207 -4312 2454 1653
1524 1653 -4484 993 3065 -2942 -450 4008 -1934 -2409 3717 -272 -3119 3290 1548 -3814 1166
1539 1166 2986 -2835 -438 3564 -1923 -1732 3844 -296 -2304 3298 1422 -3279 1660 2970 -3211
1554 -3211 -87 3599 -1804 -1285 3932 -408 -2970 2924 1194 -3197 1878 2892 -3643 101 3676
1569 3676 -2314 -1252 3866 -1328 -2702 3823 392 -3692 2347 1436 -3935 1335 3276 -3837 -969
1584 -969 3337 -2792 -2476 4047 -1092 -4719 2896 763 -3827 2070 1927 -4789 -438 3604 -2901 -1395
1600 -1395 3076 -2462 -3012 3840 -73 -3969 2022 671 -3663 2048 2806 -3773 -727 2838 -2127
1615 -2127 -452 3995 -1863 -3046 2998 948 -2109 2453 648 -3650 1364 3039 -1679 53 1408
1630 1408 -2174 -457 3749 -252 -1852 839 66 -715 2332 1232 -2559 -38 1188 -200 1196
1645 1196 1367 -1448 -914 1648 1172 289 115 -819 -604 1231 1564 540 -547 -1232 -231 943 1123
1662 1123 505 -997 -1807 231 1490 -116 -485 -477 -1701 -370 2696 -213 -1898 308 -654 -912 2458
1679 2458 528 -3699 -761 1250 -1586 919 2066 -3711 -2557 3455 -344 -1747 2439 -1744 -4142
1694 -4142 2862 2343 -3494 571 1302 -3972 1561 5076 -3136 -2648 3282 -1824 -1259 5245 -582 -5637
1710 -5637 2700 2029 -3350 2879 2807 -5792 349 5449 -2669 -1396 4486 -3055 -3407 6606 873 -4083
1726 -4083 3131 761 -4619 4349 4505 -5284 -250 4317 -3409 -240 6157 -3364 -4221 5306 416
1741 416 -3615 4763 435 -6034 3399 4429 -3910 393 3601 -4690 -409 6242 -2092 -3292 3799
1756 3799 -1205 -3294 4133 1020 -5501 1686 2390 -4030 1452 3289 -4677 -1569 4423 -2123 -2431
1771 -2431 3588 -2022 -3546 3872 878 -3660 1555 967 -3850 1062 2875 -3117 -1197 2578 -2144
1786 -2144 -1329 2932 -621 -2842 1743 635 -2038 1653 576 -2467 261 2252 -823 -333 1119
1801 1119 -1124 -669 1830 -66 -957 1043 -139 -413 1573 836 -471 62 379 154 836 349 185
1818 185 487 355 1210 414 -630 33 771 -63 -7 1394 -174 -307 1327 539 -891 1070 583 -1652
1836 -1652 540 1411 -1549 -448 1761 -1291 -613 2679 -954 -1962 1933 391 -2240 1368 651 -3182
1852 -3182 936 1729 -2701 -432 2633 -2505 -1318 3012 -1276 -2395 2753 132 -2570 1971 950
1867 950 -3747 1221 2648 -3079 200 3076 -2853 -1437 3743 -1025 -2515 2881 -289 -3115 2403
1882 2403 1714 -3676 976 2393 -3354 66 3811 -2708 -1350 3327 -775 -2037 3234 341 -3228
1897 -3228 2661 1923 -3132 1233 2857 -3434 98 3412 -1874 -1693 3645 -805 -2283 3181 591
1912 591 -3117 2131 1934 -2842 851 2890 -2660 -599 2841 -1403 -1362 2969 -1059 -2344 2707 523
1928 523 -3053 1508 1360 -2813 478 2175 -1871 -968 2291 -1007 -1472 2295 197 -2395 1171 1056
1944 1056 -2198 451 1544 -2246 -245 1865 -1343 -883 1480 -115 -1873 1291 594 -1709 556
1959 556 638 -1922 96 1340 -1355 -709 1137 -601 -1388 1005 192 -1292 699 870 -1241 15 1169
1976 1169 -930 -550 1521 -151 -998 891 438 -881 465 1108 -1233 363 1230 -1192 -212 1249
1992 1249 -231 -972 1410 983 -1353 440 899 -1369 5 1450 -1002 -631 1136 -394 -1384 841
2008 841 685 -1302 617 1035 -1590 292 1812 -1219 -257 1708 -190 -1150 1411 -201 -1359 1304
2024 1304 842 -1823 222 1151 -1389 -578 1082 -1525 -1123 1464 -648 -1706 1000 195 -1735 410
2040 410 1330 -1731 136 999 -1769 -527 1613 -303 -1458 1715 168 -1640 660 859 -2005 459
2056 459 1137 -1249 -269 1574 -1191 -1405 1451 -348 -1391 1153 417 -2167 793 1156 -1319 123
2072 123 1890 -1478 -663 2248 -56 -1011 1780 114 -1570 1196 1184 -1644 465 1852 -1497 -216
2088 -216 2088 -301 -568 1642 111 -1539 1272 340 -1375 630 929 -1457 121 1233 -1031 -726
2104 -726 1215 -913 -1428 1349 213 -1049 662 934 -1312 17 716 -1055 -825 1332 -610 -1030
2120 -1030 1069 9 -1110 812 59 -844 222 827 -818 -657 951 -407 -1014 683 -30 -934 687
2137 687 256 -1097 -7 787 -617 -314 976 -658 -723 880 480 -498 418 616 -1132 32 947 -495
2155 -495 -415 875 -113 -668 798 417 -1142 965 1356 -1250 920 1044 -880 -908 1421 -270 -845 1107
2173 1107 247 -1485 1744 1475 -1445 427 900 -1314 -313 2294 -953 -924 1363 -326 -1442 1502
2189 1502 585 -2045 781 1696 -1999 485 1885 -1730 -739 2119 -780 -1716 1728 -416 -2561 1672
2205 1672 866 -2751 357 1306 -2728 -7 2493 -1626 -1248 2170 -1265 -2101 2648 -145 -3027 1672
2221 1672 978 -2930 999 1687 -2978 3 3006 -1910 -1364 2399 -1399 -2129 2752 292 -2412 1377
2237 1377 730 -2659 1532 2577 -2717 -361 2572 -1501 -881 2665 -1115 -2272 2495 698 -2479
2252 -2479 2024 1363 -2398 863 1999 -2004 382 2097 -1949 -649 3116 -286 -1534 2375 -281
2267 -281 -2024 2059 999 -2275 711 1645 -1937 205 2450 -1888 -1205 2303 -908 -980 2072 -339
2283 -339 -1824 1766 907 -1574 645 707 -1938 352 1778 -1263 -415 1275 -1223 -770 1467 -503
2299 -503 -1057 452 -622 -1115 1192 738 -1141 266 496 -917 364 866 -959 -532 421 -443 -113
2316 -113 442 -796 -534 459 17 -431 238 -341 -417 669 -89 -775 161 -38 -531 661 364 -728 254
2335 254 303 -627 757 757 -1104 478 885 -566 503 1304 -954 -602 1670 150 -522 977 -15 -1206
2353 -1206 1110 659 -1612 982 1118 -1170 265 1493 -713 -359 1846 -773 -533 2011 134 -1384
2369 -1384 1365 422 -1721 1573 1474 -2131 -80 1795 -1273 146 2054 -1565 -1464 2095 -137 -1301
2385 -1301 1668 198 -1758 1026 1170 -1541 327 1287 -2111 58 1962 -1304 -1401 1275 -882 -1513
2401 -1513 2529 8 -2420 1048 904 -2000 836 1558 -1439 -439 1583 -1129 -775 2078 -548 -1315
2417 -1315 1543 188 -2098 851 1014 -1940 519 1820 -1565 482 1840 -478 -311 1668 -716
2432 -716 -1391 1264 253 -1427 1179 619 -1008 44 1134 -1248 306 1942 -752 -532 1048 -547
2448 -547 -450 737 88 -777 536 236 -654 128 525 -966 313 466 -544 -424 429 -133 -494 481 215
2467 215 -435 13 469 451 -149 -346 -552 -214 -51 -155 203 1 120 -525 -335 -124 -92 -165 -210 -286 -480 -10
2489 -10 604 -456 -352 316 -231 -169 367 16 -579 197 231 -341 294 360 -59 -343 434 -287 -151 471 -156
2510 -156 -860 814 437 -288 -204 899 -371 14 664 -270 -160 615 56 -413 805 241 -833 773
2528 773 523 -415 527 637 -706 -256 965 -112 -510 911 -131 -452 1118 377 -871 489 625
2545 625 -867 175 986 -939 -454 817 -147 -658 708 -215 -894 774 348 -978 122 585 -890
2562 -890 -148 912 -555 -839 933 -684 -865 382 -17 -1054 308 703 -910 -44 594 -746 -523
2579 -523 468 -310 -566 965 -56 -936 508 463 -1070 255 855 -738 8 893 -765 -409 783 115
2597 115 -828 751 151 -805 413 482 -717 262 788 -467 -117 714 -190 -669 712 91 -608 445
2615 445 660 -630 272 576 -285 229 399 -349 -408 1010 39 -706 606 311 -635 330 448 -655 111
2634 111 534 -638 -261 653 -454 -530 631 -10 -816 409 525 -919 103 565 -562 80 595 -417
2652 -417 -308 678 -553 -218 333 135 -431 7 217 -858 -34 293 -493 -211 184 -348 -376 233 -130 -329
2672 -329 212 -18 -559 263 294 -341 -140 388 -13 -116 -53 84 -228 61 499 -187 -49 383 194 -161 422
2693 422 208 -102 103 246 -156 104 298 -108 -305 278 -239 -365 547 222 -225 360 521 -193 61 367
2713 367 -475 -281 825 -304 -356 528 -6 -586 424 560 -684 20 556 -552 -189 644 -445 -507 838
2732 838 -126 -564 691 71 -1050 244 306 -766 64 596 -1130 -354 1163 -653 -703 773 -204 -835
2750 -835 661 84 -1022 484 375 -1063 -50 557 -913 -326 584 -304 -628 704 -440 -968 477
2767 477 104 -797 72 251 -821 337 1004 -580 -52 618 -232 -493 1163 -152 -651 717 53 -579
2785 -579 347 465 -595 71 661 -274 -158 498 -208 248 865 66 -230 431 137 -345 317 25 -435 281
2805 281 153 51 211 307 -416 -219 401 -65 -315 232 -291 -10 144 -1 -28 -318 -168 244 195 -434 -70
2826 -70 71 -418 119 187 -336 -410 -38 -235 -94 409 8 -948 50 -212 -662 389 89 -917 28 346
2846 346 -680 -165 609 -780 -781 1067 -162 -1232 606 46 -850 854 550 -1092 -45 754 -873
2863 -873 -55 1205 -614 -580 1088 -327 -724 888 239 -1093 938 781 -1089 285 836 -1127 29
2880 29 1595 -660 -620 1539 -481 -739 1286 115 -1514 1201 602 -1211 576 865 -1390 337 1682
2897 1682 -819 -346 1491 -563 -970 1293 162 -1721 765 400 -1655 754 821 -1406 78 1430
2913 1430 -881 -372 1107 -900 -809 1528 68 -1338 689 267 -1292 763 923 -1509 -347 906
2929 906 -987 -398 1144 -492 -969 1268 -166 -946 913 -204 -1350 697 693 -1055 117 1065 -928
2946 -928 -267 1100 -291 -486 851 -269 -723 1047 125 -978 -26 382 -292 547 748 -643 -246 549
2964 549 127 -124 561 -394 -845 731 131 -520 52 37 -194 601 725 -101 -239 24 297 259 380 219
2984 219 -323 -102 263 30 -86 79 103 143 40 282 96 -125 107 45 -309 211 -1 -421 -309 103 46
3005 46 -146 74 -442 -109 696 169 -811 70 -97 -96 529 393 -784 -300 351 -199 -386 137 -539 -775 280
3026 280 141 -359 438 95 -995 302 604 -403 -361 582 -525 76 1120 8 -576 436 378 -648
3044 -648 617 212 -557 -27 762 -293 61 891 -542 -430 685 -101 -382 258 146 -970 411 443
3062 443 -781 223 770 -382 95 849 -122 -352 632 -222 -371 1060 -3 -610 408 250 -791 347
3080 347 503 -430 -16 344 -72 -733 426 105 -468 468 128 -935 9 272 -550 72 478 -249 -469
3099 -469 315 -306 -444 302 -41 -830 -71 228 -248 31 502 -153 -340 557 98 -421 220 125 -338 149
3119 149 -51 -596 8 374 -124 44 336 104 -369 329 366 -541 224 147 -273 -232 358 -38 -334 408 237
3140 237 -203 358 203 -375 6 447 -118 -252 575 -154 -235 398 -123 -69 388 364 -495 462 488 -153 -292
3161 -292 393 -201 -422 685 -358 -351 177 -33 -805 453 306 -694 346 180 -621 31 663 -320 -552
3180 -552 537 -207 -731 569 135 -746 321 371 -717 -147 486 -515 -294 569 -356 -764 709 15
3198 15 -683 200 477 -625 152 286 -911 -38 700 -796 -445 581 -325 -728 667 327 -643 144 556
3217 556 -677 -28 602 -339 6 997 -185 -422 875 -80 -455 354 365 -587 368 209 -277 -47 525
3236 525 -605 -276 701 -187 -503 1011 -3 -436 183 280 -658 -154 602 -384 146 554 -143 -367 355
3255 355 -234 -660 439 485 -268 511 260 -661 -38 427 -335 -10 408 -654 -561 506 54 -837 300
3274 300 119 -677 111 404 -365 -330 393 -181 -540 278 -204 -254 19 5 -629 24 94 -388 118 296 -246
3295 -246 -104 238 78 64 614 -105 -453 10 -221 -322 198 317 -155 8 245 178 -205 405 327 -141 237
3316 237 106 -170 216 185 -216 -109 402 659 -213 -286 451 -290 133 799 -44 81 407 349 -17 675 216
3337 216 -550 319 271 -301 157 369 -329 -109 805 -21 -263 682 -18 -518 462 170 -711 165 318 -516
3357 -516 -287 598 -192 -638 88 46 -437 450 -51 -902 22 452 -733 -11 291 -687 -262 117 -163 -392
3377 -392 281 -151 -538 598 280 -462 -41 219 -741 -11 893 -363 -455 324 -3 -259 554 -565 -772
3396 -772 161 140 -643 438 299 -652 46 316 -286 -271 705 -529 -485 1060 33 -704 433 333 -469
3415 -469 -13 326 -432 549 577 -216 -193 801 -594 -343 674 83 -333 566 19 -573 -669 396 -109 -135
3435 -135 325 -332 -66 543 277 8 277 -24 -570 414 266 -315 110 91 -449 104 529 -58 -201 216
3455 216 187 -290 542 -204 -487 -36 404 -76 337 -285 -728 130 457 11 49 -219 -150 -268 353 -202 -291
3476 -291 -278 8 81 155 383 -251 -76 -580 -359 444 -338 -166 -130 -209 -169 177 284 -491 141 369 -86 403
3498 403 433 -220 -101 356 27 152 297 14 66 288 158 -449 14 -266 -107 562 400 106 -155 -33 -103
3519 -103 73 499 -335 -232 382 181 -568 488 -152 -593 312 466 -266 -65 77 -885 -113 393 -75 -288
3539 -288 394 -381 -216 649 334 -751 52 -117 -307 276 758 -702 -85 747 -212 7 569 -286 -378 537
3559 537 26 -87 402 385 -683 122 729 -167 140 386 -451 -445 605 -300 -574 250 -21 -21 451 331 -824
3580 -824 268 238 -537 107 269 -289 -173 806 361 -161 256 60 -231 321 322 -265 107 585 -336 218 455
3601 455 -239 -685 493 -136 -41 309 136 -803 95 494 -232 -134 -50 -236 145 482 244 -235 272 -386 -412
3622 -412 149 578 -307 -158 492 -142 -74 -128 -266 -113 -83 235 -123 185 384 -479 163 121 -11 -48 148 -356
3644 -356 -245 270 295 -271 -17 37 -573 192 -477 -418 -354 283 -179 125 -7 -3 -406 -212 302 -231 -188 41
3666 41 -42 73 46 -48 -114 176 -24 -24 326 359 -115 64 378 -188 -27 283 81 -58 122 187 -153 -105 212
3689 212 358 11 205 -188 -464 312 19 389 128 58 136 137 149 -200 86 -155 -477 473 71 -379 -57 375
3711 375 150 -130 -118 183 -711 69 26 -40 -19 -199 -278 -207 76 -145 -276 233 -47 -499 269 -183 -58 153
3733 153 199 -341 198 286 -252 -369 92 469 -234 93 -155 -425 395 425 -51 -171 295 -171 28 292 94
3754 94 -524 313 -364 -304 265 79 -110 -84 540 -81 -125 -35 -122 -262 222 -212 -492 182 250 -106 -32 294 -159
3777 -159 164 451 -85 354 396 -36 -53 307 255 -258 159 220 -99 -12 293 -358 104 49 90 58 38 -98 -360
3800 -360 290 -179 301 -352 149 -153 -121 -1 -397 -337 -121 -136 -87 339 54 -210 -187 69 -329 -70 99 -66
3822 -66 -325 181 94 -248 177 75 -272 -19 216 179 -99 87 58 49 111 -86 -74 -17 170 -264 421 75 172
3845 172 136 -28 143 15 42 171 -88 12 175 -359 48 79 -94 -303 481 -176 133 168 232 -124 36 607
3867 607 -239 -65 265 -183 40 290 14 -260 368 54 -390 631 161 -390 -117 475 -332 -230 238 -372
3887 -372 -348 298 -83 -68 291 -62 -292 104 448 -296 -222 256 -554 -281 63 -218 -529 149 10 -450 119
3908 119 94 -218 199 190 -615 -88 627 -283 1 421 -135 -211 599 52 -250 421 408 -494 -112 -31 -729 324
3930 324 394 -376 100 348 -239 -218 344 171 -350 170 398 -285 232 215 -122 -141 240 -217 -393 470 -174
3951 -174 -46 404 233 -200 -258 60 -384 43 227 -72 -98 250 175 -172 224 -125 -153 157 -122 -572 215
3972 215 192 -234 -76 58 -436 -95 100 23 146 -97 -8 -142 -110 39 -351 142 54 -327 -18 52 -79 -50
3994 -50 -132 20 -164 -2 187 -130 66 248 -357 -102 205 -62 -192 49 329 -208 -252 -120 -134 180 96 -186
4016 -186 7 185 426 -366 -6 49 -151 200 579 -277 268 401 -110 -43 155 -43 -634 664 46 256
4036 256 -124 -144 -31 -113 333 163 -36 243 108 -206 446 478 -415 124 253 -110 260 5 -267 -266 325 -332
4058 -332 -258 427 -192 -201 -16 252 -255 414 99 -413 -88 282 -193 -383 391 -133 -24 255 -123 -340 -143
4079 -143 208 -172 431 -44 -605 -214 394 -70 151 165 -486 -433 415 83 -251 -23 155 -143 245 489 -458
4100 -458 7 -90 -125 -225 419 109 -355 273 100 -30 -128 63 -551 20 375 -53 291 -167 -296 -101 74
4121 74 73 122 249 -105 413 115 269 -309 -163 -210 142 304 140 223 -360 145 204 22 55 45 40 -147 153 56
4145 56 -344 89 -39 4 130 4 6 -127 279 -29 -45 57 -20 52 1 140 -131 83 354 -103 70 229 191
4168 191 66 168 -378 -324 91 -60 -314 -152 9 -57 56 -6 -72 247 -200 -125 -207 -48 178 -125 97 105 -31
4191 -31 -75 233 152 46 211 180 -211 138 376 13 230 106 -115 27 324 62 -62 328 146 -71 123
4212 123 -263 -281 297 123 -352 -34 93 -126 -48 368 -229 -119 475 -134 -116 18 111 -23 192 -25 -437
4233 -437 49 -110 -280 -62 -89 20 -52 -135 45 64 -226 338 -113 165 -162 -605 131 170 4 -182 186 -28
4255 -28 -78 158 -91 39 313 178 -220 296 93 -8 -100 22 -269 -353 134 46 -127 -45 11 -191 81 92 -181
4278 -181 150 5 -125 -482 105 24 -233 62 225 -40 103 230 -253 78 64 -62 -87 64 11 -331 56
4299 56 289 -234 81 278 -73 -35 81 -97 -88 272 241 -84 230 -72 -9 479 112 -363 75 -70 -69 -100 277
4322 277 170 -79 212 -123 -305 205 105 -214 -191 -72 -315 -149 318 47 -97 238 -92 47 323 77
4342 77 -185 -163 202 -357 36 -37 -470 21 394 -263 36 -276 -404 60 264 221 -28 75 59 -449 -372 -21
4364 -21 120 122 55 -144 -295 207 9 -69 173 373 -306 35 75 -84 -93 -17 -108 -171 395 -181 236 55 -19 20
4388 20 338 334 37 241 321 -262 -241 81 -228 -16 137 -131 -195 257 164 -110 250 41 -184 87 246 106
4410 106 -117 -253 -64 -103 179 -58 -315 -176 120 -95 -258 141 -33 168 67 376 -164 199 -228 177
4430 177 280 -16 -28 92 -65 -217 -194 -86 20 82 -131 -180 -156 2 74 -161 -298 -80 122 59 152 -202 -133
4453 -133 217 -47 64 87 207 7 -14 341 -66 -173 17 -64 8 -107 -220 133 -240 -127 -132 -15 -225 -92
4475 -92 -168 768 -129 -218 -269 22 9 235 36 -101 64 -9 -105 323 162 4 -329 141 213 -45 363 9 -14
4498 -14 -224 112 -18 -217 228 163 -185 41 -36 96 -337 87 -99 -20 347 -370 190 -102 -109 -224 82 -273
4520 -273 -255 394 163 -16 -94 352 -105 51 38 295 -226 121 1 324 100 63 -109 -104 59 -198 37 -153
4542 -153 -314 348 -8 -221 -106 -17 -165 -86 96 12 66 338 13 -178 406 184 -27 91 269 -122 127
4563 127 185 61 -124 111 264 -126 133 125 -25 74 53 271 171 225 111 -64 -183 400 -118 -49 93 165 171
4586 171 15 242 -60 -10 -68 -63 -182 -137 -29 -6 172 62 -28 60 -132 -196 14 390 39 133 166 -37 80 210
4610 210 59 74 -436 -114 -220 37 -113 53 -141 -69 -35 220 -166 -271 -378 89 -26 -25 201 -124 145 -266
4632 -266 143 -118 299 -99 -90 122 -131 -37 -11 -102 -14 -251 341 211 -9 63 -139 13 4 -39 -240 -220 401 133
4656 133 -199 56 40 -240 326 79 37 145 -121 -162 -78 33 -11 -306 30 191 -220 162 -119 -433 334 -22
4678 -22 4 -35 -12 -430 123 76 -174 29 -64 -123 -195 300 38 -204 -103 -436 -128 192 103 89 -291 303 64
4701 64 -138 -76 -46 -168 39 79 63 -39 -378 -31 -154 -44 69 187 -148 45 -436 6 251 -181 -566 -162
4723 -162 133 376 80 416 -88 141 155 222 -89 -93 3 -146 203 -132 97 108 -294 -240 140 -240 74 20 -86
4746 -86 -241 -45 -449 -95 -215 -30 -4 85 -75 -222 -104 165 278 -442 27 -1 -340 -142 92 -139 93
4767 93 256 -284 -66 -24 296 20 -212 -103 -138 -147 363 -196 -91 -347 -382 125 -358 254 -60 526 178 -250
4789 -250 -100 89 -381 -59 141 -289 290 -9 18 9 172 -181 260 -47 -72 -240 -181 -72 -135 -97 2 281 -151
4812 -151 -161 238 257 -135 -34 -108 111 -249 312 67 345 180 186 204 -120 -148 253 -7 -133 -121 -42 202 -359
4835 -359 -72 167 -272 284 35 -106 -49 -248 -143 45 222 179 61 96 -50 -123 20 170 -142 127 -93
4856 -93 -139 143 -1 -126 170 109 -228 -23 -238 -36 -1 257 -129 103 -39 -256 17 -64 -124 -251 -128 -6
4878 -6 -49 180 116 108 14 -132 76 -238 -236 419 72 -338 7 139 -351 182 -90 -254 32 -462 75 296 -39
4901 -39 69 -293 137 205 -120 -66 10 -153 12 30 -51 473 43 -230 297 37 194 205 185 -30 16 452 116
4924 116 -25 -43 197 6 24 439 279 -133 -59 134 26 31 208 295 -16 244 142 292 72 -335 63 139
4946 139 -42 -358 -281 -53 -111 -184 173 -238 335 349 85 -64 -76 -198 194 -72 -41 184 -64 -90 177 168 36
4969 36 118 11 -441 131 -70 -69 -82 -181 122 -45 -591 -220 -151 -158 107 55 -129 264 -314 -110 74 54 -153 -288
4993 -288 96 -103 -332 114 -67 -79 -244 34 -292 -277 17 89 -53 -135 -162 -235 272 40 -422 -12 -181 99
5015 99 -388 84 -87 219 121 251 45 -103 -66 -277 213 139 -121 177 -133 -120 -166 -18 -385 -271 -236 -150 203
5038 203 22 146 -222 357 85 -176 341 168 -73 -257 -192 -190 -124 -125 -62 -29 -12 -300 -124 149 -236 186 139
5061 139 -55 23 -103 -219 -366 -3 16 685 4 -40 -19 139 197 1 190 -149 -187 -38 -347 -24 216 -213
5083 -213 -152 24 7 -199 -230 234 -144 485 147 -353 36 168 -83 182 129 -15 -158 52 -102 243 105
5104 105 -136 -25 146 49 -90 42 -8 224 -209 489 203 -72 -31 100 -198 16 10 -161 -258 228 26 295
5126 295 170 -177 -154 256 231 -59 29 97 -117 110 160 138 57 -11 -131 140 363 -121 -112 97 -62 -39 -132 138
5150 138 -230 -127 -278 75 205 -59 -188 -62 -241 100 -37 419 -216 -96 9 47 260 105 -92 -102 370
5171 370 262 -49 330 388 106 274 440 -39 -101 -55 131 -167 193 -12 157 193 51 87 -29 455 -99 112
5193 112 550 -9 -345 83 222 -352 -61 -25 -336 -68 188 184 363 495 -184 -40 147 203 293 278 88 -161
5215 -161 620 -300 37 144 124 -140 13 123 371 105 -13 315 -374 -157 -20 22 257 -14 -50 -30 -289
5236 -289 183 -201 190 -69 4 76 104 127 248 188 140 -103 -51 -23 318 -105 -142 197 -273 273 78 -184 24
5259 24 126 251 -110 393 -72 -138 4 -40 -113 399 255 -364 -384 86 -264 83 -21 8 -245 246 552 -70
5281 -70 -137 -84 -301 215 635 148 -339 195 -84 53 185 -147 133 99 129 -21 149 38 -353 258 171 -199
5303 -199 339 -194 -725 -284 137 356 -41 -266 -532 -337 218 -60 134 -104 -62 -117 373 320 -487 123 -129
5324 -129 307 -126 11 297 -137 60 206 366 207 15 -126 -33 133 80 -37 -15 25 -204 -6 -46 -397 138
5346 138 -269 -317 -41 456 -104 194 296 -79 -73 -333 101 -186 85 -249 171 208 39 -153 117 -278 301
5367 301 -6 -238 5 305 -4 89 68 82 168 -213 -414 -94 62 304 158 -305 -358 54 44 8 48 -222 -70
5390 -70 24 95 430 -270 155 -43 24 -65 -15 127 31 -98 -356 -84 -196 86 111 240 -511 253 171 109 -261
5413 -261 240 -151 -62 -96 44 -202 266 -30 28 -100 -161 141 -462 130 66 6 -309 116 303 -264 -282 102
5435 102 -84 -134 -266 72 225 -19 216 -273 -133 120 75 3 -206 19 -17 -216 -313 281 -507 51 -129 -260
5457 -260 11 -41 388 -175 -15 75 -115 -68 382 22 -27 -77 248 -148 117 98 -17 24 -306 166 237 -57 88
5480 88 163 74 -326 55 -197 -209 -299 157 -127 -135 72 -71 74 -158 -134 -251 34 -309 -87 -250 -69 -254 1
5503 1 -72 98 100 274 99 -56 71 180 120 95 -461 64 -36 82 255 -192 -254 219 -58 271 177 217 98
5526 98 192 187 206 -203 -16 -221 -150 65 -298 273 12 108 147 -122 -10 333 305 62 -81 -16 186 -397 41
5549 41 -74 -320 98 133 32 -124 205 6 -138 -207 -126 -177 -28 32 -145 -131 34 -114 -211 283 362 -414 165
5572 165 155 15 -147 -127 94 -46 309 195 -590 -69 -115 36 -98 -285 -6 43 236 -16 7 13 8 -32 223
5595 223 -278 -403 -4 -26 -451 279 110 133 -332 -434 181 372 114 89 -181 -197 24 -146 18 -282 238
5616 238 13 -32 309 -149 379 344 19 -461 -491 106 72 133 256 -49 -253 -59 -199 258 306 -194 -172 229
5638 229 106 -117 -95 -75 49 171 -169 184 154 78 8 259 113 178 21 592 51 81 364 211 193 154 -102
5661 -102 116 357 26 102 2 -1 69 -88 24 221 -47 10 151 158 92 46 -59 209 7 177 68 -30 -234
5684 -234 59 209 143 -310 -57 131 -79 362 73 78 55 -183 15 189 -374 -58 -35 -7 -16 -177 184 -39 -212
5707 -212 3 -85 -6 -211 -109 348 225 -243 -109 40 -83 169 347 -46 -76 185 358 47 258 -8 -94
5728 -94 13 -81 260 227 -250 -365 46 45 22 -260 98 -9 7 147 77 89 377 30 -339 -112 172 -198 10
5751 10 146 -331 59 -45 3 -158 279 -9 50 -76 -161 114 -11 225 3 197 -35 -138 -196 -50 70 39
5773 39 250 -217 45 -245 -248 -404 -140 -383 316 41 -178 -13 80 -151 -434 -85 110 -96 -165 423 -210 -179
5795 -179 329 210 24 125 133 67 -49 141 -266 202 -84 -86 -180 -185 -285 173 584 3 34 26 303 57 -346 43
5819 43 -13 -103 -93 -15 34 -15 -260 49 246 59 -80 198 -12 -313 142 -110 -289 -416 -155 -129 -238 -192 -84
5842 -84 -79 -10 -244 -282 60 294 157 -436 57 -227 -467 -147 126 86 -157 -108 -224 203 228 202 -62 -59 -1 -149
5866 -149 62 162 -188 0 255 206 -174 -223 383 -80 167 -268 164 14 367 69 194 45 -546 -196 122
5887 122 393 12 -176 240 84 89 456 279 65 51 68 -118 223 29 -112 -56 80 2 133 149 -176 -280
5909 -280 -141 -149 306 41 24 34 -300 -87 -60 115 61 342 -26 54 104 -53 121 19 -321 -189 -78 -40 -61
5932 -61 25 -136 -284 145 25 11 -30 308 36 -34 11 11 -22 218 -37 74 3 -246 192 190 130 -48 -24 206 -15
5957 -15 -219 -169 92 39 -289 259 49 129 137 -69 8 -58 -190 163 -214 -224 53 -325 26 77 324 -140 56
5980 56 -126 -29 215 381 271 -204 -339 257 41 -200 281 140 -89 54 17 -35 28 -222 349 -153 106 182
6002 182 -99 -47 -101 42 196 59 -86 172 323 -133 264 369 -116 -45 377 -29 -489 -127 -31 -297 -57
6023 -57 -458 -29 -151 -161 74 91 101 274 -155 95 -189 38 -90 225 49 292 271 -57 5 187 199 -49
6045 -49 83 54 -153 -18 35 31 -123 89 -195 168 -12 -120 -192 -217 -212 -379 -38 255 137 -41 -255 -246 -219 -125
6069 -125 -2 -224 108 230 179 195 53 68 90 286 264 102 42 -83 128 -148 -157 -17 241 336 -107 -239 27
6092 27 24 -107 -140 68 149 -63 104 -151 -197 -285 14 -135 -70 64 -283 10 21 -121 -83 -127 -110 129 12 33
6116 33 586 175 -21 -52 165 19 -208 -123 -139 -16 46 -192 -59 -447 -270 78 111 -211 -417 93 15 -146
6138 -146 125 147 -302 -71 -237 -199 139 -6 57 -54 -39 -65 67 67 -153 72 308 -371 69 -389 403 -84
6160 -84 106 125 103 207 326 57 49 90 102 32 -36 299 -169 -57 -67 -55 -166 -121 124 41 301 -71 175 -188
6184 -188 -409 -50 -86 224 -300 250 -56 40 -235 56 -83 -194 -70 -219 -18 -364 39 167 376 174 107
6205 107 -102 -89 -180 -267 -143 145 -295 -271 -168 -242 25 231 155 82 70 -155 95 109 236 422 -73 197 48
6228 48 -46 58 30 9 -228 -16 -324 5 235 247 -278 124 -268 -71 -118 130 -89 149 -194 -113 48 170
6250 170 129 47 101 138 333 -108 -21 -219 213 116 -158 138 -197 -53 124 176 -24 181 -161 101 4 -36 106
6273 106 57 118 78 259 100 -68 -311 -108 192 151 35 -5 -52 -205 59 169 -123 -267 -92 409 221 -94
6295 -94 -227 93 -6 -176 -184 -40 362 -18 419 -116 88 -137 -168 -208 -2 -44 161 353 -346 -195 -295 235
6317 235 129 -221 -29 -58 -236 -18 -183 151 92 54 136 -325 1 97 139 -57 132 119 116 86 121 -70 124 -205
6341 -205 -13 -52 51 -75 30 18 12 226 82 104 -45 7 176 -4 -108 101 81 130 242 -203 230 -251 2
6364 2 73 -261 -33 -43 123 -172 -37 448 71 -188 -82 -172 161 252 105 274 79 -66 203 24 25 -358 -15
6387 -15 -51 51 -273 203 25 -127 -155 -108 -120 102 -36 -153 155 -399 -136 -39 42 -59 -75 525 89 90 -92
6410 -92 -5 -238 -229 224 18 43 106 -99 277 150 6 -78 -77 51 -74 67 49 3 312 91 110 -274 303 121
6434 121 -180 231 -33 460 -180 -32 -121 99 -87 -167 -38 295 27 -71 -108 108 -136 11 268 367 -9 3
6456 3 65 -78 -63 -4 -217 -45 398 244 -62 225 219 -239 81 145 -164 -145 64 -197 96 152 -15 -226 -37
6479 -37 61 -293 78 174 116 -16 -106 -99 288 -90 -196 380 342 180 22 -341 68 -153 -152 -113 8 442 301 -181
6503 -181 123 -13 14 -259 -29 102 69 12 95 66 -121 -75 -3 230 99 -115 57 -201 415 -83 -296 235
6525 235 -66 332 -46 246 45 -7 314 49 3 39 93 -40 382 233 132 41 32 102 24 23 -32 72 -66 -123
6549 -123 45 353 -198 207 -156 283 376 -104 111 -255 -282 -66 -76 207 -45 -196 136 42 131 -185 48 95
6571 95 -24 -64 59 184 -8 -120 -72 -159 254 224 236 -158 21 -23 -187 -66 112 -107 139 5 329 -161
6593 -161 86 152 162 317 121 185 340 221 6 -364 193 64 -203 -150 139 45 20 -280 -104 -107 67 -70 -5
6616 -5 -163 -130 -24 -288 473 296 9 28 164 -163 123 87 152 153 -183 -336 -247 -59 -93 -192 304 238 -141 -207
6640 -207 -69 -69 6 -53 -85 -13 -28 12 -440 159 205 270 244 18 -145 88 -166 6 310 244 371 -122 188 102
6664 102 2 -101 -165 -39 -76 182 -304 -48 23 65 120 -104 125 10 -13 3 -18 57 -156 -45 119 111 -17 -8
6688 -8 209 249 205 -52 178 169 -174 36 85 -26 161 -120 25 71 146 89 -4 163 -95 323 118 -106 32 23
6712 23 -65 441 231 -121 108 -129 -14 -116 -230 188 -121 -402 -47 -39 105 -80 -282 -334 -23 -82 -24 223
6734 223 -171 -164 -175 -252 41 88 49 204 94 -223 72 -143 -51 4 148 271 -117 -192 -325 -101 -86 -283 -151
6757 -151 -95 -69 -5 118 218 47 -132 -2 -14 -91 103 345 128 146 -135 -25 -245 133 147 -87 -8 27 248
6780 248 136 125 -320 -110 -12 -206 35 212 99 -12 -125 65 131 -69 255 23 411 -12 45 -32 -237 -114
6802 -114 49 27 -97 -10 256 -87 122 476 -293 -228 -10 350 38 -115 -26 28 -89 -240 80 -149 -133 192
6824 192 -38 -81 184 103 -250 76 -15 -152 -49 66 -383 -372 -24 -190 -274 -174 17 -21 87 -87 -240 75
6846 75 297 234 -28 -35 -246 -290 258 225 70 -244 -34 -51 -39 -166 -346 13 105 -67 -343 -312 -47 33 352 31
6870 31 232 -255 210 72 -205 22 -51 81 82 -73 194 316 184 271 -308 -71 7 -261 -232 405 124 118 42
6893 42 -191 218 -81 16 126 409 -51 172 -235 171 -53 -156 -96 -84 169 -80 44 178 147 -142 -259 290
6915 290 -234 258 -262 27 -228 483 261 378 -280 167 152 -134 42 -108 -310 19 180 -74 -233 -454
6935 -454 -192 -26 -110 357 357 291 253 46 -36 -109 47 251 -85 74 -89 -233 58 235 140 9 -14 128 -71
6958 -71 100 -60 101 19 -141 86 -238 82 -46 145 -635 -86 -92 58 -46 158 102 -313 -74 -107 -58 165
6980 165 138 111 -336 15 50 147 -12 63 -157 241 -109 125 323 271 -45 -174 9 -264 -106 -213 92 -195
7002 -195 406 112 6 -314 -39 91 76 -98 328 117 -29 30 -200 343 33 -359 42 199 -11 215 -32
7023 -32 -165 35 26 -102 35 118 -36 24 -349 6 258 -55 -33 61 46 85 -69 -26 -81 185 67 462 -126 86
7047 86 223 -29 196 -116 -69 177 -219 -78 350 -136 139 32 71 118 -106 -133 51 -219 131 27 186 -5
7069 -5 86 -69 -115 -73 -213 74 81 -192 91 160 -325 -364 -40 -7 -108 62 133 -34 9 55 223 30 -130 137
7093 137 -31 -114 217 27 -147 159 -91 -21 -103 -243 91 148 -12 280 -102 -78 54 15 -114 74 -124 64
7115 64 -203 421 179 -26 47 108 -16 -63 -15 -8 -161 65 -44 126 -99 1 -8 146 221 -70 -188 -107 -200 152
7139 152 237 106 -34 118 -293 -143 28 409 -129 -270 -14 96 -194 44 -105 -29 15 53 -19 -284 53 187
7161 187 -91 335 -66 138 255 116 -259 37 41 101 2 98 16 -185 277 -4 -158 69 195 87 10 -165
7183 -165 318 49 21 125 -99 -62 348 97 14 99 322 -71 280 0 -185 -255 43 -79 121 -68 -91 -221
7205 -221 39 -94 -190 83 185 105 55 67 145 -71 -20 45 134 117 -80 -294 -163 188 179 72 130 205 -305 -59
7229 -59 -103 186 -84 -92 164 110 201 4 1 99 -232 -185 -129 -40 32 258 205 -18 -15 -86 78 11 -230 35 -129 -19
7255 -19 2 53 -89 -77 -52 -47 -267 -97 -170 -32 -133 -41 106 -80 7 201 -177 181 -79 -195 -55 238 -254
7278 -254 -43 -92 -84 -183 101 -131 -51 -223 -98 -178 -96 87 70 -158 -44 129 -369 -184 -98 -9 -278 -17 -35 -70
7302 -70 -142 7 104 253 -277 262 -17 30 -107 20 -32 18 -75 238 -21 21 -297 -127 -466 74 -3 -93 -168 -50
7326 -50 161 -34 -13 -201 335 119 -175 109 175 149 -281 129 -58 24 -160 -214 45 214 -96 -91 -216 117 -165
7349 -165 21 75 172 122 -294 161 60 -7 -281 72 -49 208 78 22 51 98 -211 -203 -70 -385 23 -15 297
7372 297 37 171 70 -36 -52 -169 -95 38 -18 46 108 330 -73 154 -128 -4 376 77 68 -112 17 -153
7394 -153 -103 71 120 79 206 -149 -54 37 105 32 150 130 -58 -140 103 -74 -43 110 112 81 1 128 -91 -92 239
7419 239 121 16 -217 -231 -139 134 27 26 -49 -13 25 -279 -147 52 126 48 -8 -54 -132 158 13 182 186 -73 228
7444 228 175 43 110 -306 -11 170 23 94 48 147 217 293 -169 218 -5 -107 -61 269 229 -83 84 295 175
7467 175 117 -87 39 17 -47 46 22 134 -69 -74 -37 -88 -296 89 -51 101 46 -298 -113 -112 127 137 26 -51 -13
7492 -13 -166 -45 -219 104 -281 -61 -180 -2 38 -33 -157 232 274 -133 -130 260 -253 289 -204 20 263 -246
7514 -246 -26 46 -77 126 -288 -109 -15 -206 -15 94 41 -92 -32 -532 -141 -139 -46 -352 16 1 -142 -21 215
7537 215 -56 -169 7 -125 39 -205 201 13 51 -49 66 42 73 167 -171 -70 -122 57 -46 -28 46 -169
7559 -169 -89 -42 -295 -184 -356 327 98 74 76 -196 -160 -421 -165 -35 -6 176 -212 3 -265 -285 -219 193 -104
7582 -104 153 196 -328 143 -243 -366 244 -130 238 199 -142 392 -25 21 -76 -251 -54 110 -19 -9 -174 196
7604 196 -255 163 -24 -257 340 0 -33 164 19 -17 411 -54 -38 54 -17 196 169 -383 -17 82 -228 353
7626 353 316 -4 -116 221 -86 50 6 -43 -158 182 147 13 -140 114 27 -44 -229 109 50 -154 99 14 100
7649 100 -39 301 221 -510 -206 144 -401 91 149 -118 189 -121 -242 207 -78 -9 -171 204 158 2 134
7670 134 -281 117 -321 103 -50 211 -202 -65 101 244 -29 -294 -156 186 189 50 -137 24 -160 109 72
7691 72 -75 222 49 -2 453 369 142 -52 -264 -110 22 153 -223 -101 246 -43 136 140 -20 92 24 448
7713 448 328 -61 -86 -124 -366 -49 -272 -222 109 527 169 -35 -285 86 247 -225 -153 -102 11 93 150 -107
7735 -107 139 -49 23 -285 24 -47 166 80 -328 133 -203 -104 151 -74 -225 130 83 -22 216 147 -188 184
7757 184 16 469 161 -67 -183 223 -186 -208 11 -152 -286 18 73 132 141 -125 116 -3 224 34 345 -63
7779 -63 -198 68 188 233 -122 -46 40 -78 1 -202 -66 0 -63 138 144 -91 -20 44 -77 -9 126 -128 79 -285
7803 -285 114 33 -128 -74 -48 -63 -44 39 -9 -62 -13 -71 -126 -146 -311 -133 104 -53 -19 474 15 -36 30 -198 -246
7828 -246 56 78 26 232 -68 61 112 -352 164 57 100 61 -83 -7 207 169 -128 -232 -77 180 -160 47
7850 47 28 -34 -357 -238 -146 -149 362 -175 110 -128 40 -26 -121 -9 102 -158 -4 -9 29 61 -324 252 -203 -1
7874 -1 241 86 246 -134 40 149 -67 12 -157 95 42 -28 -175 -66 -55 288 298 40 133 -33 -379 90 93
7897 93 101 -26 -342 274 114 153 118 141 -90 119 -216 141 232 -44 5 -97 205 -72 -39 36 -3 171 -232 50
7921 50 -174 124 -195 196 156 -97 -256 92 237 145 53 -133 53 229 -170 37 425 85 -121 163 76 5
7943 5 -9 267 119 -249 -79 132 -173 269 29 -154 -156 62 -133 326 222 -144 121 -86 -147 325 -8 269
7965 269 106 74 4 -115 -121 346 -93 18 160 -79 31 161 28 -154 -23 -73 144 -143 113 -63 -150 -23
7987 -23 -33 221 14 -74 -305 -35 59 112 16 -98 -315 268 -33 -40 -312 -31 -64 93 105 -13 -51 263 -10 67
8011 67 82 -50 149 137 316 2 127 102 -49 152 319 8 63 104 -18 101 45 166 49 76 151 64 127 119
8035 119 19 41 -73 -40 -73 -309 93 109 157 112 60 178 126 -68 52 151 -73 -48 -120 93 14 -107 16 120
8059 120 -184 -104 287 -30 -159 -231 -237 10 60 -426 -19 146 -156 -86 -129 -342 315 89 176 -81 -29 60 -134
8082 -134 375 64 -165 47 -81 65 -24 -331 169 -305 106 158 -78 210 257 98 -95 -2 174 183 78 -17
8104 -17 -213 -277 -26 69 -144 -284 -185 187 101 64 108 114 85 76 164 22 -73 28 -124 -116 18 -113 26 -163 86
8129 86 94 102 -128 -84 -84 -6 283 279 71 89 145 -94 -232 -109 -202 17 48 88 -192 7 -1 -99 492 85 29 -330 197
8156 197 -36 -159 48 -192 125 213 19 -75 14 451 -147 -31 8 -256 252 96 153 45 -184 -38 200 33
8178 33 68 -15 267 -2 -85 284 -16 -38 137 100 -222 140 515
8191E15
$$ Imaginary data points
##PAGE= N=2
##DATA TABLE= (X++(I..I)), XYDATA
0 0 0 0 0 0 0 0 0 0 7 -8 8 -8 14 -16 16 -24 31 -38 48 -56 64 -78 94 -110 129 -150 174 -202 235 -271 309
31 309 -351 399 -453 513 -578 647 -726 811 -907 1009 -1122 1244 -1380 1526 -1686 1860 -2053
48 -2053 2260 -2492 2747 -3024 3333 -3676 4060 -4492 4984 -5545 6196 -6960 7874 -8986
62 -8986 10377 -12170 14585 -18020 23324 -32645 53740 -198804 175561 336903 -319225 142012
74 142012 201871 -429533 -47229 466301 -202541 -212349 297833 -138178 -251583 428626 76882
85 76882 -431991 97290 158224 -257274 203602 295563 -374885 -152212 318375 -110423 -102870
96 -102870 301631 -124075 -296811 279896 133474 -247691 105871 77936 -293374 114141
106 114141 325002 -179723 -132097 157324 -135807 -75517 299024 -15877 -248048 117656
116 117656 73464 -147232 127356 105641 -236219 -19602 204896 -50043 -36227 111781
126 111781 -130376 -132515 182654 79905 -113546 35490 10693 -125821 62009 129928 -93080
137 -93080 -69213 69236 -22381 -16517 99263 -26418 -131175 18940 71917 -12390 21160
148 21160 22669 -88855 -47583 80031 28500 -47080 6422 1153 -49799 29015 68609 -52261
160 -52261 -67992 37680 12186 -20016 62808 6064 -110485 835 79403 -33726 -7543
171 -7543 64728 -64238 -61978 101259 13426 -90252 48687 26704 -91863 59977 95228
182 95228 -107436 -37113 94847 -55905 -32643 130972 -34993 -117816 95934 35873 -108383
193 -108383 73489 68281 -134573 22474 130161 -93528 -41058 121534 -71456 -79919 149920
204 149920 2915 -129964 90441 41219 -134187 69705 104886 -133726 -6481 129668
214 129668 -91106 -50118 139398 -55338 -109771 128780 18830 -125710 85119 54069
224 54069 -143157 39407 114239 -113404 -22129 123522 -82562 -70421 132799 -27372 -114070
235 -114070 101937 27522 -124664 67301 73193 -128931 8658 108945 -91717 -36817 118002
246 118002 -57766 -85520 109707 -925 -107887 77608 43102 -114845 37096 84115
256 84115 -98254 -13900 100423 -63953 -52725 102562 -22195 -86426 80438 24007 -94330
267 -94330 47507 60290 -88878 4634 84324 -62329 -33552 88702 -27719 -64260 76321
278 76321 12746 -78278 48164 47167 -75315 13088 70226 -58558 -23735 78200 -26919
289 -26919 -50945 69659 6362 -68921 46150 38486 -69285 16251 62628 -55180 -18897
300 -18897 71215 -30801 -48614 66214 2278 -64949 47379 33438 -70979 16573 57097
311 57097 -59578 -15261 70877 -35025 -45741 66419 -6203 -67561 49874 27384 -72068
322 -72068 23826 53477 -65620 -11389 67192 -44303 -40477 70374 -13225 -62854 55110
333 55110 16916 -74604 30111 47200 -67428 856 65465 -50608 -32901 68447 -23273
344 -23273 -55721 61922 10502 -68284 39162 37030 -69667 9982 59808 -53478 -18348
355 -18348 69470 -30342 -46777 62817 -1164 -62708 48487 30807 -65126 21652 52084 -58848
367 -58848 -9094 66411 -36070 -34695 67876 -8707 -57079 52206 20013 -64706 30626 48007
379 48007 -58489 1557 62345 -43773 -28655 65629 -16512 -48324 58139 12334 -62530
390 -62530 34798 36384 -61917 9818 57516 -47069 -19113 62833 -27507 -45475 56582 923
402 923 -57453 42477 28347 -62533 14596 46294 -54343 -10699 60300 -33453 -35987 57426
414 57426 -9950 -55202 44881 16886 -61494 25571 41238 -56615 -2266 52614 -43937 -26947
426 -26947 59817 -17636 -46092 49995 5052 -58913 33577 31288 -57848 10244 48949 -46549
438 -46549 -13700 55960 -29852 -37895 54002 -1829 -47949 42191 18722 -57026 20274 40883
450 40883 -46548 -1404 50706 -34082 -23399 53542 -11943 -41704 41998 10507 -45133 30271
462 30271 30331 -47193 3807 41203 -31550 -9917 47373 -18677 -32066 40485 4214 -37070 27539
475 27539 17813 -40147 12663 36294 -30695 -9936 33859 -19570 -20002 39247 -249 -35857 20624
488 20624 12921 -31557 12952 26248 -31900 -9767 33149 -12994 -19225 27201 -7271 -32721
500 -32721 23410 19406 -29820 2517 18850 -28937 -6089 35760 -13688 -27538 23605 600
512 600 -27774 23409 14726 -40110 999 31273 -21689 -7871 31383 -22900 -30087 37836 8351
525 8351 -34283 19592 11778 -41110 14467 39288 -33740 -14928 36040 -19947 -18765 47078 -6352
538 -6352 -46573 29085 19834 -36365 23155 28690 -50590 -3128 51014 -23835 -18493 43605 -21093
551 -21093 -36999 52959 12829 -49365 24511 21056 -47395 23056 48759 -47897 -16948 48479
563 48479 -24622 -19499 56828 -15743 -52387 43776 18765 -44875 29072 23962 -59207 10244
575 10244 54661 -36727 -16350 43756 -32281 -28969 59134 -2202 -50856 30844 10842 -45346
587 -45346 30973 32820 -54888 -4656 42406 -29959 -9489 44559 -29238 -37867 43897 5059
599 5059 -35762 26834 5783 -46834 20621 35101 -35270 -5843 27092 -28778 -8948 42181
611 42181 -14102 -32274 24430 1260 -22918 26375 10421 -36954 5155 24087 -17043 1562
623 1562 20503 -22217 -12943 27606 837 -14778 12812 -1672 -16937 15834 15286 -14933 -2762
636 -2762 8511 -7000 2554 15276 -4839 -11254 5255 5693 -587 4646 1999 -7461 -2478 9320
650 9320 6529 -4416 -1975 2445 -3781 1315 12207 -2314 -12441 6210 6032 -8213 7359 8046
664 8046 -17208 -2489 18289 -7745 -8257 15790 -8792 -16981 20811 5793 -23289 9714 10405
677 10405 -24360 6869 22893 -24255 -9753 25663 -14502 -16155 29284 -6943 -30421 24316
689 24316 9456 -31789 15581 18765 -36081 3385 32830 -27463 -12167 34555 -18863 -24404
701 -24404 37519 -2409 -36105 27567 12020 -38749 18499 27205 -38927 374 37165 -28210
713 -28210 -13488 40893 -17017 -29038 39221 1277 -37199 28842 15952 -40813 15955 31646
725 31646 -36175 -1827 38742 -25981 -16450 42021 -11607 -30553 36090 4890 -36847 25866
737 25866 19721 -38610 10862 32429 -32012 -5051 37403 -22303 -20028 37980 -7077 -30748
749 -30748 30274 8233 -35558 19487 21046 -34933 4429 30260 -26808 -9705 32816 -16253
761 -16253 -22403 30270 -1789 -29550 21908 11118 -31249 10546 21179 -27563 -2683 26482
773 26482 -18368 -14008 26781 -7614 -22820 21332 4617 -25943 12171 14173 -24172 1554
785 1554 20662 -17931 -9141 22342 -8757 -16805 19616 1862 -21377 12293 10987 -20296 3545
798 3545 17417 -16180 -5979 19881 -8013 -13397 17954 999 -17886 12769 10268 -18141 4277
811 4277 16190 -14478 -4251 19736 -7322 -12102 18060 891 -16631 12964 9249 -17803 5208
824 5208 15851 -14781 -3225 19263 -9273 -11410 18612 -704 -16699 14239 7544 -18504 6868
837 6868 14434 -16531 -1812 18370 -11272 -10182 18870 -3605 -16140 15071 4978 -19182 8230
850 8230 12394 -18863 99 17091 -13697 -8243 18546 -6733 -15480 16043 1648 -19361 10529
863 10529 9699 -19128 2720 15717 -16146 -5490 18055 -9775 -12907 17401 -1485 -18157 12719
876 12719 6791 -19466 6003 13548 -16748 -1759 17857 -11500 -9999 18033 -3987 -15485 15185
889 15185 4713 -17699 9383 11737 -17115 1602 16764 -12258 -5946 18402 -5977 -12164 16367
902 16367 1957 -15983 11546 9626 -16570 4493 15028 -13159 -3577 17403 -8127 -9813 16404
915 16404 -936 -14402 12521 6582 -15808 5967 12174 -14103 -884 15359 -9590 -7319 15655
928 15655 -3525 -12550 12986 3437 -14910 7618 9441 -14534 1052 12951 -10946 -5806 14152
941 14152 -6032 -11064 12631 697 -14174 8264 6829 -14289 2051 10717 -11619 -4053 12673
954 12673 -7285 -9420 11812 -871 -12279 8255 4756 -12857 3180 9654 -11392 -2699 11406
967 11406 -6731 -7930 10722 -994 -10450 8283 4460 -11249 3503 8737 -9310 -1880 11302
980 11302 -5940 -6740 10558 -151 -9861 8053 5254 -10977 3551 9720 -8650 -2045 11522
993 11522 -5346 -7040 11253 615 -10410 8669 5964 -11644 3795 11294 -10103 -2475 13373
1006 13373 -5798 -7361 13467 -147 -13089 10647 6438 -14138 5451 11001 -13760 -1969
1018 -1969 15944 -9241 -8675 15555 -3647 -14151 14571 4112 -18088 8058 10691 -17371 1981
1031 1981 16479 -15395 -7871 18675 -7719 -13579 17593 -1117 -20688 13948 8628 -21064 6179
1044 6179 13972 -20321 -1357 21296 -13863 -11147 20023 -7163 -16566 20556 2328 -23015 12724
1057 12724 11371 -21758 6762 18095 -21471 -4500 23259 -11860 -11380 22338 -6668 -19496
1069 -19496 21012 6169 -22061 12295 11409 -22787 6685 21528 -18881 -6239 21507 -12434
1081 -12434 -10274 24120 -4389 -20784 17560 6581 -18546 13522 12064 -23122 3273 20507
1093 20507 -13976 -3510 18699 -12737 -11495 21808 -592 -16310 12565 2756 -17228 12688
1105 12688 12712 -18188 -457 13024 -11831 -1190 16560 -10457 -12694 13600 275 -8965 11268
1118 11268 88 -16406 6564 9851 -9264 620 5080 -12187 -1883 13192 -4163 -7351 4157
1131 4157 -3873 -5077 9247 1954 -10203 -939 2051 -2807 4515 3176 -7721 -3951 3593 2009
1145 2009 1574 433 -4756 -3157 2571 3982 2480 -2807 -5475 680 3293 1798 2915 -2143 -7418
1160 -7418 2375 7054 -1206 -255 1150 -7611 268 11976 -433 -6161 3954 -3145 -4340 12590
1174 12590 4526 -12376 1390 5986 -6908 6643 10276 -13687 -5780 13532 -2697 -4115 12776
1187 12776 -6905 -14838 14744 7668 -12703 5983 4749 -17547 6471 18190 -13415 -7010 13255
1200 13255 -10508 -5826 21188 -4443 -19566 12095 4421 -14326 13080 8244 -23405 1678
1212 1678 17861 -12766 -2419 16148 -16081 -11797 22439 -1372 -16759 13801 -316 -19599
1224 -19599 15251 12948 -21385 570 13523 -16399 683 20823 -14647 -13698 18483 -3017
1236 -3017 -12642 17650 -175 -21869 12011 12193 -16491 5057 12184 -18715 -1102 21082 -9561
1249 -9561 -9794 15480 -6573 -11646 18733 3102 -18158 8682 7782 -14385 7946 12837 -16137
1262 -16137 -2617 15792 -7172 -4558 14781 -6617 -11855 13934 3660 -11532 8194 3880
1274 3880 -13374 5881 11461 -10246 -1790 9489 -7169 -3104 11873 -3481 -8996 7392 790
1287 790 -7132 6636 2663 -9912 2231 6418 -5464 277 5093 -5718 -2858 6473 -1572 -4096
1301 -4096 2958 -1339 -4192 3334 1652 -4091 -555 840 -2182 454 1839 -2023 -1559 206 -726
1316 -726 -133 329 -1077 -504 -471 -168 844 -512 -1707 889 373 -1435 1497 561 -2697 685 2660
1333 2660 -2503 -76 3015 -2421 -1941 4467 -740 -3062 4124 436 -4634 3889 2571 -5312 1942
1348 1942 4746 -4624 -173 6104 -3470 -2617 6975 -1506 -4610 5501 618 -5974 4654 3772 -6667
1363 -6667 2244 5978 -5947 -1005 7091 -4755 -3904 7574 -1625 -6043 6593 949 -7806 4451
1377 4451 4171 -7562 1724 5772 -6703 -1306 7154 -4576 -4505 6813 -1393 -6580 5862 1341
1391 1341 -7885 3546 4321 -7585 74 5904 -5937 -2333 6791 -3367 -5158 5934 -610 -6698
1405 -6698 4701 2406 -7148 2155 4755 -6495 -947 5959 -4336 -3339 6350 -1612 -5651 5319
1419 5319 1287 -6082 3392 3619 -5648 513 5166 -4285 -1845 6330 -2150 -4021 5561 583 -5069
1434 -5069 3887 3066 -5109 1782 5058 -4173 -745 5888 -2091 -3378 6028 377 -4387 4102 2510
1449 2510 -5182 2603 4077 -4350 -170 5432 -3041 -2706 5483 -1297 -4431 4606 1316 -5388 2812
1464 2812 3457 -5192 553 4683 -3880 -2444 5371 -2115 -4283 4649 168 -5636 3037 2193 -5772
1479 -5772 1302 4140 -4815 -1453 4719 -3187 -3348 4852 -803 -5375 3453 1612 -5182 2043 3037
1494 3037 -5048 -27 4428 -3484 -2123 4614 -1723 -3887 4007 445 -4687 2485 2693 -4699 1040
1509 1040 4261 -3439 -1095 4710 -2067 -2782 4733 -118 -3734 3297 1836 -3774 1673 3031 -3340
1524 -3340 -8 4175 -1891 -1482 4265 -472 -3304 3601 1606 -3301 1980 2823 -2940 218 3528
1539 3528 -2147 -1368 3670 -491 -2921 3359 1063 -3107 1395 2385 -2978 -215 3763 -2633 -1714 3466
1555 3466 -981 -2975 3181 95 -4228 1671 1699 -3556 59 2918 -3703 -1513 3873 -1750 -2709 2993
1571 2993 -80 -4021 2884 1787 -4202 321 2453 -3631 -578 4040 -2730 -2787 3639 -881 -3100
1586 -3100 3393 511 -4864 1962 2420 -3707 724 3399 -3974 -934 4776 -1578 -2556 3665 -662
1601 -662 -3172 3996 1720 -3663 968 2630 -2943 860 4043 -2894 -2090 3669 -824 -1598 3880 -433
1617 -433 -3281 2807 2121 -2080 1525 1514 -2817 848 4010 -1382 -1429 2127 -1096 -1146 3330 343 -2627
1634 -2627 1240 1211 -953 1627 914 -2775 -680 1796 162 -100 660 -1771 -982 1624 1087 -879 -206
1651 -206 -916 -647 774 1225 -876 -1637 -1190 72 1082 266 -389 -1223 -1544 225 1666 -187 -1706
1668 -1706 -684 -1254 -209 2338 -93 -2616 -250 154 -727 1696 1207 -3488 -1050 2583 -612 -80
1684 -80 2272 -2609 -2202 3997 1197 -2604 1114 -402 -3397 3151 3648 -3740 -961 2657 -2272 217
1700 217 4934 -2206 -3854 3496 678 -2109 4233 941 -5766 2266 4359 -3068 548 3520 -4537
1715 -4537 -1027 6548 -1099 -3587 4143 -1030 -3785 5689 2248 -5913 1421 2890 -4256 1771 4919
1730 4919 -5193 -2935 5551 -1841 -2476 5175 -1916 -5876 4752 2358 -5046 1847 2260 -5973 933
1745 933 5265 -3768 -2301 3929 -3507 -2807 5413 -1092 -5330 3327 1225 -4568 3153 2222 -5886 -79
1761 -79 4247 -3077 -932 3845 -3324 -2607 4895 123 -3610 2848 28 -4056 2834 2698 -3906 96
1777 96 2709 -2660 -56 4125 -2204 -2300 2936 -105 -1525 2726 473 -3107 1928 2092 -1481 875
1793 875 1822 -1959 -5 2814 -538 -858 1753 -332 -940 2250 365 -1445 656 1006 -673 524
1809 524 977 -989 -284 492 388 -164 191 -700 -394 596 195 -4 -612 -625 404 136 -697 412 -264
1828 -264 -891 612 232 -1536 439 897 -1503 -112 1255 -1275 -1129 1261 -1240 -1248 1811 -224 -2271
1845 -2271 1082 190 -2603 921 1478 -2507 -120 2747 -1939 -1570 2561 -1299 -2242 2579 -329 -3175
1861 -3175 2325 1509 -3138 999 2323 -2924 145 3698 -1990 -1298 3378 -1185 -2198 3600 385
1876 385 -3342 2450 1850 -3242 1410 2885 -3043 109 3644 -2208 -1120 4078 -1524 -2722 3413
1891 3413 507 -3282 2454 1500 -3822 1090 3113 -3080 -84 3392 -2081 -1108 3554 -1026 -2656
1906 -2656 2843 655 -2871 2219 1074 -3452 818 2455 -2509 -661 3084 -2399 -1589 2975 -690
1921 -690 -2490 2397 237 -3307 1322 1393 -2982 41 2205 -2508 -516 2763 -1822 -2124 2269 -53
1937 -53 -1921 1592 277 -2905 673 1474 -1978 -245 1565 -1900 -759 2009 -706 -1647 1640 263
1953 263 -1782 1012 853 -1306 -97 1759 -1087 -359 1676 -631 -941 1773 302 -912 1081 846
1969 846 -1464 244 1858 -765 -111 1297 -657 -904 1356 674 -1236 1052 1068 -1336 83 1064 -756
1986 -756 -707 1392 -409 -1305 1125 405 -1115 542 686 -1386 41 1162 -1138 -628 1399 -386 -1726
2003 -1726 1246 276 -2154 699 701 -1747 -60 1017 -1195 -728 1358 -939 -1576 1181 40 -1509
2019 -1509 1170 580 -2064 474 1447 -1819 -252 1611 -1093 -691 1535 -683 -1836 1364 227 -1859
2035 -1859 415 1381 -1531 282 1712 -1454 -950 2052 -546 -1468 1563 170 -1374 1019 1025 -1650
2051 -1650 695 1555 -1392 -190 2141 -1159 -616 1573 -74 -1058 1575 1287 -1674 687 1324 -1140
2067 -1140 144 1766 -969 -599 2140 -132 -1330 1562 504 -1610 1257 1010 -1923 177 1177
2082 1177 -1514 -263 1939 -763 -682 1529 -604 -1971 1117 889 -1499 759 837 -1625 285 1272
2098 1272 -1227 -908 1424 -676 -1584 1230 -320 -1730 745 418 -1784 -60 776 -1101 -446 1075
2114 1075 -694 -1051 936 -404 -1106 571 229 -1387 46 952 -926 310 1001 -399 -559 903
2130 903 -140 -847 708 335 -979 329 1404 -1076 318 989 -701 -134 1136 219 -729 946 865
2147 865 -551 684 1081 -933 -216 854 36 -155 927 196 -825 1179 759 -1550 85 1385 -723
2164 -723 -389 1112 -730 -1275 1437 39 -1630 337 678 -1535 400 1064 -1696 -560 888 -730
2180 -730 -639 1396 -62 -1980 672 139 -2037 430 1463 -2164 -128 1919 -1677 -568 2197 -1302
2196 -1302 -1860 2639 -526 -1764 1000 629 -2511 644 1670 -2339 -292 2419 -1634 -479 2588
2211 2588 -1164 -2406 2114 83 -2549 2215 837 -3081 609 2468 -2002 -460 2487 -2422 -1258
2226 -1258 3292 -651 -2239 2359 121 -2799 2271 1734 -2639 1022 2393 -2037 321 2776 -2131
2241 -2131 -1198 3135 -783 -1650 2528 47 -2498 1782 1358 -2498 378 1903 -2633 178 3054 -1699
2257 -1699 -817 2358 -1293 -1627 2639 -63 -2608 1045 778 -2151 1251 1850 -2393 -35 1963 -1663
2273 -1663 -795 1732 -1503 -1622 2259 475 -1903 1269 106 -2533 1037 1366 -1751 -91 664 -1589
2289 -1589 -75 1495 -727 -1043 1099 -251 -1362 1388 -65 -1446 235 671 -1133 400 792 -1269
2305 -1269 98 949 -825 -273 1219 -757 -388 600 78 -449 282 177 -39 781 312 -359 714 147
2323 147 -173 671 600 -235 -76 25 -675 767 354 -513 14 493 -820 718 773 -881 -202 936 -314
2342 -314 -646 1248 -174 -1205 637 98 -758 881 294 -1501 504 1000 -1367 142 1174 -1546
2358 -1546 -164 1772 -735 -1317 1248 -476 -1151 1382 119 -1781 611 1030 -1604 182 1415 -1739
2374 -1739 -493 1457 -700 -418 1473 -304 -2295 2116 755 -2295 821 1244 -2194 361 2100
2389 2100 -1584 -92 1514 -1379 -718 1577 -478 -1588 2212 378 -2132 1819 791 -2255 548
2404 548 1615 -1319 -86 1917 -918 -1068 2478 -350 -1022 1390 328 -1526 847 795 -1714 990
2420 990 1398 -1585 80 1798 -731 -361 1495 76 -1162 1561 -94 -1717 596 333 -1245 659
2436 659 736 -1445 -157 1042 -645 -760 860 -905 -843 1478 399 -898 206 679 -935 -244 657
2453 657 -1033 -422 299 -875 -215 1430 -677 -730 360 128 -958 -340 441 -959 -120 414 -325 -300
2471 -300 105 41 -352 2 94 -239 225 112 -64 55 291 -113 -131 205 20 -132 144 407 -55 -80 351
2492 351 107 106 334 348 -175 370 731 -389 -18 717 15 -328 776 211 -169 446 375 -398 883 627
2512 627 -386 -212 589 -265 -396 849 -173 -676 655 292 -680 463 243 -783 416 912 -850
2529 -850 -458 811 -537 -656 742 147 -927 694 33 -915 774 318 -791 101 730 -627 -483
2546 -483 1057 -546 -654 1128 111 -1120 569 309 -1027 134 560 -792 -378 719 -551 -495 792
2563 792 -349 -746 752 286 -894 394 657 -805 -289 524 -703 48 994 -423 -505 1044 225 -803
2581 -803 683 642 -579 407 512 -746 326 820 -411 -376 841 -23 -433 861 347 -707 605 576
2599 576 -638 181 729 -570 -112 872 -104 -616 803 73 -791 753 320 -781 437 778 -831 -152
2617 -152 872 -476 -522 692 -374 -912 670 51 -745 105 364 -901 116 626 -859 -200 452 -429
2635 -429 -616 775 -146 -626 292 84 -847 110 391 -817 -160 515 -725 -367 518 -433 -610 273 127
2654 127 -656 194 346 -791 -18 441 -316 -69 413 -371 -353 731 -241 -357 337 14 -286 141 415 -226
2674 -226 -254 331 49 -291 330 81 -337 227 5 -125 -121 424 -217 -55 423 20 -82 360 287 -210 343
2695 343 343 -45 -116 450 -311 -382 285 -54 -402 131 326 -600 12 443 -205 -459 404 -268 -430 719 -186
2716 -186 -623 160 271 -733 124 296 -649 -382 600 -645 -457 351 -463 -813 561 -198 -1023 346 296
2735 296 -799 -135 619 -759 -38 899 -433 -547 1022 -133 -744 580 45 -925 554 374 -938
2752 -938 326 794 -764 21 772 -668 -302 521 14 -552 837 227 -723 597 541 -901 350 996
2770 996 -442 -97 794 -369 -310 1070 173 -470 646 39 -611 482 571 -673 185 743 -318 17
2788 17 720 -401 -377 527 -22 -343 686 76 -588 129 -117 -496 331 190 -681 -182 304 -76 -390 48
2808 48 -196 -475 247 35 -254 -102 -354 -1 -7 -184 1 7 78 270 273 -265 -120 83 -379 -35 354 -262 -211
2831 -211 613 -173 -171 424 -154 -595 369 487 -588 44 547 -587 -140 1013 -100 -337 875 -275 -207
2850 -207 882 388 -926 679 437 -718 536 983 -707 79 1100 -310 -500 872 -167 -654 1130
2867 1130 508 -792 458 537 -1043 555 1058 -1091 -215 1163 -343 -525 1464 -318 -1153 1454 56
2884 56 -1198 999 313 -1531 676 1335 -1153 29 1154 -1096 -596 1198 -715 -1201 1168 -239
2900 -239 -1148 909 347 -1836 385 1198 -1381 -272 1417 -1167 -449 1328 -268 -998 1211 -220
2916 -220 -1178 1260 309 -1311 62 832 -1029 353 1276 -1197 -517 1194 -360 -1145 1167 -184 -1127
2933 -1127 1173 368 -1132 477 687 -1090 387 1114 -630 -446 886 -503 -539 1254 50 -1208
2949 -1208 643 419 -445 699 485 -1015 -81 904 -387 100 643 -290 -321 773 213 -489 285 8
2967 8 -528 281 184 -389 -476 276 6 72 428 -45 -606 -14 263 212 44 -28 -113 92 185 112 -122 -229 -39
2990 -39 274 62 -13 -217 -284 -217 30 52 25 -152 -287 -332 234 -442 -348 194 -237 -532 416 391 -477 -308 -127
3013 -127 -348 143 519 -277 -335 372 42 -354 426 -216 -672 303 230 -467 148 620 -888 171 714 -63
3033 -63 -554 685 -129 -221 850 289 -753 355 492 -507 200 864 -313 -155 1071 -103 -161 234 -72
3052 -72 -846 768 434 -625 168 345 -1001 15 1054 -622 -509 658 -483 -192 705 260 -618 544
3070 544 -2 -666 281 140 -647 159 839 -603 -141 647 -448 -491 531 169 -564 344 63 -778 2
3089 2 514 -586 -435 438 -25 -351 417 -321 -554 261 -119 -607 380 304 -464 131 315 98 -203 518 173
3110 173 -62 88 -242 -607 185 328 -244 311 540 60 -111 414 179 -279 558 181 -378 219 280 -383
3130 -383 90 337 -344 142 466 -30 -133 380 380 -483 145 79 -392 69 396 -241 -445 431 -173 -355 317
3151 317 60 -446 -18 452 -449 -277 141 -630 -458 376 -327 -264 597 -499 -747 518 57 -575 188 332
3171 332 -656 67 69 -460 -389 502 -12 -918 508 74 -542 413 119 -635 -99 440 -636 -450 447 -294
3191 -294 -481 341 -32 -435 535 219 -781 375 383 -456 -16 789 -765 -36 750 23 -605 590 306
3210 306 -372 466 554 -722 245 921 -517 335 476 -478 -262 502 -119 -523 750 242 -852 114 315
3229 315 -241 -495 816 -294 -633 810 -321 -373 273 -83 -756 448 142 -803 197 551 -522 -94
3247 -94 807 -499 -492 628 -219 -413 113 57 -654 205 398 -367 -185 536 -573 -22 586 -39 -651 402
3267 402 -135 -547 329 158 -453 183 124 -792 -121 471 -367 -104 636 -74 -328 475 -40 -508 218 277 -324
3288 -324 405 360 -104 42 -102 -24 -71 241 35 63 299 547 23 -89 194 -112 -153 485 -297 -124 267 -49
3310 -49 -14 85 413 -405 -191 351 -144 441 204 -100 -295 334 -28 -259 -51 -130 -27 364 318 -56 -290 12
3332 12 129 -116 333 411 -466 106 163 -455 -240 28 -211 -384 460 -146 -366 376 -21 -347 208 477 -480
3353 -480 -64 302 90 -549 476 -123 -552 402 226 -113 185 455 -399 568 380 -186 -104 725 -404 -126
3373 -126 552 171 -698 -107 287 -483 215 478 -722 -83 637 -96 138 540 -318 -343 706 256 -368 506
3393 506 168 -627 347 414 -640 -149 613 -363 -389 1081 -313 -606 472 90 -642 622 96 -531 277
3412 277 565 -525 236 700 -283 -482 523 24 -25 435 -480 -697 577 218 -548 265 195 -629 48 713
3432 713 -489 -148 474 -483 -346 394 64 -612 -25 -164 -475 -78 473 -611 -241 5 -238 90 -43
3451 -43 -418 -339 76 348 90 408 -53 -846 233 466 -104 -244 177 -319 229 497 163 -121 3 -147
3471 -147 164 528 -159 -87 -72 -89 197 445 -131 -56 355 -146 -156 420 87 -245 56 204 -39 748 -168 -313
3493 -313 -255 442 182 -93 -125 -595 -317 625 156 -280 254 -363 -403 498 11 -385 -67 -37 -143 91 515
3514 515 -684 -426 213 -223 -28 665 -498 -843 575 69 -698 104 -42 -606 -46 320 -374 -68 360
3533 360 -479 -184 868 -147 -507 -44 9 -364 330 254 -714 -368 501 -129 39 592 -455 -487 556 143
3553 143 8 664 -134 -750 633 737 -480 111 269 -329 -193 818 -107 -409 266 -84 -394 767 -126
3572 -126 -744 -94 120 -148 343 248 -654 -331 295 119 -211 571 -206 -561 518 551 -222 268 22 -531
3592 -531 240 766 -443 -340 519 161 -333 416 -18 -26 10 451 0 52 143 -727 -65 478 116 -215 -13
3613 -13 -15 -210 373 12 -108 -114 -126 -24 55 153 -266 6 56 -528 187 349 -204 -624 160 133 -421 457 404 -197
3637 -197 107 264 -53 -162 313 -109 126 634 429 -144 -442 42 -210 85 627 -599 -132 76 139 24
3657 24 289 -316 -148 -70 202 -147 -241 59 71 300 -134 64 178 113 316 -262 -18 52 -34 -110 350 49 63
3680 63 -7 -72 -354 126 363 8 -268 124 -147 -100 247 -233 -94 150 283 -223 92 85 -530 -101 -204 -119
3702 -119 -86 55 -79 46 32 98 -146 106 -98 -179 -239 188 -68 156 445 -425 59 49 53 -63 63 116 -96
3725 -96 297 325 -245 159 369 -395 114 193 -185 16 138 -71 -250 261 87 4 174 508 -261 12 202
3746 202 -180 -227 373 221 -459 419 240 -232 17 217 21 181 443 -168 51 219 95 8 18 256 -89
3767 -89 43 171 -467 -81 178 -226 -111 10 -86 -347 637 -4 -168 372 -246 -467 -18 190 -96 79 -278
3788 -278 -391 -238 255 -147 -426 -36 72 -241 291 147 -266 21 161 71 -135 534 -126 -340 -314 58 -277
3809 -277 -228 -112 -274 -34 177 -491 240 442 -403 -34 157 28 52 92 -73 -210 117 245 232 47 153
3830 153 146 47 -142 35 -72 24 -73 38 5 331 168 -55 242 251 -257 -21 318 -40 133 244 -60 -14 355
3853 355 332 -2 -32 103 -93 102 -61 -164 -38 193 -390 -119 461 -417 -270 -118 17 -177 288 2 -353
3874 -353 281 221 -315 -259 73 -158 -68 250 -193 -299 -9 -108 -487 430 115 -511 329 358 -340 -8 224 -428
3896 -428 -238 474 -161 -209 332 5 -647 311 599 -495 415 341 -460 -47 147 -172 230 443 -59 -204
3916 -204 553 -391 -369 472 -37 -621 67 385 -571 92 461 -115 30 388 -178 -307 503 273 -438 297
3936 297 256 -386 141 247 -271 73 285 -309 26 464 39 -456 300 -267 -212 47 213 -187 185 43 -325
3957 -325 -28 581 -26 -100 422 70 -389 187 380 -333 -195 356 -241 -259 163 -560 -25 161 -142 -302 228
3978 228 -100 -265 206 -82 -497 17 46 -135 -121 116 -153 158 13 -194 -143 -178 56 -209 -95 186 -107
3999 -107 180 143 -389 -113 90 228 -153 -31 264 -370 -48 19 206 -12 119 77 -149 256 447 -14 -50
4020 -50 686 -116 -108 69 9 -302 272 -76 53 320 150 -102 187 49 76 102 302 -178 -487 132 69 -119
4042 -119 86 41 -150 580 200 -402 205 -232 -311 162 131 66 -353 -15 163 4 147 -289 -193 317 408 -234
4064 -234 -124 231 26 -313 339 245 -430 454 -78 -381 290 62 -178 -53 81 41 306 524 -227 -81 501
4085 501 -319 183 411 -97 -373 255 452 -289 255 -119 -108 -91 520 -159 -358 41 166 -342 320 -10 -208
4106 -208 39 123 -293 211 519 -158 26 455 372 -283 447 108 -170 104 23 -188 104 -27 3 -58 349 -217
4128 -217 -168 419 -143 -58 254 357 180 23 436 60 -170 139 -135 98 215 -86 -314 -33 -4 -349 93
4149 93 288 -49 -192 -25 205 -232 -10 -7 -294 148 17 -145 118 -86 -30 39 114 -77 129 -66 100 -116
4171 -116 -81 209 -104 133 143 62 -91 326 -228 163 85 259 -258 -97 122 -246 81 283 -160 13 84 -14
4193 -14 -129 350 -36 -304 459 261 14 237 264 -272 132 175 -11 -76 157 45 11 348 129 -232 170 -85
4215 -85 -160 250 383 -282 71 86 74 -283 -60 5 -229 -19 46 -53 64 -106 -472 112 136 175 -64 167 52
4238 52 195 9 110 -210 -58 62 -47 7 135 -102 -14 -156 -149 -324 -89 -270 -55 47 224 79 -43 -184
4260 -184 -241 -241 -56 111 -154 8 -131 -168 -41 164 -178 149 -22 246 -274 236 76 -76 230 -52 -208
4281 -208 294 117 21 210 72 -218 81 393 -3 -147 215 -27 -248 -109 133 10 -71 45 -164 -157 110
4302 110 -81 -438 130 203 -43 278 -252 -551 290 74 57 -257 81 -193 65 142 49 -410 168 -112 -61 240
4324 240 20 -130 -176 270 -575 123 371 -116 -267 239 -199 62 61 -147 -122 -26 -129 -94 -32 117 -185 178
4346 178 89 -47 21 368 -20 -71 302 -13 -234 226 333 -51 -32 109 -66 -82 304 -368 -117 143 -59 -329
4368 -329 475 30 -145 -193 284 69 119 341 133 -176 56 -66 -51 272 -219 274 97 86 -31 214 313 -195
4390 -195 131 85 -294 -94 -150 258 250 19 -43 -218 -90 -88 30 87 29 19 -46 -66 163 135 -131 61 84 -72 -200
4415 -200 -289 -123 59 -96 36 124 -194 -80 -269 64 247 49 43 -117 216 -104 -47 -117 -234 198 -131 134
4437 134 -156 24 228 -40 -156 -109 72 125 139 -172 -117 -78 96 8 -98 197 -254 13 137 8 -282 -52
4459 -52 58 86 -94 -39 115 28 162 3 -227 103 293 -143 -85 96 -13 -79 72 148 -19 91 101 -242 170
4482 170 320 38 -150 149 -38 270 231 31 -54 110 57 10 10 -77 -217 56 -168 -203 44 145 -85 -200 210
4505 210 -110 -286 10 -14 -42 -81 281 -135 25 277 147 400 128 230 -224 18 445 -51 -13 -70 -3 71
4527 71 305 146 -68 236 -2 -28 32 176 -38 8 -160 -420 353 387 -100 -201 -145 280 96 -42 -3 332
4549 332 160 109 -100 43 -137 137 -1 195 113 -43 203 -293 296 -42 40 -206 100 -64 352 161 2
4570 2 -77 157 -2 99 86 72 37 -144 -4 74 23 -458 -29 -164 103 344 74 21 -154 -198 295 116 -36
4593 -36 -344 -278 277 86 -55 -188 176 -78 -130 -36 28 -1 -324 65 12 115 56 -234 -68 -173 154 133 18
4616 18 -69 87 108 212 40 -306 133 -107 118 45 -40 -79 -137 -32 -172 336 -166 -298 3 -40 210 209 -202
4639 -202 12 -1 -82 -53 45 -114 -255 516 263 -161 -314 -51 -268 -322 272 211 141 47 -71 -31 67 76 -310 -153
4663 -153 -41 -187 215 348 -308 156 129 43 164 41 19 -12 20 -38 92 -172 129 -25 -239 87 236 -164
4685 -164 1 8 77 83 108 -49 -15 116 -38 153 89 -195 -102 -195 -59 70 -191 -229 -250 125 287 -5 131 -40
4709 -40 -35 -190 -298 20 -12 110 -10 -62 29 -135 -144 -386 226 53 309 102 -94 237 462 -140 -93 11 -343
4732 -343 300 -123 240 -86 -230 -166 153 -5 268 -37 219 11 29 -1 -456 -105 60 266 -268 92 12
4753 12 209 101 -137 54 -71 152 -190 272 36 268 -43 -170 -97 89 266 -168 91 92 -69 -68 -22 -45 -52
4776 -52 -255 -146 -116 -159 -140 -172 -52 -24 412 225 -17 77 -13 -337 -8 173 -60 -140 167 204 -283 -62 352
4799 352 -111 -56 70 133 -61 -498 35 42 -110 354 -81 118 -358 89 -446 403 99 -476 -294 51 115 176
4821 176 -373 140 -15 -101 113 454 238 -375 -37 -24 -87 189 -30 215 214 424 117 53 -346 238 130 126 252
4844 252 -52 -376 58 201 -181 -87 28 -117 102 51 99 -71 -229 440 13 53 -56 161 -514 347 -69
4865 -69 144 41 97 -252 -20 113 192 -126 -144 -35 -286 -251 417 -256 208 116 -161 282 105 -49 4 237
4887 237 -94 125 277 -191 -134 391 250 238 137 195 23 -79 308 44 27 -76 -68 36 -242 38 -168 -258
4909 -258 -255 52 -306 174 -177 44 4 88 -81 277 -290 76 -170 38 19 -194 169 148 -245 205 4 -106
4931 -106 46 -370 -238 -92 323 180 365 -61 -155 83 259 -121 157 567 -358 -122 -172 196 -123 -61 529
4952 529 -21 10 -63 -255 264 186 172 7 286 -43 -426 -271 214 67 -52 -121 490 288 34 55 -44 -25 -89
4975 -89 -263 51 156 101 48 -146 -270 -219 -65 -7 109 109 34 8 -42 177 -67 -64 71 -195 -384 162 -14 38
4999 38 252 -158 -108 -21 76 183 53 -142 -116 260 -78 116 -59 79 -56 7 171 -135 -130 181 169 -208 41
5022 41 15 99 -235 -298 -318 -247 92 -161 -34 287 370 -334 236 165 -136 -54 -25 -136 -63 -107 -200 -106 48 -102 -209
5047 -209 176 -207 -94 426 -124 119 -268 40 -67 -199 -50 -213 -40 270 -46 -191 75 99 -257 -335 28
5068 28 -65 176 -213 -73 86 -129 -35 118 -78 -153 -273 -68 65 -407 -414 -142 389 129 -119 81 125 41 10
5091 10 -237 -19 150 288 51 349 -75 -262 84 207 -105 -161 252 -69 60 -62 -88 -502 96 111 -326
5112 -326 206 -92 -100 -202 54 234 320 14 -85 204 210 -227 -140 -285 -46 57 179 -3 -208 68 -229 11
5134 11 -124 -83 -56 -38 -284 -176 -292 -231 -85 -76 61 5 54 -26 -31 -459 52 315 -132 -95 174 -173 156 243 -294
5159 -294 96 185 67 41 207 228 -80 -400 342 -96 -137 -115 -58 -37 149 331 145 -174 -82 -164 15 -111 79
5182 79 -64 323 -186 190 233 -14 -303 36 73 -9 190 -157 -148 -153 -25 -204 241 -106 48 85 -19 208 56
5205 56 -159 -189 -6 164 -146 -148 -56 423 207 -153 247 -113 -180 30 86 68 704 -609 -27 642 9 58 -73
5228 -73 197 -112 -321 143 211 23 1 -191 -324 -222 -181 142 -497 -66 -432 305 -258 -501 -184 -538 190
5249 190 32 -441 150 219 -203 301 86 -111 -269 203 21 -6 221 366 -121 215 37 -302 342 -232 -66
5270 -66 -84 429 212 -602 -54 -68 -108 -86 -145 -118 -220 349 87 225 142 -6 118 219 -135 179 186 -21 258
5293 258 7 16 125 124 -109 6 55 -106 79 -94 87 157 70 -113 -91 18 -118 -321 -226 -31 -76 53 213
5316 213 164 157 100 320 -220 -128 189 48 -336 267 334 -146 -139 -102 384 -125 303 -306 -324 -254 -89 84 259 -221
5340 -221 275 152 334 3 -182 245 41 52 -86 -323 209 216 -592 -531 170 239 -131 -130 251 138 -241 430
5362 430 -251 38 148 -369 154 182 -332 -6 201 154 -30 -212 14 -38 -34 133 154 164 -151 -236 -138 -32 92
5385 92 290 308 550 -228 20 274 123 222 -118 -173 -217 87 234 -254 201 -102 -74 -394 54 172 90 16 41
5408 41 80 118 -75 -293 188 249 96 78 -292 74 -28 -152 -175 185 -312 281 174 -208 357 347 -105 -295
5430 -295 -196 207 2 219 363 -168 -41 369 -132 39 -219 144 242 21 -34 191 217 -110 191 39 87 -113
5452 -113 -31 -337 270 -55 174 -112 -174 -74 462 146 -94 142 -58 87 -423 -138 -281 22 271 321 158
5473 158 49 -112 -132 -153 26 -264 -157 -332 401 -156 -359 287 197 18 88 -217 -22 -23 68 214 -312 232
5495 232 36 -288 211 -133 -132 75 153 169 170 -39 78 -58 -29 9 126 -406 -395 -128 0 -306 113 142 -144
5518 -144 -228 243 -490 -6 -267 -447 522 290 212 -92 147 -418 -60 -334 480 -215 -157 65 -74 -34 71
5539 71 64 211 -238 -69 -106 -112 -280 226 114 -69 257 -236 -262 -82 287 89 -208 27 -11 -165 268 -406 -16
5562 -16 -365 -92 122 310 -185 -230 -109 388 4 104 243 -42 -40 -181 149 -230 2 -241 -315 -304 260 -182
5584 -182 118 -203 76 -98 -121 -192 -104 -13 88 144 -195 -79 -132 3 32 -54 46 -37 -410 -16 -148 98 11
5607 11 138 112 -153 -112 48 89 52 57 152 118 425 -263 -110 -83 263 213 192 84 -249 204 -154 -31 113 -74
5631 -74 -256 289 -24 40 167 -266 -192 311 289 70 107 403 88 105 134 58 61 -124 22 -189 147 77 -165 -72
5655 -72 -23 -33 77 -132 1 267 -233 362 -193 -185 -387 -203 50 263 -19 -35 -18 38 273 -102 17 -269 -54
5678 -54 56 -657 -138 -186 -86 202 206 320 87 328 -55 -324 -25 405 354 11 110 122 115 118 -185 218 -266 -85
5702 -85 325 -103 -112 95 -161 44 -403 -146 -114 -156 289 -149 -170 -60 139 -202 -129 71 301 161 236 76 -60
5725 -60 310 -75 -242 -526 44 51 -75 -175 -43 -75 -182 151 393 -63 149 -7 128 220 144 -227 51 170
5747 170 34 -114 33 55 87 245 90 331 -108 205 -123 316 -292 74 26 19 138 -248 -123 -63 -298 308
5769 308 -477 200 -44 407 -265 -26 -241 -184 -212 36 354 52 -47 -11 62 85 -83 244 138 347 -99 -127
5791 -127 -75 -161 -348 531 200 -144 -50 -239 -153 -17 169 225 33 233 -206 23 75 85 74 240 446 -158 203
5814 203 198 -305 -128 -255 -69 195 -59 74 229 136 -147 -546 59 -333 205 38 82 85 -459 113 44 170
5836 170 -69 -27 -169 -242 -231 -196 -91 26 -160 114 -275 131 -57 64 -213 5 7 14 55 56 -33 -172 372 -279
5860 -279 -240 72 -603 204 243 21 -121 -141 302 -78 167 292 29 -212 -141 -186 -179 230 -8 -122 -18 -62 -35
5883 -35 309 84 45 -145 38 -20 -65 69 -179 -2 185 415 218 42 333 356 -37 78 -60 -82 -106 92
5905 92 124 45 -24 124 187 175 23 121 76 139 -139 -256 -95 -87 -11 12 222 365 -46 -290 -476 105 166 75 353
5930 353 -38 38 249 315 -53 -18 168 327 255 -152 140 275 -212 -39 147 124 -115 -82 -156 243 -328 -374 11
5953 11 -4 -255 -70 -210 -175 -354 -201 -63 240 21 109 24 340 -11 -169 13 238 -2 -24 69 329 468
5975 468 5 76 -175 205 230 35 181 459 150 108 118 -202 -165 -156 -25 180 -139 -104 -270 139 -46 -54 259
5998 259 -95 -82 -176 -114 137 -135 -138 -285 -56 -25 -93 -229 -231 22 41 153 -16 -117 232 -160 -431 -33 219
6021 219 -166 96 563 21 -159 -354 176 88 -394 -240 -5 -255 -282 -32 92 -72 -62 -233 -338 99 -293
6042 -293 -15 179 -281 20 -224 -276 -168 216 -5 -274 -183 76 -140 -332 -53 149 -246 -153 -183 57 91 -136
6064 -136 -107 122 37 75 1 43 -115 -22 196 164 -514 271 -102 -63 414 125 320 34 189 -79 88 130 -242
6087 -242 -16 -76 -275 -138 59 -149 248 -214 -84 -368 -399 -8 -294 -291 189 70 -189 -20 -4 -186 -263 27
6109 27 -66 190 -140 -288 -575 -45 65 176 188 161 63 -197 -104 222 -57 -2 362 -158 -86 -241 -232 198 -158
6132 -158 -76 32 -20 359 -23 -183 47 -171 178 49 233 212 -76 22 -144 -92 40 -188 -33 -123 -234 -207
6154 -207 128 360 245 38 191 -175 192 181 -30 216 -537 187 -318 -64 228 297 91 95 276 345 -254 7
6176 7 152 106 149 -99 -38 6 134 38 -16 -260 -145 -71 253 -91 -54 90 -194 174 -257 30 227 64 -108
6199 -108 -176 -289 323 -372 -377 230 -104 82 277 233 230 219 71 212 369 -241 76 141 -45 108 93 -406 -290
6222 -290 16 214 -21 86 -91 -491 -17 193 245 -196 -120 -268 243 155 -1 215 162 170 -17 69 230 159 38
6245 38 6 272 -145 76 -86 -62 -10 383 -462 30 -130 -73 156 -164 154 -140 -146 -101 -52 -134 261 -26 -16 -101
6269 -101 -152 -58 73 -26 115 -27 73 -255 -97 -302 -158 18 -29 -6 -261 -10 -48 -90 136 18 -98 144
6291 144 -25 221 49 -62 126 196 -6 19 -173 74 -161 112 -97 21 222 -95 -95 27 -20 223 309 135
6313 135 198 -159 -253 313 -104 -158 176 143 28 292 -162 -316 116 79 7 -52 166 -51 226 -131 -246 -125
6335 -125 137 -231 -267 204 -9 190 -11 152 146 125 113 -230 -143 -181 377 174 -179 21 -7 2 -376 -161 -382
6358 -382 157 -351 -12 -123 61 -89 62 -129 -45 -44 141 8 -297 41 -106 -113 -134 28 138 228 -187 53
6380 53 125 -304 -173 24 -17 -119 14 85 -228 178 -87 -142 396 -78 -198 -630 -60 219 -6 -94 -17 314
6402 314 -12 -84 -14 -189 -444 -77 -71 -165 -130 -330 59 116 34 -172 -275 77 -106 184 122 1 -57 314 54
6425 54 -330 -58 -17 -109 -8 163 -5 34 24 168 61 93 -161 -6 3 210 -13 -136 194 538 2 -50 182
6448 182 169 -224 -208 164 -3 191 -207 -66 37 -405 71 -21 -72 2 -67 115 -22 29 217 -154 136 -77
6470 -77 -105 -240 -114 215 -107 22 -135 42 -119 -99 -280 -104 -117 -175 -18 -120 194 348 90 -276 332 -5
6492 -5 288 84 85 -29 -5 -426 70 -132 -106 142 22 168 208 -5 4 -183 288 -23 -127 309 55 188 72
6515 72 -278 -130 -18 60 -33 258 -53 254 -28 67 -51 -292 -229 58 315 -488 -51 67 -61 34 -72 -38
6537 -38 -1 -114 -23 -22 78 318 469 285 93 -290 262 367 219 -294 182 196 -100 163 -145 40 0 -15 -118
6560 -118 -341 81 -241 -143 -217 -197 166 92 25 116 193 38 120 220 -178 125 -157 -122 155 72 -355 -124 -54 87
6584 87 66 81 -162 -157 -69 -282 146 157 1 23 31 -228 6 106 -156 103 -46 -67 219 80 55 -271 66 -187
6608 -187 45 147 -231 -361 -6 -517 -63 -235 108 161 -151 62 190 -115 -199 -34 139 219 -191 -337 86
6629 86 33 -129 76 41 -445 -126 -18 -238 -107 77 -96 -113 70 -64 -226 59 57 -73 185 -260 -229 -325 26
6652 26 -103 173 -10 125 -90 -41 282 -73 51 30 108 153 -217 -58 63 211 161 -7 120 -106 83 23
6674 23 36 101 -38 -124 -154 -14 -137 -23 87 105 321 96 -93 -107 -16 37 105 -178 -41 52 382 -41 109 -112
6698 -112 -232 -184 -157 -71 -116 38 -99 469 193 -221 73 65 -114 77 63 63 295 168 -95 -98 -203 40 -8 -289
6722 -289 2 -85 74 -245 51 73 -191 -69 279 76 2 58 88 55 166 -7 -33 53 186 -301 43 -103 117
6745 117 206 -179 61 -49 39 -184 -186 -22 223 -166 -53 246 161 -13 65 -274 -206 -48 332 -2 88 -142 -254
6768 -254 183 -181 84 -41 -106 -102 142 -80 -95 -186 135 88 128 -121 48 -169 133 -28 165 -242 -28 339
6790 339 120 -284 -159 214 200 80 193 -14 153 254 110 55 196 -70 -43 -59 -72 -31 -325 -364 9 429
6812 429 -144 37 -46 -114 16 -78 8 -326 -131 -141 -12 484 -62 364 -212 97 -68 451 42 244 61 -25
6834 -25 -93 193 72 18 52 135 345 24 -250 358 -354 61 154 52 -187 22 -157 -181 101 -508 148 19
6856 19 1 -56 529 174 -134 -228 -243 -182 -204 -31 -215 -298 -256 -28 -88 191 -61 279 -151 247 -331 46 197
6879 197 137 67 209 261 -44 -47 -227 -119 59 108 48 -339 -350 342 33 -43 110 -264 267 -6 -102 -302 46
6902 46 -95 -41 51 -348 91 68 421 -447 -112 132 -41 -309 -256 -23 89 236 119 254 -150 -126 192 182
6924 182 -173 40 -144 143 2 -538 -525 200 220 35 124 81 67 -236 -43 -216 -141 160 16 -84 -209 288
6946 288 125 89 395 -33 -52 -128 162 -147 -548 -237 238 -2 -30 220 -69 29 14 -45 -77 -40 -247 -23 84
6969 84 270 -74 -135 -1 -15 -75 -248 26 -188 -33 26 -207 126 128 -6 -94 -275 -18 362 -231 -30 1 122
6992 122 -102 -143 -47 107 183 129 -293 -137 -41 91 -23 -30 -203 -105 292 29 9 -55 79 -242 -96 -95 -143 -83 240
7017 240 -313 651 75 -71 -22 -229 131 299 -59 131 -91 -41 -83 -244 71 -82 3 -47 -92 -226 78 -1
7039 -1 185 -37 -139 -150 -101 18 -49 38 -43 -155 -62 -21 -175 67 -217 -182 -31 -50 -66 -87 -152 -101 -77 -53 48 -140
7065 -140 48 -68 -214 29 -70 163 2 -107 -3 -46 -4 19 68 -23 -163 -37 152 158 -310 81 135 32 -33
7088 -33 -34 435 -160 -108 204 158 61 -5 19 3 -23 80 -115 -53 206 159 -36 27 -182 173 -112 -28 -143 -206 -204 -71
7114 -71 279 221 -145 90 109 166 -148 40 105 78 -40 49 71 -125 135 173 -203 -102 -79 0 -41 9 -298 -118
7138 -118 -126 -186 63 296 -49 290 41 -244 -5 -33 -68 175 -72 -74 92 -15 73 227 -43 -29 -150 216 216 -268
7162 -268 37 -35 224 -100 4 224 -241 68 -228 -324 78 21 20 2 197 -71 -113 -210 188 -188 124 391 -220
7185 -220 -98 -176 -108 -142 296 -88 -90 -240 3 329 -31 179 -19 -199 75 404 44 -11 -228 142 45 117 -142
7208 -142 50 -101 152 -61 -347 104 88 55 -211 -24 218 -149 53 238 -49 244 -381 -33 -177 17 -236
7229 -236 -65 -11 58 -73 63 250 -124 162 190 -71 98 12 54 -102 -233 144 4 235 -20 -90 -73 -33 -300
7252 -300 104 -271 -436 4 -133 -36 212 96 97 310 -199 -116 310 3 132 -213 88 -228 357 6 -102
7273 -102 -242 161 -149 251 212 188 307 -62 115 170 50 -147 -235 159 -112 -23 129 -79 148 -149 254 508
7295 508 -145 -179 55 77 184 13 -27 100 -114 58 -54 -228 60 -89 -61 123 -69 354 175 282 -257
7316 -257 -109 156 172 400 -100 -246 252 70 -144 237 -85 -84 -353 50 -72 54 -134 -283 -1 50 70 122
7338 122 217 -67 46 -35 -204 199 31 300 205 -108 157 -348 225 36 27 46 -141 -81 134 184 -286 95 322
7361 322 76 -34 155 -115 -178 -270 103 -207 -77 -162 -162 21 102 17 156 -79 122 225 -58 -56 104 75 -136
7384 -136 0 254 140 84 237 -16 217 245 -129 -185 -54 -32 37 -116 165 170 282 -339 40 -12 21 119 -178
7407 -178 -76 207 -222 -177 164 -53 -416 -146 120 68 -91 -483 68 235 -166 192 -135 164 76 149 -104
7428 -104 44 15 183 402 110 130 -99 -152 90 -53 -142 216 256 -19 -116 350 36 -337 -120 -291 -94 -95 145
7451 145 49 135 95 -8 -82 14 247 -174 -109 -108 262 -183 116 295 -197 165 1 -18 43 142 86 -219 -63 5
7475 5 257 183 64 114 64 -278 197 -26 228 3 407 15 9 13 164 60 -387 251 -82 71 -78 -29 -129
7498 -129 -214 -13 -32 8 -53 -176 157 116 273 -100 -60 108 -149 -65 -196 -17 -42 -202 24 -264 61 -7 -73
7521 -73 -49 90 -208 125 310 -38 -43 -86 -255 -108 -14 121 206 249 154 71 178 203 -254 65 443 -143 45 51
7545 51 -73 23 12 -257 -18 -108 145 85 18 -72 41 163 103 63 201 -176 -53 290 -46 -68 128 -191 -55
7568 -55 -222 95 -377 170 -55 -85 -107 48 231 91 144 25 -106 -56 86 -157 151 22 -137 87 -27 -146
7590 -146 -25 141 8 -158 395 -139 47 35 4 -264 67 -280 185 8 163 144 155 -33 -59 93 280 -604
7612 -604 -476 -241 204 -2 230 -280 12 -113 139 -87 116 164 215 20 -175 94 -71 209 -233 -7 -183
7633 -183 -23 -166 -274 -82 71 64 -424 131 306 258 -241 -145 57 -60 161 317 -231 37 24 -47 -85 64
7655 64 -87 124 28 107 -150 -216 -316 249 -121 -4 -268 -193 -34 -292 52 337 208 83 -108 30 233 65
7677 65 136 -82 78 -19 -15 -38 118 16 -52 140 -10 14 45 41 -16 232 124 85 -260 206 181 -9 -196 -31 61
7702 61 -42 71 -207 31 -230 278 368 -376 64 -77 -46 -2 -45 140 -29 -298 59 -325 -52 2 289 -325
7724 -325 -38 -137 442 148 177 108 -48 -131 -157 -60 -99 -136 56 72 263 -135 -58 68 -68 -55 -53 -92 18 121 -268
7749 -268 -183 -90 -45 80 -65 -101 225 55 37 84 -114 34 117 21 -81 -484 -152 113 -145 -86 -84 39 -25 -137
7773 -137 108 74 45 -44 240 120 297 -87 -82 -285 -119 -51 48 -11 -49 351 202 -45 -179 -123 -18 76 103 175
7797 175 -29 -54 -208 105 -107 106 297 -41 271 62 7 -86 -398 26 -42 -234 41 -118 -29 270 -107 282
7819 282 -39 4 57 110 211 19 0 1 -190 -183 49 336 152 497 -91 393 541 -183 -50 149 141 158 -65 -187
7843 -187 115 207 202 -224 58 -21 -196 -83 -3 73 47 -233 211 -208 -34 -94 -128 -6 174 -218 -65 -62 -189 48
7867 48 109 -31 -188 49 -46 -106 -57 -50 -202 -112 127 244 -279 -180 44 258 73 531 -102 98 51 264 196 147
7891 147 -47 131 85 -278 -97 168 -196 -68 100 -150 -61 124 -151 108 1 -107 -109 278 -44 64 217
7912 217 17 -94 -117 -27 -45 -82 -83 234 73 -48 1 130 151 -196 -92 70 -398 -141 -19 89 21 77 44 -152
7936 -152 147 30 -26 223 119 -85 -47 127 53 -222 -252 -17 262 104 244 371 249 122 -93 83 286
7957 286 -202 251 44 217 -54 436 -490 141 -172 -50 38 243 -91 137 53 -52 6 -81 120 64 7 -73
7979 -73 3 -41 -114 -11 -23 -159 253 -8 -159 69 75 21 -100 46 34 2 -39 -75 62 28 11 -62 71 -25 -63 47
8005 47 260 278 48 -212 70 -45 130 -198 -39 -80 24 9 188 -298 -8 313 -121 -29 -58 -297 -105 -122
8027 -122 226 75 -332 206 15 -72 -348 -102 43 95 199 -162 -211 186 -196 0 40 -20 -57 72 -34 -26 -73
8050 -73 -65 50 -307 -34 146 -6 -57 -180 177 -174 62 56 -139 57 14 -55 -231 -196 -55 -93 291 -207 -251 -123
8074 -123 -221 199 290 200 -228 46 -23 -197 -186 160 -95 -16 -151 132 -47 7 20 202 245 -165 -250 96 -180
8097 -180 -201 -88 177 1 -221 71 -218 250 29 -39 280 55 250 132 -219 3 41 303 148 -214 -96
8118 -96 -372 -78 141 -187 366 -268 -217 -88 -81 -229 146 -452 53 209 -167 98 169 -193 -364 17 -45 147
8140 147 -124 37 -1 -50 -179 -414 -97 105 -72 334 187 91 -182 -57 -150 -145 -96 95 44 -108 -124 240 227
8163 227 -98 148 140 -59 -461 78 -100 25 231 194 219 -142 -30 -351 85 96 39 -164 -54 106 102 -54 150
8186 150 441 198 -260 98 61
8191F1
##END NTUPLES=NMR FID
##END=
