##TITLE=1H_2AAK_W
 D2O
 8 sc, 
 10.4.2024
##JCAMPDX= 6.0         $$ Bruker NMR JCAMP-DX V2.0
##DATA TYPE= NMR FID
##DATA CLASS= NTUPLES
##ORIGIN= UXNMR, Bruker Analytische Messtechnik GmbH
##OWNER= root
$$ XWIN-NMR		Version 3.5
$$ Wed Apr 10 15:48:53 2024 Russian Standard Time (UT+4h)  she@DPX200
##.OBSERVE FREQUENCY= 200.1309
##.OBSERVE NUCLEUS= ^1H
##.DELAY= (6, 6)
##.ACQUISITION MODE= SIMULTANEOUS
##.ACQUISITION SCHEME= undefined
##.AVERAGES= 8
##.DIGITISER RES= 18
##SPECTROMETER/DATA SYSTEM= spect
##.PULSE SEQUENCE= zg30
##.SOLVENT NAME= CDCl3
##.SHIFT REFERENCE= (INTERNAL, CDCl3, 0, 15.7039)
##AUDIT TRAIL= $$ (NUMBER, WHEN, WHO, WHERE, WHAT)
$$ ##TITLE= Audit trail, XWIN-NMR		Version 3.5
$$ ##JCAMPDX= 5.01
$$ ##ORIGIN= Bruker BioSpin GmbH
$$ ##OWNER= she
$$ F:/spectra/data/she/nmr/H-F/1/audita.txt
$$ ##AUDIT TRAIL=  $$ (NUMBER, WHEN, WHO, WHERE, WHAT)
(   1,<2024-04-10 15:47:57.10 +0400>,<she>,<DPX200>,
      <created by zg, POWCHK disabled, PULCHK disabled
       configuration hash MD5:
       00 E9 B6 7A A2 85 ED C7 34 08 36 98 17 FE 4E 26
       data hash MD5: 16K
       7F F7 55 16 89 52 44 63 57 97 35 F4 5E 7F B1 89>)
$$ ##END=
$$ 
$$ hash MD5
$$ 2C A6 E2 58 C5 23 04 D7 AD D8 F5 86 ED 24 67 B3
##$RELAX= 
##$RELAX= 
##$RELAX= 
##$RELAX= 
##$RELAX= 
##$RELAX= 
$$ Bruker specific parameters
$$ --------------------------
##$DU= <F:/spectra>
##$EXPNO= 1
##$NAME= <H-F>
##$PROCNO= 1
##$TYPE= <nmr>
##$USER= <she>
##$AMP= (0..31)
100 100 100 100 100 100 100 100 100 100 100 100 100 100 100 100 100 100 
100 100 100 100 100 100 100 100 100 100 100 100 100 100 
##$AQSEQ= 0
##$AQ_mod= 1
##$AUNM= <au_zg>
##$AUTOPOS= <>
##$BF1= 200.13
##$BF2= 200.13
##$BF3= 200.13
##$BF4= 200.13
##$BF5= 200.13
##$BF6= 200.13
##$BF7= 200.13
##$BF8= 200.13
##$BYTORDA= 1
##$CFDGTYP= 0
##$CFRGTYP= 5
##$CHEMSTR= <none>
##$CNST= (0..31)
1 1 145 1 1 1 1 1 1 1 1 1 1 1 1 1 1 1 1 1 1 1 1 1 1 1 1 1 1 1 1 1 
##$CPDPRG= <>
##$CPDPRG1= <>
##$CPDPRG2= <>
##$CPDPRG3= <>
##$CPDPRG4= <mlev>
##$CPDPRG5= <mlev>
##$CPDPRG6= <mlev>
##$CPDPRG7= <mlev>
##$CPDPRG8= <mlev>
##$CPDPRGB= <>
##$CPDPRGT= <>
##$D= (0..31)
0 1.2 0 0 0 0 0 0 0 0.06 0 0.03 0 0 0 0 0.0002 0 0 0 0 0 0 0 0 0 0 0 0 
0 0 0 
##$DATE= 1712749676
##$DBL= (0..7)
120 120 120 120 120 120 120 120 
##$DBP= (0..7)
150 150 150 150 150 150 150 150 
##$DBP07= 0
##$DBPNAM0= <>
##$DBPNAM1= <>
##$DBPNAM2= <>
##$DBPNAM3= <>
##$DBPNAM4= <>
##$DBPNAM5= <>
##$DBPNAM6= <>
##$DBPNAM7= <>
##$DBPOAL= (0..7)
0.5 0.5 0.5 0.5 0.5 0.5 0.5 0.5 
##$DBPOFFS= (0..7)
0 0 0 0 0 0 0 0 
##$DE= 6
##$DECBNUC= <off>
##$DECIM= 32
##$DECNUC= <off>
##$DECSTAT= 4
##$DIGMOD= 1
##$DIGTYP= 9
##$DL= (0..7)
0 120 120 120 120 120 120 120 
##$DP= (0..7)
150 150 150 150 150 150 150 150 
##$DP07= 0
##$DPNAME0= <>
##$DPNAME1= <>
##$DPNAME2= <>
##$DPNAME3= <>
##$DPNAME4= <>
##$DPNAME5= <>
##$DPNAME6= <>
##$DPNAME7= <>
##$DPOAL= (0..7)
0.5 0.5 0.5 0.5 0.5 0.5 0.5 0.5 
##$DPOFFS= (0..7)
0 0 0 0 0 0 0 0 
##$DQDMODE= 0
##$DR= 18
##$DS= 0
##$DSLIST= <SSSSSSSSSSSSSSS>
##$DSPFIRM= 0
$$ [...]
##$SUBNAM2= <"">
##$SUBNAM3= <"">
##$SUBNAM4= <"">
##$SUBNAM5= <"">
##$SUBNAM6= <"">
##$SUBNAM7= <"">
##$SUBNAM8= <"">
##$SUBNAM9= <"">
##$SW= 18.0517689322627
##$SWIBOX= (0..15)
0 0 2 0 0 0 0 0 0 0 0 0 0 0 0 0 
##$SW_h= 3612.71676300578
##$TD= 16384
##$TD0= 1
##$TE= 0
##$TE2= 300
##$TE3= 300
##$TEG= 300
##$TL= (0..7)
0 120 120 120 120 120 120 120 
##$TP= (0..7)
150 150 150 150 150 150 150 150 
##$TP07= 0
##$TPNAME0= <>
##$TPNAME1= <>
##$TPNAME2= <>
##$TPNAME3= <>
##$TPNAME4= <>
##$TPNAME5= <>
##$TPNAME6= <>
##$TPNAME7= <>
##$TPOAL= (0..7)
0.5 0.5 0.5 0.5 0.5 0.5 0.5 0.5 
##$TPOFFS= (0..7)
0 0 0 0 0 0 0 0 
##$TUNHIN= 0
##$TUNHOUT= 0
##$TUNXOUT= 0
##$USERA1= <user>
##$USERA2= <user>
##$USERA3= <user>
##$USERA4= <user>
##$USERA5= <user>
##$V9= 5
##$VALIST= <valist>
##$VCLIST= <CCCCCCCCCCCCCCC>
##$VD= 0
##$VDLIST= <DDDDDDDDDDDDDDD>
##$VPLIST= <PPPPPPPPPPPPPPP>
##$VTLIST= <TTTTTTTTTTTTTTT>
##$WBST= 1024
##$WBSW= 4
##$XGAIN= (0..3)
0 0 0 0 
##$XL= 0
##$YL= 0
##$YMAX_a= 46727
##$YMIN_a= -52182
##$ZGOPTNS= <>
##$ZL1= 120
##$ZL2= 120
##$ZL3= 120
##$ZL4= 120
##$ABSF1= 10
##$ABSF2= 0
##$ABSG= 5
##$ABSL= 3
##$ALPHA= 0
##$AQORDER= 0
##$ASSFAC= 0
##$ASSFACI= 0
##$ASSFACX= 0
##$ASSWID= 0
##$AUNMP= <proc_1d>
##$AZFE= 0.1
##$AZFW= 0.1
##$BCFW= 1
##$BC_mod= 2
##$BYTORDP= 1
##$COROFFS= 0
##$CY= 11.3945322036743
##$DATMOD= 1
##$DC= 2
##$DFILT= <>
##$DTYPP= 0
##$F1P= 15.6554695791079
##$F2P= 12.8336369535428
##$FCOR= 0.5
##$FTSIZE= 0
##$FT_mod= 4
##$GAMMA= 1
##$GB= 0.15
##$INTBC= 1
##$INTSCL= 1
##$ISEN= 128
##$LB= 0.24
##$LEV0= 0
##$LPBIN= 0
##$MAXI= 10000
##$MC2= 0
##$MEAN= 0
##$ME_mod= 0
##$MI= 1.114404
##$NCOEF= 0
##$NC_proc= 0
##$NLEV= 6
##$NOISF1= 3.799351
##$NOISF2= 2.8
##$NSP= 1
##$NTH_PI= 0
##$NZP= 0
##$OFFSET= 15.70392
##$PC= 1
##$PHC0= -25301.91
##$PHC1= 8.78731
##$PH_mod= 1
##$PKNL= yes
##$PPARMOD= 0
##$PSCAL= 0
##$PSIGN= 0
##$REVERSE= no
##$SF= 200.130013532006
##$SI= 16384
##$SIGF1= 3
##$SIGF2= 2
##$SINO= 400
##$SIOLD= 16384
##$SREGLST= <1H.CDCl3>
##$SSB= 0
##$STSI= 0
##$STSR= 0
##$SW_p= 3612.71676300578
##$SYMM= 0
##$S_DEV= 0
##$TDeff= 0
##$TDoff= 0
##$TI= <>
##$TILT= no
##$TM1= 0
##$TM2= 0
##$TOPLEV= 0
##$USERP1= <user>
##$USERP2= <user>
##$USERP3= <user>
##$USERP4= <user>
##$USERP5= <user>
##$WDW= 1
##$XDIM= 8192
##$YMAX_p= 0
##$YMIN_p= 0
$$ End of Bruker specific parameters
$$ ---------------------------------
##NTUPLES= NMR FID
##VAR_NAME=  TIME,          FID/REAL,        FID/IMAG
##SYMBOL=    X,             R,               I
##VAR_TYPE=  INDEPENDENT,   DEPENDENT,       DEPENDENT
##VAR_FORM=  AFFN,          ASDF,            ASDF
##VAR_DIM=   8192,          8192,            8192
##UNITS=     SECONDS,       ARBITRARY UNITS, ARBITRARY UNITS
##FACTOR=    0.0002768,     1,               1
##FIRST=     0,             0,               0
##LAST=      2.2672688,     0,               0
##MIN=       0,             -52182,          0
##MAX=       2.2672688,     46727,           0
$$ Real data points
##PAGE= N=1
##DATA TABLE= (X++(R..R)), XYDATA
$$ [...]
1810A58p3j37n5M4o2J71k9j37M03j0j58m09L35j93K73j87K02j74Q3O3k72L85p4
$$ 158 85 -52 -107 -63 -125 46 17 -120 283 273 115 -294 41 -152 121 -66 136 -38 45 108 -164 221 147
1833A47k51K30l46O6q9R1M8J43P4N0M9j93k8pJ06p3q4K18L4K8j51N7k48J68l09
$$ 147 -104 126 -220 -154 -243 -152 -104 39 113 163 212 19 -9 -16 90 17 -67 151 185 213 62 119 -129 39 -270
1858b70L27j4j12O5K1p5J58o5o9N0J33l2l71M69k9j06j3k07J30o0p2PK04j93Q8
$$ -270 57 43 -69 -4 17 -58 100 35 -34 16 149 117 -254 215 186 80 67 -140 -10 -70 -142 -135 69 -124 -36
1883c6P6R6m1L0m7k1J35l99j64M07Q6j00p9K35q9K5j16K5J22j99j35J62J25r9
$$ -36 40 136 95 125 78 57 192 -207 -371 36 122 22 -57 178 89 114 -2 23 145 -54 -189 -27 98 -1
1907aJ58k76N3K53j64K54k98j20R6l8K4K51l36J04n7J71ok63K5K00K7J0NJ05M9
$$ -1 157 -119 -66 187 23 277 -21 -141 -45 -83 -59 192 -144 -40 -97 74 68 -195 -170 30 57 67 72 177 226
1932B26j68J48m40J08J60k03J84mkj1n8K97l25J7j65P3R2q5J81o1J81r6j49P8
$$ 226 58 206 -234 -126 34 -169 15 11 9 -2 -60 237 -88 -71 -236 -163 -71 -156 25 -36 145 49 -100 -22
1956b2L76j58l21J58J21pj7J04j99L39j06l40o7j31M24k88J10K45j33r9j36P1
$$ -22 354 196 -125 33 154 147 130 234 35 374 268 -72 -139 -270 154 -134 -24 221 88 -11 -147 -76
1978g6o4J50k58M83J1l28J33l4k47L45m73M68l8l87Q6N28k97J75Q6l02K1j7K19
$$ -76 -140 10 -248 235 246 -82 51 17 -230 115 -358 110 72 -315 -229 299 2 177 263 -39 -18 -35 184
2001A84q5k09J03N3k27J83p7J44j03J40k84K83k49J29q4m0J78l0j27p9J03Q1K04
$$ 184 99 -110 -7 46 -181 2 -75 69 -34 106 -178 105 -144 -15 -99 -139 39 9 -118 -197 -94 -13 191
2024A91l59L0k7J0M40j97l54N34j74k09L0R9qk99K48O1K65l48R8rM3Q2j29K6k62
$$ 191 -168 -138 -165 -155 285 88 -266 268 94 -115 -85 14 6 -293 -45 16 281 -67 31 22 65 147 18 44 -218
2049b18J67J32M7N4Lk43J6K76j44m3n7J03j20N0Q7K85k78k82J83l93J63K94rm3
$$ -218 -51 81 128 182 185 -58 -42 234 90 47 -10 93 -27 23 110 395 117 -165 18 -375 -212 82 73 30
2073C0p5J88q5Q8l9k7K4k47l33L52O4K0k40M52k14j63L93l45j07R5LK44J29o3
$$ 30 -45 143 58 146 107 80 104 -143 -476 -124 -60 -40 -280 172 -42 -205 188 -157 -264 -169 -166 78 207 144
2097A44j73P5j21K8J7q0J3J67k8n7L1M2r9J71j43J80M1k44J17o5m7J01j58J32
$$ 144 -29 46 -75 -47 -30 -110 -97 70 42 -15 16 58 -41 130 -13 167 208 -36 81 16 -31 70 -88 44
2121D4M7QK2k14P8R6p9j67Rj7K26J74l40P2J79j34l0n0l2K3K51l10J78n3p0J75
$$ 44 91 99 121 -93 -15 81 2 -165 -156 -173 53 227 -113 -41 138 4 -26 -76 -108 -85 166 -144 34 -19 -89 86
2147H6k84K47k04K35j03j18J59l7L19j96j46L5R5j33j87K41q9j44J59pJ90J18
$$ 86 -198 49 -155 80 -23 -141 18 -19 300 104 -42 -7 88 -45 -232 9 -80 -224 -65 -72 118 236
2169B36j48k14J01k21K13R4K34k39J35k42p3J93k1j11O1J9m4j07J86J41j81M0
$$ 236 88 -126 -25 -246 -33 61 295 56 191 -51 -124 69 48 -63 -2 17 -27 -134 52 193 12 52
2191E2j57j13j54L66p0K61K1o6k19J12k70L67m8j77M98n99P3K2k28M84l2k88j19
$$ 52 -105 -218 -372 -6 -76 185 206 140 -79 33 -237 130 82 -95 403 -196 -123 -101 -329 155 123 -165 -284
2214b84J62M36l18j01O8J25J85l22OK34L0k79r2J28o0M3p7J41oJ17j57k50K02
$$ -284 -122 314 -4 -105 -37 88 273 -49 -43 191 221 -58 -150 -22 -82 -39 -116 25 19 136 -21 -271 -69
2237f9r0K04j48o4J99j36O5N2j33M8J28l42QM00j22J43j21p4K0K89q2n1m94J64
$$ -69 -159 45 -103 -167 32 -104 -39 13 -120 -72 56 -286 -278 122 0 143 22 -52 -32 257 175 124 -370 -206
2261b06L26j75K14j91O0j58J29L5m8K49l66K72j80j66L15q1j59P8k5Q3r2R9j40
$$ -206 120 -55 159 -32 28 -130 -1 34 -14 235 -131 141 -39 -205 110 29 -130 -52 -77 6 -86 13 -127
2284a27K10O7j80K3J73j35k66J17J62k80K34j33mn3L41q0j50J04P1k62K2P8K18
$$ -127 83 150 -30 -7 166 31 -235 -118 44 -236 -2 -135 -139 -192 149 69 -81 23 94 -168 -146 -68 150
2307A50qj26p6K69o2n22N58k09K68l87J45j09j7j9L93r6j41K21j47l9J62k41J04
$$ 150 142 16 -60 209 147 -375 183 -26 242 -145 0 -109 -126 -145 248 152 11 232 85 46 208 -33 71
2330G1l60K83J6p1k8K29k6j7k06K87J18l01%l58L27j76K06j79J03J27l43M11j25
$$ 71 -289 -6 10 -61 -89 140 114 97 -109 178 296 -5 -5 -363 -36 -212 -6 -185 -82 45 -298 113 -12
2353a2qJ25J76k06L2j88J84o9j38M5k59L69j80J02k12J73K74l67J40J73j22r7
$$ -12 -20 105 281 75 107 -81 103 34 -104 -59 -318 51 -129 -27 -239 -66 208 -159 -19 154 32 -65
2375f5n1J9J67J19j51j0q6o3k02M48j4j10k7k3j7K50k17l7j54J08j3R6K5j39L41
$$ -65 -116 -97 70 189 38 28 -58 -121 -323 125 111 1 -26 -49 -66 184 -33 -70 -224 -116 -129 -33 -8 -147 194
2400A94k16L04j98L3j87q2K61k7j83K83j64Kk11K86j56Rl8k3K2L2J67J45m27l6
$$ 194 -22 282 84 117 -70 -152 109 82 -101 182 18 20 -191 95 -61 -52 -90 -113 -91 -59 108 253 -174 -210
2424b10K6M3J64m0k9J5K55k62K2J92k06p0J63J84k68J82k64j2L5m2K46k32j01
$$ -210 -184 -141 23 -17 -46 -31 224 -38 -16 176 -30 -100 63 247 -21 161 -103 -115 -80 -122 124 -108 -209
2447b09L39j51J14j40m9J39j25K35M0J65l59Mj11m1J73n7k66M34j64Q0J78l74
$$ -209 130 -21 93 -47 -96 43 -82 153 193 358 -1 3 -108 -149 24 -33 -299 135 -29 51 229 -145
2469a45K80P8k54M7k85q3N12k49j2J29Jk22J05P8r6K99l14j36M07k66J26Q5j1
$$ -145 135 213 -41 6 -279 -362 150 -99 -111 18 19 -203 -98 -20 -116 183 -131 -267 140 -126 0 85 74
2492G4j68J75m5kK1j53N3K41k05l41M80j82l3Q8k4k8m5j04J83P9p8Q4J7j22K71
$$ 74 -94 81 36 34 55 -98 -45 196 -9 -350 130 -52 -85 3 -21 -49 -94 -198 -15 64 -14 70 87 -35 236
2517B36n38K47k0J13p8r6q4J15L73m97J0L12k7m7k58k8L87l1j08J86k09R6p6P5
$$ 236 -302 -55 -75 38 -40 -136 -220 -105 268 -229 -219 93 66 19 -239 -267 120 89 -19 167 -42 54 -22 53
2541E3Kj81L52j41J33l39J86j34Q0k22M11l05M9p4K59j21K54j58j02k2J4p1K40
$$ 53 55 -126 226 85 218 -121 65 -69 11 -211 200 -105 -56 -130 129 8 262 104 2 -20 -6 -77 163
2564A63k48L16N8l41J14m5J3j61M06j67j54N4j28J75j06k9J15l30M33k6k66J21
$$ 163 -85 231 289 -52 62 17 30 -131 275 108 -46 8 -120 55 -51 -80 35 -295 138 112 -154 -33
2586c3n2L52m06K19o8L6J9K67l50R7j53O1qP3j64K08j96N4j59K54j73J3R9J58
$$ -33 -85 267 -139 80 12 48 67 334 -16 81 -72 -11 -19 54 -110 98 -98 -44 -203 51 -122 -109 -10 148
2610A48j58K04k09k0j52j59M50j2K1l86J60J01k19L34k31R4J45k18K90k81Q6j01
$$ 148 -10 194 -15 -35 -187 -346 104 92 113 -273 -113 -12 -231 103 -128 -34 111 -107 183 -98 -12 -113
2632a13K50k96m9L73j90K79j72k20K6K74j52l65M15m6k52K24r2N3J00K5k50K74
$$ -113 137 -159 -208 165 -25 254 82 -138 -112 162 10 -355 60 14 -238 -14 -106 -53 47 72 -178 96
2654I6m8q9M3O3L05n16K2J38O8j3%l21K74K88j6n59J07J00K32j98j33L32k35r
$$ 96 48 -41 2 65 370 -146 -124 14 82 69 69 -252 22 310 294 -265 -158 -58 174 -24 -157 175 -60 -69
2678f9q3J64J52j29L6J21k08j63M38m11O0K85j52j38j21K39R1j74K27j62lj0J71
$$ -69 -152 12 164 35 71 192 -16 -179 259 -152 -92 193 41 -97 -218 21 112 -62 165 3 0 -10 161
2701A61k93L72k89L5j25J1j7J34j35k35K80J4K68k51N0m6l9J77k89Pj9J54K83
$$ 161 -132 240 -49 -14 -139 -128 -145 -11 -146 -381 -101 -87 181 -70 -20 -66 -105 72 -217 -210 -229 -75 208
2724B08j17j76K11Mjm04J75j40K21j35K28M3j90J7q2J54k59K84q4L8m13L35k0
$$ 208 91 -85 126 130 129 -275 -100 -240 -19 -154 74 117 -73 -56 -138 16 -243 41 -43 -5 -418 -83 -103
2747a03rj06L35L0k23J12m08K19K66Q7k36r7J18qk1J4l3K17j24m9J89j07j52l0
$$ -103 -112 -218 117 147 -76 36 -372 -153 113 200 -36 -133 -15 -23 -44 -30 -63 154 30 -19 170 63 -89 -119
2771a19J05J54jj76K63l29r9jL31J94l47rJ30M2l01K92k34J98q7LJ30K4m00N04
$$ -119 -14 140 139 -37 226 -103 -202 -203 128 322 -25 -34 96 138 -163 129 -105 93 6 9 139 163 -237 267
2795B67l51k33M00M1k2k54L24p5j85q0P3O1qK6J37l02J58QN1j41j63K40J55m46
$$ 267 -84 -317 83 124 102 -152 172 97 -88 -168 -95 -34 -42 -16 121 -181 -23 -15 36 -105 -268 -28 127 -319
2819c19K99J84k83K39r0K6r8m9J15J00k45k23L15p6M5J18j81L07j43R6k39J53
$$ -319 -20 164 -119 120 30 56 -42 -91 24 124 -121 -344 -29 -105 -60 58 -123 184 41 137 -102 51
2841E1k17K79p2o0k4K2N1j38J30k52K86j40p4M57l49j63M75j88j15o9m3L47j09
$$ 51 -166 113 41 -19 -43 -21 30 -108 22 -230 56 -84 -158 299 -50 -213 262 74 -41 -110 -153 194 85
2864H5J4J60j23K8rL6m42K17j09PJ8K20m54K56J9J10j59J29j66J76k99M44k33
$$ 85 99 259 136 164 155 191 -251 -34 -143 -136 -118 102 -352 -96 -77 33 -126 3 -163 13 -286 158 -75
2887g5J10Mn6K73l0k01J89k25O7L33n96M14J71n27R1QK17j12K05k52J69j22l8
$$ -75 35 39 -17 256 226 25 214 -11 56 389 -207 207 378 -149 -58 -50 167 55 260 8 177 55 17
2910A7K57j76j7J23k63J14K55j99j92j57Q1L23k17J92k11J91N2k76n5mK19j77
$$ 17 274 98 81 204 -59 55 310 111 -81 -238 -157 166 -51 141 -70 121 173 -103 -158 -162 57 -120
2932a20J01J42l3k18J12l8N1Pq3j05M8j86L50k34J90K6kj68J35R6N0k28K66Kl10
$$ -120 -19 123 90 -128 -16 -54 -3 4 -79 -184 -136 -322 28 -206 -16 10 8 -160 -25 71 121 -107 159 161 -149
2957a49q8P5J98L07m38J21j74O2Q4P6k09L96m21k8L43n65J69J02L03j02k23L19
$$ -149 -237 -162 36 343 -95 26 -148 -86 -2 74 -135 261 -160 -188 155 -410 -241 -139 164 62 -161 158
2979A58k16P2J7k1O1m0rL4j29Q2L42k01jj2r3K1j02M8J26M9j99K12k46K08k60
$$ 158 -58 14 31 10 71 31 22 56 -73 9 351 150 149 137 44 65 -37 11 137 186 -13 199 -47 161 -99
3004i9o9K40j43R0Q5R1q6j53On5J16r1%q7L93l37R5R4Q5j26p6K36k60n2M46l98
$$ -99 -168 72 -71 19 104 195 109 -44 -38 -93 23 -68 -68 -155 238 -99 -4 90 175 49 -27 209 -51 -103 343 -55
3030e5M00l60O2j59O2K05J11k72o7J1K15l69J24P0k82K61k1J01j55M3K63Q5k60
$$ -55 345 -15 47 -112 -50 155 266 -6 -73 -62 153 -216 -92 -22 -304 -43 -64 37 -118 -75 188 273 13
3053A3J1J33k73J56J3rk62j6K72L5l26J50J98J6J11j40k61K05k99L85m23M13l
$$ 13 24 157 -116 40 53 44 -218 -234 38 73 -253 -103 95 111 222 82 -179 26 -273 112 -311 102 99
3076I9K5q7j85K38Q3j5l43M13km34K48J33j63P5Q0j37j9R5K57l10m6J10Kk3j93
$$ 99 124 37 -148 90 173 158 -185 228 226 -208 40 173 10 85 165 28 9 104 361 51 5 115 117 94 -99
3101i9j5J21P4l36L25m4K14l90J35l2L5j39J12k4j1J32L2J59l36J89M6j34kP8
$$ -99 -114 7 81 -255 70 26 240 -150 -15 -47 -12 -151 -39 -63 -74 58 90 249 -87 102 148 14 12 90
3125I0M1q9Q2n0k01P6J88K0k28o5J87k74J11J6k01L87k07L21k67J1J31q7j33K05
$$ 90 131 42 124 74 -127 -51 137 157 -71 -136 51 -223 -112 -96 -297 90 -117 204 -63 -52 79 -8 -141 64
3149F4L5j41P5q5o4J93j37J32o2J79k84J33j32k6K88j16j29N6R4l87K56K88k7
$$ 64 99 -42 33 -52 -116 77 -60 72 10 189 -95 38 -94 -120 168 52 -77 -21 73 -314 -58 230 203
3172B03l47M08l73R1j89Q3P4j89K39L19n79L66P1j77k8oN7J41j92J10o4N2R6n8
$$ 203 -144 264 -109 -18 -207 -124 -50 -239 0 319 -260 106 177 0 -28 -34 23 164 -28 82 18 70 166 108
3196A08o1j37L24m34J72J53N9m0l11K29j18J94k25K43j75J80l53N35k57L3l5k13
$$ 108 47 -90 234 -200 -28 125 184 144 -167 62 -56 138 -87 156 -19 161 -192 343 86 119 84 -129
3218a29J11J26O4j97j27J7L71l42J67J6q4N7L9o3%q3K09l23K98q5J98l34J97k72
$$ -129 -18 108 172 -25 -152 -135 236 -106 61 77 -7 50 89 26 26 -57 152 -171 127 42 240 -94 103 -169
3242a69L07k7k0l97J40J98kj74J34l6J0J01J7k54K93j53J74N4J29n24K72l6o3
$$ -169 138 111 91 -306 -166 32 30 -144 -10 -46 -36 65 82 -172 121 -32 142 196 325 -199 73 37 -26
3265b6J12j98J67j91M11k55J23k62J13J51J56Nk00l1k09Q9o9K05m7k06J60r8M
$$ -26 86 -112 55 -136 275 20 143 -119 -6 145 301 306 106 75 -134 -45 -114 91 44 -162 -2 -100 -96
3288i6pJ23j5O0J33j46l5k88L23O5O0k24J68o7j21j56M46j74k36K38r5N5P2k8
$$ -96 -103 20 5 65 198 52 17 -271 52 117 177 -47 121 54 -67 -223 223 49 -187 51 -44 11 83 55
3312E5L9q2L07k34k55k03N84M2j46k49K48l52K33m2Q7j10K89k19J30j82J79l83
$$ 55 94 12 319 85 -170 -373 211 253 107 -142 106 -246 -13 -55 32 -78 211 -8 122 -60 119 -264
3334b64M65J34r2l94J76k37K18J55k11J92k47J10P6J70k84O3J52l23K04M6j77
$$ -264 201 335 243 -151 25 -212 6 161 -50 142 -105 5 81 251 -33 30 182 -141 63 109 -68
3355f8R8p9j12k54O32m10J49o9K40j57n3j5L4M0j92m6L08J94k11r5J38o7K5p5
$$ -68 30 -49 -161 -415 217 -193 -44 -113 127 -30 -83 -98 -64 -24 -216 -262 46 240 29 -66 72 5 30 -45
3379d5J94n6p5j11j04L06j50P7j04J43k11N07l79K28l11j36mK60j08P3Q4n8M8
$$ -45 149 93 18 -93 -197 109 -41 36 -68 75 -136 371 -8 220 -91 -227 -231 29 -79 -6 78 20 68
3402F8Q6m31K21j0J09K2l38L42j52J50j30j7l0J65j03K9K50l20j19J50N7j23j31
$$ 68 154 -277 -56 -66 43 65 -273 69 -83 67 -63 -80 -110 55 -48 -19 231 -89 -208 -58 -1 -124 -255
3425b55K27J60j36J99k10j10q0J91J0r4J1k3L35j83j16K8J4k54M72l14R5J9r3
$$ -255 -28 132 -4 195 -15 -125 -205 -14 -4 -98 -87 -110 225 42 -74 -46 -32 -286 186 -128 -33 -14 -107
3448a07P0Qo5k9J03n8J74k57K23j80J85K9o0q8R2j52j6K14j82MK15l24J82KM1
$$ -107 -37 -29 -94 -123 -20 -78 96 -161 62 -118 67 96 36 -52 40 -112 -128 86 -96 -92 123 -201 -19 -17 24
3473B4N5r2J01l3r8k0K5M1k52J93j89M58q6l50J61M7rj7M2j43R0K28p5k19J89
$$ 24 79 -13 88 55 -43 -63 -38 3 -249 -56 -245 213 127 -223 -62 -15 -24 -41 1 -142 -52 176 101 -118 71
3498G1J04j88j14K62k41K8r9j0K71k9k12J61J70Q0l50M2nJ40Oj30oJ65j01K11
$$ 71 175 -13 -127 135 -106 -78 -177 -187 84 55 -157 4 174 254 -96 -54 -59 81 87 -43 -49 116 15 226
3522B26k82n9J87K1j99J2K65n20L82N8m9N2O9k37J40j82K08l1J17q3j24P8J61
$$ 226 -56 -115 72 93 -106 -94 171 -349 33 91 42 94 163 -74 66 -116 92 61 178 95 -29 49 210
3545B10k41L2K1J12j76j42K31l1j74K92j91K07rj88K78j26l00J84k32L09k03K35
$$ 210 -31 1 22 134 -42 -184 47 16 -158 134 -57 150 141 -47 231 105 -195 -11 -243 66 -137 98
3567I8k94R2L50k88K71j08p5p0j47J11j44L76k31j77K39R0p3j1p9n6K61o7J16
$$ 98 -196 -104 246 -42 229 121 46 -24 -171 -60 -204 172 -59 -236 3 93 20 9 -70 -126 135 68 184
3590A84j08j89K31q0p1o0J50r5P3l4J54Q8m20K92k1J29j89k0L5k10M06j78k10
$$ 184 76 -113 118 38 -33 -93 57 -38 35 1 155 243 -177 115 94 223 34 14 49 -161 245 67 -143
3613a43K40j82J27j60R6J87n4J21k15q0J33k01J41o8m6n4J72o0o5j6k0JJ05R3
$$ -143 97 -85 42 -118 -22 165 111 232 17 -63 70 -131 10 -58 -104 -158 14 -46 -111 -127 -147 -146 -41 52
3637E2j22R0J59k6o9M4j27j08J31m7j12j33L49L0l21JJ40MJ21k69L68j53r6K86
$$ 52 -70 20 179 153 84 128 1 -107 24 -23 -135 -268 81 111 -210 -209 -69 -65 56 -213 155 2 -94 192
3661A92j79k22K04J16j60O7jo9Q6K54k14No3k57N6K71Kq0L0m4mj38l3P1L2K16
$$ 192 13 -209 -5 111 -49 18 17 -52 34 288 74 79 16 -241 -185 86 88 8 38 -6 -10 -148 -181 -110 -78 138
3687A38m1j12k6J01k03M1l4j98K65L0k2k77L80M3j58k53K94j11J91p0J2k14L4
$$ 138 97 -15 -41 60 -143 -102 -136 -334 -69 -39 -61 -338 42 85 -73 -326 -32 -143 48 -22 -10 -224 -190
3710a90K06J45m49L11Q9k90K43j36k7J58m5q1r5L8K4r8J59j8J57l6lr0M6p7j6
$$ -190 16 161 -288 23 112 -178 65 -71 -98 60 15 -66 -161 -123 -99 -197 -38 -56 101 65 62 -28 18 -59 -75
3735g5j76J73MK68j33k66N4J32Q7l39K88J51k10j9J74R3l06K04l2o0j79J5K90
$$ -75 -251 -78 -74 194 61 -205 -151 -19 68 -271 17 168 -42 -61 113 206 -100 104 72 12 -167 -152 138
3758A38q0K5j79K4o5J28j21K02o3n8j68K76K51l66O9M5k07K14m38L91p5J54j4
$$ 138 58 83 -96 -72 -137 -9 -130 72 9 -49 -217 59 310 -56 13 58 -149 65 -373 18 -57 97 83
3781H3l7n0j42J48K08j44k20O2J14J32L4K7l60J45L1q2J18M4j57K34p8j77M0j5
$$ 83 46 -4 -146 2 210 66 -154 -92 22 154 188 215 -145 0 31 -51 67 111 -46 188 110 -67 -27 -42
3805d2J09k7K59m10L37j49p5J1k5o5M8j15J67L36l83OJ2l4K36m07K95n4j49K49
$$ -42 67 40 299 -111 226 77 2 13 -12 -77 -29 -144 23 359 -24 -18 -6 -40 196 -211 84 30 -119 130
3829A30k84K19l10K50J10j91k9J9J0L23j19j84p8J33K44j48k72K33k46M0q3N89
$$ 130 -154 65 -245 5 115 -76 -105 -86 -76 247 128 -56 -134 -1 243 95 -177 56 -190 -150 -233 356
3851C56k25l00O6J32J49j77N0k63K35J7R3l63J83K10l12n2M20r5K01q1l19kj35
$$ 356 131 -169 -103 29 178 1 51 -212 23 40 133 -230 -47 163 -149 -201 219 124 325 244 -75 -77 -212
3874b12J71R8L5J83m27K16k52J52J99J70r0j18q4o8J70m24K57k0J31k7j08j36
$$ -212 -41 57 92 275 -152 64 -188 -36 163 333 243 125 41 -27 143 -281 -24 -44 87 60 -48 -184
3896a84J45K7Q0k91K55k3p5J3K32l37N8j8j31K44k5l4J25l3j29J88M4p7N0j28
$$ -184 -39 -12 68 -223 32 9 -66 -53 179 -158 -100 -118 -249 -5 -30 -64 61 28 -101 87 131 54 104 -24
3920b4r9K22k06L4p5J71j51J17K13o9k25m6m8Q0J01J71l47J55J27M6j40J58N8
$$ -24 -123 99 -107 -73 -148 23 -128 -11 202 133 -92 -138 -186 -106 -5 166 -181 -26 101 147 7 165 223
3943B23k63j97M02L6k76kj47L03nm4R2p4j52l15M22l6O9J03J29p6k45R8M1J18
$$ 223 -40 -237 165 201 -75 -77 -224 79 74 30 122 48 -104 -419 3 -33 36 139 268 192 -53 45 86 204
3967B04l30N2K2Q1P9r6k93M29j06R9Kk10QK83o27J9L00J13k1J59K2J47q5m09J93
$$ 204 -126 -74 -52 29 108 12 -281 148 42 141 143 -67 -59 224 -403 -384 -84 29 8 167 189 336 251 -158 35
3992C5k01M50k27J21j89j82J71k24K3J83j25m9K05m5O0J6j3L04l25k58L20%j10
$$ 35 -166 284 57 178 -11 -193 -22 -246 -223 -40 -165 -214 -9 -54 6 22 9 313 -12 -270 50 50 -60
4015f0J72l46J90N0m14M73k82L77j18j01J0n5r9L46R1m3k60J05P4j66o9R6m7K6
$$ -60 112 -234 -44 6 -408 65 -217 160 42 -59 -49 -104 -203 143 234 191 -69 36 110 -56 -125 -29 -76 -50
4039e0j13K46O5j79J35k34M42l86R8N4j66M3J87l19J34L68n44K52M97l75l07r6
$$ -50 -163 83 148 -31 104 -130 312 -74 24 78 -88 -45 142 -177 -43 325 -219 33 530 155 -152 -248
4061b48M55J22n14J44J58L5k27j12R8Q9Q2n3J77k96P6L7k15K25j88P8j22K47j4
$$ -248 207 329 -185 -41 117 152 -75 -187 -89 0 82 29 206 -90 -14 23 -192 33 -155 -77 -199 48 34
4084C4j42P0K45P3m01j41K67K92L0l82J11n1%n0Q5K57j94m3m1M5j34j21J44L43
$$ 34 -108 -38 207 280 -121 -262 5 297 327 -55 56 5 5 -45 40 297 103 60 19 64 -70 -191 -47 296
4108B96j50l01L11l80K94r5M8Oj83M54m13j27K60J18q4k7j32o2K20k5l10K39J14
$$ 296 146 -155 156 -224 70 -25 23 29 -154 300 -113 -240 20 138 54 27 -105 -167 53 28 -282 -43 71
4131G1j64L3N10n56Q1j36K07M8j93J49k12J65M0J93l40%K43j18l95N90m98L08
$$ 71 -93 -60 450 -106 -25 -161 46 94 -99 50 -162 3 43 236 -104 -104 139 21 -374 216 -282 26
4153B6j81J23J89Kl30l1J04l1K44l8L6r7J49j60o3R0J37l7k52J23J01j83K1J3
$$ 26 -155 -32 157 159 -171 -202 -98 -129 115 77 113 16 165 5 -58 32 169 132 -120 3 104 -79 -58 -45
4177d5K75k02n7j81O8J43J49j46J82K4Rk40n8m7j3J25L21l16j36L26j97j7nK13
$$ -45 230 28 -29 -210 -142 1 150 4 186 210 219 -21 -79 -126 -139 -14 307 -9 -145 181 -16 -33 -38 175
4201A75j55Lk07K56L4K63k68K46j25nm47K13p7kN4Ql9k68R2J17K49j24k8l6J65
$$ 175 20 23 -184 72 106 369 101 347 222 217 -230 -17 -94 -96 -42 -34 -73 -341 -249 -132 117 -7 -35 -71 94
4226I4q9N9j23O0J52l91J99L4J82p7j52n3R6j96l4L07p7P0q7J19j94N2J1L16k24
$$ 94 5 64 -59 1 153 -238 -39 -5 177 100 -52 -105 -9 -205 -239 68 -9 61 -26 93 -101 -49 -38 278 54
4251E4k54j27L21L17k24J11l02l7R4nj27J45J9k9O9P6j55R0q6k01K28K33k90L5
$$ 54 -200 -327 -6 311 87 198 -104 -141 -47 -52 -179 -34 -15 -44 25 101 -54 36 -50 -251 -23 210 -80 -45
4275d5J17Q4j41J36k75K44j30k43P0K48q7l9L53l33J6j5j3J59j02k43L67k24j03
$$ -45 72 156 15 151 -124 120 -10 -253 -183 65 -22 -61 292 -41 -25 -40 -53 106 4 -239 128 -96 -199
4298a99L94o9k78m8J60p2J52jMq4p7J08j44L12q0N2K36k29n9l7J39j62QL5j77
$$ -199 195 126 -152 -200 -40 -112 40 39 43 -41 -118 -10 -154 158 78 130 366 137 78 41 180 18 26 61 -116
4323a16N7q0n7K4Q6j04K0K02j34N4J15J0j91OJ49j35J20r1k42J56P3J19Nj10j22
$$ -116 -59 -139 -196 -172 -86 -190 -170 32 -102 -48 67 77 -114 -108 41 -94 26 -65 -307 -151 -78 41 46 -64 -186
4348a86L59l02K88l72L4L27j48Q3J49p5o0M2j27J63l18rJ18j23L29k97P4M39m57
$$ -186 173 -129 159 -213 -179 148 0 83 232 157 97 139 12 175 -143 -152 -34 -157 172 -125 -51 388 -69
4371f9J81j90q3K28q0p7k49L36J64l74J91J90m67n3M29k8j28M38m51M5J9J40j18
$$ -69 112 -78 -161 67 -13 -90 -339 -3 161 -213 -22 168 -299 -352 77 49 -79 359 -92 -47 -28 112 -6
4394fj9MJ10m2M2k41M56j20j38p0M4O8rK2K2k9j21l2K52k92K44k60N4K81K3r9
$$ -6 -25 -21 89 47 89 -152 304 184 46 -24 20 88 79 101 123 94 -27 -59 193 -99 145 -115 -61 220 243 144
4420A44j61K76k09p6L13l27j90K35k1j45J36k5L5k09K38N7j17j44M36k34L3J65
$$ 144 -17 259 50 -26 287 -40 -230 5 -16 -161 -25 -50 -15 -224 14 71 -46 -190 246 12 45 210
4442B10k75o7J7J02k2Q0k55M53m03N9K55l00K9r6L05pj69J31q4qJ42J18m34J34
$$ 210 -65 -132 -115 -13 -35 45 -210 243 -160 -101 154 -146 -117 -213 92 85 -84 47 -37 -45 97 215 -219 -85
4466h5J75j34j40OJ55K09k34J44m7R7l19j23N8Q8J02K02m5j75qQ8k98J72K5O3
$$ -85 90 -44 -184 -178 -23 186 -48 96 49 146 -173 -296 -238 -150 -48 154 109 -66 -74 14 -284 -112 -87 -24
4490b4L46m34k6J31l1k2K76j20p3j33J45k5j16J82j38N2K13j11p0n1O3k36P9J61
$$ -24 322 -112 -138 -7 -38 -60 216 96 23 -110 35 10 -106 76 -62 -10 203 92 22 -29 34 -202 -123 38
4514C8l41L05J55j95J00K4K47m21K59k97R2L7nO3j77M32l38K30l14J07K17k06
$$ 38 -303 2 157 -38 62 86 333 -88 171 -126 -34 3 -2 61 -116 316 -22 208 -106 1 218 12
4536A2K1n2J58j42j04J07Q3j32L1J97l22O3J92M6m52L91r9J05p6q0K53m16L00
$$ 12 33 -19 139 -3 -107 0 83 -49 -18 179 -143 -80 112 158 -294 97 -2 103 27 -53 200 -216 84
4559H4J24k89J56k4j89L46j52p5m9l2k02K83Pj81P8L71l63L23j76q3K07N7k00
$$ 84 208 -81 75 51 -138 208 56 -19 -68 -100 -302 -19 -12 -193 -115 256 -107 216 40 -43 164 221 21
4582B1N9k83N05l90J30Q4m1k74K87l57Q7J97k46L26k13L34l21K74j50j34K46N2
$$ 21 80 -203 302 -88 42 126 85 -189 98 -259 -172 25 -221 105 -108 226 -95 179 29 -105 141 193
4604A93k35L5j2J99l68K38R8j08O3o5j56J40mJ30k32J05q9K20n15N85k62k53L09
$$ 193 -42 -7 -19 180 -188 50 148 40 103 38 -118 22 18 148 -84 21 -68 152 -363 222 -40 -293 16
4627A6j63N8M7J82l13K04k67K49L03k06k60J46J36k8m1J42k66N3l3J44nj16Lo8
$$ 16 -147 -89 -42 140 -173 31 -236 13 316 110 -150 -4 132 104 63 205 -61 -8 -41 103 98 -18 -15 -83
4651h3r3O3J00J1J33m0k65L1L43l3k4p9j62K1K22j49J24q2j06M00m35J5j2o8L47
$$ -83 -176 -113 -13 -2 131 91 -174 -143 200 167 143 64 -98 -77 145 -4 120 38 -68 332 -103 -88 -100 -168 179
4676A79ln5q3pj41k6O6q6K32j70K02j05n4j08K23L8n0K1k20LJ03L03k62r0K51
$$ 179 176 121 38 31 -110 -136 -70 -156 76 -94 108 3 -51 -159 64 102 52 73 -147 -144 -41 262 0 -90 161
4701A61j08j5L1k35R1q6J80L8l62L76Nj4m5q7M3r2m8K25l07J00qJ45l6J9j08N4
$$ 161 53 38 69 -166 -75 -161 19 57 -305 71 76 62 17 -70 -27 -119 -167 58 -249 -149 -157 -12 -48 -29 -137 -83
4727h3J57j89M7J24j55J42Mj42Q0j17K64p1J14k47q6k74L83J27r0O6j79K02n7
$$ -83 74 -115 -68 56 -99 43 47 -95 -15 -132 132 61 175 -72 -158 -432 -49 78 -12 54 -125 77 20
4750B0Q6j85j21L02m8k84J05K56k40K69J05j02l15K27k88L72k68O1m3R3j19Q6
$$ 20 106 -79 -200 102 54 -230 -125 131 -109 160 265 163 -152 75 -213 159 -109 -48 -91 2 -117 -31
4772c1j35o5K95m5j15p1M08k63j98J71J83o9l1j99K91k87K35o9J41N5k44l7P2
$$ -31 -166 -231 64 19 -96 -167 241 -22 -220 -49 134 65 34 -165 126 -161 74 5 146 201 -43 -80 -8
4795hj71J18j15J96J47q2p4L4J37m90K67L1J64k40J45j1ok31M2R2P7j41J83p1
$$ -8 -179 -61 -176 20 167 85 11 45 182 -308 -41 -10 154 -86 59 48 42 -189 -147 -55 22 -119 64 -7
4819gQ1k6J31n1K03l33Q4j37K44k91J86O6O5k54o1k89L98j21J90q7j06L43o6M1
$$ -7 74 48 179 128 331 -2 82 -55 189 -102 84 150 215 -39 -100 -389 9 -112 78 -9 -115 228 162 203
4843B03P4n43P8J75K26l13J48l10Q9k2Q6K31o2k16N7K52l93J37q7j48P4J52J03
$$ 203 277 -266 -188 -13 213 -100 48 -262 -173 -195 -109 122 60 -156 -99 153 -240 -103 -190 -338 -264 -112 -9
4866iK16k35j34J18J66k61l9K26M45m84Qk70K6K25N9j60k3L27o8p1j61r1M22l18
$$ -9 207 -28 -162 -44 122 -139 -178 48 493 9 17 -253 -227 -2 57 -103 -126 201 133 62 -99 -190 232 -86
4890h6q8J83J54q3l7o8J0j96K42J62j37k40l7K50j97M0K25k67J23J66j64N8P8
$$ -86 -174 9 163 80 43 -25 -15 -211 31 193 56 -184 -221 29 -168 -128 97 -170 -47 119 -45 13 91
4913I1j65k50M09j71K40k65j96J37K96m06J42K63j56K34l48J80r0J60j64J03j72
$$ 91 -74 -324 85 -86 154 -111 -307 -170 126 -280 -138 125 -31 203 -145 35 -55 105 -59 44 -128
4934a28L90k41J08J52k81J13k14r6k2L24j02l7o7r4k42K22o4K23j78M47l56R7
$$ -128 262 21 129 281 0 113 -101 -197 -219 105 3 -34 -101 -195 -437 -215 -279 -56 -234 213 -143 -46
4956d6m6K83r5o8k24K34J34k94J57m2j4k3J25l5k94J36NJ10K47l85J35J36l60
$$ -46 -92 191 96 28 -196 38 172 -122 35 -7 -21 -44 81 46 -248 -112 -107 3 250 -135 0 136 -224
4979b24M09j87Rm3J57j28j80K42j11l7K85m70M08J42l04J09j50K62Q0k05J13j73
$$ -224 185 -2 7 -36 121 -7 -187 55 -56 -93 192 -278 130 272 -32 77 -73 189 269 64 177 4
5001DK12l73K06m9L8O2l53K05K25l74J43J35k23k11RJ98Q9jJ77j11j25n2K60k7
$$ 4 216 -157 49 0 38 100 -253 -48 177 -197 -54 81 -142 -353 -344 -146 -57 -58 119 8 -117 -169 91 64
5025F4M7j75K55l64R9k4o2K79n1j03l6k31M18J14k92Q3j57J68j59K90O5k1l28
$$ 64 111 -64 191 -173 -74 -98 -160 119 68 -35 -71 -302 116 230 -62 21 -136 32 -127 163 228 207 -121
5048a21J9J5P8j65J50J24l4j52K64k46Q2j04j25J39J81j07j81L50r7p7K3P1l2
$$ -121 -102 -87 -9 -174 -24 100 66 -86 178 -68 14 -90 -215 -76 105 -2 -183 167 70 -7 16 87 55
5071E5q2q0J06j2j7j34N6q3K18R7k41L93j71k19K62j91J04j44N5O0j16J35k42
$$ 55 -27 -107 -1 -13 -30 -164 -108 -191 27 124 -117 276 105 -114 148 -43 61 -83 -28 32 -84 51 -191
5094a91K38k6k15K75m34J90L99n75L02l13M15j0k36K27q7J28j6o8k09J25oJ83
$$ -191 47 21 -194 81 -353 -163 236 -339 -37 -350 65 55 -181 46 -41 87 71 3 -206 -81 -87 96
5116I6j38J7n0m6J75J20j86P5n1J53k57N4J71j76n7L41j06l0j2k54L79k43L69
$$ 96 -42 -25 -75 -121 54 174 -12 63 12 165 -92 -38 133 -43 -100 241 135 105 93 -161 218 -25 344
5139C44l12J73j81k56N10l40K8q0m8j6K40r5o8L09l9l88L57k14K19l70J54Q6l
$$ 344 32 205 24 -232 278 -62 -34 -114 -162 -178 62 -33 -101 208 169 -219 138 -76 143 -227 -73 13 10
5162A0j0l30N62k09P6l6o8R4P0k81P0lj10j0k05K47J56k9k34K49J32k43l5K39
$$ 10 0 -330 232 23 99 63 -5 89 159 -122 -52 -55 -165 -175 -380 -133 23 -6 -240 9 141 -102 -137 102
5186A02j13J18j20O9k82L12o8q2M2Rpj71L13k98J75K47j4r6k61k3R6l7K69j89
$$ 102 -11 107 -13 56 -226 86 18 -64 -22 -13 -20 -191 122 -176 -1 246 232 136 -125 -148 -52 -89 180 -9
5210iJ41j65k02J44N2Q9N9j80L7J74J34l02j49K47j49k09K38NJ92j50Q6j00J3
$$ -9 132 -33 -235 -91 -39 50 109 -71 -34 140 274 -28 -177 70 -79 -288 -50 -45 147 -3 83 -17 -4
5233dj57J49j22Q3J12l70K15N1j3j30OJ30N4m20M15k43L36l6l52K90M2K2Q1j4
$$ -4 -161 -12 -134 -51 61 -309 -94 -43 -56 -186 -180 -50 4 -416 -1 -244 92 56 -296 -6 36 58 139 125
5257A25j60J6K07O1m79K2R3J11R7k46P6J58p3o1k20M93j13j78L06l76K18l74K26
$$ 125 -35 -19 188 249 -230 -208 -115 -4 93 -153 -77 81 8 -53 -273 220 107 -71 235 -141 77 -297 -71
5280g1M3n3L02j86j66L69j92k95O2K48J83l85R3l8P1J29j87J51j08K0n1M0J46
$$ -71 -28 -81 221 35 -131 238 46 -249 -187 61 244 -141 -48 -86 -15 114 -73 78 -30 -10 -61 -21 125
5303A25l39J89J38O3m7r9J06j31P8J35m96L04N2l20J97N8K54k29K33m32J58j38
$$ 125 -214 -25 113 176 129 30 136 5 83 218 -278 26 78 -242 -45 13 267 38 271 -161 -3 -141
5325a41Q2Rl0M22l32j59M71l81N0J33k34Q1j25J09j13J67Q6k37O8J97k17rP7N
$$ -141 -59 -50 -80 342 10 -149 322 -59 -9 124 -110 -29 -154 -45 -158 9 95 -142 -74 123 -94 -103 -26 -21
5349b1K44k67j7P3Q1q1J91m30J79j16J19K6r7L3J76k20P5J68l5N5k60J31O0j67
$$ -21 223 -44 -61 12 93 12 203 -227 -48 -164 -45 -19 -116 -83 93 -127 -52 116 81 136 -124 7 67 -100
5373a00R2J34N8k2j35k1j56L07r4j04R5j5R7j37J16R0j12n2J99l23r2K34k21K06
$$ -100 -8 126 184 162 27 6 -150 157 63 -41 54 39 136 -1 115 205 93 41 240 -83 -175 59 -162 44
5397D4Rj18J2J65k29J36J37o5j0l56L21J02k4K2K6l8j6j10JJ5m3j3P8J03n97N40
$$ 44 53 -65 -53 112 -117 19 156 91 81 -275 46 148 124 146 172 134 118 8 9 24 -19 -32 46 149 -448 92
5423I2J43k50L8k68J14q3K05J5j88L14j98O8O8J21j59j05K79m04P1J90K23l57
$$ 92 235 -15 23 -245 -131 -214 -9 6 -182 132 -66 2 70 191 32 -73 206 -198 -127 63 286 -71
5445g1RK51m11M63l37R1NJ02M0k06K43m89M01k64j0K47k81J42J15J53j74j67N23
$$ -71 -62 189 -222 241 -96 -5 0 102 142 -64 179 -310 91 -173 -183 64 -217 -75 40 193 19 -148 375
5468C75m16J49k02J39L9j64K07m2k38J06k5J52j56J47o5N6J12q6Q6k72L15j47
$$ 375 -41 108 -94 45 84 -80 127 85 -153 -47 -72 80 -76 71 6 62 174 88 174 -98 217 70
5490G0J07k67J00K37l93J40O0k09M09m27K13L3k63J80l2O1r3j74L22J25j83j34
$$ 70 177 -90 10 247 -146 -6 54 -155 254 -173 40 73 -190 -10 -42 19 -74 -248 74 199 16 -118
5512a18J70K5j43J76k59L32l33M00j45j33K54k60K06l68K36r9mQ3j66Q8J23P7
$$ -118 52 77 -66 110 -149 183 -150 250 105 -28 226 -34 172 -196 40 -59 -63 20 -146 -58 65 142
5534A42j33J6O3pj02l1m3M56Q0l13J56k77k58K66k8M57o32N6J02J00l6k16P1M2
$$ 142 9 25 88 81 -21 -52 -95 361 441 128 284 7 -251 15 -13 444 -188 -132 -30 70 34 -182 -111 -69
5558f9O3%k9j58L56k42O7M7q4K93p1k20J14o6m8j80pL97l44J49%mK16j43K8l26
$$ -69 -6 -6 -35 -193 163 -79 -12 35 -49 244 173 -47 67 1 -47 -227 -234 163 -181 -32 -32 -36 180 37 65 -261
5584b61N17k77J44j04O6o1O8j82K02k30L36l33K03k00J14jj99K99k62Q6k4J82
$$ -261 256 -21 123 19 85 24 92 -90 112 -118 218 -115 88 -112 2 1 -198 101 -161 -75 -99 83
5606H3j10nJ6r9J45LK18j96j81J2q4M8N2J20j8j11l59N56k16R0J65m5j40q8K61
$$ 83 -27 -32 -16 -115 30 33 251 55 -126 -114 -198 -150 -98 22 4 -107 -466 90 -126 -36 129 84 -56 -144 117
5631A17K7L1k19P6j5n3J31k71N5J81j65P8K15k91J08j3j39K05j60%j54M58l76
$$ 117 144 175 -44 32 17 -36 95 -176 -121 60 -105 -27 188 -103 5 -8 -147 58 -102 -102 -256 202 -174
5654a74K68k48p4K61j18J04J07j50qj5K29j66j68Q3K85j98J32L0j10q9JN0j2P1
$$ -174 94 -154 -228 33 -85 19 126 -24 -32 -47 182 16 -152 -69 216 18 150 180 70 -19 -18 32 20 91
5678I1k40J28K42k88L00l32J38k37L26L07m37kj75K8J18N9j50q5n7K44m3n6O8
$$ 91 -149 -21 221 -67 233 -99 39 -198 128 435 -2 -4 -179 -151 -33 26 -124 -209 -266 -22 -65 -121 -53
5701e3L2p6J80J0l7r3j16J50K24j20j21K27K3l35J14J38j97L1n8L31l26Q5J95
$$ -53 -21 -97 83 93 56 -37 -153 -3 221 101 -20 207 230 -105 9 147 -50 -19 -77 254 -72 13 208
5724B08l19J72p2J13rk07J42j63K18k74J85p6pK31k22p4J20j69M21l99L91k14
$$ 208 -111 61 -11 102 93 -114 28 -135 83 -191 -6 -82 -89 142 -80 -154 -34 -203 218 -181 210 -4
5746dK70k67l99N20o6L4J13j70j01L39k64j11J22j40J32ol0l2M2J00j77L7q4j9
$$ -4 266 -1 -400 120 54 88 201 31 -70 269 5 -106 16 -124 8 2 -28 -60 -18 82 -95 -58 -142 -161
5770a61K07L3O2k02L0k3K61j17l08P9L12R5p82Q44k78l8Pk2J8N0Q0j01q0J79p4
$$ -161 46 79 141 -61 -31 -54 207 90 -218 -139 173 268 -514 330 52 14 21 -1 17 67 147 46 -34 145 71
5795G1J4L3j02J12N8r8Pj3q2j2k67N42k25K8j64J89j20n8K4J91l14O4J45o1mO1
$$ 71 85 118 16 128 186 88 95 82 0 -12 -279 263 38 66 -98 91 -29 -87 -63 128 -186 -122 23 -38 -42 19
5821A9L1J0j60J59J4k76N21l33J24L8k63L4J53k7J59l10J05R8J2K39m83K74j63
$$ 19 50 60 -100 59 73 -203 318 -15 109 147 -116 -82 71 44 203 -107 -2 96 108 347 -136 138 -25
5844b5j1j80J96J25p1K47l08J13p6L8J91k37K09k34j05M27k41k61L67l93Q2M13
$$ -25 -36 -216 -20 105 34 281 -27 86 10 48 239 2 211 -23 -128 299 58 -203 164 -229 -147 266
5866B66k15j09O5J05k3kj11J49j68j22M48N2j95l94L42J21k40q9q4L51M7p6o9
$$ 266 51 -58 7 112 89 87 -24 125 -43 -165 283 335 140 -254 88 209 -31 -120 -204 147 194 118 49
5889D9Q1o9l7j76J23J21L8k75K44pk12J11l9J13j89p4J70k89K20K78j46j12j0
$$ 49 130 61 24 -152 -29 92 130 -145 99 92 -120 -9 -48 65 -124 -198 -28 -317 -97 181 35 -77 -87
5912h7LL6R1p7n7Q8R3j10j15q6O19j96r3k06L08j1kk38J54l16J16K63j80J12k05
$$ -87 -84 -48 43 -34 -91 -3 90 -20 -135 -221 398 202 109 -97 211 200 198 -40 114 -202 -86 177 -3 109 -96
5937i6J20m4J6J94j51l5j83j8K80M7j79J4q3J89J22m03L77k21L75m73Q1J02Q2
$$ -96 24 -20 -4 190 39 4 -179 -197 83 130 -49 -35 -118 71 193 -210 167 -54 321 -152 -71 31 113
5960A13oj7j93J1J98j89k34K21m3J25Q0k05J84R6Jm4J08l9j17n4n3j21O5L24m73
$$ 113 107 90 -103 -92 106 -83 -317 -96 -139 -14 66 -139 45 141 142 98 206 167 50 -4 -57 -178 -113 211 -262
5985b62N07l32L9l5J12J09j46j62K73j54J08j16j09L29K02k00l40nJ68O7O3o7
$$ -262 245 -87 -48 -83 29 138 -8 -170 103 -51 57 -59 -168 161 363 163 -177 -182 -14 53 116 49
6007D9J14k22K21P5l38J31p2K01k68L12m95J47J60L09l30J9J33l41K21J7L8J07
$$ 49 163 -59 162 237 -101 30 -42 159 -109 203 -292 -145 15 324 -6 13 146 -195 26 43 81 188
6029A88j08k05J08j24M2j0K68j47J37m62M25j99K25L2O6k41J77n3l24K22J23j21
$$ 188 80 -125 -17 -141 -99 -109 159 12 149 -313 112 -87 138 170 236 -5 172 119 -205 17 140 19
6051A9j4J75M2k39J18J40k01N6j92K8J37k07K74J01q0r8J68l72p1Q6J17P6M5J8
$$ 19 5 180 222 -17 101 241 40 96 -96 -68 69 -138 136 237 157 59 227 -145 -216 -130 -13 63 108 126
6075A26l51L06l05K78J56l87L33j27j28J73N6r3j0j04J00o2J74k29l7P7Q9M2j19
$$ 126 -225 81 -224 54 210 -177 156 29 -99 74 130 37 27 -77 23 -39 135 -94 -131 -54 35 77 -42
6098d2L8K6L95l97j55j9L12J66m50J99J3k4l65K69P4r1j9J88M6j39o4j1k4Lr6
$$ -42 -4 22 417 20 -135 -154 158 324 -126 73 86 62 -303 -34 40 -51 -70 118 164 25 -39 -50 -74 -71 -167
6123a67P1P6j3J04oL5l1R4q8J13l40K46n7R5l35L43l58M08l45J96k0J22j88K85
$$ -167 -96 -20 -33 71 65 100 69 163 75 188 -152 94 37 132 -203 140 -218 190 -155 41 21 143 -45 240
6147B40l35N3O8p6J41k75J61p5K53j96J94O6L4k60N1K47l16n3J74l4l30k1K76
$$ 240 -95 -42 26 -50 91 -184 -23 -98 155 -41 153 219 253 -7 44 291 -25 -78 96 62 -268 -289 -13
6170a3NR9q5M17k71l56J80m1L4oK0p8J59j00J94k82K02j48l3K15j03j90p9J49
$$ -13 -8 91 6 423 152 -204 -24 -65 -31 -37 -17 -95 64 -36 158 -124 78 -70 -103 112 9 -181 -260 -111
6194a11L07N0k34M1K45l37q3J08J87k50K06j78j50N5N26l65K8M9O1l76J46J67
$$ -111 196 246 12 53 298 -39 -122 -14 173 -77 129 -49 -199 -144 382 17 45 94 155 -221 -75 92
6216I2O8j12L1J73l57J31J7o9n5M8j3J96j39J2Q0O0j94J00l3k89J00K69N1j26
$$ 92 160 48 79 252 -105 26 43 -26 -81 -33 -46 150 11 23 103 163 -31 69 36 -253 -153 116 167 41
6240D1L1j20J04j60J60r3n4J41k0o3k04K01L2J38p3j51J82j67L06j09k74N1J59
$$ 41 72 -48 56 -104 56 -37 -91 50 30 -33 -237 -36 -4 134 61 -90 92 -75 231 122 -152 -101 58
6263E8pm5r0R8k36P5K62k19K27j04J6N4k29K25r2k23j6J45P8Q3l18L36j76M3P8
$$ 58 51 6 -84 14 -222 -147 115 -104 123 19 35 89 -140 85 -7 -230 -246 -101 -23 60 -258 78 -98 -55 23
6288B3rK24j25j34L6j13j86K38J40k8k90L08p0O1J92k62j11K84J4M3j71K57J1
$$ 23 14 238 113 -21 15 -98 -284 -46 94 66 -224 84 14 75 267 5 -106 178 192 235 64 321 332
6311C32k99j73L28j22k14J22k5L1k9o1J30k27J83k6R0p7J90j92o0O1J4R9r2Q6
$$ 332 33 -140 188 66 -148 -26 -51 -20 -49 -110 20 -207 -24 -50 40 -37 153 -39 -99 -38 -24 75 -17 69
6335F9j16j3J76k8j86J22l77O43j34J20m53M25k84M4j45K91k61N3O5k01K22J34
$$ 69 -47 -60 116 88 -98 24 -353 290 156 276 -177 248 -36 8 -137 154 -107 -54 11 -190 32 166
6357A66j86l0J67k84M60l23q0K8L47m46j61K34R6O8q6j16J88j39J02L86m25RJ35
$$ 166 -20 -50 117 -167 293 -30 -110 -82 265 -181 -342 -108 -12 56 -30 -146 42 -97 5 391 -34 -25 110
6380A10l3j20J70j05j36J13j67K43l0J91j59o6l38M22k9j38P5k15L95l56J38M9
$$ 110 77 -43 127 22 -114 -1 -168 75 45 236 77 11 -327 95 66 -72 3 -212 183 -173 -35 14
6402A4P5J0j13q4j91j9K42p5K82j23K2k18J30P1kk15N8r3M99k38k20J93q4J74
$$ 14 89 99 -14 -98 -289 -308 -66 -141 141 18 40 -178 -48 23 21 -194 -136 -229 270 32 -188 5 -79 95
6426I5j2j1J3p3k9Q0K1m7N7j17J70J16j00o8n9J88k91J24m3N0l5k59L72k57R5
$$ 95 83 72 85 12 -17 63 84 37 94 -23 147 263 163 95 36 224 -67 57 14 64 29 -230 142 -115 -20
6451b0k07K04r6K3j22k5L42j28O8R4k6l84J97O8J42j48J52J1j72k3K52k82K3J5
$$ -20 -227 -23 -119 -96 -218 -243 99 -29 39 133 107 -277 -80 -12 130 -18 134 145 -27 -50 202 -80 -57 -42
6475d2K05k67k7J66M6k4j78J67J15j9M7l04Q2k14M01l09O3l9J70K91k83j19Jk41
$$ -42 163 -104 -131 35 81 57 -121 46 161 142 189 -115 -33 -247 154 -155 -92 -131 39 330 47 -72 -71 -312
6499c12L55k33K83r4O7j00J23Mk1k58R2J38r0M14l63M7K37k42J05J31k86l2j83
$$ -312 43 -190 93 -1 66 -34 89 93 72 -186 -94 44 -46 368 5 52 289 47 152 283 -3 -35 -218
6522b18M8R7K66r7NK72n08K76j30r9J77p1J11r9K9oR7O8l35K82k87K39j4l81M17
$$ -218 -170 -73 193 96 101 373 -135 141 11 -88 89 18 129 30 59 53 150 218 -117 165 -122 117 103 -278 139
6547A39j78Q3j96pJ36J65l65J25K13M2k23K9J51j34q4K60k89L89k04j64J34K18
$$ 139 -39 44 -152 -159 -23 142 -223 -98 115 157 -66 -37 114 -20 -104 156 -133 256 52 -112 22 240
6569B40k47o8r0P4K49j7k2j41j18L88j7n08L51r3K76k84M7L1J13k11J04j16J21
$$ 240 -7 -75 -165 -91 158 141 119 -22 -140 248 231 -277 74 -19 257 -27 20 51 164 -47 57 -59 62
6592F2k6j33M4N4j59P8R5j2Qq7J34J15j75J7J7j82J01Q5O4R7q9o3l1K08k0p0M
$$ 62 36 -97 -53 1 -158 -80 15 3 11 -76 58 173 -2 15 32 -150 -49 36 100 197 108 45 14 222 202 132 136
6619A36Q9l85K80r1j87J03K78m88K82J15k52J54R8j82L51l11N9n1j35M3jK25q4
$$ 136 225 -160 120 29 -158 -55 223 -265 17 132 -120 34 132 -50 301 -10 49 -2 -137 -94 -95 130 46
6642D6K6K37l57J59j54J4Q6mj09K25j20l25o4P7K51j9K01M4k89j71L82k28J78
$$ 46 72 309 -48 111 -43 -29 57 53 -56 169 49 -276 -340 -263 -12 -31 170 214 -75 -246 136 -92 86
6665H6k30L23l43M6J40k37L76j96J83j92p4L34l35K70j78q8J20k38Q0K17j19J95
$$ 86 -144 179 -164 -118 22 -215 161 -35 148 -44 -118 216 -119 151 -27 -115 5 -233 -153 64 -55 140
6687A40k34L1L0q7j47K80m3o9o0K10q4q7J49K5L25l65pj84K47pj65P2M7J23j07
$$ 140 -94 -63 -33 -120 -267 13 -30 -99 -159 51 -33 -120 29 54 379 14 7 -177 70 63 -102 -30 17 140 33
6712C3M4q5k1L8n8j15K13l41J90J56M9j22j8l2p8K60n4J50k07j99K16r2J81j15
$$ 33 77 -8 -29 9 -49 -164 49 -292 -102 54 103 -19 -37 -69 -147 113 59 209 2 -197 19 -73 108 -7
6736gk29L88k33P7K3p3K77k34J13j05J27k51Q2j12L26j37p5k59L68j74J30O2l57
$$ -7 -236 152 -81 -4 19 -54 223 -11 102 -3 124 -127 -45 -157 169 32 -43 -302 66 -108 22 84 -273
6759b73L90r9j38m6J80P1k69L42l68L84K4k52J58j46J10q4L13l93K66l05k5J82
$$ -273 117 18 -120 -166 14 85 -184 158 -210 174 198 -54 104 -42 68 -16 297 -96 170 -135 -160 22
6781B2o3P1j56Q4k13L04P3r3J65k43R8J09O9k19j55N1O8q7J68j63J81K36l99M2
$$ 22 -41 30 -126 -42 -255 49 122 29 194 -49 49 158 227 8 -147 -96 -28 -115 53 -110 71 307 -92 -50
6805e0j2n6J88o6j08K90j54l03J24O22m19J17l13j46L53l61J96L3n0RJ23k06J39
$$ -50 -62 -118 70 4 -104 186 32 -271 -147 475 56 173 -140 -286 67 -294 -98 -65 -115 -106 17 -189 -50
6828e0j06J24K04j45j72J13k08L42J7k0k88L34l05P1J91rj89O8j11L18n0j76n6
$$ -50 -156 -32 172 27 -145 -32 -240 102 119 99 -189 145 -160 -89 102 93 -96 -28 -139 179 129 -47 -103
6851a03J18m0Q1j35J65qn3j47L32k04L5j19N1O3j50L0j76K56K16j50J6k64L66
$$ -103 15 -25 56 -79 86 78 25 -122 210 6 41 -78 -27 36 -114 -84 -260 -4 212 62 78 -186 180
6874A80J10l16J19j06j5J3j79LK70L6k8l77K56j73M5L44l83K03j35n0L57l21K64
$$ 180 290 -26 93 -13 -28 -15 -194 -191 79 115 87 -290 -34 -207 -162 182 -201 2 -133 -183 174 -147 117
6897A17k71lJ24K57J04k03k14j21J95J17J09j57o7L9m7J17J04m16M49k92P3K36
$$ 117 -154 -157 -33 224 328 125 -89 -210 -15 102 211 54 -13 26 -21 96 200 -216 233 -59 14 250
6919B50k14R1m9R9l84L26Nk45J69j54K49k17J3K11l05M6J97j55k81O5N26l09N
$$ 250 36 127 78 177 -207 119 124 -121 48 -106 143 -74 -61 150 -155 -109 88 -67 -348 -283 243 -66 -61
6942f1j26J20r4P7R0j26K91k98K15J53k01K83n49J70k0J54r5J8L2J7k03N9J42
$$ -61 -187 -67 -161 -84 6 -120 171 -127 88 241 40 323 -226 -56 -76 78 -17 1 33 50 -153 -94 48
6965D8J47k63O5J48m3k20K46k21J68k24j32P4N02k88M2J7k30J87j77J71Q5n8Q
$$ 48 195 -68 -3 145 102 -118 128 -93 75 -149 -281 -207 295 7 49 66 -164 23 -154 17 102 44 52
6988E2M3k84K17l7j6r4L80j80Q1j50j22K08j15Q4J1k28L14m84L95j89N6K04l27
$$ 52 95 -189 28 -9 -25 -119 261 81 162 12 -110 98 -17 67 78 -150 164 -320 75 -114 -58 146 -181
7011a81J17m4J85l6j94j03L24j02OJ14j96K27j53n5L87m02K19l50K37K27n18K74
$$ -181 -64 -108 77 41 -153 -256 68 -34 -28 86 -110 117 -36 -91 296 -106 113 -237 0 227 -291 -17
7033a7o1O3k7J28J38k00J14j34j08J07N0q3K19J3k47O8K4J33j21J87k07j8k6j62
$$ -17 -78 -15 -42 86 224 24 138 4 -104 3 53 -30 189 202 -45 23 47 180 59 246 39 21 -5 -167
7057a67J99P0j16p8j7L22qm07K5J99O2J69k48J91j57J03q5J41r0j41j01K82j20
$$ -167 32 102 -14 -92 -109 213 205 -202 -177 22 84 253 5 196 39 142 57 198 108 -33 -134 148 28
7080B8q5o1P7J98l34J56J11p7J72j68j05J04M1j85l6P9K91K7k16j07J02j47L18
$$ 28 -57 -118 -41 157 -177 -21 90 13 185 17 -88 16 57 -128 -164 -85 206 233 17 -90 12 -135 183
7103A83j88K8j69L09k29k0OO3n3J35J1k62M14k32J87k12K16j84j6O1P5j28j7J48
$$ 183 -5 23 -146 163 -66 -86 -80 -17 -70 65 76 -186 228 -4 183 -29 187 3 -13 48 123 -5 -22 126
7127A26k60J36j35P2p2jJ67j20j9K07j45J6j23O3J32n73M96K45q0j44K85j67k97
$$ 126 -134 2 -133 -61 -133 -134 33 -87 -106 101 -44 -28 -151 -88 44 -529 -33 212 132 -12 273 106 -191
7150a91L70j57j79j63L62Q8k46M0J5J29m90M36L45m22L6J02j07j31K21j28O9l4
$$ -191 179 22 -157 -320 42 130 -116 -76 -61 68 -422 14 359 -63 -27 75 -32 -163 58 -70 -1 -35
7172c5L5l11K80j02m6L10k84M7J33j57J54J08J09l93J33MR6J8k30K13j42r4M2
$$ -35 0 -311 -31 -133 -179 131 -153 -106 27 -130 24 132 241 -152 -19 -15 81 99 -131 82 -60 -154 -112
7195a12N1m7Kk33M41j2J35m9j03l6l6r1R6p2K39J9j69P6k40L68l71P5L06j53j70
$$ -112 -61 -108 -106 -339 102 90 225 176 73 37 1 -90 6 -66 173 192 23 99 -141 227 -144 -69 237 84 -86
7220h6J36J39j87q2K43l84j09M66K6j44K2m1m0P7Nr1J75j99J95J1j03P5k72L80
$$ -86 50 189 2 -80 163 -221 -330 136 162 18 40 -1 -41 36 41 -50 125 -74 121 132 29 104 -168 212
7244B12k49k41K31J04J17k59O1j59K79Mj2Nj60J8j16M57l65J21M8O3J6j39k04
$$ 212 -37 -278 -47 57 174 -85 -24 -183 96 100 88 93 -67 -49 -165 292 -73 48 96 159 175 36 -168
7267a68K16l23K46L1k51NK39K7J32M2m2j88l5K16k35Q4k42M11m1j21KRK20p2p3
$$ -168 48 -275 -29 2 -249 -244 -5 22 154 196 154 -34 -69 147 -88 -4 -246 165 124 3 5 14 234 162 89
7292H9k39J72q4j56L46j07J0q7n3K54Q0l10M0J96O8n33K66J40k29K20l69L28m2
$$ 89 -150 22 -62 -218 128 21 31 -56 -109 145 225 -85 -45 151 219 -314 -48 92 -137 83 -286 42 0
7315@N8M6J78j27R6k85j20K57l33J60Q3j29k14K75J23k26j36K31L45j59j02O7
$$ 0 58 104 282 155 251 -34 -154 103 -230 -70 13 -116 -330 -55 68 -158 -294 -63 282 123 21 88
7337H8l2J18j3l13K08m0J18k43L16j80L1o8K10k19Q4K19k94j38k52K98J9J47J01
$$ 88 56 174 161 -152 56 16 134 -109 207 27 58 -10 200 -19 65 284 -10 -148 -400 -102 -83 64 165
7360A65j35K08j13k03P8J32k52K28j19l3nO0r5J47j65M5L1P9j72m0L64k80j71
$$ 165 30 238 125 -78 0 132 -120 108 -11 -44 -49 11 -84 63 -102 -57 -26 53 -119 -159 205 -75 -246
7383b46L51O8j75k20J2k4J10J82pnJ3l08J9L57L0m20L83k8O2k20j91L56j19j34
$$ -246 105 173 -2 -222 -210 -234 -124 58 51 46 59 -249 -230 127 157 -263 120 92 154 -66 -257 99 -20 -154
7407a54l2L50j79J47j46j52K86q9R4j64O0l1j95K23J88k90N2KL6j61M9L12l69
$$ -154 -186 164 -15 132 -14 -166 120 31 125 -39 21 -10 -205 18 206 -84 -32 -30 6 -155 -106 206 -163
7430a63N4K29j99M9Q1M7J28N6j22K5O6k19k59J35j18J15J49L12n18L15k21Q9k77
$$ -163 -109 120 -79 -30 51 98 226 282 160 185 251 32 -227 -92 -210 -95 54 366 -152 163 -58 31 -246
7453b46J91MQ8j70j9J80K10k63O2j80L17j80k43M26j44Q3k84J22J36j41k36J72
$$ -246 -55 -51 37 -133 -152 28 238 -25 37 -143 174 -6 -249 177 33 116 -168 -46 90 -51 -287 -115
7475a15m1J72N4J27o02N79j71j92K06p5J35k92K83k05K1R9K53l14oM38l75M8M2
$$ -115 -156 16 70 197 -405 174 3 -189 17 -58 77 -215 68 -137 -116 -17 236 -78 -84 354 -21 27 69
7498F9QP6j87K65m28R4l9K47l18R9P1L81k30L7P8l60K30m7L5j95J02k6J07o7j61
$$ 69 77 153 -34 231 -197 -103 -142 105 -213 -114 -43 338 108 145 223 -137 93 46 81 -114 -12 -38 69 2 -159
7523a59M44m40R7j93L27k19Q3q5L2M9J45j57K91K8n09K30M2L9k61J86M33k31p0
$$ -159 285 -155 -58 -251 76 -143 -60 -145 -113 -64 81 -76 215 243 -266 -36 6 45 -216 -30 403 172 102
7546A02M0j65J41j81K40l85M3K22k31J85k03J23k15M69O6l63J88j13J44j23K8
$$ 102 142 -23 118 -63 177 -208 -165 57 -174 11 -192 -69 -284 185 251 -112 76 -37 107 -16 12
7567A2j87K41j66Pl9K07P5j86l6RN5J6k1j00J93j01n7j1l1K20N6j91j07k4Q8R9
$$ 12 -175 66 -100 -93 -132 75 150 -36 -72 -63 -8 8 -13 -113 80 -21 -78 -89 -120 100 156 -35 -142 -166 -78 21
7593B1o4m4k36M04k09K74l29L1K09J26M3l17l1L20k24RK0k7L64m70J24J90k17
$$ 21 -43 -87 -323 81 -128 146 -183 -152 57 183 226 -91 -122 198 -26 -17 3 -24 340 -130 -6 184 -33
7616c3o0R3j42O7p0J27QK18q7l18M30j13j54K62k7o0j48k49L36k38R3N3M11l59
$$ -33 -93 0 -142 -75 -145 -18 -10 208 121 -197 233 120 -34 228 201 141 -7 -256 80 -158 -65 -12 399 40
7640D0k93j52J67J55L8J38l14K74j64J81j39K44k13Q1J6k19K59j60J47j85K02
$$ 40 -253 -405 -238 -83 -45 93 -221 53 -111 70 -69 175 -38 43 59 -160 99 -61 86 -99 103
7661A03k35J06R3j53L7p3K23j38Q6Jl31L83j21J36j34K57j47M0n7j87J04P0j81
$$ 103 -132 -26 67 -86 -49 -122 101 -37 49 50 -281 102 -19 117 -17 240 93 133 76 -111 -7 63 -118
7684a18J94l28K08J55j50j4J62j48R5k3O6J24l33j25K01k4J22q3M3p3j23J57J96
$$ -118 76 -252 -44 111 -39 -53 109 -39 56 33 99 223 -110 -235 -34 -58 64 -19 24 -49 -172 -15 181
7707A81j09O7k49J78j8L2k03L42k86j54J6J83nk12K17N4j27J17l56L52j2O8L8
$$ 181 72 139 -110 68 50 82 -121 221 -65 -219 -203 -20 -25 -237 -20 34 -93 24 -332 20 8 76 114
7730A14k19M0L7K6R1p4M6J5Q9L1k63J32j67J15j09O3k73K28K71l38Q8jJ10k25
$$ 114 -105 -65 -28 -2 89 15 61 76 165 196 -67 65 -102 13 -96 -33 -306 -78 193 -145 -57 -58 52 -173
7754a73M5K07k62J60J48l32j29K99N2%K48m71J52q9m6J63j98M31k32N0J07n20
$$ -173 -128 79 -183 -23 125 -207 -336 -37 15 15 263 -208 -56 -145 -191 -28 -226 205 -27 23 130 -390
7776c90M01n8K13l30J29q4J79J60k57j75M39J02k05J2k32j3j8L28k67pK0j21j22
$$ -390 11 -47 166 -164 -35 -119 60 220 -37 -212 227 329 124 136 -96 -109 -127 201 -66 -73 -53 -174 -296
7799b96K9L18Mj39k1J73J34o9k80K3J43k19j58L46l0j26P0P1l5N1L6p1P4K4O5
$$ -296 -267 51 55 -84 -105 68 202 133 -147 -124 19 -200 -358 -12 -42 -168 -98 -27 -62 -11 25 -46 28 52 117
7824A17n6J0j2j93K16J13l27N9K37j81J06j33J0k01K22J87k05J30J73o10M66r4
$$ 117 61 71 59 -134 82 195 -132 -73 164 -17 89 -44 -34 -235 -13 174 -31 99 272 -338 128 34
7846C4K6j57K73k52O1q7r4K25m4j07J33k4m7M20m57K5J17R4j60j19J70r6J34J62
$$ 34 60 -97 176 -76 -15 -102 -196 29 -15 -122 11 -13 -60 360 -97 -72 45 139 -21 -140 30 -66 68 230
7870B30k15O1n4J27j30P8j9L1n9q9l3J10Q4j80K7p1N4M5L8n4n9R0O2Jj24J55j10
$$ 230 15 76 22 149 19 97 78 109 50 -39 -72 38 122 -58 -31 -102 -48 -3 35 -19 -78 12 74 75 -49 106 -4
7897dJ7o5P6j49O3J05J66m01K21J71m59K93K93m48K54J84k73j29J75p8J29o5k63
$$ -4 13 -52 24 -125 -62 43 209 -192 29 200 -259 34 327 -121 133 317 44 -85 90 12 141 76 -187
7920a87K04m4J19j4j10rk4j1K65l47K32j19L16l48oL16k22q7J36L6k4r1J45m13
$$ -187 17 -27 92 78 -32 -41 -65 -76 189 -158 74 -45 271 -77 -83 233 11 -76 60 96 72 -19 126 -287
7944b87J87J6J54P6k12J32K6k16m9L34j11L7O6j95Q3j04N0p3P9m7K17j94K8Q3
$$ -287 -100 -84 70 146 -66 66 92 -124 -173 161 50 87 153 -42 41 -63 -13 -86 -7 -54 163 -31 -3 80
7968H0j43R1j26J58O7j57p6Q0Q8J11j40k14P9J65j19r4N4N8j36O4K9j07M74p1
$$ 80 -63 28 -98 60 127 -30 -106 -26 62 173 33 -181 -102 63 -56 -150 -96 -38 -174 -110 -81 -188 286 215
7992B15j14o6j17L11j84j82K2K36j64j37N37j32l18%J75J65K5l61K3k8K79j92
$$ 215 101 35 -82 229 45 -137 -115 121 -43 -180 357 225 -93 -93 82 247 272 -89 -66 -94 185 -7
8014gJ03J17l18J56O1m48J40J37K82l14j81K84k6QL7j18P7M8j44J82K51n39K12
$$ -7 96 213 -105 51 112 -336 -196 -59 223 -91 -272 12 -14 -6 31 -87 -10 38 -106 76 327 -212 0
8037@L3K2j19Q6j28K9J18M4k71l1K44r3q5K76L2j47N5k59N65k67j01K25l29k85
$$ 0 33 55 -64 22 -106 -77 41 85 -186 -217 27 -66 -151 125 157 10 65 -194 371 104 3 228 -101 -386
8061c86M39l06L49m9k2j4J54n2l92K99j74J26L0j03pM6L58k39l1j02J41Lk75J79
$$ -386 53 -253 96 47 25 11 165 113 -279 20 -154 -28 2 -101 -108 -62 296 57 26 -76 65 68 -207 -28
8085b8j62n7N62j97j72J40N1j83J84k41J10J88q5j67R2l35K76j6Q5m1k3J36m13
$$ -28 -190 -247 315 118 -54 86 137 -46 138 -103 7 195 110 -57 35 -300 -24 -40 45 4 -19 117 -296
8108b96K63k87L56j85J22j56N7k8K64j00J46m09K35J00m6K7j74K59j01J28k05
$$ -296 -33 -320 36 -149 -27 -183 -126 -154 110 10 156 -253 -18 82 36 63 -111 148 47 175 -30
8129c0k1M47l46K1j94K34K7K84m58j9L3m5J30J68J01m16O5j76K35j59P7N5J72
$$ -30 -51 396 50 71 -123 111 138 422 -36 -55 -22 -67 63 231 332 -84 -19 -195 40 -119 -42 13 185
8152A85Q6j09j61l8j52O5j18K98j88J8J33o4q8l0J27j0J63L1k26k2N9j01K07k43
$$ 185 271 162 1 -37 -189 -124 -242 56 -132 -114 19 -45 -133 -163 -36 -46 117 148 -78 -100 -41 -142 65 -178
8176a78K11l4j21L9J01p8M7j68J28L00j69J0Pk87O1
$$ -178 33 -1 -122 -83 18 -60 -13 -181 -53 247 78 88 95 -192 -131
8191a31
$$ Imaginary data points
##PAGE= N=2
##DATA TABLE= (X++(I..I)), XYDATA
0@%%%%%%%%%%%%%%%%JrJ6j6J6j6J7k5L2l2M0m8N3o1P1q0R0j04J18j33J49j67J86
$$ 0 0 0 0 0 0 0 0 0 0 0 0 0 0 0 0 0 1 -8 8 -8 8 -8 9 -16 16 -16 24 -24 29 -32 39 -41 49 -55 63 -70 79 -88 98
39I8k08K31k56K86l18L52l88M27m72N21n74O33o98P67q44R33j033J146j275J423
$$ 98 -110 121 -135 151 -167 185 -203 224 -248 273 -301 332 -366 401 -443 490 -543 603 -672 751
59G51j598J805k056K370k774L318m090N285p404J2337n0849r277N0060J348Q741
$$ 751 -847 958 -1098 1272 -1502 1816 -2274 3011 -4393 7944 -42905 -52182 -2122 -774 7967
74G967J8555K0205k2074l1128j5514K387j1673q742J4546L6612K0250n72j963
$$ 7967 26522 46727 24653 -6475 -21989 -19602 -31275 -40017 -25471 11141 31391 30819 28856
87B8856O881j0867l0122k3262M022R853J077O566K6250K2766l760j7422p489o848
$$ 28856 35737 24870 -5252 -28514 -24492 -14639 -13562 -6996 19254 42020 38260 20838 13349 6501
101F501k0348k1016J995J8648J3124M736J1097J5198j702k1274j9407n892m203
$$ 6501 -13847 -34863 -32868 -14220 -1096 3640 14737 29935 28233 6959 -12448 -18340 -22543
114b2543j0342J28K0073K1956O014r48M130k48j7200k1784n796O266L198K447
$$ -22543 -32885 -32757 -12684 9272 15286 14338 18468 18220 1020 -20764 -26560 -20294 -17096 -14649
128a4649J5035J9952Q672p054q112m290r599j5847q145Q597J3650P200O103J0991
$$ -14649 386 20338 29010 21956 13844 9554 -45 -15892 -24037 -15440 -1790 5410 11513 22504
142B2504P069q512j6675r816l851o244n649O671J6343J1495Q40P1J606o034j6362
$$ 22504 29573 21061 4386 -5430 -9281 -15525 -21174 -14503 1840 13335 14175 14246 15852 9818 -6544
157f544j3365q67M363J346M197J3535J3647j51p902m630l247j0028j2315K13J1452
$$ -6544 -19909 -20776 -16413 -15067 -10870 2665 16312 16161 8259 3629 382 -9646 -21961 -21748 -10296
172a0296Q754L310P110J0505M80j1600j0302l010k678o642M7J1575J2625L941
$$ -10296 -1542 1768 8878 19383 19863 8263 -2039 -5049 -7727 -14369 -14322 -2747 9878 13819
186A3819m81K438M48j0199j3591m959L107R53PP572J2450M989n574n330j618n996
$$ 13819 13338 15776 16224 6025 -7566 -12525 -9418 -8465 -8458 -886 11564 16553 10979 5649 4031 -1965
202a965j1535n330N664P713L057L689P868N233n897j0207m665j463m517m136N926
$$ -1965 -13500 -18830 -13166 -5453 -2396 1293 9161 14394 8497 -1710 -6375 -7838 -12355 -16491 -10565
217a0565J1451O315K66J910L436m742j0989o560J188J494q46M065J0492P277j237
$$ -10565 886 7201 7467 9377 12813 8071 -2918 -9478 -8290 -6796 -7642 -3577 6915 14192 12955
232A2955m137j569l280q169o960R88N983L656J783N780N819j357p483n895k164
$$ 12955 8818 7249 3969 -4200 -11160 -10172 -4189 -533 1250 7030 12849 11492 4009 -1886 -4050
247d050l681m482M14P698O984K031L53K501r93p067p356k568J464J21J381N984
$$ -4050 -7731 -12213 -11799 -4101 2883 4914 5267 7768 6775 -292 -7648 -10216 -8752 -8631 -7250 -1266
263a266P965L067k668k239j117m211p053k843M281M426K098L159O107K427l955
$$ -1266 6699 9766 7098 4859 3742 -469 -7522 -10365 -6084 -1658 440 3599 9706 12133 8178
278H178o129k736j877l943k158M087O526L697L79R02J405l786o953m684K74L19
$$ 8178 2049 -687 -2564 -6507 -8665 -4578 1948 5645 6024 6926 8331 4545 -2408 -7092 -6818 -6499
294f499k18K566O665M549o85k700j278j971n632m929J183M203K585J653M106M447
$$ -6499 -6717 -4151 2514 7063 6378 3678 2400 429 -5203 -10132 -8949 -4746 -2161 -508 3598 8045
310H045o03n031l662j015k390k892R34N172N443J020Q69K018q66n362n240j025
$$ 8045 7442 2411 -1251 -2266 -4656 -7548 -6614 -1442 4001 5021 5890 7908 7042 1680 -3560 -4585
326d585Q23m63P41M216N753P96k308p62j106m116n041j404K669K417J132K653
$$ -4585 -3762 -4225 -3484 732 6485 7281 4973 4211 3105 -1011 -6052 -7456 -4787 -2370 -1238 1415
342A415L901J181k929m074j605j745k833j064L162M665J944J033J371J053k704
$$ 1415 5316 6497 3568 -506 -2111 -3856 -6689 -7753 -4591 74 2018 3051 4422 5475 2771
357B771n157k650P40L01m62K696M855L066p34j313m23j851m223k773Q88K886Q87
$$ 2771 -2386 -5036 -4296 -3995 -4457 -1761 3094 6160 5426 4113 3690 1839 -2384 -5157 -4269 -1383 -496
374d96J397L376K314j019l329k337j401k190k092Q14L739L112O85O84J173p96
$$ -496 901 4277 6591 5572 2243 -94 -1495 -3685 -5777 -4963 -1224 1888 2573 3257 4430 3634
390C634m193l195o91N4L7N69L494L749M62r60p06p89k592l338o36J860J865P08
$$ 3634 -559 -3754 -4445 -4391 -4354 -3785 -291 3458 3920 2960 2254 1465 -1127 -4465 -5101 -3241 -1376 -668
408f68K435K797J188k150k854j152o93k334r15K437L323J510j68J579K03k034
$$ -668 1767 4564 5752 3602 748 -404 -1097 -3431 -4346 -1909 1414 2924 2756 4335 4538 2504
424B504l565j964L18j66m22J819L354K251j027j048k49j512l531j886J020J597
$$ 2504 -1061 -3025 -2707 -2873 -3295 -1476 1878 4129 3102 2054 1805 293 -3238 -5124 -4104 -2507
440b507R07J236K566K020j121k377j178r68j642j562J290K658K059M63Q46J226
$$ -2507 -1600 -364 2202 4222 3101 724 -454 -1422 -3064 -4626 -3336 -678 1381 1844 2690 3916
456C916n85k908k298j95K63o29M93L025K346L17r16k69k36k919k457j53J392P39
$$ 3916 3331 423 -1875 -2070 -1807 -2436 -1943 1082 3428 3745 2829 2560 2324 -595 -3052 -3205 -1813 -1074
474a074K38J940K232J53j738j670n94j486j508m63J863K206P76L86J195M4j660
$$ -1074 -836 1104 3336 3489 1751 81 -513 -1999 -3507 -3970 -2107 99 875 1261 2456 2500 840
491H40k226j225K77m54J27J619K507J109n9k47m89j257k153j248P80J143L30J277
$$ 840 -1386 -2611 -2334 -2788 -2661 -1042 1465 2574 2515 2268 1779 522 -1631 -2879 -2099 -956 -626 651
509F51J670J167n01j638q90o30j692j008P64J953R59Q77L52O15n54k261j496m21
$$ 651 2321 3488 2987 1349 459 -171 -1863 -2871 -2107 -154 805 1682 2034 2649 2095 -166 -1662 -2083
527b083J7k73M87J810J717N1l96j78n01j586j613l68J101P59J69J695J645k20
$$ -2083 -2066 -2339 -1852 -42 1675 1726 1330 1152 651 -935 -2548 -2916 -1815 -1056 -887 808 2453 2233
545B233p19j136m89q09p22m56J210J244N45O48Q20L50j557j615q28J96j33o01
$$ 2233 1514 378 -111 -920 -1642 -2098 -888 356 901 1549 2369 2719 1162 -453 -1281 -1085 -1218 -1819
563a819J392J820P51p16j09j01j034j621p89P61N18r5P92J608O02p14j222q2o50
$$ -1819 -427 1393 2144 1428 1319 1218 184 -1437 -2226 -1465 -947 -1042 -250 1358 1960 1246 24 -58 -708
582g08j209q52J197J175N58M08R47L12m40j679n42l72j88j7N56J518J053m63L36
$$ -708 -1917 -2769 -1572 -397 161 569 1516 1828 1388 -291 -833 -1205 -1393 -1410 -854 664 1717 1254 1590
601A590o3n64j260j223J73O48R3M19J197R82j23j281m22j70r33r77J80P84J160
$$ 1590 1527 963 -297 -1520 -1347 -699 -606 -187 1010 1992 1869 588 166 -4 -937 -1914 -1734 -950 210
620B10O1L61P53J03j331p80m61J33o01J62R94J265K11k74L63l52q74q91n44N11
$$ 210 271 632 1385 1488 157 -623 -1084 -951 -1552 -1390 -396 869 1080 806 1169 817 -57 -948 -1492 -981
640i81J56K38Q64J004K94m35n76m60n82m15o28O15Q39L72K84O84L41p74r81o42
$$ -981 -825 -587 277 1281 1575 1140 564 104 -478 -893 -1521 -906 -67 305 589 1273 1614 840 -141 -783
660g83k83k4l70O95J160O88O2o60N29n94j026n61K24K95n3J70J060N71j38m76
$$ -783 -1066 -1090 -1460 -765 395 1083 1145 485 1014 420 -606 -1167 -943 -648 -701 -531 529 1100 962 486
680D86o7o04o14l28m2P11O69K06M08P25p21m25p24k13Nk59R2P01P71J87k90N5
$$ 486 419 -185 -799 -1127 -1169 -458 211 417 825 1550 829 404 -320 -533 -528 -787 -695 6 777 964 674 729
702G29j04r14m60j27K02Q8N67J90N92J22k24n13p9l73o18k29N84N17K22J8M80
$$ 729 625 -289 -749 -876 -674 -586 -19 171 763 885 661 148 69 -304 -922 -1151 -567 -50 172 190 670
723F70L94p51r07K85j47l62R2J89R41K54R2k11K06o60m34m87M22J36J42J12O86
$$ 670 1064 313 -594 -309 -456 -818 -726 -537 404 658 750 539 745 85 -349 -836 -414 -278 -136 -24 662
744F62L46q2m52m10l19l18j91J26L00M87K66j30O20k70p81j97l60N7j18K64L97
$$ 662 1008 926 474 64 -255 -573 -764 -638 -338 149 415 285 905 635 -146 -343 -703 -646 -764 -500 -103
765a03M83L04l52J06r0n46o83L88o0K09J56K39P96l48J46l68m22k15k06K9K44
$$ -103 380 684 332 438 348 -198 -881 -493 -553 -344 -188 51 847 499 645 277 -145 -360 -566 -537 -293
786b93M89j8M36nll24n01k09K12r7j43L23M98R1k11N3j01k21l23l23K31L62m61
$$ -293 196 178 614 609 606 282 -219 -428 -216 -313 -456 -133 365 456 245 298 197 -24 -347 -670 -439 -77 -538
809e38L98N67K25k56l14j27k02j63l40K14O61k76K95J61L84m36m73J44k91J25
$$ -538 -140 427 652 396 82 -45 -247 -410 -750 -536 125 -151 144 305 689 253 -220 -76 -367 -242
829b42k45O52jK41j04Q4j15j07j10k00j04l2N7l1N92K90j62k94J46n45ll08m0
$$ -242 -487 165 164 405 301 385 270 163 53 -147 -251 -283 -226 -257 335 625 463 169 315 -230 -233 -541 -581
852e81M01Q4PJ88M71R7n11k27j72k02k75M42O6J47K45J20on3j87l64k5M62p10
$$ -581 -180 -96 -89 99 570 667 156 -71 -243 -445 -720 -278 -212 -65 180 300 294 241 54 -310 -335 127 -583
875e83L98K87L72K6kl70K70j20p87L30k32M19j75K79M10J38o33J11j69k83l0M1
$$ -583 -185 102 474 500 498 128 398 278 -509 -179 -411 8 -167 112 522 660 27 138 -31 -314 -344 -303
897c03J7J3K71L9N0J58j2m19j02P8K1n8K59L62N2k30j54L3o7l57r2K40k5L49r3
$$ -303 -286 -273 -2 37 87 245 233 -186 -288 -210 -189 -247 12 374 426 196 42 75 8 -349 -441 -201 -226 123 30
922C0l8K54L3m3k90J12m06K14ML51K43m31K66o3J0k96k30RJ47O4j59R2J72J99
$$ 30 -8 246 279 236 -54 58 -348 -134 -130 221 464 33 299 236 246 -50 -280 -271 -124 -60 -219 -127 45 244
946B44j79o3j50J16m57K5K50J90K30m22O38l49m0l79J84m1J17l78O26k20K38k5
$$ 244 65 2 -148 -32 -489 -464 -214 -24 206 -216 422 73 33 -346 -162 -203 -86 -464 162 -58 180 155
968A55O7J60m31k2P5j21J7j67N43J51m03K47M8k95j16J6l64L46J23J46Kj84Q4
$$ 155 222 382 -49 -71 4 -117 -100 -267 276 427 24 271 319 24 -92 -76 -440 -94 29 175 177 -7 77
991G7J80r8n07K73k54J46mL35mp5r7L63k43K2j64O5j3l01L39J03jJ07j23j3J0
$$ 77 257 159 -348 -75 -329 -183 -187 148 144 69 -28 335 92 114 -50 15 2 -299 40 143 142 249 126 113 123
1016A23O8l82K62J17j37NJ16q4j2J00q0k52q8j11L94j69K8K02j04Q7O8Kn5k29
$$ 123 191 -191 71 188 51 56 172 88 76 176 96 -156 -244 -355 39 -130 -102 100 -4 83 151 153 98 -131
1040a31k33L28J36j03j34L86r8r6J3j8k47j08jL36J30n7n1K37k35l6m10J71L13
$$ -131 -364 -36 100 -3 -137 249 151 55 68 50 -197 -305 -306 30 160 103 52 289 54 18 -392 -221 92
1063I2k84K86J1Pj0j52J33k97J48O4k98L07k52K51j24K30Nj17Q7l5m36K63j21
$$ 92 -192 94 105 112 102 -50 83 -214 -66 -2 -300 7 -245 6 -118 112 117 0 87 52 -384 -121 -242
1086b42K23m8L8K11K5k59J36Q9k50r2J36j1M8J04M09p92N43k22k57R6J17J5J22
$$ -242 -19 -67 -29 182 207 -52 84 173 -77 -169 -33 -44 4 108 517 -275 268 46 -211 -115 2 17 139
1109A39j33j71J82J30j19P9p6j8k39J46j45K07j9k97M76r8J64j08l95L32j52j34
$$ 139 6 -165 17 147 28 107 31 13 -226 -80 -225 -18 -37 -334 142 44 208 100 -295 37 -115 -249
1131b49L02j55Q1j40M5K52k17M8k0o3kJ71Q7p5P6k09j30M35k14K9l04M22j51k92
$$ -249 53 -102 -21 -161 -116 136 -81 -33 -53 -116 -118 53 140 65 141 -68 -198 237 23 52 -252 170 19 -273
1155b73L72k38K28j42o4K44k83K42l57J11J33J02m7k6J58l07J22J80l12J33K6
$$ -273 99 -139 89 -53 -117 127 -156 86 -271 -160 -27 75 28 2 160 -147 -25 155 -157 -24 2
1176Bk97N88l92j30J83j28J76J11k17K33n5j79n0J46J12m8q2n0L7%J13J29l75
$$ 2 -295 293 -99 -229 -46 -174 2 113 -104 129 74 -105 -155 -9 103 55 -27 -77 -40 -40 73 202 -173
1199a73L45j25k95N94n43J93Q0l78O19l31j02L16j49j57J47qj32R6M8J60l15J14
$$ -173 172 47 -248 346 -197 -4 76 -302 317 -14 -116 200 51 -106 41 33 -99 -3 45 205 -110 4
1221DJ24k91J09J42m0q9l0K90l10Q2k36K04l2J79k77L58nj92j92J54J66O9k23
$$ 4 128 -163 -54 88 48 -41 -71 219 -91 -9 -245 -41 -73 106 -171 187 182 -10 -202 -48 118 187 -36
1244c6O0P3j40J52k27L26l84J50J08l62L00j60p8j2L41j99O6j11J8P3J90o7l0
$$ -36 24 97 -43 109 -118 208 -176 -26 82 -280 20 -140 -218 -230 111 -88 -22 -133 -115 -42 148 81 51
1267E1L4k59J53q4QKR2l4k8R9J76j03k45J11J08m6jJ8r9J28L7k4P2j94j24L98
$$ 51 85 -174 -21 -105 -97 -95 -3 -37 -65 34 210 107 -138 -27 81 35 34 52 -47 81 118 94 166 -28 -152 246
1293B46l05j45J10K7J65l68N35m21M26j60j63K68k67R1j98N30l43J23J80l86J
$$ 246 -59 -204 -94 -67 98 -270 265 -156 270 110 -53 215 -52 39 -159 371 28 151 331 -55 -54
1314e4J20r8k19M59j68P5N6j37N0j67J07K39L4j34j72J65j9j9l00L47k89k47K49
$$ -54 66 -32 -251 208 40 115 171 34 84 -83 24 263 297 163 -9 156 137 118 -182 165 -124 -371 -122
1337a22nJ35j68K23j72M5Q6MQ3j48kM1N3k15L7L71j88M6l42l2L03K5J55k17k00
$$ -122 -127 8 -160 63 -109 -64 22 26 109 -39 -41 0 53 -162 -125 246 58 104 -238 -270 33 58 213 -4 -204
1362b04O31m49Q4j60j6K74j0j29m2M1r4J73k49J12K4n0P4J53rm73L09j01K8N3
$$ -204 427 -22 62 -98 -114 160 150 21 -21 20 -74 99 -150 -38 -14 -64 10 163 154 -319 -10 -111 -83 -30
1386c0k24N88o08M79o5j30k32R4Q3P9J35J63Rk16J21k89R2no8O0N6p2k68L66j45
$$ -30 -254 334 -274 205 140 10 -222 -128 -45 34 169 332 341 125 246 -43 49 44 -24 36 92 20 -248 118 -27
1411b7K04o3j29n5J28l7Q7l4l16M13J86j4l41k32K76L0j24L78n48K41P6k07L99
$$ -27 177 114 -15 -70 58 21 108 74 -242 171 357 343 2 -230 46 76 -48 330 -218 23 99 -108 291
1434B91k1k10K26j08j06M9j59j73J91K70k13K21j62k9n2k26J60Jq8J14L37l99
$$ 291 270 60 286 178 72 121 -38 -211 -20 250 37 258 96 67 15 -211 -51 -50 -138 -24 313 -86
1456h6j0J29N1j76N6P5k10J99j11J21n7k74K12K20J60j46j54m4k52R1J67j3K00
$$ -86 -96 33 84 -92 -36 39 -171 28 -83 38 -19 -293 -81 139 299 153 -1 -45 -297 -206 -39 -52 148
1479A48j52j79K22q7K88l96K49j33K73l09jL56m16O6M3q9J87Pn1R9q4K02k69m7
$$ 148 -4 -183 39 -48 240 -156 93 -40 233 -76 -77 279 -137 -71 -28 -117 70 77 26 125 41 243 -26 -73
1503g3L85k66j98Jq6K83p1k62K37J30K4o8J32k05k12L39j63r5J77q1K18K16j80
$$ -73 312 46 -152 -151 -237 46 -25 -287 -50 80 104 36 168 -37 -249 90 -73 -168 9 -72 146 362 182
1526A82j2j11R8k48K5j84M3n6K64J15NO3r1j66q4K54k57R2K44%k10j91n6J08L7
$$ 182 170 59 157 -91 -66 -250 -207 -263 1 116 121 184 93 -73 -157 97 -160 -68 176 176 -34 -225 -281 -173 -136
1551a36kj0K37j40O4K07k11J15k28J45j22K24k96J81k11J25K52k69O8K34j03j99
$$ -136 -138 -148 89 -51 13 220 9 124 -104 41 -81 143 -153 28 -183 -58 194 -75 -7 227 124 -75
1573g5k17K68M3j7o1j72L20j22q9j4M84l18OK3Q9k83J27l8J17P7m4p3k36M05l18
$$ -75 -292 -24 19 2 -59 -231 89 -33 -122 -136 348 30 36 59 148 -135 -8 -46 71 148 104 31 -205 200 -118
1598a18K39n0J02l11K90p4L0K2n0j63N5P3p4j16J39J31N1k5K1o4j66M8o3k69L54
$$ -118 121 71 173 -138 152 78 108 130 80 -83 -28 45 -29 -145 -6 125 176 151 172 108 -58 -10 -73 -342 12
1623A2l6j38L62k7O0j11l12J72o9l5J47j9kj10J71J52j41M1k56J39k9j50K10K84
$$ 12 -24 -162 200 173 233 122 -190 -18 -87 -122 25 6 4 -106 65 217 76 117 -139 0 -29 -179 31 315
1647C15m45L8J38r0J09k35J28q1Q0P9J7q1K06k86j5K00k08K11k54K61k84Q9J10
$$ 315 -130 -92 46 -44 65 -170 -42 -123 -43 36 53 -28 178 -108 -123 77 -131 80 -174 87 -197 -108 2
1670Bm9KK23m28K23j5J31n2r9J12k2J57r4k8l45J66o0N9J85j02M1O3j3J4J4jj00
$$ 2 -47 -45 178 -250 -27 -42 89 37 -62 50 28 185 91 63 -282 -116 -176 -117 68 -34 7 70 57 71 85 84 -16
1697a6j16J07J58l29M26j81N6j8p3q2J31j06J54j46J01J13l40N28k54o3j98J05
$$ -16 -132 -25 133 -196 230 49 105 87 14 -68 63 -43 111 -35 66 179 -161 367 113 50 -148 -43
1719d3M01m38JRL93m38K76l25O8K17l13M97k98k39J70J9J36J48k66k7j74L49j57
$$ -43 358 -80 -79 -70 323 -115 161 -164 -96 121 -192 305 7 -232 -62 -43 93 241 -25 -52 -226 123 -34
1742c4J20j56J46J37k23J47j2J00j12k50M4j98K36o3j30L89k27K05q1K62m77L85
$$ -34 86 -70 76 213 -10 137 125 225 113 -137 -93 -291 -55 -118 -248 141 -86 119 38 300 -177 208
1764B08m78J74p9l3K84j81K18k45R8k46J61J17j73j11K34k6j18K42QJ46j44R7
$$ 208 -270 -96 -175 -208 76 -105 113 -132 -34 -280 -119 -2 -175 -286 -52 -78 -196 46 54 200 56 153
1786A53j56j04J78j34K79k28L3n6R8O7P6m28Q8N6J43N1j62l9J85k2Nm73N51k80
$$ 153 -3 -107 71 -63 216 -12 21 -35 63 130 206 -222 -134 -78 65 116 -46 -85 100 78 83 -390 161 -119
1810a19j2K91l03L39k17p7J42J97l16J39n2Pj70L49l51K36O0O7k51J63k30N4j47
$$ -119 -131 160 -143 196 -21 -98 44 241 -75 64 12 19 -151 198 -153 83 143 210 -41 122 -108 -54 -201
1833b01J96o8J00o5lJ67o2j46J64j00j13J32J04k82R7J15J05m8%J46l59J26Oj89
$$ -201 -5 -73 27 -38 -41 126 64 -82 82 -18 -131 1 105 -177 -80 35 140 92 92 238 -121 5 11 -178
1857a78N3J38O7r4J84j45q9j11N0N5J44l35K90O2q4O5q5P8J4n1k17j01j13J84
$$ -178 -125 13 80 -14 170 25 -64 -175 -125 -70 74 -261 29 91 7 72 -13 65 79 28 -189 -290 -403 -219
1881b19K46j24Q7O9j91M6j33N8L79l50J8J56J13j19j48K10j03n6QJ35j35j67J53
$$ -219 27 -97 -10 59 -132 -86 -219 -161 218 -132 -114 42 155 36 -112 98 -5 -61 -53 82 -53 -220 -67
1904f7L06m60L38QK93m12j39oJ63N7j46J40p4l9K48j23o0J8l78J00K43k40J37
$$ -67 239 -221 117 125 418 6 -133 -139 24 81 -65 75 1 -38 210 87 27 45 -333 -233 10 -230 -93
1927i3nK96k68M3Q5l31L06P0j4r1K58r0J42l52L5n6R9L9J68m17J8J12J34j84K41
$$ -93 -98 198 -70 -27 58 -273 33 103 89 -2 256 166 308 -44 -9 -65 34 73 241 -176 -158 -46 88 -96 145
1952A45k91m9J6K28K5k62K34K92n29K62j23j8N2k18N5J16k46L48Q0k60J60O2r6
$$ 145 -146 -195 -179 49 74 -188 46 338 -191 71 -52 -70 -18 -236 -181 -65 -311 37 117 -143 17 79 -17
1975a7Q7q1k44L5J21p8j5J82K7o2J92m93K55k27L80k16O5j1M9J4n1J81k58J91
$$ -17 70 -11 -255 -220 -99 -177 -192 -10 17 -45 147 -346 -91 -318 62 -154 -89 -100 -51 -37 -88 93 -165 26
1999B6j50P6j66N5L07r3O8K1m00J78J41k06J57r0M3j39K53j92J38r4O2J13j32
$$ 26 -124 -48 -214 -159 148 55 123 144 -256 -78 63 -143 14 -76 -33 -172 81 -111 27 -67 -5 108 -24
2022b4r4J68o2qK21m9k57J47j49J14J37p7l6N9r9J14J51k7k22p1k27K74K11m36
$$ -24 -118 50 -12 -20 201 152 -105 42 -107 7 144 67 31 90 -9 105 256 229 7 -64 -291 -17 194 -242
2046b42n6R1J10j1P6L0J5J37j32p4j6K7K13l27L06l92L09k14M7LO6J62j55J54
$$ -242 -298 -207 -97 -108 -32 -2 13 150 18 -56 -72 -45 168 -159 147 -245 64 -150 -103 -100 -34 128 -27 127
2070A27j44K19m7l0j37J1m36N07n9q5o3K40q3l6p9K52k12R7j23K08j65j51K06
$$ 127 -17 202 155 125 -12 -1 -437 70 11 -74 -137 103 20 -16 -95 157 -55 42 -81 127 -38 -189 17
2093A7j17J07N5J35k10j78K61m08J05K57l97N37M3l24J12l7k9P2j10k5O7m9K03
$$ 17 -100 7 62 197 -13 -191 70 -338 -233 24 -373 164 207 -117 -5 -42 -71 1 -109 -134 -67 -116 87
2116H7j35K46k09K9k39M38k03Q2j51j5P3J06n1M5n0j27j07M15J1j85j01l68L40
$$ 87 -48 198 -11 18 -221 217 14 96 -55 -70 3 109 58 103 53 -74 -181 234 245 60 -41 -409 -69
2139f9k1j80K60J66k02K1J35Jn9k75J55Q9N4J53M6j61k20N0N1J45l4J1j86L04
$$ -69 -90 -270 -10 156 -46 -25 110 111 52 -223 -68 21 75 228 274 113 -107 -57 -6 139 105 116 -70 234
2163B34j35m38M75lj06J56l44R3J22j74P5J08oO3J01j72k59K59k03J04J07J2k1
$$ 234 99 -339 136 133 27 183 -161 -68 54 -120 -45 63 57 120 221 49 -210 49 -154 -50 57 69 48
2186D8k76K81j54K04j37L9L8P3n1o0J37j05j6k17Q7Q4J81N6j08p3J41k33jO2K12
$$ 48 -228 53 -101 103 -34 5 43 116 65 5 142 37 21 -196 -109 -25 156 212 104 31 172 -61 -62 0 212
2211B12l48K2m8j54L62N3l45R0K06J43n0k41J99n5J5j31J33J42Mm3J37k43j57
$$ 212 -136 -114 -162 -316 46 99 -246 -156 50 193 143 -98 101 46 61 -70 63 205 209 166 303 60 -97
2234i7K76l4j59M3j31K69j07O9k85P5K23k48K55l43j44L16K61j23M7j51j2k37
$$ -97 179 145 -14 29 -102 167 60 129 -156 -81 142 -106 149 -194 -338 -22 239 116 163 12 0 -237
2256b37J63PJ13k52K10MJ46J8j01K44k20k28J61P2k0k98L32N1J24k03l2J33m20
$$ -237 -74 -67 46 -206 4 8 154 172 71 315 95 -133 28 100 80 -218 114 165 289 86 54 187 -233
2279b33J41J0K59k08J84k3j48J02o3j32J04j14l5J52L2kj36J19J84j03n8l07L60
$$ -233 -92 -82 177 -31 153 130 -18 84 21 -111 -7 -121 -156 -4 28 26 -110 9 193 90 32 -275 85
2302H5k9M3N4k87K34l2J18J01l54j38J75m7K8J73j72N4J83j57j3m5O2R4j30Q0
$$ 85 56 99 153 -134 100 68 186 287 -67 -205 -30 -77 -49 124 -48 6 189 32 19 -26 36 130 0 80
2326H0rJ1j94L46M3k03J31k75M0K03l12J4K68k76L25o6l00L68m32L06l20J55K18
$$ 80 71 82 -112 234 277 74 205 -70 -30 173 -139 -125 143 -133 192 126 -174 194 -238 68 -252 -97 121
2349A21r0P3j08K3J63j40k94N46k29j12j4J59K00l67J26J54k02J06l52M48l47
$$ 121 31 104 -4 19 182 42 -252 294 65 -47 -61 98 298 -69 57 211 9 115 -237 211 -136
2370a36K42J09k66P9Q3j57N7j22J13k5J97r2k23J3j26J72L11j40j43OK30q3l10
$$ -136 106 215 -51 28 111 -46 11 -111 2 -23 174 82 -141 -128 -254 -82 229 89 -54 -48 182 99 -211
2393b11P9K29J16m5K1k05k28J04K85l78K13J34j77O3K4j88K55p3q1K04k06J70
$$ -211 -132 97 213 168 189 -16 -244 -140 145 -233 -20 114 -63 0 24 -164 91 18 -63 141 -65 105
2415A05j08j82L86j97j58K47j0k30j8J37j9K05Q8j02j84Rk63M07j80p3J7n5m6
$$ 105 -3 -185 201 4 -154 93 83 -147 -165 -28 -47 158 246 144 -40 -31 -294 113 -67 -140 -123 -178 -224
2438b24J84J90j69K44N5j98n5o8k3k91L83Q4j34K96m42K07k18N72m52M10m49M21
$$ -224 -40 150 -19 225 280 82 27 -41 -64 -355 28 112 -22 274 -168 39 -179 393 -59 351 -98 323
2460C23k85R8O4l50j01J96n7KM9k4K55k98J89kj00N0o2J70j46M8K1k30J87N5k50
$$ 323 38 136 200 -150 -251 -55 -112 -110 -61 -85 170 -128 61 59 -41 9 -53 117 -29 19 40 -190 -3 52 -198
2485a98L22K29k58L3n04L25or4J43j08K51j5j2j81J21r1JMM5j5J94l31P9K06m1
$$ -198 124 353 95 128 -376 -51 -57 -151 -8 -116 135 120 108 -73 48 -43 -42 -38 7 -8 186 -145 -66 140 99
2510I9Q3Kj81m2j18K41q1M8L0o6j04R2J05m71J76mJ33R2k88K28P7m1J47m3k29
$$ 99 182 184 3 -39 -157 84 3 51 81 15 -89 3 108 -363 -187 -191 -58 34 -254 -26 51 10 157 114 -115
2535a15L51m12J49J66k73J17kj09K39k83L36j96O7m2j79J73k50K53o7J04L4P7
$$ -115 236 -176 -27 139 -134 -17 -19 -128 111 -172 164 -32 35 -7 -186 -13 -263 -10 -77 27 61 138
2557A38j10j70j67K84j78J42O6Q3Lj06K27k96K3QK65l0q2K1j54j95K03j81M2P5
$$ 138 28 -142 -309 -25 -203 -61 5 88 91 -15 212 -84 -61 -53 212 182 100 121 -33 -228 -25 -206 -164 -89
2581h9K57o4j88j09P3K64P2j25R5j14k6m5M9l2k74K66Lr9j0K92m75K65K2o0mJ45
$$ -89 168 104 -84 -193 -120 144 216 91 186 72 46 1 50 18 -256 10 13 -86 -96 196 -279 -14 8 -52 -56 89
2607H9M7j57J1o0J15Q6j55j69L13q4j71K27j30n8J38J63j27K12k60J13J07j31
$$ 89 136 -21 -10 -70 45 131 -24 -193 120 36 -135 92 -38 -96 42 205 78 290 30 143 250 119
2629A19j63j58J3L00k84L26k27j56M8M6L41r9P0q8j57K46l06L92m01J34MJ63q
$$ 119 -44 -202 -189 111 -173 153 -74 -230 -182 -136 205 106 176 88 -69 177 -129 263 -138 -4 0 163 155
2652A55j45jk05K10o2J03k12L12k23j06K63l0l07L77k47K0R6K22j91K0pj10N0
$$ 155 10 9 -196 14 -48 55 -157 155 -68 -174 89 59 -248 129 -118 -98 -2 220 29 49 42 -68 -18
2675a8R2J50k13rk89L57J83n18J15J52J81l28L17r2q2J63k33j97L39j21j36K20
$$ -18 74 224 11 2 -287 70 253 -265 -150 2 183 -145 172 80 -2 161 -72 -269 70 -51 -187 33
2697C3j53J27N8m0j03p2p6K99k21q8J23P6L45m87K43M8j48K2K33k13O3p0J42j10
$$ 33 -120 7 65 25 -78 -150 -226 73 -148 -236 -113 -37 308 -179 64 112 -36 -14 219 6 69 -1 141 31
2721C1j31J23K58l42P0J84j09J7k68M7R1J65k37J04l4q7J52m6L79n99K91J3o3
$$ 31 -100 23 281 -61 9 193 84 101 -167 -120 -29 136 -101 3 -31 -118 34 -12 367 -232 59 72 9
2744IJ50j73O6o5lj28J05J01k40R9Q4qk4J94k94J88m9j12L14j45k69L66j14K04
$$ 9 159 -14 52 -13 -16 -144 -39 62 -178 -79 5 -3 -27 167 -127 61 12 -100 214 69 -200 166 52 256
2768B56ql13M5J89k61J83q7J01m5p7l5j02M6J03p9J34l37N50j84j7j35q4L44k19
$$ 256 248 -65 -20 169 -92 91 4 105 60 -17 -52 -154 -108 -5 -84 50 -287 263 79 62 -73 -157 187 -32
2792c2q7M0J39JM4k39N2K5Rk0K45o7k5K70j76l60J32o9Q3J16K23l46J8j27K56
$$ -32 -119 -79 60 61 105 -134 -82 -57 -48 -68 177 110 85 355 179 -181 -49 -118 -35 81 304 -42 -24 -151 105
2817A05o2M9j23m0R8j3J64k70O9m2o4P4M0K90m24J25O7J60l92L92o2j48P2m53
$$ 105 43 92 -31 -71 27 14 178 -92 -23 -65 -129 -55 -15 275 -149 -24 43 203 -189 203 141 -7 65 -388
2841c88N88k02K1M6Lk02r7K33k34M26k14j46j01M23l12P0o9K04J13j60k58K88
$$ -388 200 -2 19 65 68 -134 -231 2 -232 194 -20 -166 -267 156 -156 -86 -155 49 162 2 -256 32
2863C2k08K86K0j55J37j70J50J21n95K69J92o9J12k68K0K24K16l70J51k21rJ73
$$ 32 -176 110 130 -25 112 -58 92 213 -382 -113 79 10 122 -146 -126 98 314 -56 95 -126 -135 38
2885C8J08k64J88L5r1j20O9kJ32l14L05j1o1k34K93j8k05J48O7l9j4K00j94J19
$$ 38 146 -118 70 105 14 -106 -37 -39 93 -221 84 73 12 -222 71 53 -152 -4 63 24 10 210 16 135
2909A35j73K90l73K99j85j90J33J44j06J17j80NN4J76J8k06m86N78k5M4Om2Q3
$$ 135 -38 252 -121 178 -7 -197 -64 80 -26 91 -89 -84 -30 146 164 -42 -528 50 25 69 75 33 116
2932A16j13j57P0p5K61k63K33j36M27k47n5J28k36m1K20k45n0M7O6m4k4n3K84
$$ 116 3 -154 -84 -159 102 -161 72 -64 363 116 61 189 -47 -88 132 -113 -163 -116 -50 -94 -118 -171 113
2955A13j52K3m6K37J03k41k05J10j34L00K2R9j11k38J20k11K00J75k65J28J8p6
$$ 113 -39 -16 -62 175 278 37 -168 -58 -192 108 130 229 118 -120 0 -211 -11 164 -101 27 45 -31
2977c1L2J70k59J42k0J3j46J25j09J48K2j63J48N6k3o6r1m6J65K9Lk05q1J24K65
$$ -31 1 171 -88 54 34 47 -99 26 -83 65 87 -76 72 128 105 39 -52 -98 67 96 99 -106 -187 -63 202
3002B02k62l51O27j10j61kj16J0M01k19o9J69j21k39mL06kL9J2q5R2j44j02Mj97
$$ 202 -60 -411 216 106 -55 -57 -173 -163 238 19 -50 119 -2 -241 -245 61 59 98 110 25 117 -27 -129 -125 -322
3027c22L98p0O4q9m54O00j71J82k60J82p0j75K09n6n7j62K43j64j16K26K29j75
$$ -322 76 6 70 -19 -473 127 -44 138 -122 60 -10 -185 24 -32 -89 -251 -8 -172 -288 -62 167 -8
3049hJ79k1j57J60m39K87N9kq0j41J41J21j35J24K10k64j60K89m00L27k10J12
$$ -8 171 150 -7 153 -286 1 60 58 -22 -163 -22 99 -36 88 298 34 -126 163 -237 90 -120 -8
3071hj54l1K40q8J30m0n4j4J1N5K96j82m77K47L75k97no3P3P3j69L70k50q7J72
$$ -8 -162 -193 47 -41 89 49 -5 -19 -8 47 343 161 -316 -69 306 9 4 -59 14 87 -82 288 38 -49 123
3096A23j85m4J90j42k54M81J0k54o6K00Q8l1k05mR1N6m0P5J84l13N1k71K51J35
$$ 123 -62 -106 84 -58 -312 169 179 -75 -141 59 147 116 -89 -93 -2 54 14 89 273 -40 11 -260 -9 126
3120A26j53Q9l59M60M0l79n7K61l1k5J31l63M91l13J51l04L57m33qM99j48l26
$$ 126 -27 62 -297 163 203 -176 -233 28 -3 -28 103 -260 231 -82 69 -235 122 -311 -319 180 32 -294
3142b94K55j20K09j22p8J07K6p3J0J75l6j61J12n6M0J3j25K33k18K05m66L49j35
$$ -294 -39 -159 50 -72 -150 -43 -17 -90 -80 95 59 -102 10 -46 -6 7 -118 115 -103 102 -364 -15 -150
3165a50J44J65j48L16k11j39K1j35R4nR4j18K7Q7J25j94L6lM5k91Q1J9k1r0Q5
$$ -150 -6 159 11 327 116 -23 -2 -137 -43 -48 46 -72 -45 42 167 -27 9 6 51 -240 -159 -140 -161 -251 -166
3190a66K7J84k65J18M6R1j75J84j9J78k45Q2K35r3l90J31K35j42MJ54k56OK84
$$ -166 -139 45 -220 -102 -56 35 -140 44 25 203 -42 40 275 182 -208 -77 158 16 20 174 -82 -76 208
3213B08j00k55j58M39j87J67k10J63P8j07R7j86J15J60l85J87O8k17K27o6q5j98
$$ 208 108 -147 -305 134 -53 114 -96 67 145 38 135 -51 64 224 -161 26 94 -123 104 38 -47 -245
3235b45K87o5J84L3n78K92j68J88J4L39m42J06Q2o5k49K54k9l7K17j18O2k62J54
$$ -245 42 -23 161 194 -384 -92 -260 -72 -58 281 -161 -55 27 -38 -287 -33 -62 -99 118 0 62 -200 -46
3258d6j65K58j20R8J98k16P2n4p4ll4nP3m6L2O5K6m2k1kp0L0L96k29Lk42K48J3
$$ -46 -211 47 -73 25 223 7 79 25 -49 -52 -86 -91 -18 -64 -32 33 59 17 -4 -6 -76 -46 350 121 124 -118 130 143
3286A43l8J66l83J57oJ18m11K5M03k12j0j44K59j21K55m05K29KJ6K9J17j39k2
$$ 143 105 271 -112 45 39 157 -254 -229 174 -38 -48 -192 67 -54 201 -204 25 27 43 72 189 50 28
3309B8J81k85J69k56J90Lr4J73J09l29Qk25M32r9j85K29m2j86J79k9J44j35N6
$$ 28 209 -76 93 -163 27 30 -64 109 218 -111 -103 -328 104 5 -180 49 7 -179 0 -29 115 -20 36
3332C6p7j18L43k42l6k03J56K43q5l9J27k09K40j85J61k96J32J16k09R8P5J8l31
$$ 36 -41 -159 184 -58 -94 -297 -141 102 17 -22 105 -104 136 -49 112 -184 -52 64 -145 -47 28 46 -285
3355b85M49k54J37Lj76K38j85l4Q9r7p0L16j49R1j99J79J16j89k01M21j22k53
$$ -285 164 -90 47 50 -126 112 -73 -107 -18 -115 -185 131 -18 73 -126 53 169 -20 -221 200 78 -175
3377a75K52P8l02J52Nm1J31R5p7j29K1j47M17k05K9r3k80K14K1K77m63L48j92
$$ -175 77 155 -147 5 10 -31 100 195 118 -11 10 -137 280 75 104 11 -269 -55 -34 243 -220 128 -64
3400f4o3L11j55r7J6p4J39K12j42l4j25J76j12O3R9k77P3M%O6q3o8K88N0j57k53
$$ -64 -127 184 29 -68 -52 -126 13 225 83 49 -76 100 -12 51 150 -127 -54 -50 -50 16 -67 -135 153 203 46 -207
3426b07J86j64J33K89l43R5J18k35M5J71K5k81O0j13N08m05L3J26m8l14M10P5
$$ -207 -21 -185 -52 237 -106 -11 107 -128 -83 88 113 -168 -108 -221 287 -118 -85 41 -7 -321 89 164
3448A64k27J95m24K40l8o8k93O73j8k38N8J66k56P2n5J36R9J71l91j47K53l17
$$ 164 -63 132 -292 -52 -90 -158 -451 222 204 -34 24 190 -66 6 -49 87 186 357 -34 -181 72 -245
3470b45K13k5J37k37J18J24q8j25J27N6p7j06m6K76m0j15J95l1k7j51P2J44j69
$$ -245 -32 -57 80 -157 -39 85 -3 -128 -1 55 -22 -128 -174 102 62 -53 142 111 84 -67 5 149 -20
3493b0M9N2l19L48l28K10rm8j56J44N20l19j86p2J13j71K83L3K35k28r1K9j79
$$ -20 29 81 -238 110 -218 -8 -17 -65 -221 -77 443 124 -62 -134 -21 -192 91 124 359 131 40 69 -110
3516a10M8l5J62k26J71m4J22n3K44l93K12k46L54l02R5j0l0j8R7Q9o5j63J47m3
$$ -110 -62 -97 65 -161 10 -34 88 35 279 -114 98 -148 206 -96 -1 -11 -41 -59 38 127 62 -101 46 3
3540Cp8j81K01%k7J48P0j80L16l18j72K97m36N20j57p7Q5J19k46K40L0j40K22
$$ 3 -75 -256 -55 -55 -82 66 136 -44 272 -46 -218 79 -357 163 6 -71 14 133 -113 127 157 17 239
3563B39m45J16kN0p8K27k02J68OK7p4K22j04k55n6M16J80k36m88L99J9O5k68n0
$$ 239 -206 -90 -92 -42 -120 107 -95 73 79 106 32 254 150 -105 -161 255 435 199 -289 110 129 194 -74 -124
3587a24N8J04J17j4r7Q0j43O2r6p5L35j72K25l77K71K8l11R7N4j96L21k76J94
$$ -124 -66 38 155 141 44 124 -19 43 -53 -128 207 35 260 -117 154 182 -129 -32 22 -174 147 -129 65
3610F5k29M11j54k35K59r7L8j66K4M5L07k91J01l41L00N3l82K82k7K7j4K9k43
$$ 65 -164 247 93 -142 117 20 58 -108 -84 -39 268 -23 78 -263 37 90 -292 -10 -37 -10 -24 5 -238
3633b38J81k43L97j46j54N72l78k85L23K7j44J47k02K50k31J24j1P3pj96J45K40
$$ -238 -57 -300 97 -49 -203 369 -9 -294 29 56 -88 59 -143 107 -124 0 -11 62 55 -141 4 244
3655B44k94L12m10K21j24j04K10Pl5o4J18N2p9l4q1J5ok34K09J52l2n3N9j31R8
$$ 244 -50 262 -148 73 -51 -155 55 62 27 -37 81 133 54 20 -61 -46 -52 -286 -77 75 43 -10 49 -82 16
3680A6m47O99n51O19o27J81N3O0%K7R7j11oJ49q3q0J59jk27J8j09J23j03J66j7
$$ 16 -431 268 -283 336 -291 -110 -57 3 3 30 127 16 10 159 76 -4 155 154 -73 -55 -164 -41 -144 22 5
3705ENj7J97l59J07m4K36j23J10O3n19J65j2L64Kj16n2N5m9J51j33P4l01J49j86
$$ 5 10 -7 190 -169 -62 -106 130 7 117 180 -339 -174 -186 178 180 64 12 67 18 169 36 110 -191 -42 -228
3730b28j4L74KJ50k80J69j12l9J26k54L06j88J42j53j20K81l69J23N3Qp2R5L6
$$ -228 -242 132 134 284 4 173 61 22 148 -106 200 12 154 1 -119 162 -207 -84 -31 -23 -95 0 36
3753C6j53J93q2q3QJ75L7j65L31m38K06j49j01J79k31K60L1M7j07%K33k25N9O6
$$ 36 -117 76 -6 -89 -81 94 131 -34 297 -141 65 -84 -185 -6 -237 23 54 101 -6 -6 227 2 61 127
3777A27l88J71M6L9j42Q0K72l87L17k09p3J33n4Q9o5k9J0K39j83Q9j52J88k97
$$ 127 -261 -90 -44 -5 -147 -67 205 -182 135 -74 -147 -14 -68 21 -44 -73 -63 176 -7 82 -70 118 -179
3800a79K83j50J68k77L70j18k12J16Lqj29J25r7j57J79k36O37k53k49L79k28J76
$$ -179 104 -46 122 -155 215 97 -115 1 4 -4 -133 -8 -105 -262 -83 -319 318 65 -184 195 -33 143
3822A43J2j51N3k2P3j37K85k84M3L0k43J27J83l3K1k83K24J01o4l4K4j44M1n5
$$ 143 155 4 57 35 108 -29 256 -28 15 45 -198 -71 112 79 100 -183 41 142 78 44 68 -76 -35 -90
3846i0K76k90K82k34M8M21k40P2l54K5K23n0n4j15K26j44LQ5k26J07j46J03j99
$$ -90 186 -104 178 -56 -8 413 173 245 -109 -84 139 89 35 -80 146 2 5 90 -136 -29 -175 -72 -271
3869b71L77rq2o7J13j82M1K69j37K8m23M04m39M11P8j15N0j17K51m46Q3M1N8N9
$$ -271 106 97 15 -52 61 -121 -80 189 52 80 -343 61 -378 33 111 -4 46 -71 180 -266 -183 -142 -84 -25
3893b5K6P7n8j43J02l8N8J32m0j29L7L87k47j65J35j46M1J33m7k09J56l4k11L75
$$ -25 1 78 20 -123 -21 -59 -1 131 91 -38 -1 386 139 -26 109 -37 4 137 90 -119 37 3 -208 167
3917A67j7k90O8j63K00J47l4J11j40k48L18j27j22L7j54K47m0j16O2N6J42J39
$$ 167 150 -140 -72 -235 -35 112 78 189 49 -199 119 -8 -130 -93 -247 0 -40 -156 -94 -38 104 243
3939B43m18J89n8K66j48j03J45j09l27N33j88j7k1J80q5m76N08N9j15k8k2k34
$$ 243 -175 14 -44 222 74 -29 116 7 -320 213 25 8 -13 167 82 -394 114 173 58 30 8 -226
3961b26J97K19k14r3p4l3L37k6j45ql8m6J71o1M8q4K47M2k14K10m30K57r5j27
$$ -226 -29 190 -24 -117 -191 -224 113 87 -58 -66 -104 -150 21 -40 8 -76 171 213 -1 209 -221 36 -59 -186
3985a86l3L48l64N9L01k48K94j12j13P2K62k38J04j96M5J10k41L18k68J72lq9
$$ -186 -219 129 -235 -176 125 -123 171 59 -54 18 280 42 146 -50 -5 105 -136 182 -86 86 83 -6
4007fO1j04M7kp5j55l8K05L65j99j06O2K68m79K09j50M26k07o8j26J04j57l5K07
$$ -6 55 -49 -2 -4 -79 -234 -272 -67 298 99 -7 55 323 -156 53 -97 329 122 54 -72 32 -125 -160 47
4031D7k25L50k60L4o1K24j69N8p2k83K67K02j31q4J96lj69R1J04j17N2K4n4J17
$$ 47 -178 172 -88 -54 -115 109 -60 -2 -74 -357 -90 112 -19 -103 93 90 -79 12 116 -1 51 75 21 138
4055A38m11J81J10J64j80L1j05r0L35l21j90J50L34p4j95J03K4K06q4k08J46r4
$$ 138 -273 -92 18 182 2 33 -72 -162 173 -148 -338 -188 146 72 -123 -20 4 210 126 -82 64 -30
4077c0Q6K3r0k82J58K46k50M05m59K16j54J94j90K21P1n1l70J20L34j85k8Q1j12
$$ -30 56 79 -11 -293 -135 111 -139 266 -193 23 -131 63 -127 94 165 114 -256 -136 198 13 -15 66 -46
4100d6%J31r2J34j30j43R0K41k48KL5K98j64p6p3L54m51J12N3j01O4M4j30P5N8
$$ -46 -46 85 -7 127 -3 -146 -56 185 -63 -61 -26 272 108 32 -41 313 -138 -26 27 -74 -10 34 -96 -21 37
4125C7P2J00j43k43L53j85j29K85k27J15j44J01k40L15j88K43k12J91k20NK02
$$ 37 109 209 66 -177 176 -9 -138 147 -80 35 -109 -8 -248 67 -121 122 -90 101 -119 -114 88
4146H8l87n0N45j00j89J6K84k24L4k6QJl1J42j56K7j86J50m7J42J32k14K84n10
$$ 88 -299 -349 196 96 -93 -77 207 -17 17 -9 -1 0 -31 111 -45 -18 -204 -54 -101 41 173 -41 243 -267
4170b67K63O9J65k47J53j52j14m2K58j57J98l67O5kJ60j47J67O8L07l18o1K4k19
$$ -267 -4 65 230 -17 136 -16 -130 -172 86 -71 127 -240 -175 -177 -17 -164 3 71 378 60 -1 23 -196
4193a96K81k0p8j19Q3J05j77J26J9P0q0J09j14Q1j71J7M7q7J08J24j91jK82l78
$$ -196 85 65 -13 -132 -49 56 -121 5 24 94 14 123 9 90 -81 -64 -17 -104 4 128 -63 -64 218 -160
4217a60K40l5l36J18L00j56J85k12j40K83k40J89J38j86j63L55l41K95L5j36K07
$$ -160 80 45 -291 -173 127 -29 156 -56 -196 87 -153 36 174 -12 -175 180 -161 134 169 33 240
4238B40m30rJ42k70J42L04n1L0N4k76J16J90l29P7K08q1j08qJ02j24J84k23N1
$$ 240 -190 -199 -57 -327 -185 119 68 98 152 -124 -8 182 -147 -70 138 57 -51 -59 43 -81 103 -120 -69
4261f9j82J69J12k61L20j58j50K71M6j35J25j23J36k90K60q0J35j5k63K97j50
$$ -69 -251 -82 30 -231 89 -69 -219 52 98 -37 88 -35 101 -189 71 -9 126 111 -152 145 -5
4282eK60l97LK7J07m8l03M39p8J19k23J53p9o4Q4nM2L4j85O3O4J2p0J13k07Q8
$$ -5 255 -142 -139 -112 -5 -53 -356 83 5 124 -99 54 -25 -89 -5 -10 32 66 -119 -56 8 20 -50 63 -144 -56
4308e6k1N4J58k53J61j49J76j8No1k95L89l8r1k01L01R8k05J87l72R7K33J9J1
$$ -56 -77 -23 135 -118 43 -106 70 52 57 -4 -299 90 52 -39 -240 61 159 -46 141 -231 -134 99 118 129
4332A29r1J50pk9j25Q8k19J66O7o0j50L11j15j33K90k49j50J63j0J03k0J7K35
$$ 129 38 188 181 152 27 115 -104 62 129 69 -81 230 115 -18 272 23 -127 36 26 129 109 126 361
4355C61l53j2k53M93k65M0L1J96j56J48o0k53K39l15M26l08K14m29L38k82Q1J44
$$ 361 8 -4 -257 236 -29 11 42 238 82 230 170 -83 156 -159 267 -41 173 -256 82 -200 -119 25
4377B5j8J01oj11p7J25j91N1m0j83K77p6p2J72k2N0J61k50J44k9n0k7m8K20l29
$$ 25 7 108 102 -9 -86 39 -152 -101 -141 -324 -47 -123 -195 -23 -45 5 166 -84 60 31 -19 -46 -94 126 -203
4402b03K89j27J5j72J20QK25k39J41M8j73l9q9J7J22J46l4n2r7j17J92L77j99
$$ -203 86 -41 -26 -198 -78 -70 155 -84 57 105 -68 -107 -196 -179 -57 89 55 3 -94 -211 -19 358 159
4425A59j75k9j90M10k13J44k4Q3p0k52r7M21k4l12K56p8j97O6P5J00J38k20l1
$$ 159 -16 -45 -235 175 -38 106 82 165 95 -157 -254 167 143 -169 87 9 -188 -122 -47 53 191 -29 -60
4448f0K92l96MJ37o9Q8j59R9P5J90l33O4J95q0r3K48j40k13J32j00kP7jj44RK48
$$ -60 232 -164 -160 -23 -92 -4 -163 -64 11 201 -132 -68 127 47 -46 202 62 -151 -19 -119 -121 -44 -45 -189 -180 68
4474F8p4m4J24j36J33p8kj18L36j37k6o3J99k86J4L75l99J59k3J73l91K42J95
$$ 68 -6 -50 74 -62 71 -7 -9 -127 209 72 46 -17 182 -104 -90 285 -114 45 22 195 -196 46 241
4497B41k33J43j96P0L6k09L28l87J42M06k77j28j13K38k07J63j7j06j28K76J64
$$ 241 8 151 -45 25 61 -148 180 -207 -65 341 64 -64 -177 61 -146 17 0 -106 -234 42 206
4518B06k13R0r3n8N8j52J72O5j10K62m88J89N3m6j93K98L32n01L8p4K7L66p1j3
$$ 206 -7 83 -10 -68 -10 -162 10 75 -35 227 -261 -72 -19 -65 -258 40 372 -129 -91 -165 -138 228 157 144
4542A44l6j82rK87p6k2j60M6K28k18j70K96j60OP9Q5r2J31j74J08rP4l70L68n2
$$ 144 108 -74 -83 204 128 106 -54 -8 220 2 -168 128 -32 -26 53 138 46 177 3 111 102 176 -194 174 122
4567A22j8k43l4K04k59J62m8P3l1J76k15J62K34l03K88l96q1K34k0O1k34J42j22
$$ 122 104 -139 -173 31 -228 -66 -114 -41 -72 104 -111 51 285 -18 270 -126 -207 27 7 68 -166 -24 -146
4590a46K62lN9k1r9l4r3M1K91j58j89J26j47J52l71k6K41R7j55J19J65K1q8K44
$$ -146 116 113 172 151 52 18 -75 -34 257 99 -90 36 -111 41 -330 -356 -115 -18 -173 -54 111 132 44 288
4614B88k60k20P9P6j95J50J02o9m2J27o0J27J58k60M8L4J48k64J30j83K09j49
$$ 288 28 -192 -113 -37 -232 -82 20 -49 -91 36 -24 103 261 1 49 83 231 -33 97 -86 123 -26
4636b6J94k80K55R1j73k49J95K72l33n7J48j19M6K4j4q4L0j72L02J02J87L6m14
$$ -26 168 -112 143 234 61 -188 7 279 -54 -111 37 -82 -36 -12 -26 -110 -80 -252 50 152 339 375 -39
4659c9J97l42n8L00L13l73QJ74j45j13r6MM39j13j03k5J10j05K25k85K8J12l3
$$ -39 158 -184 -242 58 371 -2 6 180 35 -78 -174 -170 269 156 53 28 138 33 258 -27 1 113 80
4682H0j93N3M1J69K6j91q1J47k67J45R7j20J80k54K44m7Q4K09m26K00j50J4j9
$$ 80 -113 -60 -19 150 176 -15 -96 51 -216 -71 26 -94 86 -168 76 29 113 322 -104 96 -54 -40 -59
4705e9K87l12J52j40oL76j93J32k87p0m7J93J62k84k2K58nj60l7J9l8K75l66K17
$$ -59 228 -84 68 -72 -78 298 105 237 -50 -120 -167 26 188 -96 -118 140 135 -25 -62 -43 -81 194 -172 45
4729D5r7R6k68J86J35j59jk62L59k8j4L3j00r8L74k82%J71j47l0L8j15M49k52
$$ 45 -52 44 -224 -38 97 -62 -63 -325 34 6 -8 25 -75 -173 201 -81 -81 90 -57 -87 -49 -164 285 33
4753C3p3j66J49m3J24r4q1O07k46k50R0O8j79L0n2K55j43K6o7J97k72k07L24j82
$$ 33 -40 -206 -57 -100 24 -70 -151 456 210 -40 50 118 -61 -31 -83 172 29 55 -12 185 -87 -294 30 -152
4777a52J46q0K96m34J07R7j1n8Q9k3j69J90l1k78K50J08J18j98m0M1L9k19K59
$$ -152 -6 -86 210 -224 -117 -20 -31 -89 0 -23 -192 -2 -33 -311 -61 47 165 -33 -73 -32 7 -212 47
4800D7K6k0J48j76o7J17P8l95K37J01kj77J79j94J49r0JQ3l84M28j06j48M3K31
$$ 47 73 53 201 25 -42 75 153 -242 -5 96 94 -83 96 -98 51 -39 -38 45 -339 89 -17 -165 -122 109
4824A09n3K51l15L51l39O7K77k75k5l7J75J4nj25j88M1J90k46o1L04j77J73K1
$$ 109 56 307 -8 343 4 71 348 73 48 11 186 200 195 70 -118 -77 113 -133 -194 110 -67 106 127
4847A27j61L6M2j85L11k87J59p2K1Q9j04J06k06J42r1K17kk10J29J1m3J95k91
$$ 127 -34 2 44 -141 170 -117 42 -30 -9 80 -24 82 -124 18 -73 144 142 -68 61 72 29 224 -67
4870f7M6Q3J58j18r4J17k94j8J21p7L9J31j48K52j53J5O1K29l80J79K69m99K17
$$ -67 -21 62 220 102 8 125 -169 -187 -66 -143 -104 27 -121 131 -22 -7 54 283 -97 82 351 -148 69
4893F9J48j07l87Q9J57K78j75O9k82k2m8L31r9pK91j73j90J95k25k23L26NJr9
$$ 69 217 110 -277 -188 -31 247 72 141 -141 -163 -211 120 21 14 305 132 -58 137 -88 -311 15 20 21 -78
4917g8R0j00J53p8M0r4K39K2j3j85K21L2j66J27j39J11j49j00J36J4j98k00K05
$$ -78 12 -88 65 -13 27 -67 172 194 181 -4 217 249 83 210 71 182 33 -67 69 83 -115 -315 -110
4940a10L74l12J0K07n3J53m20K04j08k81J08L04J01l77P9J55J21k02J33R6j08
$$ -110 264 -48 -38 169 116 269 -151 53 -55 -336 -228 76 177 -200 -121 34 155 -47 86 182 74
4961G4J3l2O6l53K12j96K50L7r4QQ7j29k2Qp4R3%j99K19J98J5O3k71o5M9J65P3
$$ 74 87 55 121 -232 -20 -216 34 71 -23 -15 72 -57 -79 -71 -145 -52 -52 -251 -32 166 181 244 -27 -92 -43 122 195
4988A95j82J90l43r1J99J38k41J08lk1J32m6j21J71l4M2k37j61K64L3N4J46j20
$$ 195 13 203 -140 -231 -32 106 -135 -27 -30 -51 81 35 -86 85 51 93 -144 -305 -41 -8 46 192 72
5011G2J07k67M8K38k07PJ85j1l45J1L51l05r0L44j81L16l50J42o3j97L68m40K13
$$ 72 179 -88 -40 198 -9 -2 183 172 -173 -162 189 -116 -206 138 -43 273 -77 65 2 -195 173 -267 -54
5034e4M2p5K04J29k62J14m7q8J54M8J33j74J02l65k09J73K02l25K75J99l30K9
$$ -54 -12 -87 117 246 -16 98 51 -37 117 165 298 124 226 -139 -348 -175 27 -298 -23 176 -154 -125
5056a25j20L14j6l14R1Q5K73J99m57O8L2J64n19K18O4o4K42o1J23j23l20L38k55
$$ -125 -245 69 53 -261 -170 -85 188 387 -70 -2 30 194 -325 -107 -43 -107 135 74 197 74 -246 92 -163
5079a63Q6m6L3q0J30J83L0k72J85j64L1J04R2Pk04k03K60l7J52j51j17L40j77
$$ -163 -77 -123 -90 -170 -40 143 173 -99 86 -78 -47 57 149 156 -48 -251 9 -28 124 -27 -144 196 19
5102A9K14j88K9l5J24K17n08J83j07m0K17l10K79j99J86j25qJ9J83J24m43N0J81
$$ 19 233 45 74 39 163 380 -128 55 -52 -92 125 -185 94 -105 81 -44 -52 -33 150 274 -169 -119 62
5125F2l3p0NJ19p7k03K37j69K02j23NJ42k45Q2J18K6p2j87J84k11J63J02o4J35
$$ 62 29 -41 -36 83 6 -197 40 -129 73 -50 -45 97 -148 -66 52 78 6 -181 3 -208 -45 57 -7 128
5149A28j63Q3j40m7J11L31k57Q9o1r9j14J71j14P8N1J67l33L22k94L84m42Ll6
$$ 128 -35 48 -92 -139 -28 303 46 135 74 -25 -139 32 -82 -4 47 214 -119 203 -91 293 -149 -146 -182
5172a82L36l46K78q6J40k29k1J49p6J50lk53n0Pj2K57k40K08j65J91j41K71m52
$$ -182 154 -192 86 0 140 -89 -110 39 -37 113 110 -143 -193 -186 -198 59 -181 27 -138 53 -88 183 -269
5195b69L74J09j75R6q3JK9L2j76Pj70M65k86j9Q1j20L12l43K63j18J95r2k45k7
$$ -269 105 214 39 135 52 53 82 114 -62 -55 -225 240 -46 -65 16 -104 208 -135 128 10 205 113 -132 -159
5219a59K86q3J16k8P3j98l4p0J42o7o0K83l01J55j5J9k6l03K16q2R0k59N41j98
$$ -159 127 44 160 132 205 7 -27 -97 45 -22 -82 201 -100 55 40 59 33 -270 -54 -136 -46 -305 236 38
5243C8K42j06k57J9K33j28Q3Mq2m9P4p1J03j0r5n3M8K89k94K1k0j98K61J1j40
$$ 38 280 174 -83 -64 169 41 124 128 46 -3 71 0 103 93 -2 -55 -7 282 -12 9 -11 -209 52 63 -77
5268g7K47l29L18L2j83K12k24k78M42r5j09K24l39J78l27M53j36L7k35J45J86
$$ -77 170 -159 159 191 8 220 -4 -282 160 65 -44 180 -159 19 -308 145 9 46 -189 -44 142
5289A42p8P9j99J67M7r7j84K3J85K1k09mq6K10K17j59k24K23J61k56J78j89N8
$$ 142 64 143 -56 111 158 61 -123 -100 85 106 -103 -107 -193 17 234 75 -149 74 235 -21 157 -32 26
5312B6kRM5M4j37J21j34Q7J33j5r3r4P6k72J76J37J8k86K23J60m67J15L8J95p3
$$ 26 24 33 78 122 -15 106 -28 59 192 177 84 -10 66 -206 -30 107 125 -161 62 222 -245 -130 -92 103 30
5337C0j55J67k91kL12k08N1J10j95J04J34k4M0k12K11o3M2j40K34l4K9j69R4j41
$$ 30 -125 42 -249 -251 61 -147 -96 14 -181 -77 57 33 73 -139 72 9 51 -89 145 111 140 -29 65 -76
5361g6L4K57o8nQ4m29K56p4Mo8K15j76j07K21p2l2j31K60J40n22M41k79K41l68
$$ -76 -42 215 147 142 226 -203 53 -21 -17 -85 130 -46 -153 68 -4 -36 -167 93 233 -289 152 -127 114 -254
5385b54L20K97k03j39mj53qq2J28Q5r7q2K24k6j78K87j09j36M20j05r5l0k35m8
$$ -254 66 363 160 21 17 -136 -144 -226 -98 -13 -110 -192 32 6 -172 115 6 -130 290 185 90 60 -175 -223
5409b23L23K28j84j41J46q9j07N6J8k14J90L00m75J76J1l20M40k49K42R6l1k61
$$ -223 100 328 144 3 149 60 -47 9 27 -187 3 303 -172 4 15 -305 135 -114 128 224 193 -68
5431f8Q5J18m0k16K8K12k67L93k50OJ7k81M04J13k46k13P0N2J37k61M17k22k02
$$ -68 17 135 95 -121 -93 119 -148 245 -5 1 18 -263 141 254 8 -205 -135 -83 54 -207 210 -12 -214
5454b14J54J17j8m0j0m01L99o0J69j40P5J25r3k31OJ77M2m7K3L46k82N3j78j80
$$ -214 -60 57 39 -1 -11 -412 -13 -73 96 -44 31 156 63 -168 -162 15 57 10 33 379 97 150 -28 -208
5478b08L33k0L8k45r4J95K4R6k71N0J43J3N1m41K74R9J1O1j1k22J70K38j40K17
$$ -208 125 105 143 -102 -196 -1 23 119 -152 -102 41 54 105 -336 -62 37 48 109 98 -124 46 284 144 361
5502C61l38r6J33r2L2J15k7p4j40j74L76r5N6n7J25j54j03J45M2j32J31K7j19
$$ 361 23 -73 60 -32 0 115 88 14 -126 -300 76 -19 37 -20 105 -49 -152 -7 35 -97 34 61 -58
5525e8j54P9K99P4k27k22qO09n89J32j78J81l6L41l63N1J55j85Jr3L79k72j38
$$ -58 -212 -133 166 240 13 -209 -217 392 -197 -65 -243 -62 -98 243 -120 -69 86 -99 -98 -191 188 -84 -222
5548b22K98r5K13k48O0OQ5k06J62o4J91k00p4K1J6P5k45J43PoK19qK4l24J40M78
$$ -222 76 -19 194 -54 6 12 97 -109 53 -11 180 -20 -94 -73 -57 18 -227 -84 -77 -83 136 128 152 -172 -32 446
5574D46k95m35L42om7J13k83J93j33Q1M8K20k08k72L78j26J68J1o4j22j23K12
$$ 446 151 -284 58 52 5 118 -165 28 -105 -24 24 244 36 -236 142 16 184 195 131 9 -114 98
5596I8p6Q1j93J39Q8j53J83k77J38k43L07j97j54K36K18M5k71j07P5K03n6k50
$$ 98 22 103 -90 49 137 -16 167 -110 28 -215 92 -105 -259 -23 195 240 -31 -138 -63 140 84 -166
5618a66j2L77k52rJ14m9J1l8j13K83l75K79r8K36p9j45K68k29K07l97L8K02k54
$$ -166 -178 199 -53 -62 52 3 14 -24 -137 146 -229 50 -48 188 109 -36 232 3 210 -187 -149 53 -201
5641b01K77M0j96O8J51J69p3k87M33l16J5j97K63j98q3j31J94N8j03L96r3j39
$$ -201 76 116 -80 -12 139 308 235 -52 381 65 80 -117 146 -52 -135 -266 -72 -14 -117 279 186 47
5663D7J0k64J61K8K12j90Q5N6k32K17%j53j2L5P6k15m4j4j56M95o1j28R2n7Q7
$$ 47 57 -207 -46 -18 194 4 89 145 -87 130 130 -23 -35 0 76 -139 -183 -197 -353 142 81 -47 45 -12 75
5688G5K42j90j03L46m49j10J52J1P7j85L69j61M7q2q2j09K71N6m29R2L03j37K08
$$ 75 317 127 24 370 -79 -189 -37 -26 51 -134 235 74 121 39 -43 -152 119 175 -254 -162 141 4 212
5711B12o7J8k36M1Q9m3k13R6j07J75O9Jm6q3R1p9j20k7L22j59n2j9jJ97K5k45
$$ 212 145 163 -73 -32 57 14 -199 -103 -210 -35 34 35 -11 -94 -3 -82 -202 -229 93 -66 -118 -137 -138 59 84 -161
5737a61K98k38L67l21l5K02j60n6qo3J73j02R4J38k69M6MK5J37j71o6O6L08l85
$$ -161 137 -101 266 -55 -90 112 -48 -104 -112 -175 -2 -104 -10 128 -141 -95 -91 -66 71 -100 -166 -100 208 -177
5761a77J80J91j77K48k96J16J01k6j02jj22o5pK10J30l71J17P5p2Q9L7J46o30
$$ -177 3 194 17 265 -31 85 186 160 58 57 -65 -130 -137 73 203 -168 -51 24 -48 41 78 224 -406
5784d06O56j55l24K20j33O1J06K55l15M1j41J11okk84J74J07j60L39l3k04n6Q6
$$ -406 250 95 -229 -9 -142 -81 25 280 -35 6 -135 -24 -30 -32 -316 -142 -35 -195 144 111 -93 -149 -63
5807f3J38l45M05l67M83j04j18K73k65l9J04l52K70k43K53J38j66n7K1m6k23K44
$$ -63 75 -270 135 -232 251 147 29 302 37 -2 102 -250 20 -223 30 168 2 -55 -34 -80 -303 -59
5829e9K00j24M4J33j22M2j66j09J30j3J31k13K55k16k42L26l5k3j20L26p5m5K36
$$ -59 141 17 61 194 72 114 -52 -161 -31 -44 87 -126 129 -87 -329 -3 -38 -61 -181 145 70 25 261
5852B61l42j99J59R3m7jk19J52J41j63m4m0K91m5l10K17L63j39k55J77q7J09p3
$$ 261 -81 -280 -121 -28 -75 -76 -295 -143 -2 -165 -209 -249 42 -3 -313 -96 267 128 -127 50 -37 72 -1
5875aM3j42J52j02J24J5N3O7l70J54R8J21j56j46J65j64M1J34j24K9j11J70k4
$$ -1 42 -100 52 -50 74 89 142 209 -161 -7 91 212 56 -90 75 -89 -48 86 -38 -9 -120 50 26
5898B6k45J86q3j30Q8K22K4Q6n4j38k37L66j30N4R6l95J01K75j55k64N44k36j33
$$ 26 -219 -33 -116 -246 -158 64 88 174 120 -18 -255 111 -19 35 131 -264 -163 112 -43 -307 237 1 -132
5921a32J43j74L85k78j28J50m2J53j55j56L27n3O8j27J63L4l44J61l3j25J02Q2
$$ -132 11 -163 222 -56 -184 -34 -76 77 -78 -234 93 40 108 -19 144 178 -166 -5 -38 -163 -61 21
5943B1J55k54J08q1J71j37L3L7mL7K5J69l94nR9k16L15P1j15l4J39k36J60k9j18
$$ 21 176 -78 30 -51 120 -17 16 53 49 86 111 280 -114 -119 -20 -236 79 150 35 1 140 -96 64 35 -83
5968h3K62j91J85j96N6k96J64N5k63N11k79K41q7N1m4k65j39K13R6k69L81j5q0
$$ -83 179 -12 173 -23 33 -263 -99 -44 -307 204 -75 166 79 130 86 -179 -318 -105 -9 -278 103 88 8
5991HK6l2J3j44L52j61K97n09L18l23J81M8Q6k20j73K23m4M75m20r5K44k77P8
$$ 8 34 2 15 -129 223 62 359 -150 168 -155 26 74 160 -60 -233 -10 -54 421 1 -94 150 -127 -49
6014d9P4r0M02m77J46l5K79o1j60J65k70L17k66k96K42M1k63M59J41m28K73r5
$$ -49 25 -65 337 -140 6 -29 250 189 29 194 -76 241 -25 -321 -79 -38 -301 158 299 -129 144 49
6036D9j06K08J1p7j76L30l63n1J52J5n9J56P6k00o2p2L2k5J88k74K01L02j95l2
$$ 49 -57 151 162 85 -91 239 -124 -175 -23 -8 -67 89 165 -35 -97 -169 -137 -162 26 -248 -47 255 60 28
6060B8l0M1j78R0k31L34K3P7l10J64K52k98k5NJ14N6j10J47O0R1l28oJ86ON3l82
$$ 28 -2 39 -139 -49 -280 54 77 154 -156 8 260 -38 -63 -58 56 112 2 149 209 300 -28 -34 152 158 211 -171
6086a71k03L31j25O2K42r6O1pk71n2L89j55r0M2J5R9k03J85j67M13j98k82M16
$$ -171 -374 -43 -168 -106 136 40 101 94 -177 -229 160 5 -85 -43 -28 71 -132 53 -114 299 101 -181 235
6109B35k76J30K19l73m15N55o3M9k30K23k01J39J12j30pJ36r2J68k33R4K83l03
$$ 235 -41 89 308 -65 -480 75 12 61 -169 54 -147 -8 104 -26 -33 103 11 179 -54 40 323 20
6131B0k43K99k43p9K87L7j86M56j67k85K10j49J79J9j26j75n1N67m23K6Q2J14
$$ 20 -223 76 -167 -246 41 78 -108 348 181 -104 106 -43 136 155 29 -146 -197 370 -53 -27 55 169
6153A69nm23L77l47L52j83J42p1o2J48K7jk67l9J27L3j11J73J33K9j12q8P0p1
$$ 169 164 -259 118 -229 123 -60 82 11 -51 97 124 123 -144 -183 -56 -23 -134 39 172 201 89 1 71 0
6177@j94L0n9L55j1K3k76J67J87l33L25l81J85j57j32L64j50K8K36m14j9M14n0
$$ 0 -194 -164 -223 132 121 144 -132 35 222 -111 214 -167 18 -139 -271 93 -57 -29 207 -207 -226 188 138
6200A38qJ50j95q2N6Q7k62L0L10m20K17K05j64J39k12m7K13l12K11J6n6p4l2J1
$$ 138 130 280 85 3 59 146 -116 -86 224 -196 21 226 62 201 -11 -58 155 -157 54 70 14 -60 -92 -81
6224h1J36R0j78K98k89j15J81O6l6k8k6q9k1o3J45R5k97J36M9k60J85J83k06L32
$$ -81 55 145 -33 265 -24 -139 42 108 72 44 18 -71 -92 -155 -10 85 -212 -76 -27 -287 -102 81 -125 207
6248B07k03j34Q2K31k04j98J25l3J70k26K02oJ77l52K78P3k04O7j25j55L55p5
$$ 207 4 -130 -48 183 -21 -219 -94 -127 43 -183 19 13 190 -162 116 189 -15 52 -73 -228 127 52
6270E2N0k17j89O4L19O7k74o4L17j25J61M5l80nL45j50j36O1K4P1J56j28K41m11
$$ 52 102 -115 -304 -240 79 146 -128 -192 125 0 161 206 -174 -179 166 16 -120 -59 -35 36 192 64 305 -106
6294a06r5K72j68L52l18K42j98J14j42j94J30j38L47j96KJ96P2k40K17j27R5k8
$$ -106 -201 71 -97 255 -63 179 -19 95 -47 -241 -111 -249 98 -98 -96 100 172 -68 149 22 117 89
6316H9m5Q1j71NJ90NrK3j90L01l56J38j14p7j00j89K93L19l30k1M40m64K19j0
$$ 89 44 125 -46 -41 149 154 145 168 -22 279 -77 61 -53 -130 -230 -419 -126 193 -137 -158 282 -182 37 27
6340B7k7j18K83l07N8N3k6j07M3L49n90K67J74K30l26J03j22J24j40j73L41k19
$$ 27 0 -118 165 -142 -84 -31 -57 -164 -121 228 -362 -95 79 309 -17 86 -36 88 -52 -225 116 -103
6362a03J70k62P9J54j0R2j40K6p7r9J86k7p2O4Q2j75K0Q4R8l02j1KJ90k3p5J53
$$ -103 67 -195 -116 38 28 120 -20 6 -71 -170 16 -11 -83 -19 63 -112 -92 -8 90 -212 -223 -221 -31 -54 -129 24
6388B4r4j74m5J48R2j49K48m3j68J84J1Q0l18K54j7j96K33k55J05J53N1l69k5
$$ 24 -70 -244 -289 -141 -49 -198 50 7 -161 23 34 114 -204 50 33 -163 70 -185 -80 73 124 -245 -270
$$ [...]
8191a42
##END NTUPLES=NMR FID
##END=
