##TITLE=1H_2AAK-d6
 DMSO-d6
 8 sc, 
 11.4.2024
##JCAMPDX= 6.0         $$ Bruker NMR JCAMP-DX V2.0
##DATA TYPE= NMR FID
##DATA CLASS= NTUPLES
##ORIGIN= UXNMR, Bruker Analytische Messtechnik GmbH
##OWNER= root
$$ XWIN-NMR		Version 3.5
$$ Thu Apr 11 14:33:22 2024 Russian Standard Time (UT+4h)  she@DPX200
##.OBSERVE FREQUENCY= 200.1309
##.OBSERVE NUCLEUS= ^1H
##.DELAY= (6, 6)
##.ACQUISITION MODE= SIMULTANEOUS
##.ACQUISITION SCHEME= undefined
##.AVERAGES= 8
##.DIGITISER RES= 18
##SPECTROMETER/DATA SYSTEM= spect
##.PULSE SEQUENCE= zg30
##.SOLVENT NAME= CDCl3
##.SHIFT REFERENCE= (INTERNAL, CDCl3, 0, 15.7039)
##AUDIT TRAIL= $$ (NUMBER, WHEN, WHO, WHERE, WHAT)
$$ ##TITLE= Audit trail, XWIN-NMR		Version 3.5
$$ ##JCAMPDX= 5.01
$$ ##ORIGIN= Bruker BioSpin GmbH
$$ ##OWNER= she
$$ F:/spectra/data/she/nmr/H-F/1/audita.txt
$$ ##AUDIT TRAIL=  $$ (NUMBER, WHEN, WHO, WHERE, WHAT)
(   1,<2024-04-11 14:31:39.18 +0400>,<she>,<DPX200>,
      <created by zg, POWCHK disabled, PULCHK disabled
       configuration hash MD5:
       00 E9 B6 7A A2 85 ED C7 34 08 36 98 17 FE 4E 26
       data hash MD5: 16K
       2E 75 2D 9F 98 9F 29 80 54 0C 33 E6 06 6F 4C C2>)
$$ ##END=
$$ 
$$ hash MD5
$$ AC 15 B0 69 1F AF 7A C7 18 0E 1A 2C D6 E5 96 12
##$RELAX= 
##$RELAX= 
##$RELAX= 
##$RELAX= 
##$RELAX= 
##$RELAX= 
$$ Bruker specific parameters
$$ --------------------------
##$DU= <F:/spectra>
##$EXPNO= 1
##$NAME= <H-F>
##$PROCNO= 1
##$TYPE= <nmr>
##$USER= <she>
##$AMP= (0..31)
100 100 100 100 100 100 100 100 100 100 100 100 100 100 100 100 100 100 
100 100 100 100 100 100 100 100 100 100 100 100 100 100 
##$AQSEQ= 0
##$AQ_mod= 1
##$AUNM= <au_zg>
##$AUTOPOS= <>
##$BF1= 200.13
##$BF2= 200.13
##$BF3= 200.13
##$BF4= 200.13
##$BF5= 200.13
##$BF6= 200.13
##$BF7= 200.13
##$BF8= 200.13
##$BYTORDA= 1
##$CFDGTYP= 0
##$CFRGTYP= 5
##$CHEMSTR= <none>
##$CNST= (0..31)
1 1 145 1 1 1 1 1 1 1 1 1 1 1 1 1 1 1 1 1 1 1 1 1 1 1 1 1 1 1 1 1 
##$CPDPRG= <>
##$CPDPRG1= <>
##$CPDPRG2= <>
##$CPDPRG3= <>
##$CPDPRG4= <mlev>
##$CPDPRG5= <mlev>
##$CPDPRG6= <mlev>
##$CPDPRG7= <mlev>
##$CPDPRG8= <mlev>
##$CPDPRGB= <>
##$CPDPRGT= <>
##$D= (0..31)
0 1.2 0 0 0 0 0 0 0 0.06 0 0.03 0 0 0 0 0.0002 0 0 0 0 0 0 0 0 0 0 0 0 
0 0 0 
##$DATE= 1712831498
##$DBL= (0..7)
120 120 120 120 120 120 120 120 
##$DBP= (0..7)
150 150 150 150 150 150 150 150 
##$DBP07= 0
##$DBPNAM0= <>
##$DBPNAM1= <>
##$DBPNAM2= <>
##$DBPNAM3= <>
##$DBPNAM4= <>
##$DBPNAM5= <>
##$DBPNAM6= <>
##$DBPNAM7= <>
##$DBPOAL= (0..7)
0.5 0.5 0.5 0.5 0.5 0.5 0.5 0.5 
##$DBPOFFS= (0..7)
0 0 0 0 0 0 0 0 
##$DE= 6
##$DECBNUC= <off>
##$DECIM= 32
##$DECNUC= <off>
##$DECSTAT= 4
##$DIGMOD= 1
##$DIGTYP= 9
##$DL= (0..7)
0 120 120 120 120 120 120 120 
##$DP= (0..7)
150 150 150 150 150 150 150 150 
##$DP07= 0
##$DPNAME0= <>
##$DPNAME1= <>
##$DPNAME2= <>
##$DPNAME3= <>
##$DPNAME4= <>
##$DPNAME5= <>
##$DPNAME6= <>
##$DPNAME7= <>
##$DPOAL= (0..7)
0.5 0.5 0.5 0.5 0.5 0.5 0.5 0.5 
##$DPOFFS= (0..7)
0 0 0 0 0 0 0 0 
##$DQDMODE= 0
##$DR= 18
##$DS= 0
##$DSLIST= <SSSSSSSSSSSSSSS>
$$ [...]
##$SUBNAM2= <"">
##$SUBNAM3= <"">
##$SUBNAM4= <"">
##$SUBNAM5= <"">
##$SUBNAM6= <"">
##$SUBNAM7= <"">
##$SUBNAM8= <"">
##$SUBNAM9= <"">
##$SW= 18.0517689322627
##$SWIBOX= (0..15)
0 0 2 0 0 0 0 0 0 0 0 0 0 0 0 0 
##$SW_h= 3612.71676300578
##$TD= 16384
##$TD0= 1
##$TE= 0
##$TE2= 300
##$TE3= 300
##$TEG= 300
##$TL= (0..7)
0 120 120 120 120 120 120 120 
##$TP= (0..7)
150 150 150 150 150 150 150 150 
##$TP07= 0
##$TPNAME0= <>
##$TPNAME1= <>
##$TPNAME2= <>
##$TPNAME3= <>
##$TPNAME4= <>
##$TPNAME5= <>
##$TPNAME6= <>
##$TPNAME7= <>
##$TPOAL= (0..7)
0.5 0.5 0.5 0.5 0.5 0.5 0.5 0.5 
##$TPOFFS= (0..7)
0 0 0 0 0 0 0 0 
##$TUNHIN= 0
##$TUNHOUT= 0
##$TUNXOUT= 0
##$USERA1= <user>
##$USERA2= <user>
##$USERA3= <user>
##$USERA4= <user>
##$USERA5= <user>
##$V9= 5
##$VALIST= <valist>
##$VCLIST= <CCCCCCCCCCCCCCC>
##$VD= 0
##$VDLIST= <DDDDDDDDDDDDDDD>
##$VPLIST= <PPPPPPPPPPPPPPP>
##$VTLIST= <TTTTTTTTTTTTTTT>
##$WBST= 1024
##$WBSW= 4
##$XGAIN= (0..3)
0 0 0 0 
##$XL= 0
##$YL= 0
##$YMAX_a= 88023
##$YMIN_a= -142248
##$ZGOPTNS= <>
##$ZL1= 120
##$ZL2= 120
##$ZL3= 120
##$ZL4= 120
##$ABSF1= 10
##$ABSF2= 0
##$ABSG= 5
##$ABSL= 3
##$ALPHA= 0
##$AQORDER= 0
##$ASSFAC= 0
##$ASSFACI= 0
##$ASSFACX= 0
##$ASSWID= 0
##$AUNMP= <proc_1d>
##$AZFE= 0.1
##$AZFW= 0.1
##$BCFW= 1
##$BC_mod= 2
##$BYTORDP= 1
##$COROFFS= 0
##$CY= 11.3945322036743
##$DATMOD= 1
##$DC= 2
##$DFILT= <>
##$DTYPP= 0
##$F1P= 15.6554695791079
##$F2P= 12.8336369535428
##$FCOR= 0.5
##$FTSIZE= 0
##$FT_mod= 4
##$GAMMA= 1
##$GB= 0.15
##$INTBC= 1
##$INTSCL= 1
##$ISEN= 128
##$LB= 0.24
##$LEV0= 0
##$LPBIN= 0
##$MAXI= 10000
##$MC2= 0
##$MEAN= 0
##$ME_mod= 0
##$MI= 1.114404
##$NCOEF= 0
##$NC_proc= 0
##$NLEV= 6
##$NOISF1= 3.799351
##$NOISF2= 2.8
##$NSP= 1
##$NTH_PI= 0
##$NZP= 0
##$OFFSET= 15.70392
##$PC= 1
##$PHC0= -25302.99
##$PHC1= 10.38731
##$PH_mod= 1
##$PKNL= yes
##$PPARMOD= 0
##$PSCAL= 0
##$PSIGN= 0
##$REVERSE= no
##$SF= 200.130013532006
##$SI= 16384
##$SIGF1= 3
##$SIGF2= 2
##$SINO= 400
##$SIOLD= 16384
##$SREGLST= <1H.CDCl3>
##$SSB= 0
##$STSI= 0
##$STSR= 0
##$SW_p= 3612.71676300578
##$SYMM= 0
##$S_DEV= 0
##$TDeff= 0
##$TDoff= 0
##$TI= <>
##$TILT= no
##$TM1= 0
##$TM2= 0
##$TOPLEV= 0
##$USERP1= <user>
##$USERP2= <user>
##$USERP3= <user>
##$USERP4= <user>
##$USERP5= <user>
##$WDW= 1
##$XDIM= 8192
##$YMAX_p= 0
##$YMIN_p= 0
$$ End of Bruker specific parameters
$$ ---------------------------------
##NTUPLES= NMR FID
##VAR_NAME=  TIME,          FID/REAL,        FID/IMAG
##SYMBOL=    X,             R,               I
##VAR_TYPE=  INDEPENDENT,   DEPENDENT,       DEPENDENT
##VAR_FORM=  AFFN,          ASDF,            ASDF
##VAR_DIM=   8192,          8192,            8192
##UNITS=     SECONDS,       ARBITRARY UNITS, ARBITRARY UNITS
##FACTOR=    0.0002768,     1,               1
##FIRST=     0,             0,               0
##LAST=      2.2672688,     0,               0
##MIN=       0,             -142248,         0
##MAX=       2.2672688,     88023,           0
$$ Real data points
##PAGE= N=1
##DATA TABLE= (X++(R..R)), XYDATA
$$ [...]
1924b34J172m03j479J52J332L82j228q37J133J180o61j800K53J641O08j574j416
1941a779J219K083j80k337p43K051J535j231j879j3K166O58j614j398J088J561
1957A187j87j975k17J431R80j356q82O52Q74M51j451n64J431R38q72j548J89J867
1975I48M87k063r57J330J474j44k041l87J681R61r48j752L30J672L45r26j212
1992a202N24J829k74j292o14J042J224j155n85k1R52O19j280n89R98R87m58j530
2010h25j14J784K84j292j093R09J468k29j586q14J599J073p12j696K7J685R27
2027A395j255j313P17J254j57j279k64J043P05p93q08K00J222J54j233n12Q14
2044a10J055p31j251J38J486M16j260q24N22J670l04j761j09J247J246q04j440
$$ y = [-234, 938, 535, -944, -792, 540, 922, -306, -1143, -10, 1170, 509, -1291, -1038, 603, 1211, -363, -1779, -560, 1523, 1343, -994, -1737, 314, 1849, 618, -1261, -1274, 892, 1550, -64, -1462, -374, 1187, 1000, -975, -1192, 239, 1219, -137, -1019, -367, 507, 958, -493, -1057, 374, 1312, 440, -1108, -919, 948, 1435, -628, -1585, -255, 1219, 1075, -966, -1353, 328, 1289, 341, -1411, -1081, 591, 936, 10, -1202, -678, 1151, 877, -415, -1029, 13, 1237, 82, -503, -524, 428, 1047, -233, -822, 176, 1163, 705, -825, -939, 845, 1129, -163, -1256, -347, 1121, 892, -694, -1508, 91, 1164, 452, -1244, -1217, 468, 1395, 140, -1173, -456, 798, 641, -638, -902, 141, 846, 53, -755, -555, 667, 821, -412, -924, -110, 945, 214, -1037, -899, 587, 1003, -257, -1081, -559, 1111, 807, -954, -1063, 184, 1430, 626, -814]
2061h14l50J463J104j484j032P81R86L02j163o08O28J111l87j222Q7J454q6q56
2079h6p32N72J055l36j279J69J056M70q45j203Q81J089R1j174j194J482J450q63
2097F03j636r2J773O67j161j467O92J362J57j341m19Q38R81n11j147j03J568n
2115G59r20n85N96J108k92j658o3J648M33j105r95O66J457l53j331o90J200J217
2133A092o65j303J38J324O27j052j153O33J343k13j296m77P25J251r03n17l6J442
2151I60j55q61n69L85J020k15j371J40J179M04r16j113O97J460m48j065l31O77
2169a22J120n33j315r1J126O48p85j104L20J658j14j300n3L36J047n92r83j81
2187i18J297L14p26l79L56O51j74j160L71P07K34o79j102Q57J218k85j325P1O88
$$ y = [-814, -1164, 299, 1403, -81, -1113, -332, 654, 956, -207, -815, -187, 924, 537, -685, -598, 856, 770, -86, -818, -246, 809, 473, -806, -637, 419, 889, 44, -1159, -278, 811, 902, -272, -1466, 16, 1466, 603, -1033, -1125, 648, 1315, 154, -1313, -621, 741, 898, -443, -862, -24, 957, 446, -701, -804, 764, 759, -161, -746, -150, 958, 666, -992, -1055, 593, 1026, -79, -1074, -408, 1049, 696, -635, -1325, -125, 1092, 427, -876, -738, 586, 1213, 161, -992, -359, 984, 771, -525, -1002, -277, 974, 71, -446, -482, 960, 805, -56, -625, -240, 780, 565, -806, -666, 513, 917, 1, -1112, -415, 1045, 597, -468, -799, -122, 998, 465, -850, -941, 185, 833, 48, -1056, -736, 922, 808, -492, -545, -209, 838, 246, -737, -918, 379, 693, -33, -412, -56, 595, 421, -739, -368, 339, 573, -106, -1208, -351, 867, 582, -743, -672, 16]
2206A6R41n48j044j32J063R26j054j173N53J099l3q18o16Q26P97o55p60n3J098
2225D33K20p44o70L12J044k47r23q6R49M23o79q70K37J052L79r44o68Q37Q52k29
2245F78j061m27J035P76q76q08j67J311K77q78p35N63R37j62q47k91J119K98q64
2264a22p59O86J030l23j107k71Q96P76p79j013N86P82L89j203m86P71R79l61j112
2283f41l5J046P31j026q99M81Q78K73j143o13R96R42m51j319L7J059L78n35r80
2302h21M07J066q1j095m01J313L78l87r97J48J132J06p32r67Q25R40j70j417j0
2321g63Q43O98r86m91L77Q66P6j209o8Q11N41j95j246J72Q29L58l81q60K88O09
2341B69J81o81l11P83N47o56q92L75J181J9q47p66P57N17j03r42j50Q09P44r04
$$ y = [16, 957, 409, -635, -767, 296, 1222, 168, -1005, -452, 647, 614, -204, -820, 6, 803, 148, -612, -665, 433, 653, -91, -761, -449, 595, 348, -575, -661, 288, 711, 32, -838, -601, 451, 830, -114, -782, 55, 907, 678, -383, -810, 225, 1001, 125, -683, -850, 461, 738, -140, -875, -312, 625, 463, -384, -675, 444, 742, -122, -881, -195, 835, 512, -595, -866, 30, 806, 27, -986, -400, 382, 771, -432, -918, -147, 832, 471, -641, -676, 370, 1101, 75, -824, -343, 535, 808, -335, -948, 48, 990, 539, -780, -743, 316, 694, 159, -821, -414, 652, 571, -524, -925, 388, 766, 379, -618, -470, 662, 768, 36, -931, -106, 834, 664, -753, -763, 80, 778, -208, -699, -322, 544, 620, -589, -657, 154, 695, 500, -746, -574, 255, 613, 232, -628, -340, 269, 450, -231, -542, 241, 788, 132, -760, -385, 796, 815, -32, -798, -41, 476, 373, -569, -719, 90, 834, -70]
2361g0q78N63R00J7r34l26L79J094l42p77j32L17R29o50o24N70M28N6q48j81O71
2382A62M00l56n96o3P23L67r08n00N78J016m31p20l14R91M52o93o24j62J094L27
2402G43p07j072R09P49j59r87n1Q74K56k08j013M58R60j20r76k01L94P80l20q05
2422d96j14R98L15r15o40M52J031k13p28l58J249J80p51o19j57J212o4p31k15
2441e64L14R15n7j051j85R79L61n42o31K22P80k39l72l52M94Q05o52o61r6P96
2461B64K26o15n30L20R96m80o53J4P04N80r03l98q2P75K05n82m85M24P10j77l99
2482h6p5L57J70k69o22J11P71N9n54m34O85K85l1q25r6P53J49l91m50K58N30J38
2504D33p12m43O32N88l49p01R6O51M19p22n17M30R24m35j018M42L83O46o40q43
$$ y = [-70, -948, -385, 515, 532, -402, -728, -349, 745, 403, -374, -506, -189, 740, 90, -534, 36, 464, 520, -328, -509, 162, 562, 206, -390, -453, 270, 637, -271, -771, -193, 823, 392, -328, -642, 349, 801, 108, -516, -678, 416, 743, 36, -1036, -127, 622, 463, -524, -575, 299, 555, 347, -666, -208, 752, 632, -344, -545, -151, 629, 309, -496, -610, 388, 703, -212, -852, -400, 631, 418, -310, -668, 581, 761, 10, -609, -766, 446, 382, -349, -564, -250, 665, 608, -443, -628, 351, 712, 170, -461, -239, 541, 302, -70, -422, 72, 877, 225, -436, -532, 264, 490, -125, -655, -335, 661, 181, -472, -458, 246, 826, -77, -475, -557, 218, 423, -159, -644, -220, 490, 313, -86, -161, 196, 366, 97, -525, -414, 357, 416, -138, -572, 113, 398, 367, -458, -554, 199, 348, -43, -493, -235, 295, 433, -279, -722, -90, 498, 149, -552, -456, 195, 614, -108, -625, -195, 729, 294, -724, -282, 101, 747, 107, -736]
2524g36N99L24Rj95n90N72O25n32l44K6N58K01q24m21Q05M91k37o74r2N57N59
2545F81m81o28N6N11K11k52o57K99O06q0m99J02j4N76k10q03L89O37o7n12k74
2566d09L68N07l79n97k02P16K94m35k10j14Q61j62m81k87M94M53j67r40K18O61
2586A89K99l66q51N73N08N8p20k61O82K18l04o64L45Q69P5m77n39N72M13k55r80
2607f16J34N05N79n32n47M67N79r0n85k94M11M09q3o73O5O59k52j42p15N04O11
2628C94k61n27j01M50O42n77m16j1Q15r8n55n66O84M43l72j74J06L65K29k26o93
2649d49K13N96M7p38k10M37M54r8n72k93P96K10n59k78J56O80P4o00k31M85L37
2670D57l58n32k9O48L37m24o38L08P13j63p73J78L69K57k64m88K94N29J70q86
$$ y = [-736, -137, 187, 196, 1, -589, -17, 608, 76, -268, -242, 316, 517, -307, -728, 77, 568, 331, -343, -435, 122, 681, 200, -428, -372, 139, 350, 98, -559, -260, 346, 266, -233, -131, -145, 431, 221, -582, -193, 444, 377, -135, -409, -41, 466, 87, -510, -712, 4, 298, -137, -347, -461, 400, 238, -243, -530, -36, 417, 250, -690, -472, 189, 488, 122, -729, -156, 352, 410, -310, -571, 111, 329, 25, -639, -294, 575, 650, 173, -366, 206, 619, 364, -616, -482, 23, 602, 70, -477, -10, 569, 479, -106, -400, 11, 420, 337, -336, -271, 388, 136, -6, -721, -217, 394, 133, -394, -495, -45, 597, 20, -396, -407, 408, 310, -245, -811, -127, 316, -56, -230, -124, 241, 470, 244, -449, -236, 360, 407, -331, -541, -104, 350, 252, -320, -613, 183, 393, -166, -444, -288, 392, 466, -134, -365, 120, 457, 99, -433, -462, 186, 523, 99, -539, -231, 482, 319, -454, -276, 93, 350, 86, -402, -108, 421, 591, -295]
2690b95o4K13M52q0m44j27O04L5k40l35p4R02m2q06k24O08K96k11m70lK87O34
2712F16o91m62N11M85l64m10Q2K25K89j28p25N29L98j78k03m06K46O26k54o11
2732d25N9N20L10m38m26J48M42K5n42j15N99M04l09l92k92M64L00k47k91L7O53
2753D84k15n44l86R06K02m22k95r5R17k14m43k07K18P49l20l86k06M22J85m74
2773a24m91L89O01k44l32l36O68P9j14l56L57J20M9l19l42M17L28Q6r02M8L88
2794c0M58k81l49R2L09j02l32k48N91J75R1p02J7M23K39l0n89K61N02j56l99L8
2816b2J61J59Jp61P0L75K98m2o66L10M84R9l49m13L65L81k09l53l18O31K12n32
2838a19j23M50J49k74m61j5L20M35l28m38L93K64J13j19o21M72M4o0m00J98M92
$$ y = [-295, -359, -146, 306, 226, -218, -345, 259, 294, 54, -281, -355, 547, 505, -301, -525, 83, 379, 168, -302, -305, -18, 616, -75, -537, -26, 459, 95, -315, -233, -8, 281, 153, -572, -43, 355, 177, -26, -432, -186, 440, 186, -425, -366, 154, 464, 26, -400, -252, 190, 215, -327, -442, 157, 561, 252, -140, -432, 32, 332, 85, -206, -169, 484, 269, -275, -661, 245, 447, 25, -270, -365, 552, 338, -105, -312, -94, 655, 335, -51, -257, 165, 350, -124, -615, -226, 375, 131, -201, -537, 131, 210, 96, -260, 97, 217, 266, -53, -395, 22, 350, 436, -466, -418, -30, 428, 147, -202, -110, 199, 97, -235, -483, 108, 283, 374, -328, -311, 112, 351, 321, -268, -7, 495, 339, -60, -22, 139, 298, 299, -462, -392, -17, 281, 239, -427, -117, 367, 466, 117, -296, 69, 450, 241, -112, -430, 201, 413, -119, -242, 208, 357, 83, -378, -393, -73, 362, 34, -404, -11, 253, 366, 247, -374, 98, 142, 82, -318, -120, 372]
2859C72j90l7q04M09N74q1l36k08K49M52j36l85k17M37M82p10k46M12L64k9o08
2880b36LL27L57k56n34J48M40J66m80m19M37K45J01k87k17M74p0P0n17j44N01
2901A09K60m65k31L72L74m26j45k6M71km58l83K81L84P8k95j58L42L8k21k51J82
2923a70K80K23l88n55P20K96J06o95j93O60j58j00l32L44K89j9k32j88J57L26
2943C71l98j40O5M87k31J6n10K65O41o7o09m2L37k5k93k26L66O08n39j33l32M75
2965H6P9r3l46J16K07J69j42m39K47K57K03n43j25J57L57l09j74jN16n3j97j09
2987a37R9O25m93l10%R8N24l66j87K94J9J55k96m71K96M67m2m37J44J44R8Q5n46
3010b37K8K72K85m25l60K50N32j21o09M79J75K4o7m86K15L08q3Kl61J04L22k08
$$ y = [372, 182, 145, -659, -250, 324, 243, -93, -301, -52, 400, 264, -121, -338, 99, 581, -129, -375, 37, 401, 372, -236, -233, 94, 451, 195, -339, -191, 249, 415, -65, -484, -47, 198, 299, 12, -205, 269, 199, 269, -248, -392, 109, 369, -96, -327, 45, 419, -7, -152, -178, 293, 291, -167, -550, -269, 115, 193, -102, -260, 82, 120, -101, -352, -170, 110, 333, -55, -610, 110, 406, 512, -183, -376, 284, 126, 26, -306, 38, 327, 308, 76, -112, 45, 371, -27, -167, -102, 385, 154, 170, -340, -75, 566, 499, -110, -152, 185, 160, -133, -359, 7, 615, 76, -57, -389, 86, 165, 72, -274, -158, 49, 218, 76, -363, -116, 141, 344, -199, -324, -167, 190, -119, -293, -294, 222, 169, -28, -137, -38, 587, 94, -216, -216, -118, 406, 40, -147, 147, 166, 321, 25, -446, -150, 317, 275, -162, -18, 126, 224, 309, -237, -209, 63, 348, -77, -437, -187, 345, 224, -385, 94, 269, 293, 226, -260, -45, 263, 180, 182, -179, -75, 247, 39]
3032C9l04Q6L85p8j72l58M80K77j72l72j40J40L26j86l85K84K89j75nj13l4M89
3054C01Pp20J04N72k20l00J34K93%r5qk38K85J56p2o64P8M10L06n00j58L94M8
3077A13J05m81N0M12K16j65o05J14O55j20k11k65K31K8J34j96m44L61M40n31j89
3098c48L42K81J59n33l80N72N6J1l11J0M6M60l27j43N3J97O7n06K04K30nj81l11
3121c57J24M87k3k38j72K70J17k5l95J72M3J02J78m64Q2j3M47k13j33p4R5N9k29
3144a60J95K62Q7l27m71N39J72p9k59J05J8P7j89k67J54L22j8M9k80L49R4k59
3166A14n4k70K19L4p2l19J27N20j14l81k9K90R5j59l93l1N26r1J40m05J47K86
3188A80K4o03J47J57K73j54j36j1K01J49l62j97P2M74j18j04j36K91J79l45j22
$$ y = [39, -265, -179, 206, 128, -44, -402, 78, 355, 183, -189, -329, -189, 137, -49, -434, -150, 139, -36, -41, -154, -188, 301, 308, -412, -308, 264, 44, -256, -122, 171, 171, 76, 68, -170, 115, 271, 199, -465, -387, 23, 329, -171, -329, 65, 113, 218, -263, -213, 199, 415, 250, -355, -241, 414, 294, 83, -182, 49, 77, 211, 15, -429, -68, 372, -159, -348, -6, 275, 434, -99, -479, 93, 149, 160, -151, -141, -95, 365, 38, -105, -52, 145, 212, -294, -90, 140, 135, -46, -357, -233, 254, 231, -7, -179, 91, 208, 183, -212, -40, 3, 105, 283, -181, -99, -112, 335, 122, -11, -85, 10, 69, -160, 35, 297, 384, 57, -414, 125, 297, 218, -41, 64, 82, 159, -30, -297, -143, 179, 161, 210, -70, 279, 373, 114, 60, -210, 9, 43, -29, -348, -221, 299, 185, -196, -225, 65, 160, 1, -392, -423, 103, 12, 152, -253, -106, 180, 204, -399, -252, -95, 178, 24, -112, -123, 78, 227, -135, -332, -260, 214, 96, -8, -144, 147, 326, -19, -141]
3209a41L2M0K60l68k49M04L32k68n4l33O58k40j28j22K18J61J45k65k30KM11m07
3231a42j29K39J95N6j93j32j6K66N7k77k64M93J56n25J79n7J88N8k81K21J9J99
3253C10l35j19k22K99K57j39l05L03J79j80l14MM01J19j62l49Q6M66n9k99k13
3274b72M83J20l16j91J60J33J06o1j35J84J96k32j03l32J99J42K92m02k13L52
3294A10L11l91p1K19j01M7k71Q4J31L32m02j31j60O22k49k1k39K8J19J98j4m88
3316c37M58O4l26o6J80J34q2M4k71J91J37L0k62J23J62k5o3l13L0kN41k83m87
3339d23N73l2Q6l98J33P8P5k55N3L4J21O4k12nO6L02l55p1pQ5L43r8k43K39K60
3364D13k48l67L17r5j21L3r6R1M54k10j15k94M77q9O5l87j23N52o4r9N3P5k61
$$ y = [-141, -109, -69, 191, -177, -426, -22, 310, 42, -12, -345, 313, 73, -55, -177, 41, 202, 347, 82, -148, -146, 265, -142, -271, -32, 163, 219, 26, -106, -122, 144, 201, -76, -340, 153, 309, -216, -37, -94, 94, 152, -129, 92, 111, 310, -25, -144, -366, -67, 190, 51, -254, 49, 228, 48, -266, -262, 139, 258, 96, -253, -167, 299, 240, -59, -272, 211, 331, 15, -176, -16, 117, 223, 162, 27, 211, 407, 175, 72, -260, -61, 81, 373, -29, -242, 110, 421, 30, -41, 178, 77, 124, -147, -63, 68, 400, -2, -133, -293, 329, 80, 59, -180, -152, -33, 165, 151, -337, 121, 185, -141, -207, -27, 107, 25, 69, -202, -11, 126, 156, -106, 17, 179, 154, 91, -222, -192, -194, 347, 64, -423, 150, 118, 204, -194, -61, 17, 92, -163, -110, -76, 45, 109, -103, -108, -42, 260, -95, -166, -173, -88, 255, 157, -86, 153, 413, 165, -202, 115, 20, -101, -68, -164, -73, 381, 171, 56, -238, 239, 150, 215, -172, -295, 257, 193, 94, 147, 222, -39]
3387c9M78p03J94K2L04k94j14K1K34j34P7j92K60K23o16p5L21L37k0m06J14Q3
3409G5R0l6k82K27j09L73k73n1P6K32j32l32o7L36J12J62m70j0L51L17m20k77
3431a08K08R6k11j92J11K2r1L09j53Q9O1M8l42j1j1N3J90J43l31j7J14p7K28k99
3455a71L60J08l15l79M38J40j35k10m7K59L9k66jq9L17Q7l11j70R4K05J5q9M4
3478g7%p1J2j08K70O8k57N1K8J04M2J62n48J83K99J04J44o41R0M20l18J31k25
3501a37K26K00k23pm9J57j50n5k38J75L38j67m3j34K7J58P6j49k62K31K25k08
3523iq7J51k64K27l17J89q5M77l87Q6j23K98o0k53M5j2L20k18k9L2jR4m0r5j38
3548a99J14K1J9O0k60O9K85m85K34L25j33n2p6K7K86k32J10k61Q2K76l69J01J64
$$ y = [-39, 439, -264, -70, -48, 256, -38, -152, -131, 103, -31, 46, -146, 114, 337, -279, -354, -33, 304, 284, -122, -8, 75, 165, 129, -153, 74, -35, 338, 65, 14, 90, 322, 190, -142, -209, 127, 239, 401, -69, -79, 272, 589, 169, -108, 100, 196, -15, -207, -96, -74, -165, 144, -9, 80, 141, 189, -153, -164, -175, -122, 68, 211, -120, -137, -23, -100, 128, -171, 189, 297, -18, -397, 41, 181, 46, -164, -211, 48, 87, -179, -180, -269, 48, 135, -176, -346, -252, -47, -32, -121, -77, -77, -148, -136, -244, 26, 94, -163, -112, -84, 20, 62, 224, -324, -141, 158, 262, 406, -235, -145, 275, -43, 88, -137, 89, 289, 66, 59, 10, 167, 17, -38, -276, -101, 237, 70, 27, -107, -80, 78, 154, 5, -257, -26, 199, -9, -96, 55, -209, 18, -299, -110, -195, 282, -105, -19, -142, 156, 96, -157, -112, -124, 196, -22, -51, -19, -20, 74, 34, -61, -199, -85, -64, -45, 15, -245, -176, 109, -376, -142, 183, 50, -2, -78, -51, 235, 3, 113, -148, -66, 210, -159, -58, 106]
3571A06j6L0q2l00J79P3j60L42k64L67R7l64k5J13k5j05R8l06L92k68K62j02k87
3594b45N38l35l0N2n9M08l31L4j00R6r9o4K29k91K99o9qj31l6R8j4O9J77j88P4
3619G4j6r5J49j22j61K09l01J73J24J6J88n80L40o1J39j14J14O2j95j61K30j13
3641a01L00j83j82M5K89j4k74k2l8j9J45l6m6K73j35K4L6m2J72o5k12N8j12L0
3665a09R2Q9J6r6J66k34Q6J12r2j84J21m0J66J29J8m74K67J38l10L71m36J70J62
3688A28m7l62N50j84K17m63M0J95j31kj33J56K0K00k02N1K6j62K32L2l97L09M8
3711A21R2m27j27L81J51k48M2j09J61J26j41kR1R9m60L52j16Q8j0j91M1k5N8O4
3735A1p1k81L09J86k11m1N78n75k5K8J7j7L88j97j99J20k65M00j08P5k12K60j1
$$ y = [106, 90, 120, 38, -262, -83, -10, -170, 172, -92, 275, 372, 8, -17, 96, 71, -34, 64, -242, 150, -118, 144, 42, -245, 293, -42, -72, -20, -79, 329, -2, 32, -68, 28, -71, -135, 94, -197, 102, 33, 25, -106, -142, -44, -58, 11, 188, 0, 74, 58, -37, 112, -10, -171, 38, -263, -90, 34, 50, 238, -342, -2, -63, 76, -38, 76, 138, -57, -218, 12, -101, 199, 16, -166, -121, 168, 154, -120, -142, -180, -199, -54, -90, -136, 137, 2, 26, 62, 20, 192, 127, -85, -27, -139, -109, -17, 72, 88, -8, 158, -76, 10, 122, 30, -154, -33, -73, 93, 222, 240, -234, 33, 171, -139, 232, -204, -34, 128, 81, -281, 269, 85, 302, -161, -121, 74, -57, -59, -192, -36, -16, 184, -18, 33, 59, -103, 129, 161, -236, 73, 121, 213, -214, -341, 40, 191, -57, -15, -124, 37, 163, 22, 20, 111, 210, -250, 102, -14, 74, 64, -127, -86, -111, -53, 11, -60, -341, -32, 154, -57, -98, 480, -95, -120, -92, -75, -92, 296, 99, -100, 20, -245, 155, 47, 122, -90, 170, 159]
3758A59k45J04K03k99J60N4j60j44L95l71K06j29K00j84K4k41M13k44Q6j14o2
3779a89L22k27k4NQ8N3J53k36n0k0K68j05l9k22J07J21K03p6r3K19j98R2j96J25
3803H1M1J6k23j29J47L12k12qJ55l00J64p0j89L95j27r3k9l44O64k36N8m7k52
3826b26J62L04k27j66L46j67J41j39J25k32N58o93L18J70j6l26L6o1R1J59Lj46
3848A4j21L32k90LK12j32J61l91k2N44k98j44J01k0n3M31l65lp9K82j51m1J46
3871A16j96J76k44N7K33k55J99k20K59K20l12j62K01j03O3Pj01k0K4M01m89J93
3893D7j66k97K63P1jO9J61k37Q6l2K21O9m12L17k59m4J23K07q3M7k10J27l25K54
3917dJ08j94o6L5J39k00K22J78j09j0N2m1m6K29n77L25M7O4n10N91l49M3q1J62
$$ y = [159, -86, 18, 221, -78, 82, 136, -24, -168, 227, -144, 62, -67, 133, -51, -27, -268, 145, -99, -13, -127, -189, 133, -94, -118, -113, -25, 28, 181, -55, -105, -125, 143, 38, -1, -223, -116, 5, 208, 132, 39, 258, 60, 152, -44, 81, 122, 138, -85, -214, -67, 245, 33, 25, 180, -120, 44, -26, -215, 180, 53, -40, -69, -413, 251, 15, 73, 26, -226, -64, 240, 13, -153, 193, 26, 167, 28, 153, -79, 479, -214, 104, 274, 258, -68, -32, -93, -2, 157, 160, 14, -107, 225, -65, -62, 150, 18, 179, -212, -234, 310, 12, -132, -31, -51, -104, 327, -38, -41, -120, 162, 11, -30, 116, -80, 96, -148, -91, 142, -113, 86, -134, 125, 345, 33, -129, 72, -31, 32, 39, -62, -82, -58, 343, -146, 47, -119, -416, -153, -82, -83, -14, 147, -90, -4, -36, 185, 254, -158, 159, -100, -144, -21, 186, 103, 150, -60, 67, -258, -4, 104, -90, -156, -121, 18, -182, 40, 218, 109, 99, 151, 110, 64, 293, -284, 41, 88, 152, -358, 233, -116, -73, -154, 8]
3941HK37k96J05k76M23N5l06q7q9L25j75p0J62o5N6J94l16k86N41l46K87l28K89
3964D2n0j31K47j06k00J64R0M6j08m7j7j76K13J7J90k01J14J12n8J03k66R9n16
3987d39M20J31n8m6nl5j39P7N7j8K92k18l0m1K33j25k9J56k50J37n8J66l17J1
4011a28J23N3R4k23J98j68R2j44RN8O7p6j37Q3l23M55J18j58m7o9N5j25J24K2
4035d7O7n2M0N2Rk4k46L68m0j44K34J30j96n0j54l06N17l59K65J04k99J24J1o0
4059e6J28j84J86J5l21K19J27k05l1L28l21L38l29K20j87J59L9o4j09j58L24J91
4081C09j26m59N6J97J07Pj12K14k59J72j37Mj23o0L24q4j93P0K70k94K38r6m0
4104a5k1P7K9j51J86n2Rj03O1j25K1k05J77O4k06L59l34J99J61j07N4j93K30l7
$$ y = [8, 245, -51, 54, -222, 201, 256, -50, -137, -226, 99, -76, -146, 16, -49, 7, 201, -115, -401, 140, -206, 81, -247, 42, -8, -139, 108, 2, -198, -34, 56, 102, -6, -53, -70, -246, -33, -16, 174, -27, 87, 199, 141, 244, -22, 77, -439, -19, 112, 54, 8, 3, -32, -171, -94, -37, -55, 237, 19, -11, -52, 181, 56, 27, 183, -67, 70, 12, 178, -139, -128, -5, 48, 142, -81, 117, -51, 41, -103, -94, -36, 31, -45, -182, -99, -422, 33, 151, -7, -54, -123, -68, -193, -69, -47, 20, -32, 8, 60, 69, 45, -201, 167, 127, -17, 217, 347, 151, 101, -53, -359, 158, -201, 64, 168, -131, -7, 4, -56, 72, -112, 74, 89, -232, -13, 114, -91, -122, 206, -115, 223, -106, 114, -73, 86, 125, 61, -48, -206, 118, 309, 183, -276, -220, -23, 84, 91, -21, 193, -66, 106, -31, -27, -150, -210, 114, 30, -163, -93, 177, -117, 121, 25, -15, -36, 41, 70, -81, 105, 53, 62, -41, 20, -105, -84, -289, -112, -48, -254, 105, -229, -30, 131, 24, 78, -115, 115, 78]
4128G8j49J73l6n6O1k49L4J03m8L01j41Q5r2J4o2j23J42m2K74j97r2J00q3N8p
4153D6j93n2M45jj77j07j8%K5J02J8j26N0j58L18p8k36K6K0K18J47m08n7M5J98
4178D7R7p3j97j91N80j26r7N3Kn1p9M7K00m02K83l0j43M85l91J59m14J46j50K58
4202A3JqL8j28K84m52K77N2k03P9q3Q6j8J61q5J1j59O2J76k39K79k63K52k40J32
4227B5j12R0J8p0J80k10K79j06k49J33j25k91P76j42l06K34K7p7k39N7L4L31r4
4250A63j58j32K03j92K25j17n5J81rk49K76j17j41J35J25m7j25M1R6j98P0J64
4272A39m8j84JJ60Q6j82J86j83L3K83m26J48N9j63J58j90K09j40K25k51K75k45
4294e0l1J78l30K32p9J99j99J26N0J02M8j21j37n9M1O1k42oP8J21R6l6j00Q9j24
$$ y = [78, -71, 102, 66, 10, 71, -178, -144, -41, -89, 212, 71, 156, 64, 78, 16, -107, 35, -7, 267, 70, -22, 78, -5, 53, 46, -147, -199, 246, 245, 68, -39, -57, -57, -32, 70, 88, -38, 12, -146, 172, 94, -142, -116, -96, 122, 269, -139, -196, -151, 47, 144, 71, -126, -317, 263, 137, 40, 93, 95, 44, -35, 12, 212, -190, 93, 63, -80, 405, 14, 173, -241, -95, -245, 13, 14, 6, 44, -84, 200, -252, 25, 77, -126, -47, -130, -44, -62, 99, 14, 25, -134, -72, 104, -135, 144, -119, 133, -107, 25, -87, 3, 21, -49, 131, -79, 200, 94, -155, -22, -147, -438, 338, 196, -110, 124, 151, 74, -165, -108, -74, 257, 163, 5, -127, 76, -116, 109, -8, -63, 118, 109, -140, 136, 19, -122, 13, 138, 91, -34, 7, 103, -95, -25, 139, 91, -93, -92, 68, 154, -28, 158, -25, 8, 291, -135, 13, 72, -91, 67, -123, 86, -54, 171, -80, 195, -50, -81, 97, -233, -1, -80, 119, -80, 46, 96, 198, 246, 125, -12, -71, -30, 31, -211, -217, -139, -18, 78, 42, -58, 31, -93]
4319i3j61L89l27O7P1K90k21R1rj11O6o5l2RL19l05K77J28j61j19j88k8Q8j60
4343a85J61q5K09P9j23pl96K30J77j97J59K8k51o0R3J63l3J16n0k97N03k91J08
4366E1N0p8K74l21J00j32n3J01l5PJ86k0%p8j9j30K42j55P7l55L5K50J31r3k40
4391b05k7M68k61L12k35J20j87J01J90J4J1m73J04ln7O2j26K97k13J89p7O1j8
4414D7Q1r1j83K34j83j8J17J34m13J4J85J50j61Q7O8n7R6o7l3R7j6p1k08K85j32
4439c8J47k88K09k20K08K34Q8m21j12L56o5Qm7O5n9k88p8M06j95K91j58l8j51
4462a46L33N2j62K02j96j30J36j19J28J49j27o3k99K48p2L8R6n6J06j85l9J12
4484FR0KL3r7k04R4l93N60j4j52Q6N6q7p2J49n7L6j56K21L5j58p9J52K8j0j95
$$ y = [-93, -254, 135, -192, -125, -54, 236, 15, 106, 97, -14, 52, -13, -45, -36, 283, -22, 255, 383, 222, 103, -85, -113, -25, -185, -24, -109, 100, 179, 56, 49, -347, -117, 60, -137, 22, 50, -201, -261, -168, -5, -38, 78, 28, -269, 234, -57, 51, 101, 23, 297, -24, 76, -56, -109, -8, -43, -36, 150, 130, 130, 52, 33, -97, 145, -10, 67, -288, -253, -3, 128, 35, -205, -232, 236, -25, 287, 52, 172, -15, 86, 276, 290, 301, -172, -68, -71, -128, -66, -192, 105, -108, 81, 4, 65, 47, 128, 37, -146, 88, -95, -113, 4, 138, -275, -261, -76, 74, -87, 0, 68, 11, 107, 40, 7, 104, 88, 17, -191, 94, -38, 109, -179, 30, -190, 18, 252, 340, -81, -193, 163, 98, 106, 59, 124, 65, -223, -301, 105, -90, 201, 43, 5, -146, 187, 239, 77, 279, 83, -47, 89, -30, 98, 247, 120, 57, -242, 6, -66, -28, 68, 12, 118, -67, -106, 6, 96, 98, 131, 34, -170, -76, -469, 91, 77, -75, 11, 67, -20, -92, 57, 0, 36, -120, 101, 136, -22, -101, 51, 79, 69, -126]
4510a26j46K58kM2J9Q8j62k3q6j4o6L88o9j0N4j45p0j11K56r6m6j28L16m21K27
4535g3k0p8rK87L54m94N0q0R5p4Q8r8l7M5O8j19J91j92J01o0o9J13L1q7J47j97
4561a17l4M30l05n8k07O11q53N59J1Q5k10jK25j98J01J97m25L82j61l08L46k11
4583a41N6J2Q8lJ35j11j77J29K98n3k71n3oJ88j75K24rl17K11j99N07k03j49P7
4607E8J59k57rj33L78l70L50k31R6j39q4J89Q3J65k90j3J4j51J00J05j75K32j63
4630h6rJ69j56M3j68R6N4M1J33R1k12N4J0O7j27M0J11k59k7J64o9P7j22K2NR7
4656C9j34K49k39M29o02J24K74j80N6jj69O3J11n3k58M17k19J57r2r8K40k20J84
4679G8j93J22j46K76P0J1l62J82r9M4Qj60K99M8k78p9K76Pj34J8J28o1j28l3J03
$$ y = [-126, -272, -14, -16, 26, 45, 133, -29, -52, -138, -152, -218, 170, 101, 91, 145, 0, -70, -181, 75, -21, -67, -195, 121, -300, -73, -93, -171, -180, 107, 461, -33, 17, -63, 32, -42, 46, -52, -89, -44, 24, -95, 96, -96, 5, -55, -124, -11, 20, -67, 80, -117, -151, 279, -26, -84, -291, 320, -533, 26, 37, 122, -88, -89, 136, -62, 39, 236, -189, 193, 32, -276, 70, -141, -85, -73, 15, 12, 147, 36, -141, -12, 286, 233, -38, -91, -97, 91, -84, 140, 131, -186, 25, -174, 333, 130, -19, 58, 217, -40, -49, -182, 196, -174, 176, -55, 41, -98, -182, 7, 90, 255, -35, -48, -34, -185, -85, 20, -155, 77, -86, -95, 74, -82, -39, -207, -111, -57, -16, 117, 208, -4, 50, 60, 127, 0, 40, 151, -108, -135, 29, -40, 37, -85, -63, -58, 39, -95, 154, -85, 344, -258, -134, 140, -40, 16, 15, -154, -91, 20, -33, -291, 126, -93, 64, -28, -126, 114, -106, 78, -115, 7, -139, 137, 207, 218, -144, 38, -61, -17, -9, -169, 130, 178, -100, -179, 97, 104, -30, -12, 116, 55, -73, -106, -3]
4704cJ4k48J67R7j56R1m6J38n7k32K74l28M43j57j1lp4Qj7J1J54lj54kM9K8j01
4731a18N6J23J5r2Q1p2pj79J73Q6k70J49J08r0Q6n2J89r3l91K17Mo0K75l67J39
4756i0l9rj87K38L35l11L8J12k74L80k25l4k57J75L21j03j15n3L82l60o5N1J94
4779A04j00l38K98K45k92J74Q2j15j9k62M18j60J9j56m5J96Q6j60J14j98K41Q9
4801B21l25J92J3j94m6O9J36mj62J78k76J25K37J10j33Q3k21J20q0j31l5P5K28
4824A80j54j58J44R7k31M62k70j8m9j13O0R3J33r1j7q8N3ll55M84O3j03k34R2
4848b3K94j92p0K2J8j42mJ86N3q2J13l49j88L67k1P9J27l64K74q4k29L28o9k09
4872a65K46o3j54J39Q8j06m8K09j34oJQ3Q6k81R7k43J88J86k5J47n89K12J1K31
$$ y = [-3, 11, -237, -70, 27, -129, -38, -84, 54, -3, -235, 39, -289, 154, -3, -14, -17, -91, -83, -100, -89, 65, 62, -92, -94, -45, -17, -118, -62, 61, 76, -16, 65, -7, -14, -193, -20, 66, -204, -55, 53, -37, 49, -3, 186, 93, -298, -81, -77, -137, 138, -229, -90, -129, -138, -325, -87, 248, -63, -25, 87, -187, 193, -32, -66, -323, -148, 173, 70, -45, -98, 284, -76, -141, -90, 104, 4, -334, -36, 209, -83, 91, 173, 58, 39, -223, 195, 35, 54, -102, -147, 49, 135, -25, 89, -109, 132, 221, -104, 88, 101, -93, -139, -70, 66, 62, -100, 78, -198, -73, 164, 274, 141, 224, 3, 123, 43, -88, -123, -48, 180, 26, -132, 12, 109, -122, 340, 70, 52, 3, -110, -50, 43, 176, 85, 68, -20, 33, 30, -325, 159, 222, 119, -115, -23, 271, 79, 9, 31, 49, -93, -97, 89, 142, 60, 173, -176, -364, 3, -18, 61, 188, -176, 98, 14, -215, 113, 44, -165, 81, 18, -136, 3, 91, -15, -63, 146, 12, 6, 7, 90, 176, -105, -8, -251, -63, 123, 98, 245, -344, -132, -121, 110]
4896A10j86M2L9r4P9j14L71m42M54j49l56J75j74J57j05N5K79N9j39q8k9k12J67
4919a01R5l5J0J08k14n2o3L56J67j33J2N5j11j60J97l05P1K11l37P8L2J39J39
4942A59m78K38K35j72kl5k1J3M76m33k5L1k23J91P9M5k27L25j83o0l42M23j85
4965a71J09Kj01J62k6m3j69M84k30N6j5j34N0Q8l8o6J19L1n0l6J28k40m5j11K00
4990d6j01K5J39j94K11J07K8j27O5r9m2P1K1p6p7K72k33K90k92L1M1k14N2n7P9
5015a26J09j63J11M8j28J35m7qj03K02j21Q8J0k7%Nk0P3LN1k31L2J4kK20j29K3
5042A9J0j99Mk8M3J67R1Nj98j82K65P1L2k39L39j68O3m1NK7k13RK71j88J31l12
5068b16L64k56kK65j89R3r7K08j21o8l3P8Jjl00P5J68k07K32N5o6k00M97k71J20
$$ y = [110, -76, -34, 5, -89, -10, -124, 247, -195, 259, 110, -246, -71, -245, -88, -193, -138, 141, 200, 61, -27, -56, -268, -101, -6, -41, -31, 77, -137, -189, -252, 104, 271, 138, 150, 205, 94, -66, 131, -174, -103, 108, -229, -151, -119, 20, 159, -319, -81, 154, -18, -20, -55, -76, -63, 413, -20, -45, -14, -237, -46, 33, 78, -149, 176, -7, -67, -409, 14, -171, -62, -60, -161, 1, -25, -68, -237, 247, 17, 73, 58, -76, -26, 62, 24, -42, 77, 108, 58, 22, 150, -90, -135, -246, -46, -147, -122, 17, -177, 34, 141, 169, 42, 107, 8, -34, 37, 58, -18, -95, 177, -56, 234, -58, -27, 14, -200, -148, -205, -126, -17, -180, -69, -21, -149, -14, -61, -69, -172, 30, -91, -3, 7, -20, -20, -15, -35, 38, 41, 92, -139, -107, -93, -95, 125, -4, 19, 29, -170, -166, -194, -151, 16, 107, 112, -86, -268, -3, 68, 100, -139, 200, 32, 95, 54, 59, 86, -127, -118, 153, -35, 96, -216, 148, -108, -110, 155, -34, 59, -38, 170, 49, -19, -52, 26, 27, 26, -274, -199, -31, -238, -6, 49, -17, -217, 280, 9, 129]
5093A29k9m1R3k2j65K63k61k01L07k09J19J84ql65N4L46j36o7n1N0P9j97J83l79
5117c24L46P2J5k07K31j94L54l66l0j9j3K94j71q0J35J37j86o9J29Q4k0kk14K08
5141A10p7P2n8M7on01K72K15k00K38j81J69m18L35Q7j89J59q8M8k36R4J70k3O4
5165A03j78N8L1j53K42M9r6J62j31Qj66j50J90K54l60J01r7o3J01J40k59N07l08
5188a5J83k03K91k09m2m0N2M6rj54J47j3l07K21Mn5l7K04p3l0l2O9k09M03n4k19
5214h1J94n9n0m4J56L5Q6l68j2L02j33r3Q0J72j25Q5k48l8L01L1k14r4O3j94J10
5239a38M20p7k42k4Kl7K69j59J21k65J6j0K72j43p2j33m7L32K28j48k81N9J81
5262A24n4j52J4q3J98k99K80o2j52J92Q7k58L03j20P4j38L1j24K42k19M4J42Q
$$ y = [129, 100, 59, 152, 130, -35, 228, -33, -234, 73, -136, -17, 167, 159, -206, -152, 194, 58, -9, -60, -10, 69, -128, 55, -324, 22, 94, 109, -98, 133, -61, 293, -73, -103, -122, -135, 159, -12, -92, 43, 180, -6, -75, 54, 138, 118, 116, -98, 110, 33, 105, 47, 94, 88, -413, -141, 74, -126, 112, -69, 100, -318, 17, 104, -85, 74, -14, 34, -202, -108, 62, 39, 103, -75, -17, 14, -139, 103, 152, 56, 218, 87, 95, -71, -221, -31, 223, -137, -36, -133, -196, -95, 45, -214, 293, -15, 168, -35, 256, 47, 5, -35, 17, 63, 54, -100, 47, 34, -273, -52, -48, -103, -140, 64, -9, -39, -71, -2, -211, 192, 138, -81, 113, 54, 4, -40, 116, 151, 237, -131, -143, 159, 26, -67, 13, 185, 60, 145, -103, -141, 160, 191, -23, -117, -54, -248, -138, 282, 205, -37, -61, -59, -96, 173, 14, 135, -130, -114, -124, 148, 5, -67, -200, -247, 85, 313, 165, -116, -57, 124, 70, -82, -68, -151, 47, -252, 28, -34, -186, 6, 93, -165, 138, 18, 92, -46, -15, -139, 103, -116, -72, 70, 78]
5285G8l75L70o8J85j82k49L29J53m01R9Q0R3J33l59K31J6J9j18N4r7R9k06O9K99
5309B52m39L17j83j5P3j65L19l16m4J78m0J61k7j43J33k50K48m5l6o7O2K7K40
5332B40m83K99K0j10k3K36j32j34j42M01k70q2M30l81K87k46p5K18J8j88J60O9
5354A12j8q9J01k75J80l2j85l9J44J58M9o3j62O8O8K0J23k73R1K3O5k10K71j15
5378A2n6K18r0p7k1J10J39k70q8O0o7J86Q1k32K83k35K39j5l18j01m4M33k33J28
5402D2J69k86J40K93k07l51L02Q6k34O5j7n6j1J03j38K11J81n31J22J42LN4nj32
5426e5K04j49r9k2j10J03J10p7K9J27j70O4O2j04O8Ml5L0q0l3j44M04j33J04k6
5451G2j32K05K2j23j14r0j21M39k46Q1r4O6K62p8l05j9N6Q6J80k31Q0jJ48Q5j15
$$ y = [78, -297, 73, 5, 190, 8, -241, 88, 241, -160, -61, 19, 112, 245, -114, 117, 133, 152, 34, 88, -9, 90, -116, -47, 252, -187, 130, -53, -68, 5, -160, 159, -157, -201, -23, -63, 98, 71, -72, 61, -189, 59, 14, -22, -89, -27, 0, 240, -243, 56, 76, -34, -57, 179, 47, -87, -229, 172, -98, -180, 250, -131, 156, -90, -165, 53, 71, -117, 43, 112, 94, 5, 106, -169, 11, -21, -206, -245, -101, 57, 106, 43, -119, -51, 17, 37, 160, -113, -22, 1, 66, -144, 127, 12, -44, 174, 84, 7, -14, 96, 235, -35, -123, -63, -130, 56, 137, -95, 188, -47, 192, 177, -141, -242, -286, 147, -86, 42, 211, -75, 65, 358, 151, -200, 102, 188, -46, 19, 2, -54, -65, 38, -100, 111, 292, -239, -117, 25, 28, 82, 77, -55, 149, 0, -99, -121, -231, -128, -18, -95, -66, 61, -109, -45, 17, -87, -19, -15, -50, -20, -100, -133, -277, 127, -6, 98, 72, -60, 145, 167, 44, -70, -160, -281, 158, -88, -7, -101, -35, 227, 149, -156, -175, -119, -33, 147, -84, -4, -5, 143, 228, 113]
5476A13r5J37l27j13L33ll1m7J54J1k30K2J89l01K83r8j05K7J59P7r7n4J55j54
5500ENk06J68O4k0J68kj6j42N5J2k24N3j0K3L6r0O8M1J47l01K92l06M09P7n07
5526b01J12j4Q5J11Lk35k0J39j94L21j41q7J27J15P3j89J18j31p0k39J83J12M4
5549B2O2r2R0p7r7J56j9k88K98J1J64m64K03j99J46K9M04n76K10p9K0op6M75k89
5574B8L06l63K21j53k26L44k8P6Mj65Q5O5j88L1k5Lkj07J93l73L92Rn9p8m6k9
5600h5J20j30L98k56Nj3J2q1j15Q9k4O1M7j41j8L40j63M2k21J64M8p4j09J81j88
5625a11Q1R4k39K28N6o6o1Q3K5j80rj8K9o9J88j72J87r6R1pL7j04K39l05L7N9
5651cr0p4M71k34Rj43K72k41l1J7MK8k03M34k27O4O3p6k69J8l4M14j59P3j81R9
$$ y = [113, 18, 155, -172, -285, 48, 45, 14, -33, 121, 132, -98, -76, 113, -188, 95, -3, -108, -81, 78, 155, 58, 4, 159, 5, 10, -196, -28, 36, 16, 184, 182, 166, 24, 79, 91, -133, -80, -90, -67, -31, -121, -53, -12, 135, -166, 126, -180, 229, 306, -201, -89, -103, -18, 93, 96, -139, -159, -20, -214, 107, -34, -121, 6, 121, 194, 5, 123, -8, -78, -317, -134, -22, 22, 84, -8, 82, 5, -92, 64, 45, -243, 55, 66, 230, -234, -31, -230, -84, -55, 349, -227, -17, -96, -76, -82, -158, 317, 28, 334, -29, 192, 39, -187, 157, 129, 205, 209, 44, 129, 194, 6, 37, 12, 15, 13, -94, 99, -274, 118, 127, 68, -10, -56, -85, 35, -95, 303, 47, 52, 39, 51, -30, -145, -56, -80, -19, 28, -113, -131, 209, 46, 88, -133, 31, 79, 5, -104, 77, -111, -30, 64, -175, 53, 109, 43, -18, 65, 90, -90, -99, -117, -88, -157, 31, -141, 46, -50, 41, 34, 71, -33, 206, -99, -62, -3, -93, -167, 304, 70, 79, -64, 208, -33, -64, -47, -43, -15, -218, 216, -11, 53, 116, 40, -229, -211, -245, 169, 10, 83, -98, 1]
5677Aj11K16j54K78l94J43K2o1P2J70k83J29j07J62L9j13J7J54k05L2l1Q1m6j8
5701gJ22l15J63pj0j75P4P3rM9j77L76k63j8j06N41l81j50O6K0JL14k40J51j49
5726e7p6L21k63j24J68Q5M1J30k21R1j23J27L5j17j57k6N0J57l5M9l36J88J39
5749D6J6n6J52l28J66p6P9K2M2o0Q8k76J75J6k1l4p9K03l95K44Q6j6k6J15j88
5774a05P7q4j77J50L58L0j76K0N3p4J54J8l94o8J3K97O6j95j20N3L71j81k39M16
5798B63k92K46l98J56k36m2L06J86N1j87o6N1n9P5k22QJ31N4j64pM7J29%k3n2
5823d5j0P4N3j33m5Q5K08J3r1j78K0P7m9KK73k54n0L0P7J16j26j06L5J27J33k63
5849b7J18j29j01K65j54n5J93k33J45l0K5K9j84J76q3p4K98j53j27M4M5R1j15
$$ y = [1, -110, 106, -48, 230, -164, -21, 1, -60, 12, 182, -101, 28, -79, 83, 122, 9, 26, 180, -25, 7, -24, 57, 11, -7, 115, -200, -37, -44, -54, -229, -155, -82, -91, -42, -219, 157, -106, -124, -230, 311, -70, -220, -154, -134, -133, 181, -59, 92, -57, -133, 188, -75, -199, -31, 54, 95, 225, 4, 95, -28, 99, 134, 17, -140, -166, -116, 41, 6, 55, -281, -93, 46, 62, 6, 158, -170, -4, -80, -1, 21, 63, 3, 91, -185, -10, 6, -15, -49, -128, 75, -320, -76, 10, -6, -32, 83, -105, -28, -112, -289, -139, 219, 249, 73, 93, 146, 72, 226, 244, -150, -218, -205, 92, 158, -37, -157, -104, 267, 86, -153, 263, -29, 217, -181, -25, -261, -303, 3, 189, 240, 53, -13, 38, -21, 54, -168, -160, -29, 25, -139, -146, -99, 30, 30, 7, -45, -55, 19, 72, -61, -106, -21, 187, 200, 109, -69, -49, 28, -21, -19, 254, 0, -50, -20, 57, 173, 47, -59, -24, 103, 236, -27, 91, -38, -139, 126, -28, -83, 110, -123, 22, -8, 17, 46, -138, 38, -45, -119, 179, 26, -101, -57, -12, 79, -36]
5872c6j9j81L39k3k65L30n1j89L5jL88l63j61L86l09k4J89J50j04l04M9K09p4
5895b9m5j13K38k1N7L6k98N41l37K2QjJ39k2j72J02k12Q5J20k34K50j17J49O8
5919B14N3k12j76J11K46k67J59j47q0q7K94M7j39Q2P8l05Q3J34j70L67k43j08
5941f6K80k99J08n3P1K07n36L91j86P4R4K66n86J08P4Q1N6j88J04m9K29K3l09
5964a06M3K08J8mn9j07Q1J3J0j09K3J58l3j14p9q1J25J32M2k64J1J78m0j11q6
5989a51P1K51Q8k85R3j90J64j7j32k6j1n6J50J76L0l3K14m04L1K15l17J97k91
6012b33L69j79K67l98K38lk49K62J5j06j26K3K81Qj72P4j31q1J25l9K82j72J0
6035F5P9k68J37o3m4n5L82k06r1P0J32k16r8J43L8p3pM09o87M32j9n8j03N1rj72
$$ y = [-36, -55, -236, 103, 80, -185, 145, 94, -95, -60, -61, 327, -36, -197, 189, -120, -144, 45, 195, 91, -213, -164, 45, -29, -74, -187, 51, 30, 87, 123, -175, 366, 29, 51, 59, 58, 197, 175, 3, 105, -107, -22, 98, -136, 114, -3, 146, 214, 267, 55, -121, -10, 236, -31, 128, -19, -99, -186, 108, 155, 16, 98, 176, -129, -46, 88, -82, 285, 42, -66, 214, -85, 23, -30, 41, 248, -288, 103, -83, -9, 85, 351, -235, -127, -53, 28, 84, -104, 0, -49, 180, 203, -106, -63, 145, 163, 159, 100, -7, 74, 87, 97, -12, 11, 169, 136, 22, -57, -138, -13, 119, 161, -103, -92, 86, 46, -65, -151, -80, 171, 259, -26, 67, -123, 41, 24, -108, -134, -145, -201, -51, 125, 155, 122, 336, -68, -37, 178, -139, 58, -233, 136, -43, 224, -174, 64, 61, -188, 74, 89, -17, -143, -120, 161, 169, -3, 71, -60, -141, -16, -55, 227, 55, 65, 144, -124, 13, -50, -94, -149, 233, 27, -64, 6, 138, -78, -176, -33, 5, -68, -75, 334, -353, 79, 60, 2, -101, -50, -59, -231]
6061b31K64o8K1K10k26J64%r9n3j97Q1L7J54q2l5j0J79j62J77j34J62k76J49k30
6085b05K18j51o1R6L1Q4r3kO8j4N8J21k09M1j03j15P2J77m3n4K18j54l5j41N3
6110a43L02m7k15m0J03K25l69J26n3J06K46r3k24k43L95k25P1P6R8k42J09P7j19
6133g9J11J11k5j69K3Q2L8k51K49j29k5J96K04n16O6M1J34J23j97k11J14O3n4
6156a01K24pq2j5l75K76J98k78J1K8K23J24j84Q9m1l14Q0l8j02M93l4j17j87L0
6180i9J17k0rK6j6l9j34J0O1K05l92K13L61l58K57Q2J8r2j22j25nJ83j85j09K42
6205G0k11J95p0J3p0n2Q6J72k50L6m5K33P9j47L00k49j65K10k11o0J34k91K53
6228d0N3L9k1j49J26n8N6k46K19K2k74L62q6q8l4lL4J09L6j69L32k73J3K34j70
$$ y = [-231, 33, -35, -14, 196, -30, 134, 134, 35, -18, -215, -134, -97, 57, -25, -60, -70, 109, -53, 124, -10, 152, -124, 25, -205, 13, -138, -199, -103, -72, 12, -81, -83, -15, -29, 29, 150, -59, -18, -121, -236, -164, 13, -30, -84, 134, -20, -55, -196, -143, 159, 112, -103, -143, -40, 185, -184, -58, -111, -5, 241, 148, -76, -319, 76, -149, -78, -2, 96, -146, -37, 40, -79, 32, 143, 118, -51, -28, 54, 92, -159, 90, -39, -64, 132, 336, -180, -114, -73, 61, 184, -13, -224, -110, -47, -101, 123, 116, 34, 19, -356, -80, 118, -160, -149, -121, 102, 226, 42, 131, 90, -224, -144, -182, -284, 209, 175, 58, -129, -99, 18, -2, -11, 15, -1, -40, -174, -164, -103, 102, -290, -77, 284, -74, 183, 265, 283, 191, 69, -56, -61, 122, -63, -172, 70, -141, 54, -16, -3, -73, -125, -39, 133, -117, -81, -126, 107, 186, 39, 339, 90, -75, 135, -76, -136, -2, -293, -40, 13, 52, 31, -118, 8, -50, 6, -240, -21, 1, -273, 89, 3, -85, -119, -122, -88, 21, 57, -112, 220, -53, -40, 194, 24]
6253B4p1J96j19j5jP6K22l95K04Lj34o2J36k25K63k38J4q3J38J38N8l6l41L21
6277G3j89K7J24j42K32l36N4L98l90R6J9K35l38R6K55k52Q2K3j39j64J90j19K35
6300G0K4j66J54O6Q0l44J43nm8K78q0l53K42j82J68j45p3K32j00J19P7l7k48K53
6324A25J32l61J96k39Q5J40n6N8q8l1p9L7M0N8k18K64J27l5q3R7l01M9J15j77
6348a45J18k8pQ7j45Q5j04J47J3q4J21m5K5k79L15j09L4n3J30m02N46j69J03j16
6372C8j71J66L1j88J46O5n4jJ37k19rK33q5k08k6L07j84rP3l7J93l75J87j25J11
6397dJ27n4N9J97l04j67m6M27l14O5J29j92r7M74m95K60l1j98N7J07op5j1Jj71
6422b62M36k01L79o29K52K13l83M61l15P0p7K49k28O9N7l5j31J54k18J28J0j4
$$ y = [24, -47, 149, 30, 15, 14, 90, 312, -83, 121, 124, -10, -72, 64, -161, 102, -136, -122, -205, -67, 71, 129, 93, -248, 73, -116, -89, 35, -107, 125, -211, -157, 241, -149, -53, -34, 201, -137, -41, 214, -38, 44, 67, -72, -236, -46, -165, 70, 94, -72, 82, 148, 228, -116, 27, 22, -26, 252, 172, -181, 61, -121, 47, -98, -171, 61, -39, 80, 157, 120, -128, 125, 257, -104, 92, -147, -62, 78, 22, 80, -8, -39, -118, -81, -41, 17, -201, 63, 190, 155, 72, 169, -132, -83, 32, -145, -27, -55, -62, 25, -120, -35, -139, 8, 21, -63, 58, 13, 38, -241, 74, -35, -1, -54, 76, -326, 220, 51, 154, 38, -133, 33, 64, -124, 22, 87, 33, 32, 169, -50, -59, 174, 89, -119, -145, 162, -22, -31, 42, 5, 198, -177, 10, -115, -4, 123, 69, 128, 325, 21, -146, -192, 235, -79, -14, 115, -77, -174, 300, -195, 65, 34, -164, -107, 0, -6, -81, -92, -91, -262, 174, -27, 352, -277, -25, 188, -195, 266, -49, 21, -56, 193, -35, 34, 91, 56, -75, 79, -139, -11, -1, -15]
6444a5K39j45O0k54J92q7jQ7k16J35k80K68m2R0J37R2j95j36K72j65J2k70K03
6467a9K89l45K57k44K4J48j77P0J04j55K58j3k6k89J37l49K88nJ71J05k67N4J01
6490A17o6m4J43K27l24n6J19j41l5LJ81p3p7k06J75J25J14l46J77R8o0M5l05K73
6514F4r6J83j90M1K10k56O3O4K09m12K07j18J38l23J43K46k62J99j77N0J25q7
6536B1K14q8k74n2J40K48L2j39J70l1m59K28J10J33K8k60l2j69J08%J12M2k01
6559a19L0N8J29k2L7j33j23p7L12O2k10R0K64l63Q5J55l17J43jP2l18J46K83l64
6583a81J82p5N9K3oJ73j21J2j16j3j48N4J27J77l09L6K76k57J82K3k78K35n4L5
6607C6J60j31m7J12k14j5L64n70M17o2j10l8j03K59q5jN2J39j61Q0k33J12O2J32
$$ y = [-15, 224, 79, 139, -115, 77, -10, -11, 76, -140, -5, -285, -17, -59, 31, 168, 260, 65, -71, 201, 36, 48, -222, -19, 270, -75, 182, -62, -38, 110, -67, 3, 107, -48, 210, 197, 171, -118, 19, -330, -42, -47, 124, 229, -38, 16, 117, 51, 7, 150, 377, 53, -3, 116, -25, -60, -57, 124, 51, -26, -232, -57, 68, 182, -164, 13, 111, 51, 96, -209, 64, -32, 151, -39, 2, 212, -44, 19, 83, 292, -120, 87, -31, 107, -216, -73, 173, -89, 110, -67, -17, 108, 21, 235, 147, -127, -179, -39, 209, 241, 102, 272, 241, -218, 10, 120, 253, 281, 21, -11, -180, -72, -72, 40, 82, -119, -89, -31, 98, 76, 113, -20, -143, -220, 92, 154, -56, 34, 298, -65, 20, 175, -142, 1, 0, 72, -246, -100, 183, -181, 1, -74, -15, 8, 2, 175, 54, 66, -50, -63, -211, -157, -30, 147, -162, -126, 150, -107, 75, 98, -180, 55, 1, 36, 196, 65, 18, 130, -84, -99, 265, -305, 112, 50, -60, -98, -201, 58, -27, -28, 24, 163, 2, 82, -151, -39, 23, 155]
6631A55j64K09j11k63K32K15l69J94j31L7J5j02K44j26Q9j54K07N9k57K32k05
6652Fk46J42K31j71Kn6J15m6k35K66q7J88l6j04L1j71J13R9j2m5K15r0j53J61
6676A17j21N9q2j26L94o3l58K01J02K17m96R8Q5j41K72k29j1J10j03L8K69j62
6698G0q8R4K8m10L23p9o7q6J43j51N00m01Q8R6L6j37j37M04m22P0J78P3l33K70
6722F2m9m5J02l30L86R2J6k03M4k83Q9K83j77l1j01J56J81k24n2J83j36J83k58
6745a12J23L7p6N4K48m19J17j93J14K1K1m9pL6N1R6Q2k62j6l0p3L4J26k58K48
6770h7l1J85l9m6j06N20m34O8M2pm9M4Qj67n6J29r7R6J31R3j55Q5k98J45j24K38
6796H8J4k38K31k06K2lQ4K43r2j33L5P2p8j44K88K4k16K16l65L85j26m9l5J43
$$ y = [155, -9, 200, 89, -174, 58, 273, -96, 98, -33, 4, 19, -83, 161, 35, 124, -30, 177, 236, -21, 211, 6, -240, -98, 133, -38, -36, -92, 23, -23, -258, 8, -79, 109, 73, -31, 0, -171, -58, 41, 29, -16, 199, 109, -44, 117, -4, 55, -27, -153, 241, 178, -180, 21, 123, 340, -156, -58, 27, -114, 158, -71, -82, 28, -75, -37, 232, 70, -18, 76, 104, -306, 17, -62, -129, -215, -72, -223, 277, -124, -36, 60, 96, -41, -178, 226, -196, -126, 52, 125, -208, 62, 13, -32, 70, -260, 126, 218, 234, 31, 75, -208, -119, 164, -13, -44, -145, 11, 192, -32, -84, 99, -37, 146, -112, 11, 48, -28, 26, 274, -145, -28, -221, -107, -86, -65, -114, -121, -85, -34, 62, 144, -118, -134, -164, -237, -203, -77, -335, -87, -118, 67, 28, -18, -124, 396, -38, 30, 72, 65, 16, 60, 68, -99, -155, -26, -123, -27, 104, 197, 42, 127, -171, -26, -150, 88, 102, -136, 95, -111, -89, -92, -8, 235, 143, 10, 45, 117, 39, -105, 183, 207, -9, 207, -158, 227, 101, 52, 17, 160]
6820A60O7m04J48l19L23j6K07o6k63P2j94K93L8l12J58Q3J98m55j8L98n6K7P2
6843A41k98M90l46q2J84j01P9k55L49ol50P1J4P3NL8l7n0J76Q0l27j36pK62J48
6868A15L3j65R8o2M9Lj15j43N4J62j10K75J02k37k15K03q6l1P1P8k74K19k89K09
6892e6pj2J08m1q6O3K08q5o8Qj11K7k46O9L05O4n6p3M9n6Mr5K46j27J23n2l25
6919b22L46m0k26L09k42N4J36j06p6K2q6K62k18j89J50L9Q7j04J33m3n5P3J57
6942A61j79K73j43k28K27m1pQ6j80L82m00K82l52L3J20j1J08m4j64km1K08j85
6965i7Q1J2r7L7J5j10J62l5L0m4J52k27J1l5J90o1p1K41j49P8K8Q0l36M24m47
6990a68J44o1m9k9L64k91J06N1Q7J55m59K21j66O6j8J92j47K4L3O7j79M3M4k6
$$ y = [160, 227, -177, -29, -348, -25, -41, 166, 100, -163, -91, -285, 8, 46, -266, -108, -25, 173, -282, -300, 98, 42, 69, 141, -157, 333, -13, -95, 89, -12, 67, -188, 161, 155, -195, -124, -110, -37, -32, 6, -31, -81, 95, 175, -152, -288, -295, -33, 115, 148, -17, 81, 19, 68, 71, -44, -187, -133, 29, -81, 194, 296, 59, -156, 47, -39, -70, 1, 79, -195, 24, -265, -56, -63, -75, 33, -8, -94, -31, 177, 92, 24, 32, -79, -52, -298, -229, 76, 140, 84, 11, 60, 4, 8, -87, 159, 32, 155, 103, -222, 124, 84, -142, 167, -75, -21, 115, 9, -67, -45, -131, 131, -87, -276, -126, -87, 0, -104, 29, -14, -69, 4, 161, -18, 255, 112, -116, 111, 70, 63, 149, -31, 351, -49, 233, -119, -86, 34, 23, 131, 87, -77, -79, -120, 88, -97, -16, -4, -101, -64, -49, -159, 3, -32, -2, -46, 106, -121, -110, -145, 45, -16, -87, 154, 5, 83, 111, 191, -145, 279, -168, -24, -85, -134, -163, 201, -90, 16, 67, 154, 309, -150, 71, -95, -29, -47, 145, -2, 22, 55, 122, -57, -14, 30, 4]
7014DJ34k22N2J56pJ36n4m6m30M01j07j26K23M4j73J10k48Q2J04J63r1n2j52O5
7038c4K83l97O5P3J31j49k64L00R8j80L0J27j1j37J78k64L06m16M35j6j49m7j5
7061e3o7j45L82k28K69r6n5r9p0L39p8k3K8M8p1j03J20n2r9K36k67J00j77M7k4
7086a38MO1L4Q6m9KK79o33m7M30J46k83J3K91j06J0k19NJ59n0K10j74O2mk39Q2
7112f8J16l4J01o7k35L26l27J90j17q7K51k43L12J0j03k91K93n8Rk6R9k20L27
7135A58j41J38j89J21J25j72J6J37j91J10k48J5J41r4K27j66R4J44k41J47j57
7156b6m6P6J33Nr6J40k84Q7J70M5k2j0j89j18K43j94J63j11k62M35k44J56j3r3
7180e5kR9k63L58j02J51j94O8r4L3l2J26j3j54K10l59P2K22q1j25N1K28j30J11
$$ y = [4, 138, -84, -32, 124, 117, 253, 199, 153, -277, 124, 17, -109, 114, 158, -15, 95, -153, -71, 33, 196, 105, 53, -99, -34, 249, -148, -83, -10, 121, -28, -292, 8, 106, -74, -44, 83, 72, -65, 113, -151, 155, -261, 174, 158, 9, -38, -53, -120, -265, 117, -111, 158, 62, 7, -92, -162, 177, 99, 76, 104, 152, 81, -22, 98, 46, -53, 183, -84, 16, -161, -114, -138, -134, -73, -39, 47, -2, 0, 279, -354, -401, 29, 175, -108, -95, 196, 90, 100, -119, -114, 45, -5, 205, 31, 93, 89, -150, -68, 48, 14, 115, 48, -187, 139, -188, 2, -115, -202, 49, -194, 118, 128, 25, -266, 27, -31, -22, -48, 51, -169, 158, 17, 155, -34, 87, 212, 40, 56, 193, 2, 112, -136, -121, 20, -74, 153, -13, 81, 225, -16, 131, -26, -72, 4, 137, 142, 46, 186, -98, -11, 159, 204, 182, 172, -17, -135, 108, -86, 77, -34, -296, 139, -105, 51, 38, -55, -57, 42, -221, 137, 35, 186, -8, 60, -34, -1, -33, 93, 80, -74, 136, -223, -151, 71, -10, -135, -84, 144, 14, 125]
7204A25J19k89J44M1j1nJ6l02Q6J1L0K46l53L57k46Q3J54j58j6J03n4Jr4k3K55
7229B20q9j34j62J08K89m11M28m22L12l96L57m2k5M1j09R8K00l19J06j43J88n9
7251C6o5n0J5O5q8M8j61M29l60M21n15rJ08Q4O3J17k46p0J93l4R5k43L17l2j42
7276b4j0M7j27K38o6j51j25K51K8Q6n2K7J42j86k15P5MK63j77l60M48k61K00k06
7300a51j9L04j63L19l93M2L0l8Oo4K44k47P6R5L2J6J14j41j90K60j91Q1k50L07
7324G9j5J5K12l10J99l22J10j46K98J49l08K4n6R2Jj96L65k69J09P3j14Q2K66
7347C38k60j65J40k27L61m24J61J24q4m3%j37L30o5J49l66L65J38l92K46J33m90
7369a68M09l65J20K66l34L6J21QJ5j84q2J47J16R8m58j03L30PJ35K0j94j1n0K02
$$ y = [125, 244, -45, 99, 140, 129, 124, 140, -162, -76, -65, -35, 211, -142, 215, -31, 52, 206, 48, 32, 135, 81, 82, -12, -35, 220, 131, -3, -165, -57, 232, -179, 249, -173, 139, -257, 100, 58, 33, 74, -35, 63, 263, -56, 50, -93, 95, 36, -29, -79, -64, 1, -87, -39, -200, 229, -131, 290, -225, -234, -126, -42, 21, 138, -108, -178, 15, -19, 76, -167, 150, 118, -24, -34, 13, -114, 124, 58, -93, -218, 33, 61, 147, 95, 122, 264, 78, -137, -62, -58, 205, 28, -332, 116, -145, 55, -151, -170, 134, -29, 290, -103, -61, -31, -69, -63, -127, 117, -130, -54, 41, 73, 89, 203, 62, -128, 132, -59, 22, -228, 79, 64, 79, 291, -19, 180, -142, -32, -178, 120, 269, -39, -15, -71, 21, 22, -174, 191, -78, 31, 104, -10, 72, 338, 78, -87, 53, -174, 187, -237, -76, 48, -36, -79, -79, -216, 114, 49, 198, -168, 197, 335, -57, 189, 322, -168, 241, -124, -4, 262, -72, -36, 85, 93, 108, -76, -158, -11, 105, 203, -255, -358, -28, -21, 114, 134, -60, -71, -121, 81]
7393H1j5j56J86M43l19p4p0j2p8K29k69J85M2j96o2L7J34j1k38M04j38j12K38
7416B29j50k23L69q6k26p7O3J65n3L5R5l32L82l52P2N4J10k0j91J50j57K52j38
7439b9J15p3R4J99n20K04m1q5K7r2o2J02J73k77J48J77j20J80k63K33J8l09k2
7462b23J34K06j9n0N3j45k86L56j30j71l6L93j46j06O8N38l81MK5q1j1n6p5J05
7486c4j24R5J31O0k90K11J27J1j77j3J4m3J27j62n7j80K73q9K53l34K63J46j53
7509E5j20K90l11L69l82P3Q8k0k34m1J83n5K40j79J99L3j06p4p7n6J50J59j22
7532F2k30K28n3M7p1k47K92R3m0J25k60L8k10L29k69J43K01k75J51j26K73l04
7554a03o7J92p5j56J91P8m9j12R4J00N7L5j07r4L38m39K2L28m70K91p9jJ08J88
$$ y = [81, 66, -90, 96, 539, 220, 146, 76, 64, -14, 215, -54, 131, 173, -23, -85, -48, 86, 75, -163, 241, 103, -9, 229, 79, -144, 225, 139, -87, -164, -101, 64, 11, 46, 141, -191, 191, -161, -89, -35, 75, 55, -136, 14, -143, 109, -29, 86, 13, 107, 306, -214, -10, -51, -136, -109, -201, -263, -161, 12, -265, -117, 60, -60, 120, -143, 90, 108, -201, -223, -89, 117, 98, 48, 101, -44, -330, 26, -104, -275, -311, 82, -64, -170, -102, 436, 55, 59, 84, 3, -8, -64, -139, -34, -158, -63, 68, 128, -162, 49, 176, 187, 10, -3, 11, -32, 95, -67, -124, -304, -31, -120, 133, -201, 62, 208, 55, -65, 225, -86, 283, -99, -26, 62, 42, -192, -233, -50, -105, 135, -44, 155, 188, 82, 8, -69, -125, 25, 184, 62, -168, 60, 7, 54, -17, -264, 28, 121, 81, 206, -54, -16, -226, 103, -166, -23, 178, -97, 54, -72, 201, -103, -170, 22, -53, -209, -18, 60, 11, -101, -7, 93, 150, 185, 78, -16, 322, -117, -95, 233, -237, 54, -25, -26, 82, 270]
7578B70k90o5K65l46J4J5M72n41J89K86k35k7J44k08p3J19k32L8N21n91K65K57
7600B47l69J59P3rJ3j1R3l10J72l87O0J83N0p1k34M90j47k8L1j9P1j08O8j76J24
7625c5q4j6j56K25o6K69j05j25k1M1J31L9n5O3j69J89k46O6q6kJ21k33N55m73
7649a73K85k22J47P1J34k11N5o5k99K93j55K3K65k53J08j43%L45k61M3m9K48j79
7672GO3J7l18J63J33j02j75P2L28k31l35L12Q1j56J15q3o3N6%J07R7l14j17K24
7696a19L9J44j24j75N5Q0J94Ll08M31k31mn2K9N9q1nJ54m5N9R7l94o1L69k48J29
7722ekr6L91j18l8j73J24k34N4K24M3j37j7l6r7o1J93J81j64mk43Q9L71l54k0
7747a29K50k24Q4R2Q8m3j29m7L73l70j33j47L97k83L19o2p0n7J6K62p9r4p2J83
$$ y = [270, -20, -85, 180, -166, -152, -137, 335, -206, -17, 269, 34, 7, 151, -57, -130, -11, -243, -205, 316, -275, -10, 247, -122, 37, 110, 101, 114, 103, 196, -114, 58, -329, -269, -86, -36, -107, -341, 149, 2, -26, 5, -14, 57, -51, 17, -159, -35, -119, -135, -291, -66, -132, 137, 32, -93, -114, -73, 58, 97, 42, 105, -64, 125, -121, -55, -141, -143, -22, -255, 300, -173, 112, -110, 37, 108, 242, 31, 86, 21, -278, 15, -140, -117, 148, -105, 3, -140, -140, 205, -56, -13, -62, 186, 7, 70, 87, -231, -68, 65, -37, -212, -140, 188, -43, -378, -66, 15, -141, -26, -109, -172, -116, -116, -9, 88, -226, -343, -119, -80, 64, -60, -235, -180, -100, 94, 97, -211, 220, -11, -15, -67, -38, 21, -60, -65, 89, 44, 103, 200, -194, -255, 114, -134, -5, -7, -103, 288, 170, 132, -41, 83, -151, -97, 127, 170, 33, 16, -20, -117, -178, 15, 196, 32, 28, -215, -126, 245, -109, -129, 121, -103, -19, 73, 161, 118, -11, -58, 315, -55, -188, -335, 62, -221, 98, 36, -34, -91, -75, 187, 108, 14, -58, 125]
7771A25j75l07M85o7j89J80jl6j38K17n8j96J65j09p6o0J31K46K10l74m0R2J27
7794A52K9l0K3k4k66q7K31jJ7J85k15o7k12M73j99L6P7J2m82L18N2l33N21l15
7818a05K60j89k08N0K12J04l05K91l17J62J32j1k82K37K32l87J39m1p0r7J47L45
7840B99k12K01j98P8j47Mq4O2J3j73J49J00m02K61K27k15J79k30R8j51P2k34M26
7863A23l7l5l64K63J18j64K20k17L37m51K09J61K4k72P6J22P4j21j76j7J52o9
7885d4j22K3l1M37k76M6N8k81R0j1J3q7O9K17k39K82k84r7L21K2j33K9n0m1n2
7910a41K61k30K05j52J20j32JM21m20M6j42o8M23J12k58O2K0k39J68m3R5j37J08
7933H0k13J0Q9K40k92o8m5J11Q4j66L63q0M4j51j02J45J52j46o7j74J99j24L47
$$ y = [125, -50, -357, 128, 61, -128, 52, 51, 15, -123, 94, 36, -160, 5, -104, -180, -240, -109, 137, 347, -27, -67, 25, 152, 181, 151, 174, 150, -116, -203, 28, 27, 44, 229, 14, -53, -265, 208, 9, 45, 122, 134, -348, -30, 22, -311, 210, -105, 155, -34, -242, -192, 20, 124, -181, 110, -207, -45, 87, 76, -206, 31, 263, -124, 15, -26, -96, -193, -46, 299, 87, 288, 90, 168, 21, 25, -59, 3, 16, -157, -8, 92, -310, -49, 178, -37, 142, -88, 10, -141, -69, -303, 123, 86, 51, -313, -50, 68, -96, 124, -93, 244, -207, 2, 163, 187, -85, -9, 113, 187, 66, -110, -127, 25, -44, -166, -143, -174, 263, -13, 33, 91, -190, -100, -111, -98, -185, -116, 101, -138, 144, -140, -237, 84, 106, -27, 2, -48, -89, -141, 120, -110, 95, -57, 63, -69, -68, 353, -67, -21, -163, -231, 192, 304, 46, 108, 128, -111, 57, 14, 109, -28, 80, -133, -123, -34, 206, -86, -154, -199, -88, -4, -170, 193, 113, 157, 6, -96, 49, 201, 55, -12, -186, 13, -111, 236]
7956B36k43k37M77m75L50j73J25PM3j62O6r9q2K05J45k70K9J75J06k8l5p5k45
7979a60J23N2J72l68L34n8q8q2J5M3j93M01n55L48J55k53L85r4j08j04J07o6J66
8002A72k55J7Q0J39j58j6J63l1r1l14J87N3J87N9j38n2K5M6j37p6J34J5J21k81
8026a51K05O5o0j92r%J96j2J94l46O4K31k96O7j84R1L55j89j85J53j24Q0L1J97
8050A81m26J23JM0M14m43L92k09p5K1Ok28J16J68j4N7k21n2P0J29rj0k42K24M0
8075E3r5M0M0ql2j3n8J16o8J4j12K97q3j53M17j74q3m51L40K22j98J3n7J00l32
8100b65K15o1K09l72J34j7J09q0K9J02j9k14L21p7j14J72k27J55n0L1m3K95k61
8123b8K21k17N3k10K41J57L0l2j91j17P7l3LK64j48J87l76J55k30K78o8oJ27j05
$$ y = [236, -7, -244, 233, -242, 108, -65, 60, 67, 110, -52, 14, -85, -167, 38, 183, -87, -58, 117, 223, 195, 160, 85, -160, -37, 15, 187, -181, 153, 95, 7, -75, -60, -17, -210, 191, -364, -16, 139, -114, 271, 177, 69, -35, 72, 6, 172, -83, -66, 14, 153, -5, -21, 142, 111, 20, -294, -107, -54, 133, 192, 54, 2, 27, 73, -64, -140, -6, 9, 130, -151, 54, 119, 59, -133, -142, -142, 54, 42, 236, -110, -46, 185, -111, -44, -228, -137, 218, 29, -156, -3, -127, -47, -16, 181, -245, -122, -121, -81, 333, -110, 282, 73, -2, 19, 25, -203, -87, 81, 67, 124, -97, -149, -79, 50, 41, 31, -211, 13, 53, -42, -2, 38, 30, -2, -15, -73, 43, -25, -11, -123, 174, 91, -62, 355, 181, 98, -353, -13, 209, 11, 24, -33, 67, -265, -50, -111, 98, -274, -140, -157, -48, -128, -99, 3, -16, -230, 91, 14, -100, 72, -155, 0, -50, -19, -62, 233, -28, 193, -24, 29, -181, 60, 217, 247, 215, 24, -93, -16, -49, -46, 218, 70, 257, -119, 36, -194, 84, 16, 10, 137, 32]
8147C2j90J60J7J62l7k23nK66k15Q6O9j68J84M2n06M06Qj48L11m57L30k9m7KM
8172E4N4L45m77R4k19K53j75J15j50P9P0R7k51L96k02m2K03m27R6
$$ y = [32, -158, 2, 19, 181, 144, -79, -84, 182, -33, 53, 122, -46, 138, 180, -326, 80, 88, -60, 251, -206, 124, 95, 48, 50, 54, 108, 453, -24, 70, -149, 104, -71, 44, -106, -27, 43, 140, -111, 285, 83, 41, 244, -183, -87]
8191h7
$$ Imaginary data points
##PAGE= N=2
##DATA TABLE= (X++(I..I)), XYDATA
0@%%%%%%%%%%%%Qj6J6j6J6k4L2l3M1n6O4p2Q8j04J20j36J58j82K08k40K72l06
34a62L47l94M42m94N52o16O87p66Q50r41J042j153J275j403J546j706J878k067
52a083K277k512K775l068L399l778M217m733N343o080P000q177R745j1960J5344
67H709k1228L4409j21913R647J60050l4529q3672r3721J21187M7642k5259n4389
79e3067j3539Q1655N328l9970o969R782N6225l8306k2444K9991L6551Q864p2940
92a8839j3454O8425M4292j7708q5691M071O9159L0487l3655o5879J9372N8331
104E8911Q270m0778m9574L1921M8221j0065n0711l0640M9407L8395l3470n3304
116c3417n446N9540J8164m9428m1616J5918N2289j052m5811j8472K5260L1050
$$ y = [0, 0, 0, 0, 0, 0, 0, 0, 0, 0, 0, 0, 0, 8, -8, 8, -8, 8, -16, 16, -17, 24, -32, 32, -40, 48, -56, 64, -72, 86, -96, 112, -128, 144, -162, 185, -209, 233, -261, 291, -325, 362, -404, 446, -495, 547, -606, 669, -734, 812, -894, 984, -1083, 1194, -1318, 1457, -1611, 1788, -1990, 2227, -2506, 2837, -3243, 3757, -4420, 5325, -6635, 8709, -12519, 21890, -100023, -90376, 69674, 35145, -48527, -142248, -21061, 26581, 1322, -53067, -66606, 15049, 20377, -19593, -26562, -16780, 39445, 1139, -21305, 8686, 45237, 54101, -18839, -32293, 36132, 80424, 62716, -22975, -18904, 50255, 80742, 47087, -18792, 580, 58911, 67181, 26403, -23171, 8750, 56971, 46906, -3805, -34445, 14962, 53357, 19887, -33417, -38863, 20677, 38841, -10587, -52203, -36285, 16004, 14952, -30859, -49331, -24071, 6979]
128F979j9508l0271J0421K7767J76l7058n455M4026K3081l5946m8235K5047O8205
141B9229R308o3073m5026M7020P2869n602o8757l2923N2889N9816j6029n8601
153a8880j5185M7975L5221k3356l5128N942L0199n93k5268M23K6045N167l2234
166C28j8244L0273L2046j8074m7529n404M6984K7238l4213n0144P751N2938J8147
179D2097m2756m1138J9988M6622J72m3179k0216L1786L1423j7559l7007o8L4265
192D430J5810k5613k5705J3351L1441J104k9841j3693K4075K4443j3039k7843
204b1080L543K8571O000k6659j3273K6422K3390k0454l4282Q203M2661J0893m0457
217f522l1845K7306M7938l744n3039k3450M1065M4914j7568n2466r048M3330K7639
$$ y = [6979, -12529, -42800, -32379, -4612, -4436, -41494, -46949, -2923, 20158, -15788, -64023, -38976, 29229, 38537, -24536, -69562, -22542, 50327, 44725, -24032, -56955, -4066, 55750, 39721, -18880, -34065, 13910, 49131, 25775, -9353, -3411, 26788, 26195, 927, 1350, 27395, 32562, 328, -17916, 12357, 44403, 26329, -21200, -26604, 20380, 47618, 13405, -36739, -28988, 23950, 42097, -659, -41797, -21809, 24813, 24985, -18194, -38410, -6624, 24799, 7240, -29767, -29835, 4430, 20240, -5373, -31078, -17727, 13714, 14818, -15023, -28716, -4641, 19802, 6763, -21080, -17537, 11034, 17034, -9625, -22898, 3524, 26914, 6460, -27822, -19619, 23042, 33935, -6522, -38367, -11061, 36877, 33133, -19906, -43356, -2291, 42623, 25055, -27411, -36459, 6871, 34510]
230C4510k6046l4682Q955L1683K206k5501p738K1030J1559j9180j5571J6851K4596
243B2672r452l2263l981L5542K3272k5716l8485P038M4648J6073l6258l3586J9299
256a1197M2253J614l9649j9590K7847L1102j2826l4379k620K9314J3444k2757
268B556k2110J3020K5303m248k7952p632K3501J5130j7883k3189Q316K4486l56
281H942k5900j0198K1980J8502j5559k6374M175K9685Q471k7174k1243J8988L2257
294A6552k670l4493j3923K8677L0334j0920l4878m830L1560K2041j7462k7510
306a7522N013K8582R844k0848j4835J4255J8555o543j8104L364K0751J911k2431
319A992j0418K1714K0940j4980l1103N32L3092J4218k9044l0029J2688L5887K739
$$ y = [34510, 8464, -26218, -17263, 14420, 16626, -8875, -16613, 4417, 15976, -3204, -18775, -1924, 22672, 13220, -19043, -23024, 12518, 35790, 10074, -28411, -21373, 23275, 39348, 3090, -30496, -11197, 31056, 32670, -6979, -26569, 1278, 32380, 19554, -14825, -17445, 11869, 25313, 2556, -19554, -6534, 18769, 14521, -13431, -21063, 2438, 17568, -315, -23504, -15188, 9298, 8942, -16958, -27156, -5176, 13326, -2233, -28607, -24432, 5253, 13724, -13450, -34693, -15705, 16552, 13882, -20611, -34534, -5857, 24477, 13557, -21321, -26151, 5409, 27450, 9988, -17522, -12509, 16073, 25917, 5069, -9766, 4489, 23044, 16501, -1603, 1761, 22512, 24423, 1992, -8426, 13288, 34228, 19248, -11855, -11323, 21769, 35987, 6943, -23086, -10398, 25489, 28228]
332B8228l5564k1654K1966K9003r488l2013p112K5018J4557j8801k1899Q463K2108
345B812m52k2208q025J7961J4566j2378j9334N376K2707M651k0546j2529J6632
358a0767K1599n951k3213j802K4001J4025j6489k0028R791K7768M101k4759j4560
371a6284K0163K5562o818k7879m864K6350J7460j7337k4481N842K5494N870k1785
384G293j4663J3421J7274p212j9785n97J7888M877j8877j3610J3470J7622q788
397H313k5081k474K4422J2240k2089k4831J0109K9130K656k8638j6605J9296K4296
410A0744p481k6326n002K3378J4310j4714j9337P068K1782K267j7985q272J6600
423b968J5145j0221j7161N479K0841M447j8320j0442J4954J7885o143j9212j112
$$ y = [28228, -7336, -28990, -7024, 21979, 12491, -19522, -26634, -1616, 12941, -5860, -27759, -19296, 2812, 2360, -19848, -27873, -9912, 4654, -7724, -27058, -21682, 1025, 5676, -14870, -27399, -10767, 10832, 4881, -18332, -20134, 3867, 17892, 1403, -18625, -8834, 18934, 23035, -1724, -16284, 3879, 29441, 22623, -5256, -10120, 16230, 33690, 16353, -8128, -2286, 23208, 29078, 7293, -7370, 6051, 23325, 16113, -3672, -4269, 13619, 18496, -381, -13991, -521, 17101, 8313, -16768, -19242, 5180, 17420, -4669, -29500, -19391, 9739, 12395, -16243, -32848, -13552, 10744, 3263, -23063, -28065, -4687, 9623, -5091, -24428, -17360, 4422, 6689, -11296, -19568, -2968, 12177, 1956, -15205, -9726, 11115, 15562, -2758, -13200, 1754, 19639, 13496, -5716, -6828]
436f828J8597J0945j3375j6678N710J9738L496j8023j2734J3310J7094n208k1158
449e114m504J8624J1733j3459j9230L989J9439L498j7729j2593J0964J5501m776
462F343j7984l489J5996R149j3519j4563P499J7475j607j9557n170J8854J3103
475A2530j4186j9467O270K3096M324k0537j3197J4985J9785m613k0381m499J8464
488B574J3072j1171j6933L983J8034L800j4855q822J1405J2979o346j5010O01
501f689J5254N640j2915j0948P634J4533j260j6195o389J3678J2890q462j7317
514a0546J66J7546P439j5074j3893Q705J7531j615j8523o023J6221J2608j0654
527C888j6638K866J7898N174j5975j1773J0973J7144m192j8401l427J7159R895
$$ y = [-6828, 11769, 22714, 9339, -7339, -1629, 18109, 21605, 3582, -9152, 4158, 21252, 16044, -5114, -9618, 9006, 20739, 7280, -11950, -7961, 11478, 14976, -2753, -15346, -4382, 11119, 6343, -11641, -15130, 866, 10015, -3504, -18067, -10568, 6907, 5300, -14257, -19427, -573, 12530, -1656, -21123, -14853, 8243, 12567, -7970, -21167, -6182, 13603, 8990, -11391, -15890, 2574, 15646, 4475, -12458, -8475, 9559, 13359, -1496, -10318, 1087, 14066, 7720, -7290, -6689, 8565, 14205, 1290, -9658, -2024, 12509, 11249, -4946, -11335, 2343, 15233, 6771, -10546, -10380, 7166, 14605, -469, -14362, -5657, 11874, 10259, -8264, -14287, 1934, 14542, 3888, -12750, -9884, 8014, 13188, -2787, -14560, -3587, 13557, 9365, -9036, -12463, 4696, 14591]
540A4591j2910j4469P049J7325r36j7297n246J4643J0962r923j5742L161J6957
553H165M170j5739j0924R941J6067l129j7998n247J5475J1273j0224j5755L633
566a0292J6416K690j4357q421J0399J2210n214j3746n56J3614O544j0387j0613
579a1713O122J4126k49j4403n402J3004J1430o869j4578J373J5743N255j2783
592A056r880Q191J3416j730j3563m172J1510R172p229j2270J828J3027L638j2027
606I67r622Q129J2773l137j5181l640J2990Q317j0552j2447M372J3644O61j3882
620f608p094R825J0794n713j3677l53J3942N771j2119j0772P570J4241j650j4897
634a0740m355J3039J0461q232j2599L004J4258L414j1535p650Q390J1897k243
$$ y = [14591, 1681, -12788, -5739, 11586, 10650, -6647, -11893, 2750, 13712, 3789, -11953, -8792, 8165, 12335, -3404, -14328, -4387, 11680, 8551, -9447, -14694, 781, 12054, 1830, -13925, -10292, 6124, 8814, -5543, -13964, -3565, 8645, 3431, -10315, -10871, 2743, 9287, -1100, -11713, -5591, 8535, 8286, -6117, -11519, 1485, 12915, 6046, -8532, -7159, 8584, 13839, 1056, -8824, -633, 12783, 11053, -2510, -6682, 4828, 14000, 6771, -5499, -3671, 9356, 12994, 967, -8655, -526, 12247, 9110, -6071, -9711, 3279, 11596, 1044, -11403, -7031, 6613, 7274, -6608, -13702, -3877, 6917, 1204, -12473, -12826, 1116, 6887, -5232, -16004, -8434, 5807, 4157, -10740, -15095, -2056, 8405, 173, -12426, -9422, 4836, 8250, -3285, -10935, -2545, 9352, 7109]
647G109j1705k003J1373P483p536j0274M125J2082K205j1574o500Q858J0929m641
661I931j2447j300J2284O085r870j0377M154J2047O78j2694p011R586R561n846
675D781j2918k58J2533M169j1456r565O928J1835k733j3308l680J1764P728q157
689b337j2020L350J3089K744j1871p819R120J1191l484j2379j369J3038O981r624
703a390r978O102J2592N98j2030m352J0347R613n522j1585J139J2586N088j0476
717B732r155O635J2302j416j2455m253J1412Q110p979j1552L004J2583J203j1810
731f39o941Q725R456n116j2094p74J1686M732r858r609M780J1666j127j1704m276
746a1093R021Q024o062j0447J426J0665K833q732o793N753R654j960r397k037
$$ y = [7109, -4596, -6599, 4774, 12257, 4721, -5553, -1428, 10654, 12859, 1285, -5215, 3643, 14572, 9931, -2516, -3816, 8468, 14553, 4683, -5694, -1540, 10507, 11185, -1509, -8520, 1066, 10627, 4781, -8137, -8395, 4138, 8307, -3149, -12714, -5786, 6049, 3316, -9992, -13672, -1908, 5820, -2337, -14357, -11007, 2082, 4826, -7045, -14864, -5744, 5447, 1963, -10416, -11785, 1253, 8234, -1390, -11368, -5266, 7326, 7924, -4106, -8458, 1889, 11502, 5980, -5605, -4466, 8120, 13208, 2732, -6423, 212, 12514, 11098, -1357, -5610, 5802, 13912, 5933, -5619, -2615, 9968, 11171, -639, -7580, 1145, 10601, 5485, -6609, -7383, 4303, 9035, -823, -10432, -5652, 6014, 4887, -6817, -11093, -2072, 5952, -110, -10557, -9131, 1534, 4367, -4365, -11158, -5405, 4249, 2289, -7108, -9145]
760i145Q430O994n736q824J929J0144L178q386n963N470R458j483r683k266Q975
775C092O578o054r026K305J0514J892r221o188P219Q873l628j0404j322J0038
789D668N453q264q998L925J0602k07j0469n078Q767Q571n811j0908R56J0976L222
804G405r356p396O503R298k165j0871k138R910O508p497q787L254J0037J441r614
819c468n238P701Q367l713j0080j53R705M409p387p342M394R093o12r365l149
834f838P929O507m869q576R79Q984K689p432o416N460P657j173q648k889P444
849H08O028n159q232J260Q972K642q170n896N504Q617k094r373j804Q949N290
864G342o234q335K825J0101J346r527n194P494Q817m108j0135L3R880M383q434
$$ y = [-9145, -715, 6279, 543, -8281, -6352, 3792, 6970, -1416, -7379, -1909, 7549, 6066, -3617, -5883, 3092, 9670, 3616, -5410, -3105, 7409, 9301, 80, -6108, 1111, 9984, 6356, -4048, -5370, 4668, 10121, 1857, -7141, -3216, 7386, 7179, -3290, -8368, 399, 8970, 3159, -7749, -6793, 4183, 7405, -1951, -9347, -2844, 6454, 4289, -6582, -8720, 1190, 7698, 201, -8586, -5332, 4705, 6146, -3468, -8706, -1005, 7362, 3649, -6431, -6584, 3121, 7530, 143, -7199, -2805, 6288, 5676, -3689, -6838, 1091, 7598, 2729, -5847, -4868, 4116, 6805, -627, -7043, -1583, 6074, 4901, -3747, -6636, 808, 6836, 1677, -6555, -5295, 3677, 6319, -1851, -7747, -2243, 6374, 4280, -5093, -6897, 2052, 7342, 1108, -7227, -4402, 5699, 7045, -2482, -7676, -182, 8635, 4527, -5608, -5575, 4305, 8688, 254]
879B54p026N301R527j644j0203k339Q659O315o644q587K559R763R14r388m813
894g352P067P613m087r032n44Q822L257o892o287M392P250j100p910k391O540
909f54N093l827o980Q57P262K395o053n096L955P359j156p228k083O396N629m226
925A643o652J401P402K168o068m936M494O906q44p444j856O417N308m531p415
940d007J816Q030J537p197m738N212O680k500q198p71P511L513o141o283L058
955b478P306q7p901l196N712N620l729p631L14Q115K276p084n604M777P572j925
971B057p804j963P400M802n257o643K398P941J370p132m100N435O442k087p442
986d583k19P506L954o031n443L531P388m09p044k826O305N370l825o572Q81O884
$$ y = [254, -6772, -1471, 8056, 6412, -3791, -6130, 2529, 8844, 2200, -6387, -3828, 5935, 6849, -2539, -7352, -285, 7328, 3241, -5791, -6335, 2487, 5744, -1148, -7435, -3043, 4207, 3107, -4803, -7194, -654, 4439, 612, -6368, -5511, 1751, 4146, -1907, -7003, -3048, 4311, 3155, -4073, -6156, 240, 5869, 1643, -5009, -3608, 3794, 5962, -106, -5042, -548, 6358, 5514, -1930, -3786, 2631, 7939, 3408, -4007, -2191, 5839, 7376, 179, -4559, 653, 7333, 4833, -3365, -4136, 3375, 6888, 747, -5536, -2478, 4828, 4741, -3160, -6356, -644, 4976, 1247, -6384, -6070, 2045, 4321, -2763, -8367, -3590, 3982, 2057, -5747, -7710, -310, 4492, -765, -7408, -5010, 2931, 4301, -2831, -6931, -1496, 4946, 2859, -4583, -4802, 2704, 6658, 627, -4816, -1285, 6103, 5694, -1350, -4176, 2129, 7499, 3674, -2898, -2017, 4867]
1002D867K204n972n046L888O503r67p076k442O038M573m594o522J524P218Q82
1017E078o599m311M297N852j800p199r05O012L694m460o180K283O748O69o839
1032c660l627N681N761l173p318J025P331K526o149n016M194P002r11o989k168
1047e491O459M783l949o361J399P135J827o173l980M432O042j944o855q42O647
1062C129L335n189n258K926O174j32o341k455M773M502l038o378M46O321K235
1077E050n373m855L391O129j092o882j867N904M006m146n291J267N818J301n469
1092b109l050L766M808j660n535q18N095L238l409m956J707N663P16n106k707
1107d357L770M800j901n124m74N240K740l966m267K070N082M59n084l024M343
$$ y = [4867, 7071, 1099, -3947, -59, 6444, 5477, -1599, -4041, 1997, 6570, 1976, -4546, -3022, 4196, 5078, -1521, -5832, -1535, 4317, 2517, -4682, -5587, 425, 4119, -341, -6521, -4238, 2510, 3179, -3660, -7287, -1606, 4155, 982, -6336, -5311, 2020, 4546, -1603, -6619, -2425, 4577, 3666, -3323, -5491, 968, 5751, 1802, -4559, -3160, 3975, 5802, -371, -4351, 81, 6123, 4179, -2676, -3518, 3129, 6464, 1275, -3983, -1057, 5117, 4985, -1356, -3811, 962, 5464, 2426, -3952, -3506, 2815, 5050, -323, -5178, -1787, 4342, 3250, -3632, -5499, 405, 4411, 265, -5026, -3759, 2059, 3360, -2109, -5159, -1393, 3415, 1755, -3780, -4598, 497, 3735, 326, -4630, -2923, 2740, 3456, -1650, -4357, -587, 4213, 2312, -2812, -3286, 1954, 4694, 728, -3539, -1469, 3613, 4072, -1012, -4036, 307]
1122C07M753k195o230r1N645L094n054m685K884N847o13o419j958N323M326l785
1138A149n614J316O218R56n345m040M553N190k025o229m05O176K839m916m841
1153e018L086N558k15n995j933N122M109l249m993O27N580J616m335l836L174
1168g02M577r65n039j382M630L385l289m833J347N081O64m327l215L248M748j762
1184B166m946j041M636K870l757m351J782N331M24m975k803M174M224k314n329
1199c909L75M925K368m237m105K850N369o14n272j588M354L939l051n074J291
1214b379N329J298m788l162L484M521j511n272m34M809K866l895m407K245M689
1229C393L31n076k055L921L598k527m670K77M714J466l869l448K516M352n81m824
$$ y = [307, 5060, 2865, -3365, -3456, 2189, 5283, 229, -4456, -1572, 4275, 3662, -2757, -4715, 608, 4934, 1149, -4465, -3149, 3069, 4025, -1320, -5360, -807, 4383, 2358, -3871, -4276, 1900, 4739, -177, -5018, -1932, 3626, 3411, -2584, -4517, 605, 4714, 1465, -3528, -2901, 2679, 4295, -40, -3876, -702, 3875, 2910, -2129, -3511, 1119, 4504, 1215, -3618, -2271, 2810, 3474, -853, -4068, -820, 3928, 2166, -2780, -3821, 815, 3685, -72, -4423, -2641, 2690, 3114, -1861, -4664, -490, 3734, 1420, -3909, -3534, 1391, 3759, -478, -4583, -1733, 3636, 3022, -2250, -3838, 516, 4455, 1404, -3670, -2379, 2950, 4248, -540, -3702, -218, 4303, 2792, -2480, -2914, 1895, 4761, 866, -3541, -1296, 3393, 3724, -1352, -3407, 514, 4112, 1585, -3085, -2808, 1906, 3372, -497, -3945, -1429, 2923, 2342, -2482]
1245b482j293M026K627k620l988J001M048Q93l669k549K660L983j203l953j011
1260c530M006K561k810l731J318M266R52l883k651L215L941j187m208r72M308
1275A595K408l213l901K291M337J20m625j869L493L350j942m409J03M816J574
1290D128m221l196K442M522r61m953j045M250K729l330l844J360M215N50m328
1305a682k277L345L455j731m134m50M205J860l078l360J517M384J7m076j637L328
1321c14L197j728l953K19L963J746l505k888K299L977m38m261j180L758K915k603
1337A204l755J026M234R43l790k720K892L909j583m534l48M370K316l776l667
1352c279K041M414m02m164j874L931K598k574l609L79M147J169l738k585K328
$$ y = [-2482, -3775, 251, 2878, 258, -3730, -2729, 1319, 2212, -1457, -4006, -1346, 2637, 1434, -2519, -3530, 476, 3037, 227, -3504, -2186, 2080, 3032, -851, -3502, -287, 3654, 2467, -1741, -2713, 1595, 4003, 790, -3111, -820, 3517, 3637, -988, -2857, 636, 3986, 2044, -2365, -2262, 2554, 4128, -93, -3289, -847, 3675, 2714, -2239, -3284, 966, 3695, 365, -3479, -2119, 2096, 2646, -1682, -3959, -614, 2841, 1110, -3024, -3474, 731, 2591, -487, -3847, -2330, 2054, 2071, -2005, -3642, -314, 2883, 1155, -2798, -2579, 1384, 3130, -375, -3263, -964, 3013, 2575, -1686, -2866, 892, 3807, 1204, -2551, -1525, 2709, 3652, -138, -2858, 34, 3943, 2360, -2174, -2522, 1848, 4164, 388, -3279, -1238, 3176, 2774, -1390, -3264, 667, 3265, 691, -2918, -2539, 1608, 2777, -961, -3546, -1218]
1367a218L593n15m341q12L459K639k715l626J404L888M81l451k158K661L170j113
1383A346l343n17L555J862k628k902J514L214N61l803j513K994K586j427l600
1398b101K31L482J456k983k313J402L592n19l456j251K987K214j717l375K32L906
1414A787R46l512k159K130L227q38l370q68L262K001k428l184J324L375N20l197
1430i84j908K102L147r27l701q4L389J810k925k675J498L439K8l541j347L005
1446C26K467j792l146K6L902R58l012k604K248L259o96l441q59L287K104k307
1462G20l196Q72L703L30l425j692K441K887j225l313m71L225J595k721k498J505
1478a263L089L3l301j327K815K586j769l484P39L178J099k978k193K067K836m18
$$ y = [-1218, 2375, 1860, -2481, -3293, 166, 2805, 90, -3536, -2132, 1756, 2237, -1214, -3372, -711, 2459, 1346, -1997, -2514, 1041, 2903, 275, -2627, -1113, 2101, 2662, -1141, -2654, 340, 2926, 1499, -2101, -1870, 1612, 3068, 85, -2228, -826, 2766, 2247, -1209, -2460, 527, 2741, 1024, -2351, -2119, 1787, 2733, -779, -2938, -808, 2419, 1581, -1789, -2657, 605, 2606, 178, -3006, -1682, 1693, 2213, -984, -2892, -790, 2357, 1430, -2271, -2355, 1034, 2844, -81, -2756, -1258, 2181, 2209, -1332, -2679, 326, 2793, 1001, -2145, -2119, 1783, 2741, -271, -2875, -627, 2632, 1936, -1505, -2364, 923, 3027, 720, -2476, -1604, 2099, 2429, -996, -2688, -247, 2640, 1415, -1898, -2369, 856, 2451, -270, -2768, -1263, 1826, 1859, -1442, -2769, 46, 2632, 863, -2621, -1882, 1296, 2395, -583, -2776, -709, 2127, 1709]
1494A709l312p78K765K392k054l099P70L567N07l040j925K331K767q41l685j68
1510b094L386J384k421k498J577K717k1l017j186K126K671j695k905j00L295J154
1526B373k479k377J466K980l00l452o55K669K172k353k639R45L198M70l014j592
1542b588K057K652j089k981k33L066J339k172k361J288K975k84k987q58K789J568
1558B181j350k599N82K904L20k112j903J897K103n61k433q53K389J647j214k864
1574a866O05K328Q42k160j585J355K335o29k625o28K399J651j732k240N47K643
1590A240M76k353j490J545K394r24k689j27K616J443k197k418J361K912q5l147
1606a443j197K662K271j297l115N87K740J117k471k190J578K835l35k903p16K663
$$ y = [1709, -1603, -2381, 384, 2776, 722, -2377, -1607, 1960, 2467, -573, -2498, -167, 2600, 1759, -1926, -2094, 1292, 2676, 255, -2243, -666, 2051, 2030, -987, -2173, -47, 2624, 929, -1976, -2076, 1219, 2373, -106, -2483, -1017, 1963, 1663, -1789, -2444, 225, 2397, 44, -2595, -1650, 1548, 2018, -996, -2588, -531, 2121, 1032, -1949, -2182, 884, 2223, 51, -2310, -1022, 1953, 1669, -1318, -2176, 613, 2181, 831, -1768, -1186, 1718, 2038, -74, -1977, -80, 2023, 1462, -971, -1824, 565, 2212, 998, -1866, -1261, 1067, 1909, -251, -1836, -481, 1854, 1225, -1400, -2028, 371, 2022, 290, -1950, -1403, 1240, 1716, -637, -2127, -582, 1812, 888, -1801, -1928, 688, 2131, -66, -2484, -1123, 1789, 1704, -1443, -2640, 22, 2293, 996, -2119, -1532, 1208, 2325, -146, -2336, -758, 2077, 1742, -1161, -1877, 786]
1622G86J600k024k398J088K427L72k670j088K146K083j583k530M51K380P55k059
1638b64j769J190K709m19k644p50K134J927j378k807J71L069O38k143j721J606
1654d51K081o17k268n72J836J890j574k127P40K020O67j964j323J461J969p88
1670I80k530J84K180J184j715k196J091K696k74k668q09K031K354j388k759J61
1686a478K837Q59k275k166J554K686m84l017l63K270J317j330k129P11K329K74
1702A595k550j007K051J709j296k218R0K653M63k045j654J636K008o46j981p52
1718a944K075J752j432j831M6K381P36j782j275J004J472pj780q61J585J394p17
1735H16j814J13J684M83j401j185R80J641n97j562j84J799Q30j323j760P45K047
$$ y = [786, 2386, 362, -2036, -948, 1479, 1851, -819, -1907, 239, 2322, 739, -1791, -1340, 1040, 1795, -264, -2033, -843, 1866, 1447, -1197, -1947, 187, 2114, 736, -2071, -1900, 1169, 1807, -336, -2057, -451, 1630, 1013, -1255, -1827, 9, 1899, 325, -1802, -1062, 958, 1625, -339, -1662, -201, 1768, 980, -1550, -1366, 814, 1998, 283, -1913, -822, 1874, 1600, -1068, -1877, 154, 2508, 1120, -1639, -1478, 1359, 2218, -57, -2223, -669, 2017, 1533, -1484, -1847, 423, 1740, 410, -1719, -1008, 1321, 1595, -955, -1962, 89, 1798, 502, -1716, -1626, 1027, 1490, -555, -2209, -573, 1435, 789, -1192, -1944, 131, 1883, 451, -1380, -1334, 1047, 1783, 1, -1274, -270, 1202, 1195, -585, -1446, 139, 1533, 816, -998, -885, 799, 1282, -119, -1304, -324, 1317, 720, -842, -1026, 773, 1603, 280, -1480, -735, 1312]
1752A312P4k206r98J676K187j223k313k29K273J322j908j992R04K389J12k105
1768g25j391J882K133j495j761K63J997M52j678j234J221J722p09j918m8K315
1784A026O92j706j623J019J972O0k284j127J886K256j487k006l11K561J154j920
1800A62j925R87K298j17k085j057J565K033j319k018N99J669N64j563j286J433
1816f0J108m25j427j02J653Q66j600j688J037J657K41k273n93J761J673j012k341
1833a525j13K404J202j788j911R62K040L21j976j195J500J434n13j876j89J827
1849F04N89j244j257R87J592o32j519k10J458J313j690j467J039J804q1k180p68
1866a662J420K144j158k115j91K131J198j420j867O44J993K72j903j072J485J375
$$ y = [1312, 1386, -820, -1818, -142, 2045, 822, -1491, -1720, 553, 1875, -33, -2025, -1121, 1268, 1380, -725, -2116, -234, 1899, 404, -1357, -1094, 903, 1355, -323, -1557, -336, 1386, 677, -1241, -1289, 1026, 1718, 12, -1611, -592, 1380, 1440, -844, -1971, -85, 2171, 684, -1322, -1633, 928, 2082, 162, -1763, -776, 1522, 1405, -680, -1737, -172, 1861, 542, -1476, -877, 792, 1356, -207, -1493, -60, 1048, 623, -804, -906, 747, 1613, 13, -1675, -638, 1019, 1260, -1013, -1606, 155, 1828, 816, -1525, -1638, 766, 1968, 180, -1731, -769, 1271, 1592, -384, -1579, -79, 1355, 842, -1034, -1223, 604, 1193, -51, -1308, -321, 1271, 639, -880, -1090, 368, 1681, -9, -1476, -437, 1367, 1286, -894, -1662, -242, 1902, 744, -1371, -1562, 569, 1767, 347, -1520, -876, 1117, 1389, -514, -1586, -101, 1274]
1882A274m66j813k96K012J96j005r58N20J493l31j347k05J491P58j346j234R16
1899c41J550P1j881r31J383J666p58j865j60J786J160j347j793O75J733M92j866
1916d26j000J432J139j71j866l96J520R20j088j241M98J446K21j351p33J176J162
1933A242r68j462M10J578K66j561r58J442J636q72k103o2J953J110j317j870L24
1950a212K267K66j726j214J102J745k96j840j71J348R34j383p83O54J245k60j345
1967f69m26J401R94j211j354M50J989k42j460r45J411J523q25j951%J897J044
1984A626j418j556L33K005J61j485j205J158J504k17j761m4J304Q35r24j322O03
2001d03R94n4j026m54J337K55l51j156K77J514k84j296n62J172J267o08j566l56
$$ y = [1274, 808, -1005, -1301, 711, 907, -98, -1056, -536, 957, 626, -721, -926, 565, 1323, -23, -1257, -341, 1209, 1280, -601, -1532, -149, 1517, 759, -1106, -1266, 520, 1680, 333, -1460, -785, 948, 1440, -426, -1426, 6, 1145, 974, -892, -1288, 232, 1152, 64, -1177, -679, 767, 988, -363, -1096, 80, 1242, 274, -1188, -778, 800, 1066, -495, -1453, -11, 1625, 753, -1350, -1412, 541, 1651, 334, -1536, -1212, 1055, 1321, -405, -1619, -517, 1228, 932, -908, -1079, 269, 1203, -180, -963, -309, 936, 676, -669, -1095, 306, 1300, 89, -1265, -815, 1174, 932, -528, -1473, -62, 1461, 636, -1315, -1315, 582, 1626, 208, -1348, -1015, 990, 1151, -334, -1539, -381, 1123, 906, -855, -899, 405, 1240, 316, -1006, -403, 591, 537, -489, -943, 394, 649, 298, -858, -581, 933, 649, -647, -1209, -37, 1230, 622, -944, -1300]
2019a300J608J215j553j181K09J917L97j829p46J118J363l82j549j63J187N53
2035H64r36p68N43R70L55j566k06J001R57j170r51L27J450K05j445r07J304J218
2053A245n11j682N0J439P50j212j250K67J633M22j252r07N80J490m13j148l94
2070h93J083P82q46r46K74R93P0j087m65J015J094o67j265L47J245L50j189j142
2088a247J298R73j05j606l76J103J349j218j348J61J901L39j610p73R28J693q59
2105F03j182l99J104Q50p83j048L56J297k5p89r66J069J073q49j274M13J123L11
2123H84j117j202J172J189l12j366l28J539Q18j198j095P3J709M08j510p09P08
2140c37J325m10j042l74J039O00m93j177L16J490l31j132j13O88O99o19r68M45
$$ y = [-1300, 308, 1523, -30, -1211, -1002, 915, 1312, -517, -1263, -145, 1218, 836, -713, -876, 311, 864, -72, -840, -297, 673, 1028, -538, -744, 257, 1214, 44, -907, -580, 870, 1075, -370, -1277, 27, 1245, 734, -948, -898, 541, 1291, 79, -1171, -904, 729, 1151, -101, -1008, -428, 1062, 649, -499, -893, 190, 972, 126, -820, -546, 447, 517, -570, -1035, -20, 1074, 407, -858, -511, 734, 1084, -105, -1247, 51, 1024, 919, -687, -1063, 40, 1389, 171, -1177, -1016, 885, 1224, -386, -1159, -231, 1462, 603, -579, -978, 126, 976, 193, -855, -499, 798, 773, -16, -982, 87, 1160, 311, -963, -550, 573, 884, -233, -1435, -263, 926, 614, -752, -1080, 459, 1277, 79, -1016, -943, 766, 1174, -336, -1045, -337, 988, 578, -464, -838, 201, 801, 308, -869, -553, 937, 606, -526, -639, 49, 748, 129, -839, -394]
2158c94R89J65j273m35Q75R28n12j307N8J041J176j174j112L44J352K63j400q84
2176a300P98J372l69q50n31R91Q65q73o39J92Q23K25q34o24P59P25n25q22K6R57
2196C66M80r38o39N26Q66r3j031o82J169R71o02j384Q6J212P44q84j016M46J430
2215A027n60r40l00Q00J073j042p34Q4R48J57o75q26P89Q65l60q85l1R82K49o61
2235d0l73M46O14l99q32l26J164P79m39j097m45J447L65r48r52M82J148K17j348
2254e37l61J094Q08p04j124M77O53K49r16l27N80R17k45j162k16J040N88q45p53
2273g84O67Q45j70j020l46R75O42l96j279K28J184N95j090q59M32J092m9j198
2291e31k64J040Q56r78r79L99Q39L14o96p42O41Q93l42p95m87Q79O37q03n60L99
$$ y = [-394, 595, 760, -513, -948, -73, 855, 343, -964, -906, 135, 1311, 137, -975, -631, 721, 984, -416, -1300, -502, 870, 501, -349, -880, 111, 976, 103, -536, -344, 479, 704, -130, -754, 5, 730, 205, -617, -591, 366, 846, -92, -731, -205, 661, 568, -463, -1145, 24, 995, 393, -991, -905, 307, 1051, 167, -849, -403, 1027, 467, -473, -773, 27, 1100, 58, -676, -592, 356, 513, -162, -988, -199, 666, 306, -579, -610, 372, 621, -40, -413, 33, 647, 248, -584, -910, 254, 1033, 594, -503, -948, 499, 864, -84, -1036, -554, 594, 811, -537, -898, 196, 1004, 300, -824, -347, 306, 555, -361, -688, -108, 809, 564, -598, -814, 226, 814, -31, -784, -117, 728, 558, -462, -808, 167, 809, 413, -866, -638, 546, 1141, 51, -808, -376, 716, 667, -531, -795, 245, 1101, 123, -856, -457, 382, 696, 0, -742, -101, 792, 450, -345, -832, 47, 684, -119, -679, -280]
2311b80Q93k8p19n90J008L97j20j126m3J194K40j089m68N56R41l06j124k15Q91
2330A2Q85p36q94M94P96p9o19m41L24R74n37p50J90N08N65p16n26J22R60J86j088
2351c70j24L85J018n00r42j46R82L91r64n82N28P21J27j087j68Q10L50j77p65
2370e13L3P40J68n82n14N88P44k99o88r1P18N22j016m93O37O01N7o39o88Q24O10
2391G19k71q89K1O63M96o98p43M28P57J80q52l72N63N04l26o04k8O72N91q94n58
2412f41P47M01q6q31l55J032N34n15j158K97J301j82r98m68J067M41l11r48l0
2431g03R28N80p87r22N40J240m41p74j80O35L11k46p46m7R30L53p80n07L86Q51
2451F21o9j086O1P39N80o79n94J42Q19j39o54j45K36O20j8j074K22M79P51q47
$$ y = [-280, 613, 585, -134, -724, 284, 681, 561, -565, -608, 586, 826, -263, -731, -175, 766, 460, -664, -879, 12, 897, 161, -733, -239, 557, 478, -141, -582, -258, 716, 179, -571, -381, 127, 692, -24, -550, -428, 532, 718, -370, -494, -109, 909, 409, -533, -679, 303, 694, -270, -852, -324, 397, 524, -563, -731, 79, 429, 252, -513, -480, 260, 428, -154, -668, -80, 664, 365, -323, -414, 304, 826, -190, -683, -46, 555, 612, -27, -715, 109, 719, 448, -441, -420, 243, 739, 41, -702, -274, 483, 663, -189, -561, 2, 506, 180, -424, -452, 220, 811, -83, -641, 106, 507, 421, -410, -765, 267, 801, 286, -872, -575, 726, 544, -454, -922, 145, 586, 275, -673, -703, 225, 805, 18, -904, -364, 876, 435, -339, -519, 116, 427, 181, -565, -612, 318, 671, -109, -616, -230, 621, 552, -534, -473, 266, 846, 167, -427, -285, 534, 395, -259, -404, -168, 452, 434, -640, -418, 61, 812, -35]
2471c5n42L5J183k7r92j79O57L30k02p93j53R67L40m39r50M65M88J53n50l60O56
2492E2O16o08o04K48O66M33j013m29Q44L73l30o72J85M01L40l45m36K3Q75j82
2512D37p98k82N20Q76m82r88k3R63L62o32k93K37N73J82r68l87O74M47k30l97
2532b09n9O67o2o06k38L60Q57n07l63m16P87M30n04o57K65P18r2l60l75N02N45
2553F83l73q32N8O05L63m07p15K39P58j91k56l68L15M07R8q48j73Q37M00n06o23
2574e29L85P96l53o03j65N27N13k85r31J47Q52J94q84m58R03L16l06l32l38P61
2594B10M15n32n44M4O12L22p19j18M36L16j96p61L9P65K37p93m66N15M86m4p76
2615e52K22L96N6k47m76K53P46P2m38l51N69L33n55m83M27K80L34p16m21J87O37
$$ y = [-35, -577, -542, 641, 614, -378, -557, 100, 430, 228, -565, -718, 249, 589, 150, -800, -335, 153, 306, -244, -604, 52, 668, 60, -544, -296, 370, 803, -210, -639, 205, 578, 248, -424, -239, 162, 502, 157, -279, -256, 619, 437, -361, -643, -123, 753, 271, -717, -740, 223, 585, -47, -340, -103, 470, 652, -316, -703, -29, 418, 188, -209, -268, 399, 337, -269, -507, -147, 710, 203, -160, -576, 211, 641, 137, -520, -255, 463, 371, 11, -364, 138, 683, 310, -522, -464, 141, 504, 97, -618, -379, 379, 188, -68, -436, -121, 286, 384, -464, -637, 200, 600, 94, -529, -144, 652, 299, -304, -469, 58, 571, 286, -645, -498, 354, 548, -336, -794, 109, 425, 119, -213, -551, 210, 625, 93, -451, -407, 205, 527, -192, -310, 126, 442, 246, -515, -476, 289, 526, -267, -733, -218, 268, 224, -552, -330, 66, 122, -125, -601, -348, 398, 470, 32, -319, 250, 583, 28, -455, -28, 252, 586, -130, -551, -364, 273]
2636B73K20o49j58M55L48l51m84j3N89L29o86k57K10O22j3o87j93P41J55m95j65
2657b09R0N97j25n00l44M81N22m7q19jM32J53k93l43Q5P86k03l74J9J22L05j54
2679A80l44l27O16K21m82j96M26K15K8o06l26P07L98o32k97R1P53k88m0m18L38
2700A7K33m4p62LP70M17n44n91K52N77O7k73m71J33M56r8o42L11M00K33l43l41
2722b40j05O16J34m21p8J57N01l98o14K53O13j97l14m52L01O81l93k80j84L37
2742h3M88j44n72P4K36K55k02n64M90K47l77J06j42K64K46k19m54M34O4L5m35
2763b53p1L69M14m21m70oL44K53k70k39L88N33l79o47J80K43M99n31l16J92N02
2784C14J20m24k73L39M42n57p9j24O15p9l94l01L96K96M9m01j90M35J92j90n97
$$ y = [273, 493, -156, -314, 141, 489, 138, -346, -359, 230, 559, -127, -384, -174, 448, 435, -252, -445, 296, 451, -44, -209, -119, 478, 353, -147, -491, -10, 512, 465, -354, -355, 77, 230, -63, -406, -321, 465, 262, -112, -93, 29, 334, 180, -164, -491, 125, 346, -136, -332, 94, 309, 337, -269, -595, 112, 510, -122, -419, -328, 425, 137, 97, -321, 17, 250, 206, -556, -553, 217, 634, 90, -501, -249, 328, 395, 122, -349, -216, 240, 142, -500, -189, 211, 444, 101, -240, -345, 271, 405, -16, -94, 63, 564, 166, -448, -195, 418, 221, -93, -545, -244, 437, 44, -236, -420, -83, 405, 261, -311, -237, -1, 254, 52, -512, -22, 225, -152, -46, -188, 76, 322, 103, -351, 83, 147, 182, -253, -324, 45, 459, 38, -432, -438, -94, 159, -111, -350, 38, 571, 192, -455, -275, -32, 467, -64, -380, -188, 314, 434, 10, -263, 76, 518, -39, -118, -242, 373, 294, -100, -401, -5, 291, 340, -61, -251, 184, 376, 186, -411]
2805d11K48K21K96l16m19K87L96j78n76Q6M88K95l49k67p3O49j82l93k04M21J00
2826A19q6r7l42R7O76j46n91J36M14M97q55l24M49L95o4m31k06N64j28k15k3L19
2848A58Q8K49m61n16N38L59j85k55j29K74K12m41j71m7O02j35l64j61O90K77n58
2869B4n56L25O11l33j80k67M56L93m90j96nK80K34l46k05J98M15j59p6n64L66
2890g5M44k78l48M7L43K85o41k58M37M05l6m56p2M1O36l50l57l96Q66j08q0k07
2912a58k0M45j16n54O1N88J97m68r0M4K91M85q00j42K04L42k88k04m2M86P8l62
2934b3j21J54J36J04n80q7M69L54k83n74J72O03J7l03j74L7N06l88j1k56N80p7
2956B55j94l00L68J3K0n17K87K05R9n8k69j14L78J3p6k74j2M36j41k86j83J75
$$ y = [-411, -163, 58, 354, 38, -381, -94, 302, 124, -452, -366, 122, 417, 68, -199, -272, 377, 195, -198, -402, 19, 119, 33, -64, -406, -309, 367, 221, -370, -234, 180, 677, -178, -502, -53, 342, 278, -153, -359, 205, 77, -138, -161, 158, 246, 495, 34, -482, 56, 415, 230, -25, -154, 120, 332, -109, -280, -327, 275, 140, -224, -385, 305, 582, 24, -532, -207, 404, 71, -109, -376, 80, 473, -17, -213, -218, 62, 296, -50, -255, -57, 358, 199, 123, -441, -75, 369, 91, -257, -210, 133, 418, -223, -481, -44, 361, 325, -131, -203, -162, 474, 124, -233, -629, 237, 129, 49, -158, -178, 267, 151, -403, -342, 246, 443, -25, -115, -71, 220, 705, -95, -237, -33, 309, 21, -183, -225, 261, 339, -23, -144, 10, 146, 250, -330, -417, 52, 406, 123, -451, -279, 324, 341, 38, -136, -99, 407, 19, 8, -248, 332, 255, 61, -239, 129, 142, 162, -355, -68, 137, 236, 178, -91, -205, 173, 186, 110, -164, -176, 260, 119, -167, -350, -175]
2978a75O42n05l40L12L13Q0n96k07K16N21j29l57J16L49j21O0l22J09L00j24l18
2999a76K2K73K42j79n44L12J81K11M5o48m0P65j77n88j24J81M42p5l42Q4p0N32
3021C27n34j20K69J15J32m25K3K55N5l35K2n2L73O6j84k28J20M67l15j98l39P01
3043A95Jm0m48J90L57O5n14q4N84j87J76m45r3L10J13j57l61J16M25q7l53j2M58
3066B09k9j58j41l4M28P8n12j20L32L46j76n31j52P18R2n56r7L50L62l08m0l40
3088b79K42J69j81p5M6J22L37n80j2J23K61K11o47J5N41j35N7n31N16k9N0k44
3110b3j00r6M19k26m70K75K60K22m95J48K4N0L45l32j11L03Qo3m92P1L06L15m39
3133a01O0j79L47o4j52Q5j51L40J95p05K42K98%k52l49L60K25j36j7r1P9P4k85
$$ y = [-175, 467, -38, -378, -66, 247, 327, -269, -476, -260, 261, 132, -225, -109, 240, 119, 179, -143, -34, 266, 142, -176, -154, 119, 361, 182, -362, -50, 131, 342, 387, -261, -301, 464, 287, -301, -425, -244, 198, 123, -219, -135, -205, 327, -207, -327, -58, 57, 189, -236, -213, 42, 97, -238, -216, -268, 105, 171, -13, -241, -121, 346, 31, -167, -506, 195, 196, 156, -292, -102, 255, 320, -194, -278, 306, 119, 295, -150, -243, 67, 180, 23, -338, -222, 203, 116, -237, -249, 209, 180, 22, -119, -153, 275, 353, -159, -279, 53, 399, 223, -308, -460, 258, 350, -206, -303, 47, 409, 101, 61, -279, -37, 132, -49, -124, -78, 44, 381, -199, -211, -88, 173, 384, -263, -248, 293, 158, 215, -316, 200, 171, 221, -23, -123, -219, 200, -26, -496, -221, 39, 261, -234, -86, -62, -12, 333, 1, -110, 193, 201, 138, -354, -283, 23, 338, -101, -41, -220, 127, 63, -89, -4, -155, 185, 380, -325, -83, 215, 215, -37, -386, -26, 199, 63, 46, -45, 34, 108, -177]
3156a77q5O4J11J44k89J63O8K18j06P2k73J42J93m76R2M2J65n2j55o0L06L5Q1
3179B23p05J46N79m6m01K92k08L03k14J1q3L0K4m3o7n4M65j14m12R1J33N42l61
3202A31l89K38K88j71n5k44J36M60L6m15j23pK34J2k74r8M37j86Ql80K04M93k19
3225A16k43j53L52K99l37l32q3N22R4k19j21J10K48k72J04l27M30j21j85kR9J72
3247A51k80K67m33N88M8l62k41j04N17j40k11r3J58M27l39l74L13K40J96k94l33
3268b99nQ20l16M6l78R2M15p1l20p2L50j43k45RO3K56K8l90K3K18k5p9p6o4K70
3293A07R0k28l3J05Q4r2O5k39K13J78n7m44J79L24k17p2j1nN9p4J2r0K39K29k31
3318I1k9R7lK19k91j59J87j14n7n6j67M78N9q3m75M05j61J78p6j66N4K05K2k75
$$ y = [-177, -262, -198, -87, 57, -232, -69, -1, 217, 111, 183, -90, 52, 245, -231, -139, -97, 68, 16, -139, -199, 107, 142, 223, -482, -336, 243, 197, -204, 88, -120, 183, -31, -20, -103, -73, -49, -92, -159, -213, 252, 138, -274, -183, -50, 492, 131, -258, -20, 268, 97, 42, -202, -66, 394, 430, 15, -108, -115, 119, 131, -143, -241, 196, 10, 18, -362, -158, 335, 116, -127, -280, 72, 371, 34, -298, -381, 141, 235, 16, -105, 5, 253, -19, 85, -242, 188, 67, -118, -120, -21, 151, -129, 138, -295, 293, 341, -21, -262, -366, 151, 11, -200, -293, -135, 292, -47, -421, -108, 132, 328, 34, -299, -304, 516, 200, 246, -132, -40, 375, 304, -16, -88, 262, 119, -126, -117, -54, 202, 230, -160, -137, 81, 56, -23, -99, -163, 107, 197, -31, -64, 41, 125, 33, 98, -141, 72, 250, 193, -251, -72, 252, 35, -37, -48, -53, 6, -68, -56, -146, 93, 322, 91, 62, 159, 156, 375, 84, -75, 112, -2, -59, -115, -282, 196, 255, 172, -303, 102, -59, 119, 43, -123, -69, 136, 158, -117]
3342a17J24P7Q2k57P8m0R1K95k81j19L1p0K78l26J61O5J37l29j15L32K81l51k92
3365b65Q6K84L46n44j52J34J96j15m3k02K95J11L0R8k57j1J77l90n9M73j21k23
3387a52P8nl4J99J83n63L0K81J28l75J94K64j02L1m01J37l0L50j93l34N47k27
3409FO6k63j31N32j13K7n13M88K3Q0m51R4J53m3K94l24N6O2N7M1m14L70J18k9
3433A86m02n9K78O9j64o5k8K65N7j02l30L05K61k25k37K3M49l24J36m16J82L10
3455A69M1k1j36j91P3K39l33O8J96J1j14R0k11J80J80l12O1L0J8j06M9N3J43m2
3479A35j82j06J33J52N1k89L1N3M5l30J25J22J14k9k03N9K12K9O1j96O1l26L69
3502I1j20j16J80J80J49l01j10L3J67j51j04K60o8j30j28J60j66M80Q3l91lP4
$$ y = [-117, 7, 84, 166, -91, -13, -53, 38, 333, 52, -67, -36, -106, 172, -154, 7, 72, 209, -120, -235, 97, 378, 27, -265, -179, 105, 451, -93, -245, -111, 85, -30, -73, -275, 20, 131, 161, 259, 2, -9, 168, -222, -281, 192, 71, -152, -74, -79, -113, 86, 269, -294, -264, 17, 145, -230, -36, 228, 126, 157, -244, -107, -137, 213, 20, -314, 233, 6, 72, -191, -322, 210, 97, 124, -389, 99, 122, 202, -249, -155, -2, -45, 249, -75, -19, 43, 100, 141, -273, 97, 215, 186, -216, -275, 3, 72, -92, -157, -185, 80, 137, 35, -295, 10, 271, 46, -191, -168, 281, -43, 93, -323, -141, 169, 210, 189, 53, -138, -65, 174, -159, -91, 105, 116, 2, 92, -119, 61, 241, -71, -10, 20, 38, -68, -19, 34, 177, 135, -47, -153, -20, 132, 183, -106, -75, -22, 23, -307, -182, -60, 54, 25, -178, -119, 93, 122, 183, -13, 48, -278, 91, -29, -145, 35, 215, 364, 63, -47, -14, 153, 2, -102, 158, 90, -40, -168, -8, -174, 306, 389, -2, -5, 69]
3524F9J76k87nl8K19j01n1k08J43J56m3l5q3J46Q7K7l78m2J82j9O6r1K59N8o8
3549A39j74j26L87k34o8K67l54K00J71j84n4K17j2N1j68nq2j38K77l38K82K70
3571C24n5l50j70J66K79k75l79N16q5J93k55P8J63q3K2m02K17N3M4k28LL35o9
3594D2K72m82J93j83J64J11l40K01r3J52l97J65J32J88lj85K24q9k35J38j86J32
3616g9L83j85k99%J13N7R3l19P0J8M89k66m08M25N8o9n6k48r1K84K46k73J07M6
3640I6L5R5l84J64j41J39k7J42j66J86n7J46jk66J93l37J1R7J02j74M9r1K9j00
3664b60J74k%j1m6pj50L44J53l2j7k70L55p2k08l07L07M4j00m1L11m9l8J76jj96
3690E7j21K4K1L0K22k62M1q8j25J17P0J87l62o6L59K36m30M8L6J41rj62l36L23
$$ y = [69, 245, -42, -47, -85, 134, 33, -18, -226, -83, 73, 30, -5, -88, 58, 145, 172, -206, -248, -66, -85, -19, -110, 149, 207, 139, -35, -161, 226, -8, -76, 191, -163, 37, 208, 24, -30, 187, 175, 226, 58, 53, -29, -167, 110, -228, 54, 324, 269, -81, -251, -85, 194, -81, -460, 56, -29, 164, -91, -13, 150, 67, 89, -313, -96, -43, 1, -227, -224, 111, 42, 314, -168, 25, -158, 6, 117, -223, -22, -115, 37, -360, -195, -63, 125, 122, -63, 161, 72, -163, -25, -211, -79, 304, 119, -180, -180, -67, -10, 83, -236, -166, -148, 341, 75, -333, 92, 150, 81, 25, -223, -314, -30, 216, -57, 50, 96, 131, 226, -158, 6, -135, 4, -23, 119, -47, 139, 82, 228, 227, -39, 154, -183, -172, -75, 27, -147, -98, -189, -160, -260, -86, -88, -88, -99, -145, -152, -302, 42, 195, 163, 146, -124, 231, 159, -49, -356, -49, -5, -105, -146, 165, 116, 78, 254, 253, 57, -64, -40, -19, 11, 233, -29, 12, -76, -201, -84, -14, 173, -189, -255, 104, 340, -90, -42, -6, 135, 126, -36, -372, -49]
3714d9n3K32l25J70J15j83R1l3j65J61J06j87K85k77R5r8J05J05M4nk46J42m4
3737a4J06j38R2J43o1Kk22J42j61J22j41K32k31OR9k6n4P0RJ22m5k2l56L87k97
3762b36k6K07M5K08j57j15L4M81m25j79K4K98n1q5J86k52M7J08j67J01Q7j10j81
3785a58l3L36M3k07N8J59m09J40K17j52q0O5jk9J15qk4J16j40J3Q6j94K06Q2l52
3810a51R2J1J06j04J72k05K50j80k02K67K0o6j51J22j92M60j60K6k18J54R3j69
3832b5N3L0N2M7k19J06r1K44n7p8j52J56o9j4n1K55p7r1l24L5J19J54j2j26j0
3857a45K07m5k30J89J64m7k5r4j65L16j20k11M32j47l8R1j48p8K11j8M4j37J3
3880A9nM0l5j54j6j8k1J92J0k94J51J54j41j43K05M2J7k10L57P8p9j13l9Q7J01
$$ y = [-49, -102, 130, -195, -25, 90, -93, -2, -35, -200, -39, 67, -120, 165, -112, -17, -115, -10, 95, 139, 134, -112, 30, -14, 92, -46, 46, 189, 128, 130, -92, 50, -111, 11, -130, 102, -129, -123, -24, -50, -104, -34, -25, 97, 52, 30, -326, 61, -236, -262, -55, -10, 198, 41, -74, -40, 441, 16, -163, -139, 159, 108, 23, 209, -43, 4, 112, -55, 46, 133, 23, -158, -191, 145, 188, -19, 39, 198, -211, -71, 146, -6, -86, -21, -22, -51, 64, 56, 32, 148, 8, 21, 107, -87, 119, 201, -151, -59, -48, 58, -46, 126, -79, 171, -9, -211, 56, 76, 10, -141, -19, -211, 249, 89, 115, -103, 51, 144, -25, 28, 58, 110, 157, -62, 44, -47, 197, 140, 62, -90, 66, -3, -17, -68, 187, 110, 19, -305, -270, -151, 3, -9, -135, -145, 62, 17, -213, -24, 140, 93, 68, -26, -191, 125, 5, -206, 226, 79, 41, 132, -16, -94, 117, 99, 143, 6, 19, 14, 54, 19, -135, -151, -169, -190, 2, 12, -282, -131, 23, -118, -261, -56, -14, 3, -207, 150, 228, 149, 36, -3, 84, 185]
3905A85j32n0J3J56P9l06M0j28K69j41k6p8K39j16M2j32K7J12k60J46O1K63l84
3928a21J79O6o4K7k67L9K10J6J37j60R2j40K50l2l07qJ32k59L95k27j6J12j28
3951g4J14K20l90N6J15k36J74J29P4R4k75j35K16N5k39l3M35l23rl4k8J8Q5M5
3975E4k06J96O5lL7j51O0q9J07J13l55L30l13K49j91k63L03p9L28q6k48J83Q1
3998A22L2j86P8O5l74L02j32K3Q5q0J44m1k7m9P9j16K8N8k13M3J31R3j31j5j93
4023b74L73m7J70m71K06O6j14K49j50L2j02O8k18J03m3O6O2q3M9J95l5j25rl07
4047c39L22k40J33P1j34J15L2K73q6l60N76l64k86J04J47lJ7pJ07j50J76l41J36
4070a01J25rj9j5m0M9k06O2K17p1j44K41N0j81K24j27n9L3J02k63J51J21j05K77
$$ y = [185, 53, 3, 16, 172, 251, -55, -15, -143, 126, -15, -41, -119, 120, 4, 46, -86, -59, 53, -207, -61, 0, 263, -121, 58, 124, 60, 87, -180, -141, 69, 85, 222, 62, 154, 14, 264, 232, -75, -83, 49, -210, 185, -42, -58, 54, -74, 40, 260, -130, -74, 41, -195, -21, 108, 182, 276, 1, -134, 82, 137, -102, -135, 300, -23, -32, -66, -94, -76, 9, 54, -152, 44, 109, 106, 143, -8, 52, -37, 70, 183, -172, 158, -155, 94, -97, -360, -57, -136, 192, 106, -142, 41, 122, 154, -32, 46, 111, -263, 39, -93, -70, 15, -65, 79, 38, 11, -38, 41, -75, -47, 11, -202, -159, -28, 65, -66, -81, -274, 99, 52, 222, -249, -43, 23, -91, 158, 8, 40, -62, 6, -212, -109, -152, -86, -24, -107, -58, 137, 102, -23, -32, -339, -17, -257, -124, -53, -187, -72, -40, 233, 147, -213, 363, -1, -287, -183, -36, -39, -22, -29, 78, -72, 104, -237, -101, 24, 15, -4, -19, -59, -10, -216, -154, 63, -8, -152, 89, 139, -42, 182, 55, -4, 29, 131, -132, 19, 140, 35, 312]
4094C12j53k19j32R2Q2K12k35O9j3k29J75N9j88K40j68L01l21J07j71J71J0N8
4116E9J2N0J47j33k67r7K81J5p8K16N1j27k0j75K44j44O3j64o3K9J40q5n6Q0r9
4141a21O7J88n2oJ51j41j82K29J00l07J52k19L47k75J08l9o6K44k22m5M8k04K49
4164Dj65r3J90Q0K28Ql50j83N40j78L28n23K01j70R4J97k48J59j56r2K89j13j91
4187a44L06o6j68p2L48l24q6K42O4k80J8J19o0J37q2K8q9O4M5j13P7K18j28o5
4211a1j41m0P2J70k33M6J83K4k83K38j04j48K87j18J11q7J6J04j29R1K9j25l2
4234h0K8J73k95J9KJ26M0qJ63l84O8K33j42L15l6m09K04j80J26J61j91K19j88
4257c6j92L36j79j5L50k15K6lj75J42O5K9k65L4O5j27L91k94J2j57L91j51j20
$$ y = [312, 159, -60, -192, -100, -18, 194, -41, 28, 15, -214, -39, 20, -168, 72, -96, 205, -116, -9, -180, -9, 1, 59, 71, 121, 268, 135, -132, -229, 52, 67, -11, 205, 256, 129, 109, -66, 178, 34, 97, -67, -130, -101, 39, -46, -102, -22, -121, -54, 134, 82, 76, 227, 86, -96, 133, 233, -74, 78, -141, 206, -69, 39, 0, -66, 178, -44, -89, -41, -245, 4, -161, -254, -64, 16, 244, 252, -98, -281, 259, 81, 409, -114, 87, -83, 11, 208, -40, 119, -37, -129, 160, 47, -144, 162, 96, -72, -144, 204, -120, -206, 36, 100, -180, -162, -43, -103, 34, -48, -20, -109, -45, 0, -113, -36, 182, 54, -11, -152, -192, -120, 50, -183, -137, 46, 70, -213, 25, -79, -227, 60, -58, 53, -34, -18, 86, -43, 48, 77, -48, -80, -52, 121, -174, -155, -153, -27, 13, 5, 168, -216, -148, 85, -57, 258, 222, -187, 17, -163, -37, 124, -67, 152, -36, -228, 108, -71, -86, 264, 49, 75, 72, -103, 39, 104, 133, -132, -98, -33, -160, 231, -63, -51, -208, 183, 32, -88]
4280h8J19q3N0P6R3j77L15k71j59M3R9j56L61j20l65M35r0p3J03j26J06k07K30
4303A15l69L42Lk97lJ25J98j41J43k06p7K18j32n6J25o5n8K49lj15j3m7r3J12
4327d5J81K6j80M5l4J46m5k38N23l18j40J89k09PL4L11k73o7qO7p4j40J61K0R0
4352B9j68J81mJ09k47J84K15m26L5K4R6j44k1l9L34J28j48l10K25j75J42K7K81
4375C28j14J4j72pl34j8L95J80m33k1L9J55J65j86K10k19Q1q1p2m9K62j06l7n7
4399g7j71L25k12M37k85O6J3q0p4J18O8l57J40L94m8m34J64l9nK34m30M94j10
4422A31j0k77k7J81r5L33l06J71r7M8m6q8Q0J27j59J30k17j82K60K00j80L8j79
4445a64J28R4j82J99j51j88J32k7n4L03j04J22o3k21r9M32j69p1J58k9o8L07l07
$$ y = [-88, 31, -52, -2, 74, 167, -10, 305, 34, -125, -82, 17, -139, 222, 102, -263, 172, 82, 9, 112, -14, 92, -115, 115, -254, 88, 91, -206, -209, -84, 114, -27, 116, -90, -167, 51, -81, -137, -12, -77, -135, 114, 111, -4, -17, -64, -157, -45, 136, 162, -18, 27, -7, 139, 94, -144, 379, 61, -79, 110, -99, -92, -58, 253, -20, -87, -95, -28, -102, -242, -81, -61, 29, -139, 42, 38, 147, -100, 84, 299, -127, -92, -68, 28, -116, -137, -176, 158, 286, 138, -172, 53, -122, 20, 47, 328, 214, 228, 56, 49, -285, -303, 92, 272, -161, -182, -143, 12, 177, -9, 201, -18, 63, -18, -90, -139, 123, 17, -20, -77, -248, 77, -135, 302, 17, 83, 96, 16, -58, 60, 128, -229, -89, 305, 257, -177, -13, -52, -57, 177, -253, 241, 131, 121, -156, -183, -2, -97, 236, -70, 101, 4, 52, 6, -82, -2, 125, -34, 96, -121, -303, -43, 157, -23, 15, -164, -36, 58, -124, 75, -76, -264, -132, -159, -213, 90, -14, 108, 45, -176, -275, 157, -12, -83, 75, 46, -22, 285, -22]
4468b2o0J91K41m00n3P1j10K6M7K50J5j66n3Q9o6J42r1o7k2jR9N6k86j56L86K14
4494B74m7l35n3Q1P1j62K38k47K22j17J25K6J46j76q4P8J52j14N2j53j61L35l58
4517b07L42o6P3k17L45k83k37J97K63k73J45k53j8J20K00j70K29j13m50M56k18
4538a35K24n6R0q0Pj30K52k98o7L15K0l28J91j81K20J6l57J81J06o8J25l10L74
4561A11m3R1l71O1K97r6J30j21j89R6j30J85l2p9J1j2J39k54L57j44j65J05K40
4584A87j33n1l05K91K86m50N0J38R6j83J45p3r2m8K01K2j14NK7qK87l80J83n8
4608B3N9m0k13Q1L49O3j92j31%j63L36p3l27L44k41Q4K37k73K35l06K18r1M1o4
4632d4L13j25l96N24j91l10J57P2QR2j02l6l2J48j3k89K21j61K40k92k7L83l11
$$ y = [-22, -82, 109, 350, -50, -103, -32, -142, -116, -69, 181, 196, 30, -23, 66, 0, 142, 51, -16, -38, -39, 60, 116, -170, -326, 60, 274, 227, -108, -161, -80, -9, -171, 67, -180, 42, -75, 50, 76, 222, 46, -38, 40, 192, 78, 130, -23, -184, 151, -207, 135, 69, 142, -75, 270, -13, -250, -53, 210, -63, 82, -171, -189, -69, 131, -39, 190, 77, -373, 83, -135, 89, 33, 123, 43, 50, -80, 172, -126, -193, 122, 142, -186, 5, -176, 44, 60, -297, -116, -10, -78, 47, -263, 111, 68, 159, -212, -151, 146, 50, 180, 59, -130, -34, -164, 21, -11, -90, -79, -91, 48, -206, 151, 7, -158, -53, 187, 54, 3, -302, -11, 275, -175, -125, 13, 109, -74, 71, -2, -94, -142, 59, 81, -33, -28, -1, -9, 278, -102, 81, 23, 82, 42, -171, -90, 259, 322, 130, -1, -1, -164, 172, 99, -228, 116, -125, -41, 196, -77, 158, -148, 70, -21, 20, -44, 269, 144, -252, 272, 81, -229, -72, 0, 8, 100, -2, -38, -70, 78, 65, -224, -3, -164, 76, -216, -243, 140, -171]
4655a71R5J44j27j99M01l44M30l26O7O6j21O0J44m7j15Oj43K88q1l29L76k5k06
4678a57K81k33L90l35K16j50J86j30k16K38q9j10K13L8j95p5K91m8Lk83K12n2
4700ek68lL93k06K5M2K15k10M3q5K39k31j7K04j44l1j17J58J72j30j43J56j33
4723g6R6k03P9K10q2r1N9R3p6K07K4k37J07j10N5N9k75J97J79j93rK93j90P4j56
4748C4m8J13j43J76j72j35j6L23o5k25M3K97r2p0p0k15J87J33m7k03M2K89l8l6
4772F2m6p3L4J02q9j25J65o3n5J2K82l41M5J45j48K2l28M97J5mL6q7j78L47k94
4797f7j1O8K34k85k52P09n07L13l1k47K48k86K0K5J07j0k2j15K85l3j68M0k67
4820b52L80q0j4qp1n9K3l1L25m24K70K02k72P0p2J6J96j88K3Q0k52J83j58K02
$$ y = [-171, -76, 68, -59, -258, 143, -201, 229, -97, -30, 36, -85, -25, 119, 72, -43, -37, -180, 108, 27, -302, 74, 49, -157, 124, -109, 281, -54, 162, 12, 198, 68, -148, 90, 1, -109, 104, 142, -53, -128, 163, 115, 118, -165, 47, -5, -273, -276, 117, -89, -64, -22, 193, -17, 26, -59, 180, -51, -68, 136, -8, -39, -156, 2, 174, 44, -99, 57, -76, 20, -183, -104, 106, 24, -67, -8, 85, 9, 216, 240, 3, 110, 0, 55, 114, -161, 36, 215, 22, 13, 306, 116, 190, 34, -14, 99, -44, 132, -40, -175, -191, 132, 67, -158, -115, 182, 90, 20, -50, -265, -78, 55, 8, -195, -153, 136, 98, 62, 16, -57, -23, 79, -10, -135, 30, -33, -88, -76, 206, -135, -90, 55, -93, -71, -399, 98, 113, 109, 145, 58, -120, 227, -67, -78, -10, 224, -61, -313, 396, -111, 202, 171, -76, 172, -114, -94, -69, 38, 28, 6, -109, 176, 143, -25, 15, -252, 128, 48, 34, 26, -45, -104, -81, -112, 213, -211, 59, 261, -11, 59, -13, 3, 199, 11, 34, 114, -138, 45, -113, 89]
4844H9n3L1r2L4J46k42Q4K8Q1k0J24l32N3J79Kj51K5j45K99j45km9K25p9j55J39
4870G4OK53n57l3J92o4O0K09j71K40l59M16k64J03r1L1J96l25K46k87M1J73L7
4893A26J32o6j77k11K15p7M4J63j23J07j25N7K15k91J52J93q6j09Oj46J18j44
4915b7m9K18k78QL23l01L34j83J69j78j57L19j67R0m23N33J0l10q0K46j08J34
4937A23k31O1L5J27q9j31J3K94k48j93O9L2P2K23l51R3j57J65N2J56j13k56M87
4960B33j16k29J30M2K0j50Q4j25L2J2K6K68l06J15l82L69k45L05R7l45K72M8j78
4983b3p1K32j67J59k89J89j24J54J85j79M5l90J75J65l13K67J29j32k1j87J50
5004d6p3N5k19K33n5K67l68K21K9R0k17J84j45j70J44P2M6j34J04RO3J7r5O4j00
$$ y = [89, 36, 67, -25, 9, 155, -87, -3, 25, 106, 86, 210, -122, -69, 110, 112, -39, -14, -159, 140, -5, -7, -56, 169, 90, -65, 74, 80, 333, -224, -257, -65, -129, -69, 140, -31, 209, -150, 266, 2, 105, 14, 45, 241, -84, 162, -125, -84, 89, 126, 258, 192, 15, -196, 19, -58, -14, 149, 26, 133, 8, 65, 280, -11, 141, 334, 248, 139, 145, -1, 117, -27, -76, 142, -136, -128, 195, -106, 228, 45, 214, 36, -121, 198, 31, 121, -302, 231, 241, -69, -149, 97, -11, 123, -108, -47, -12, 115, 26, -105, -92, 202, -46, -239, -170, -138, -66, 157, -194, -101, -258, -93, -41, 115, 2, -254, 233, 117, -112, 18, 60, 80, -70, 14, -111, -79, -67, -41, 227, -79, 36, -346, 23, -222, 83, 180, -165, 107, 155, -23, -94, 138, -29, 130, -159, 30, -94, 60, 245, 66, 111, -279, -104, 61, -252, 15, 144, 12, -9, -196, -46, -119, -64, -283, -50, -105, 162, -206, 15, 44, 134, -83, 101, -44, -214, -70, 2, 48, -86, 18, 27, 90, 107, 12, 76, -24]
5029b4p6N5q1Kk0L32l20l2J39L0j30nJ64k22J06k9J47j44J34L4O3k27K66j13l8
5054A1Or0K15p7j97k4J85p6J44j12J8m5J69k73L09j30k06J30k9P5k7M6O7j40Q9
5079C8j58J75J80k49k08K14j39K72j04L3j47K26k03N8J20j73O6J30J39m33J03
5100f0J73k78L20k17r1J80m7J2J14l70k24M34J03J36l03K49k89L52q8j03L6m8
5122iK00j6k23jJ89j86K09j61kJ7J35q8n9jk03K9P7n1K24k9k8M9k22K44l04M66
5148B56m26K06n0Q3k31p0pJ9M16n8k47R2k22L00J33l04J52mk19J39J69j38rj0
5172c0R1k2k28K1J50L5LMj3J3j68L64m00J45K28j28k4j74J29j89M31j81k00J57
5196A4J29j12K17k86P0rK31l11p9K20j43J07p4m0j23N8R5n7r9L43j72j29K80j39
$$ y = [-24, -100, -45, -126, -124, -144, 188, -132, -164, -25, 5, -125, -130, 34, -188, -82, -111, 36, -108, 26, 60, 123, -104, 162, 49, 11, 17, -73, 142, 65, -132, -156, 29, -47, 97, -15, 3, -42, 127, -146, 163, 33, -173, -43, -72, 3, -24, 22, 89, -51, 38, -120, 55, 235, -14, -222, -8, -147, 125, 21, 54, -93, 133, -70, -12, 108, -65, 1, 131, 270, -163, -60, 113, -165, 155, -62, -153, 27, -20, -8, 106, -264, -488, -54, 49, 185, -118, 131, -158, 194, 106, 3, 39, -9, 191, 175, -48, -49, 140, -46, 163, 2, 0, 17, 152, 64, 5, 4, -199, -170, -93, -144, 80, 51, 23, 72, -150, 94, -210, 256, -170, 36, -14, 69, -162, -232, -239, -220, 196, 138, -109, -17, -239, 61, 194, -110, 42, 38, -181, -42, 127, -11, -20, -30, 61, 39, -189, -168, -18, 17, 20, 24, 11, 24, -144, 220, -180, -35, 193, 65, 41, -133, -4, -193, 238, 57, -143, 14, 143, 31, 248, -38, 32, 23, 254, -57, -136, 84, -59, 48, -26, -66, -189, -131, -36, -93, -192, 151, -21, -150, 130, -9]
5220iK25n42M28j40J89q6l29L98n6n5j2K14k29J6R7m66L57M16k90k76P9r3QQ0
5244g6j3J06O1j72M02k76M7j17k73L99j78n6R7J6J30K7j61P4J4n2j57K41j76l2
5268a25J49N9j06%R8K2p6n9j3J68R5k75q2J09L9k53J78j33K67J00r4J87l24J87
5292A18Ok43K00p5j07O9k27K22qN9R7k00k17L92k35K14Lj59J39K72k09J97p7m06
5316a75K34k01J11K52k42L05j55j16k5J4j48M6q0K91o3J22j2k47j35K80o9Jo2
5339g4J22J57l23M1o9j64L28R4l41N2M08o5j72J08k30l9K86q2j41N2J28M0j45
5362b9K69K1k24p1J2Q9m7J00k36K95n7j52N6k09K78k5j39K2J1J20k58K36J45j70
5386C7k25j3J7L48k10P0j07k52J08J40P6Q0J99j03m97M72K1j44j28J70l02K62
$$ y = [-9, 216, -326, 102, -38, 151, 65, -264, 134, 78, 23, 11, 225, -4, 12, 109, -357, 0, 416, 126, -150, -71, -164, -156, -76, -89, 17, 78, -94, 308, 32, 79, -38, -311, 88, -90, -146, -49, -33, 97, 124, -37, 37, 51, -1, -158, 83, -93, -125, 24, 83, -23, -23, 75, 97, 21, -38, -51, 117, 212, -63, -145, -36, 3, -250, -72, -205, 62, 162, 68, 255, -69, 118, 124, -119, 81, 6, -101, -32, -259, -37, -45, 14, 111, -89, -306, 86, -149, 65, 68, -91, 48, 320, 111, 308, 231, -175, 59, -142, -31, 221, -21, 284, 129, 13, -12, 2, -146, -100, -180, 111, 48, 170, 158, -89, -224, 56, -13, -12, -74, 48, 205, -118, -77, -146, -310, 18, 112, -229, -177, 231, 166, -6, 102, -128, -167, 119, 37, -104, -52, 76, 116, -29, 240, 261, 37, -34, -22, 67, 20, 120, -116, 179, 122, -30, 26, -183, 95, 70, -69, -47, -36, 84, -174, 62, 207, 37, -188, -201, -184, 164, -46, 24, -83, -335, -227, -87, -11, 69, 268, 165, -332, 140, 161, 17, -111, 59, -243, 19]
5408A9j17K25o9o6K38p4j31J58j39q6j5K9k8K3J43J51k51j23Q3L7R4o4j29K96
5432B04j77N1j88K49j29q7k7N1K26j30K14n74J79K0P1J90j04n4P0L2k6P5r8l60
5456c22L32j92J95n3k35K78M1Q4J59l96L3N9k60K70r0K58N5k69N8j1p0R6l38K40
$$ y = [19, -98, 127, 58, -8, 230, 156, 25, 183, 44, -42, -57, -28, -56, -33, 110, 261, 10, -113, -30, 7, 101, 37, -92, 204, 27, 78, -110, 139, 10, -77, -104, -53, 173, 43, 257, -317, -138, -118, -47, 143, 39, -15, 55, 87, 61, 136, 38, -322, 10, -182, 13, -40, -275, 3, 44, 128, 287, -109, -76, -17, -277, -7, -97, 161, 216, -53, 5, -6, -76, 20, -318, -78]
$$ [...]
8191b03
##END NTUPLES=NMR FID
##END=
