##TITLE=1H_2-3MBBC
 CDCl3
 8 sc, 
 2.4.2024
##JCAMPDX= 6.0         $$ Bruker NMR JCAMP-DX V2.0
##DATA TYPE= NMR FID
##DATA CLASS= NTUPLES
##ORIGIN= UXNMR, Bruker Analytische Messtechnik GmbH
##OWNER= root
$$ XWIN-NMR		Version 3.5
$$ Tue Apr  2 14:07:44 2024 Russian Standard Time (UT+4h)  she@DPX200
##.OBSERVE FREQUENCY= 200.1311
##.OBSERVE NUCLEUS= ^1H
##.DELAY= (6, 6)
##.ACQUISITION MODE= SIMULTANEOUS
##.ACQUISITION SCHEME= undefined
##.AVERAGES= 8
##.DIGITISER RES= 18
##SPECTROMETER/DATA SYSTEM= spect
##.PULSE SEQUENCE= zg30
##.SOLVENT NAME= MeOD
##.SHIFT REFERENCE= (INTERNAL, MeOD, 0, 15.7039)
##AUDIT TRAIL= $$ (NUMBER, WHEN, WHO, WHERE, WHAT)
$$ ##TITLE= Audit trail, XWIN-NMR		Version 3.5
$$ ##JCAMPDX= 5.01
$$ ##ORIGIN= Bruker BioSpin GmbH
$$ ##OWNER= she
$$ F:/spectra/data/she/nmr/H-F/1/audita.txt
$$ ##AUDIT TRAIL=  $$ (NUMBER, WHEN, WHO, WHERE, WHAT)
(   1,<2024-04-02 14:06:21.81 +0400>,<she>,<DPX200>,
      <created by zg, POWCHK disabled, PULCHK disabled
       configuration hash MD5:
       00 E9 B6 7A A2 85 ED C7 34 08 36 98 17 FE 4E 26
       data hash MD5: 16K
       49 E7 EF 8D D9 48 57 B9 DA 8F 20 9D A5 23 AD 69>)
$$ ##END=
$$ 
$$ hash MD5
$$ 2B 4E 4F 03 4D DE 13 8E 12 CA 01 80 15 33 95 EC
##$RELAX= 
##$RELAX= 
##$RELAX= 
##$RELAX= 
##$RELAX= 
##$RELAX= 
$$ Bruker specific parameters
$$ --------------------------
##$DU= <F:/spectra>
##$EXPNO= 1
##$NAME= <H-F>
##$PROCNO= 1
##$TYPE= <nmr>
##$USER= <she>
##$AMP= (0..31)
100 100 100 100 100 100 100 100 100 100 100 100 100 100 100 100 100 100 
100 100 100 100 100 100 100 100 100 100 100 100 100 100 
##$AQSEQ= 0
##$AQ_mod= 1
##$AUNM= <au_zg>
##$AUTOPOS= <>
##$BF1= 200.13
##$BF2= 200.13
##$BF3= 200.13
##$BF4= 200.13
##$BF5= 200.13
##$BF6= 200.13
##$BF7= 200.13
##$BF8= 200.13
##$BYTORDA= 1
##$CFDGTYP= 0
##$CFRGTYP= 5
##$CHEMSTR= <none>
##$CNST= (0..31)
1 1 145 1 1 1 1 1 1 1 1 1 1 1 1 1 1 1 1 1 1 1 1 1 1 1 1 1 1 1 1 1 
##$CPDPRG= <>
##$CPDPRG1= <>
##$CPDPRG2= <>
##$CPDPRG3= <>
##$CPDPRG4= <mlev>
##$CPDPRG5= <mlev>
##$CPDPRG6= <mlev>
##$CPDPRG7= <mlev>
##$CPDPRG8= <mlev>
##$CPDPRGB= <>
##$CPDPRGT= <>
##$D= (0..31)
0 1.2 0 0 0 0 0 0 0 0.06 0 0.03 0 0 0 0 0.0002 0 0 0 0 0 0 0 0 0 0 0 0 
0 0 0 
##$DATE= 1712052381
##$DBL= (0..7)
120 120 120 120 120 120 120 120 
##$DBP= (0..7)
150 150 150 150 150 150 150 150 
##$DBP07= 0
##$DBPNAM0= <>
##$DBPNAM1= <>
##$DBPNAM2= <>
##$DBPNAM3= <>
##$DBPNAM4= <>
##$DBPNAM5= <>
##$DBPNAM6= <>
##$DBPNAM7= <>
##$DBPOAL= (0..7)
0.5 0.5 0.5 0.5 0.5 0.5 0.5 0.5 
##$DBPOFFS= (0..7)
0 0 0 0 0 0 0 0 
##$DE= 6
##$DECBNUC= <off>
##$DECIM= 32
##$DECNUC= <off>
##$DECSTAT= 4
##$DIGMOD= 1
##$DIGTYP= 9
##$DL= (0..7)
0 120 120 120 120 120 120 120 
##$DP= (0..7)
150 150 150 150 150 150 150 150 
##$DP07= 0
##$DPNAME0= <>
##$DPNAME1= <>
##$DPNAME2= <>
##$DPNAME3= <>
##$DPNAME4= <>
##$DPNAME5= <>
##$DPNAME6= <>
##$DPNAME7= <>
##$DPOAL= (0..7)
0.5 0.5 0.5 0.5 0.5 0.5 0.5 0.5 
##$DPOFFS= (0..7)
0 0 0 0 0 0 0 0 
##$DQDMODE= 0
##$DR= 18
##$DS= 0
##$DSLIST= <SSSSSSSSSSSSSSS>
##$DSPFIRM= 0
$$ [...]
##$SUBNAM2= <"">
##$SUBNAM3= <"">
##$SUBNAM4= <"">
##$SUBNAM5= <"">
##$SUBNAM6= <"">
##$SUBNAM7= <"">
##$SUBNAM8= <"">
##$SUBNAM9= <"">
##$SW= 18.051750892319
##$SWIBOX= (0..15)
0 0 2 0 0 0 0 0 0 0 0 0 0 0 0 0 
##$SW_h= 3612.71676300578
##$TD= 16384
##$TD0= 1
##$TE= 0
##$TE2= 300
##$TE3= 300
##$TEG= 300
##$TL= (0..7)
0 120 120 120 120 120 120 120 
##$TP= (0..7)
150 150 150 150 150 150 150 150 
##$TP07= 0
##$TPNAME0= <>
##$TPNAME1= <>
##$TPNAME2= <>
##$TPNAME3= <>
##$TPNAME4= <>
##$TPNAME5= <>
##$TPNAME6= <>
##$TPNAME7= <>
##$TPOAL= (0..7)
0.5 0.5 0.5 0.5 0.5 0.5 0.5 0.5 
##$TPOFFS= (0..7)
0 0 0 0 0 0 0 0 
##$TUNHIN= 0
##$TUNHOUT= 0
##$TUNXOUT= 0
##$USERA1= <user>
##$USERA2= <user>
##$USERA3= <user>
##$USERA4= <user>
##$USERA5= <user>
##$V9= 5
##$VALIST= <valist>
##$VCLIST= <CCCCCCCCCCCCCCC>
##$VD= 0
##$VDLIST= <DDDDDDDDDDDDDDD>
##$VPLIST= <PPPPPPPPPPPPPPP>
##$VTLIST= <TTTTTTTTTTTTTTT>
##$WBST= 1024
##$WBSW= 4
##$XGAIN= (0..3)
0 0 0 0 
##$XL= 0
##$YL= 0
##$YMAX_a= 206716
##$YMIN_a= -225115
##$ZGOPTNS= <>
##$ZL1= 120
##$ZL2= 120
##$ZL3= 120
##$ZL4= 120
##$ABSF1= 10
##$ABSF2= 0
##$ABSG= 5
##$ABSL= 3
##$ALPHA= 0
##$AQORDER= 0
##$ASSFAC= 0
##$ASSFACI= 0
##$ASSFACX= 0
##$ASSWID= 0
##$AUNMP= <proc_1d>
##$AZFE= 0.1
##$AZFW= 0.1
##$BCFW= 1
##$BC_mod= 2
##$BYTORDP= 1
##$COROFFS= 0
##$CY= 11.3945322036743
##$DATMOD= 1
##$DC= 2
##$DFILT= <>
##$DTYPP= 0
##$F1P= 15.7292609196834
##$F2P= 12.9074282941183
##$FCOR= 0.5
##$FTSIZE= 0
##$FT_mod= 4
##$GAMMA= 1
##$GB= 0.15
##$INTBC= 1
##$INTSCL= 1
##$ISEN= 128
##$LB= 0.24
##$LEV0= 0
##$LPBIN= 0
##$MAXI= 10000
##$MC2= 0
##$MEAN= 0
##$ME_mod= 0
##$MI= 1.114404
##$NCOEF= 0
##$NC_proc= 0
##$NLEV= 6
##$NOISF1= 3.799351
##$NOISF2= 2.8
##$NSP= 1
##$NTH_PI= 0
##$NZP= 0
##$OFFSET= 15.70392
##$PC= 1
##$PHC0= -25462.72
##$PHC1= 16.38731
##$PH_mod= 1
##$PKNL= yes
##$PPARMOD= 0
##$PSCAL= 0
##$PSIGN= 0
##$REVERSE= no
##$SF= 200.130013532006
##$SI= 16384
##$SIGF1= 3
##$SIGF2= 2
##$SINO= 400
##$SIOLD= 16384
##$SREGLST= <1H.CDCl3>
##$SSB= 0
##$STSI= 0
##$STSR= 0
##$SW_p= 3612.71676300578
##$SYMM= 0
##$S_DEV= 0
##$TDeff= 0
##$TDoff= 0
##$TI= <>
##$TILT= no
##$TM1= 0
##$TM2= 0
##$TOPLEV= 0
##$USERP1= <user>
##$USERP2= <user>
##$USERP3= <user>
##$USERP4= <user>
##$USERP5= <user>
##$WDW= 1
##$XDIM= 8192
##$YMAX_p= 0
##$YMIN_p= 0
$$ End of Bruker specific parameters
$$ ---------------------------------
##NTUPLES= NMR FID
##VAR_NAME=  TIME,          FID/REAL,        FID/IMAG
##SYMBOL=    X,             R,               I
##VAR_TYPE=  INDEPENDENT,   DEPENDENT,       DEPENDENT
##VAR_FORM=  AFFN,          ASDF,            ASDF
##VAR_DIM=   8192,          8192,            8192
##UNITS=     SECONDS,       ARBITRARY UNITS, ARBITRARY UNITS
##FACTOR=    0.0002768,     1,               1
##FIRST=     0,             0,               0
##LAST=      2.2672688,     0,               0
##MIN=       0,             -225115,         0
##MAX=       2.2672688,     206716,          0
$$ Real data points
##PAGE= N=1
##DATA TABLE= (X++(R..R)), XYDATA
0 0 0 0 0 0 0 0 0 0 0 0 0 0 0 0 0 0 8 -8 8 -8 14 -16 16 -24 24 -32 40 -44 52 -60 68 -80 92 -106 119 -136 156
37 156 -172 196 -220 246 -275 307 -340 378 -419 464 -512 567 -626 689 -758 833 -916 1007
55 1007 -1108 1218 -1343 1480 -1633 1807 -2001 2219 -2466 2731 -2994 3173 -2957 821 16276
70 16276 206716 -160318 74472 76215 -222629 186737 -57760 -50709 152883 -152289 34383
81 34383 71083 -115262 97228 -13521 -77405 102226 -48303 -38801 94632 -101058 35714
92 35714 74559 -127513 103781 -31634 -82001 158423 -125286 36832 71437 -159053 147597
103 147597 -52216 -57329 142268 -150917 68826 36223 -118321 134640 -70199 -21837 90777
114 90777 -108550 56583 24031 -71338 76333 -31501 -38420 72289 -50682 -898 59972
125 59972 -85680 45216 28696 -88339 101040 -54800 -36727 112441 -120925 65178
135 65178 28139 -116475 138769 -76445 -17623 102919 -137772 87870 10272 -87050 116841
146 116841 -84631 -3038 76001 -92659 60400 5135 -67396 74169 -30428 -24905 65181
157 65181 -60565 7962 52959 -76274 53583 7420 -73075 95951 -57956 -15164 83514
168 83514 -110217 70029 11521 -85783 113285 -79973 -560 78179 -107811 79890 -8483
179 -8483 -63845 94847 -69728 9506 52093 -76739 52694 -507 -47802 61124 -32934
190 -32934 -16151 51882 -53687 16299 34524 -63906 53921 -8032 -48230 78847 -60875
201 -60875 7651 54244 -88487 71732 -12567 -52849 89834 -78299 20360 46762 -84819
212 -84819 75179 -25325 -38697 75491 -65504 21008 33061 -64099 52829 -8827 -34721
223 -34721 55133 -38535 -5024 44306 -52743 26669 18547 -56477 57581 -21637 -30027 66568
235 66568 -65671 23138 35124 -73613 71779 -27763 -33044 75252 -73036 31277 27865
246 27865 -69633 69561 -30436 -23406 60431 -60797 24458 22321 -52694 48757 -14869 -26529
258 -26529 48530 -38019 3265 34694 -48980 31685 7488 -43468 53821 -29738 -14077 51035
270 51035 -59640 31688 15708 -55547 63250 -35377 -14166 55307 -64035 36796 11211
281 11211 -51352 61087 -34467 -9582 46635 -54358 29318 11855 -43192 46597 -21586 -17153
293 -17153 42910 -40868 12196 24107 -45909 37767 -4698 -31897 50281 -37463 878 38167
305 38167 -54213 38880 553 -40582 56878 -39878 -449 39949 -56565 39068 -25 -38261
317 -38261 52824 -36259 -1247 36461 -47977 31028 4610 -35468 43889 -24292 -9415 36910
329 36910 -40641 18414 15317 -39955 38993 -14034 -21030 42994 -39298 10897 24814 -45943
341 -45943 39809 -9189 -26726 47529 -39459 8585 27745 -46951 38364 -7173 -27798 45215
353 45215 -35837 4653 27862 -43439 31698 -1632 -29146 41305 -27735 -2410 30962 -39606
365 -39606 24252 6646 -32685 38988 -20963 -9869 34640 -38294 18364 12338 -36093 37264
377 37264 -16361 -14792 36459 -36163 14021 16637 -36620 34784 -11405 -18223 37080 -32758 9009
390 9009 20405 -37064 31160 -6434 -22458 37040 -29624 3762 23785 -37200 27642 -1740
402 -1740 -25067 36584 -25640 -221 26096 -35260 23407 3018 -26737 33956 -20227 -5833
414 -5833 27711 -32641 16783 8743 -29310 31194 -14123 -12062 30790 -30586 11826 14717 -32127
427 -32127 30604 -10018 -16086 33122 -30050 9269 16894 -32897 28902 -8522 -17092 31331 -27208
440 -27208 6680 16756 -29611 24108 -4154 -17252 27818 -20426 902 19213 -26468 17349
452 17349 3255 -21779 26579 -14908 -6877 24548 -27981 13501 9249 -27348 29177 -13691
464 -13691 -10332 28587 -29914 14279 10124 -27938 29577 -13856 -8950 26177 -27372 12445 8552
477 8552 -23762 23661 -9679 -9856 21655 -19886 5261 12393 -21444 16517 -479 -15783 22915
490 22915 -14614 -2932 19720 -24896 14948 4871 -22529 26934 -16287 -4910 23253 -28498
502 -28498 17101 3415 -22231 27924 -17277 -2323 20003 -25156 15871 2635 -17440 21360
514 21360 -12158 -4078 16493 -17535 7113 7272 -17449 15050 -2763 -12132 19574 -14867 -467
527 -467 16454 -22726 16096 1461 -18818 25813 -17580 -381 18836 -26730 19021 -1157
539 -1157 -16874 24946 -18896 2023 13983 -21249 16042 -1910 -11851 16968 -11209 -247
551 -247 11211 -13327 6430 4556 -12199 11855 -2718 -9179 15046 -12271 1011 12138 -19007
564 -19007 14181 -1578 -13223 21417 -17142 3503 12037 -21342 19426 -5725 -9680 19405
576 19405 -18634 7552 7146 -16124 15356 -6792 -5578 12596 -10942 3046 5528 -10111 6695
589 6695 1778 -8126 9438 -3548 -5866 12519 -10737 2769 8325 -15899 14043 -3880 -8765
602 -8765 17305 -17075 6506 6966 -16760 17879 -9487 -3998 14402 -16343 10642 1152 -11051
615 -11051 13716 -8681 158 7969 -10161 5162 1528 -6672 6736 -1426 -5586 7586 -4609
628 -4609 -2168 9561 -10923 4858 4570 -12403 14703 -7176 -4613 13993 -16584 10312 2601
641 2601 -13635 16598 -12074 492 10826 -15194 11353 -2686 -7180 12058 -8972 2471
653 2471 4508 -8000 5856 144 -4101 4941 -1937 -3435 6301 -4057 -1414 6728 -9494 5473
667 5473 2532 -9675 12221 -8307 -1396 10910 -14095 10671 -1105 -9434 14653 -11439 3296
680 3296 6634 -12862 10881 -3970 -3954 9044 -8898 2933 2591 -5542 5216 -1079 -3239 3760
694 3760 -1220 -1941 5174 -3880 -841 5422 -7352 5675 753 -7552 9745 -7640 1075 7058
708 7058 -11433 9173 -3336 -4815 10818 -10195 4826 2296 -8094 9633 -5195 -452 5072
721 5072 -6932 4554 -38 -2996 3534 -2471 -713 2310 -1299 -898 2439 -2947 642 3311 -5060
736 -5060 4479 -1214 -3701 7490 -6434 2704 2729 -7842 8453 -4492 -1271 6370 -9024 5860
750 5860 -480 -4419 7408 -6435 1714 2784 -4879 5227 -2044 -1556 3057 -2513 1216 1235 -1989
765 -1989 217 1071 -2016 1612 685 -3624 3716 -2237 -738 4594 -5775 3611 281 -4207 6906
780 6906 -5193 1024 3351 -6298 6213 -2436 -2238 4930 -5836 3190 863 -3732 4110 -2969 -36
795 -36 2608 -2518 1488 193 -1543 1570 343 -1274 1482 -793 -1328 2838 -2432 570 1542 -4041
811 -4041 3759 -1356 -1625 3958 -4783 2611 1093 -3467 4907 -3517 160 3019 -4078 3760 -1211
826 -1211 -2079 3240 -3089 1335 925 -2659 1953 -866 -647 1865 -1380 -44 1104 -1357 1029 888
842 888 -1902 1780 -594 -1146 2781 -2571 723 1210 -3175 3289 -1501 -1274 3024 -3666 2236 736
858 736 -2976 3649 -2461 -57 2843 -3345 2404 -114 -2333 3248 -2035 -197 1939 -3005 1666
873 1666 552 -2228 2546 -1414 -927 2690 -2429 1144 1282 -2976 2831 -789 -1340 3138 -3081 793
889 793 1729 -3282 3021 -1118 -2017 3312 -3038 891 1880 -3512 3008 -648 -1783 3739 -2974 621
905 621 2138 -3620 3170 -612 -2371 3545 -3167 563 2196 -3810 2905 -618 -2148 3739 -2841
920 -2841 393 2205 -3365 2769 38 -2322 3297 -2182 -278 2660 -3392 1756 667 -3302 3583
935 3583 -1830 -1352 3661 -4176 2016 1584 -4066 4540 -2263 -1302 4418 -4717 2598 1134 -4193 4734
951 4734 -2653 -861 3682 -4462 2358 809 -3394 3818 -1863 -1248 3338 -3074 1017 2060 -3523
966 -3523 2821 1 -2947 4240 -2921 -544 3737 -5162 3282 493 -4560 5853 -4054 -306 4523
981 4523 -6249 4560 -173 -3911 6202 -4659 714 3463 -5394 4216 -600 -3079 4450 -3218
995 -3218 -73 2939 -3848 1861 1190 -3616 3520 -831 -2546 4640 -3754 500 3661 -5757 4667
1010 4667 -563 -4118 6682 -5591 1131 3866 -7020 6061 -1965 -3278 6456 -6071 2348 2557
1024 2557 -5466 5376 -1988 -2045 4645 -3992 1049 2365 -3990 2649 382 -3452 3940 -1856 -2072
1039 -2072 4747 -4699 1490 3086 -6184 5940 -1922 -3333 7263 -6976 3013 2959 -7190 7637
1053 7637 -3804 -2064 6442 -7350 3978 1115 -5431 6140 -3471 -1032 4375 -4653 2213 1703
1067 1703 -3951 3525 -311 -2934 4468 -2777 -1033 4591 -5593 2879 1820 -6179 7024 -3787
1081 -3787 -1981 6856 -8218 4970 1324 -6678 8619 -5604 -287 5997 -7907 5576 -223
1094 -223 -4859 6649 -4580 -10 3887 -5242 2906 963 -3945 3993 -1079 -2719 4849 -3545 -193
1109 -193 4572 -6270 4156 927 -5791 7756 -5278 -553 6257 -8742 6380 -462 -5846 8799
1123 8799 -6945 1412 4904 -8033 6637 -1601 -3805 6814 -5396 1068 3444 -5348 3688 248
1137 248 -3843 4458 -2094 -2126 5011 -4635 812 3775 -6605 5521 -628 -4831 8023 -6620 1444
1152 1444 5111 -8695 7750 -2490 -4300 8630 -8117 3177 3087 -7741 7473 -3283 -2432
1165 -2432 6228 -6216 2417 2509 -5123 4622 -725 -3324 5046 -2997 -1122 4926 -5659 2341 2758
1180 2758 -6767 6784 -2710 -3720 8116 -8099 3392 3443 -8728 9033 -4199 -2739 8425
1193 8425 -9109 4759 1978 -7219 8338 -4499 -1714 6045 -6837 3317 1924 -5631 5117
1206 5117 -1505 -3110 5725 -4038 -377 4892 -6420 3974 1755 -6641 7733 -4344 -2131 7825
1220 7825 -9084 4991 1770 -8144 9737 -5792 -1271 7426 -9460 6045 793 -6392 8356
1233 8356 -5274 -629 5800 -6740 3721 1340 -5443 5557 -1992 -2901 5630 -4958 387 4558
1247 4558 -6776 4787 455 -6007 8160 -5251 -563 6820 -9175 6275 386 -6631 9591
1260 9591 -6960 161 6140 -9118 6841 -782 -5576 7964 -5927 604 4993 -6835 4427
1273 4427 526 -4778 6213 -2948 -2052 5600 -5613 1875 3628 -6920 5754 -1218 -4738 8084
1287 8084 -6660 1036 5227 -8826 7496 -1388 -5242 9006 -7716 2187 4931 -8550 7346
1300 7346 -2117 -4309 7856 -6413 1408 3948 -7080 5364 -259 -4558 6341 -4183 -998
1313 -998 5718 -6334 3190 2246 -6775 7033 -2651 -3259 7695 -7849 2820 3847 -8387 8207
1327 8207 -3362 -3841 8511 -8198 3466 3465 -8241 7881 -2956 -3172 7648 -7073 2194 3527
1341 3527 -6875 6039 -1150 -4369 6704 -5014 -89 5224 -7141 4245 1226 -6122 7667
1354 7667 -4061 -2041 7009 -7987 4304 2347 -7545 8164 -4274 -2278 7655 -8326 4023
1367 4023 2220 -7361 7908 -3685 -2590 6905 -7211 3152 3068 -6796 6455 -2147 -3561 7051
1381 7051 -5719 1000 4251 -7325 5492 -154 -5235 7439 -5479 -425 5999 -7854 5255
1394 5255 536 -6297 8253 -5014 -718 6390 -8115 4871 1194 -6203 7721 -4551 -1577
1407 -1577 6380 -7285 3838 1955 -6653 6864 -3027 -2539 6811 -6665 2337 3373 -6898 6625
1421 6625 -1811 -4059 7367 -6284 1435 4480 -7706 6024 -1012 -4870 7838 -6000 341
1434 341 5145 -7796 5700 87 -5567 7688 -5177 -379 5982 -7581 4556 1035 -6226 7531
1448 7531 -4175 -1736 6379 -7380 3678 2344 -6777 7041 -3130 -2784 7141 -6746 2694 3279
1462 3279 -7167 6576 -1892 -3800 7182 -6346 1302 4359 -7346 5831 -829 -4998 7494
1475 7494 -5476 229 5355 -7688 5300 394 -5624 7701 -5006 -754 5995 -7581 4668
1488 4668 1013 -6134 7270 -4255 -1478 6069 -7078 3546 1963 -6168 6691 -2866 -2623 6400
1502 6400 -6105 2275 3409 -6744 5929 -1539 -3941 7071 -5888 934 4388 -7426 5883
1515 5883 -688 -4899 7416 -5745 627 5020 -7411 5504 -291 -4920 7244 -4966 -100
1528 -100 4926 -6806 4342 636 -5204 6233 -3656 -1467 5560 -6084 2874 2236 -6100 6179
1542 6179 -2244 -2977 6665 -6285 2110 3620 -7086 6434 -2033 -3825 7301 -6547 1872 3739
1556 3739 -7314 6277 -1734 -3771 6881 -5703 1309 3877 -6350 5006 -487 -4151 6042
1569 6042 -4016 -400 4715 -6043 3332 1410 -5519 6185 -2998 -2264 6262 -6506 2884 2776
1583 2776 -6706 6887 -2821 -2773 6993 -6932 2940 2700 -6730 6685 -2834 -2692 6231 -6186 2253
1598 2253 2785 -5906 5221 -1363 -3250 5791 -4370 278 4012 -5778 3865 706 -4930 6154
1612 6154 -3602 -1422 5693 -6723 3524 1678 -6234 7100 -3811 -1713 6333 -7135 3947
1625 3947 1538 -5854 6843 -3666 -1472 5490 -5983 2940 1651 -5101 5108 -2019 -2306 4983
1639 4983 -4419 862 3258 -5316 4063 90 -4171 5944 -3951 -561 4965 -6584 4218 698
1653 698 -5385 6945 -4532 -620 5327 -7046 4563 419 -5055 6593 -4233 -399 4608 -5803
1667 -5803 3549 827 -4366 5101 -2465 -1562 4544 -4488 1456 2523 -5109 4261 -747 -3566 5687
1682 5687 -4427 461 4229 -6353 4844 -241 -4392 6694 -5056 558 4304 -6599 5057
1695 5057 -792 -4012 6046 -4765 481 3685 -5513 3829 34 -3651 4861 -2842 -842 4068
1709 4068 -4451 2002 1874 -4616 4414 -1345 -2800 5379 -4750 1080 3329 -5965 5093 -1194 -3459
1724 -3459 6166 -5390 1448 3306 -5965 5285 -1472 -2928 5553 -4789 1223 2753 -4927 3905
1738 3905 -662 -2976 4422 -3094 -361 3444 -4305 2335 1275 -4174 4570 -1881 -1959 4926 -4884
1753 -4884 1930 2385 -5388 5272 -2123 -2387 5547 -5520 2237 2133 -5323 5289 -2181 -1937 4833
1768 4833 -4713 1873 2027 -4320 4028 -1168 -2287 4147 -3275 260 2902 -4296 2665 597 -3689
1783 -3689 4510 -2546 -1205 4354 -4923 2602 1433 -4743 5296 -2713 -1394 4779 -5400 2871
1797 2871 1210 -4542 5123 -2750 -1217 4104 -4578 2252 1275 -3841 3928 -1482 -1718 3862 -3315
1812 -3315 652 2452 -4033 3063 27 -3196 4343 -2929 -482 3747 -4846 2996 599 -4028 5126
1827 5126 -3204 -522 3964 -5061 3261 536 -3701 4793 -2938 -488 3608 -4229 2422 687 -3350
1842 -3350 3694 -1794 -1302 3398 -3339 1045 1995 -3677 3137 -440 -2629 4156 -3125 217 3019
1857 3019 -4573 3256 -106 -3166 4651 -3452 103 3143 -4583 3389 -248 -2972 4336 -2990 135
1872 135 2856 -3877 2554 308 -2783 3561 -1964 -851 3054 -3305 1492 1453 -3436 3143 -1045 -1822
1888 -1822 3787 -3330 758 2241 -3968 3543 -720 -2295 4102 -3496 753 2425 -4068 3323 -792
1903 -792 -2349 3875 -3078 483 2252 -3672 2625 3 -2367 3409 -2146 -364 2718 -3184 1762
1918 1762 854 -3030 3254 -1480 -1234 3236 -3381 1284 1533 -3521 3389 -1268 -1717 3600 -3323 1204
1934 1204 1788 -3597 3188 -922 -1726 3396 -3020 609 1864 -3235 2644 -409 -2159 3142 -2289
1949 -2289 -21 2303 -3178 1973 406 -2510 3215 -1793 -775 2751 -3104 1710 984 -2917 3067
1964 3067 -1475 -1090 3028 -3032 1204 1188 -3033 2980 -1027 -1373 2922 -2710 859 1603 -2874 2477
1980 2477 -577 -1685 2908 -2243 256 1794 -2982 2068 -27 -2024 2838 -1979 -156 2227 -2807
1995 -2807 1710 393 -2301 2828 -1484 -514 2381 -2722 1386 864 -2399 2582 -1291 -1014 2513 -2487
2011 -2487 796 932 -2305 2117 -671 -1039 2333 -2108 581 1239 -2243 2068 -420 -1334 2205 -1841
2027 -1841 351 1338 -2220 1592 -114 -1444 2170 -1468 -201 1562 -1992 1333 426 -1774 2064
2042 2064 -1127 -531 1926 -2154 920 705 -2048 2142 -952 -835 2058 -2120 899 926 -2007 2008
2058 2008 -753 -921 2041 -1779 557 930 -1893 1592 -242 -1211 1725 -1387 -74 1374 -1804 1110
2074 1110 276 -1637 1947 -997 -458 1761 -2028 986 681 -1783 2084 -1077 -653 1926 -1995 974
2090 974 594 -1823 1850 -800 -617 1673 -1631 611 690 -1439 1399 -285 -871 1488 -1112 -9
2106 -9 1127 -1615 911 238 -1370 1688 -945 -442 1517 -1803 1018 456 -1644 1877 -1031 -315 1620
2123 1620 -1793 1001 348 -1409 1632 -896 -329 1255 -1380 588 427 -1164 1014 -369 -607 1165
2139 1165 -886 61 948 -1305 841 227 -1213 1465 -890 -316 1381 -1680 1026 178 -1435 1687
2155 1687 -1119 -44 1206 -1630 1113 46 -1007 1429 -992 16 915 -1055 675 148 -828 893
2171 893 -335 -456 901 -811 52 757 -1106 876 184 -1088 1420 -897 -61 1202 -1540 1091
2187 1091 91 -1180 1579 -1167 105 939 -1462 1177 -174 -773 1241 -902 100 715 -925 587
2203 587 155 -655 725 -108 -419 840 -751 -20 808 -1126 725 87 -995 1362 -949 -82 1079
2220 1079 -1470 1110 -36 -972 1453 -1126 242 764 -1274 1048 -260 -587 1003 -799 135 515
2236 515 -706 436 141 -558 550 -145 -500 802 -508 -46 781 -1007 671 215 -921 1250 -817
2253 -817 -80 926 -1345 952 -95 -833 1264 -992 220 636 -999 867 -251 -449 793 -601
2269 -601 45 431 -536 198 238 -579 459 -5 -539 772 -493 -158 716 -948 706 150 -805 1198
2287 1198 -814 14 819 -1189 869 -202 -718 1045 -943 221 490 -876 698 -191 -367 598 -368
2304 -368 -1 362 -419 151 340 -526 425 67 -528 757 -491 -174 671 -993 592 80 -810 1077
2322 1077 -774 7 714 -1112 865 -159 -504 919 -726 198 416 -694 567 -123 -411 488 -166
2339 -166 -127 466 -397 55 376 -586 422 154 -566 815 -487 -76 797 -968 652 9 -815 1006
2357 1006 -757 8 640 -991 724 -173 -517 760 -613 120 382 -593 452 42 -405 485 -126 -272
2375 -272 446 -375 -36 454 -641 372 125 -657 851 -530 -73 751 -955 661 47 -688 912 -734
2393 -734 94 621 -837 644 -71 -475 672 -490 -14 368 -566 303 168 -483 482 -69 -307 596 -441
2412 -441 -32 559 -750 524 77 -597 850 -617 -119 670 -925 595 -2 -640 921 -696 44
2429 44 592 -805 599 11 -480 730 -461 -91 531 -563 211 190 -586 462 -126 -463 742 -546
2447 -546 -22 578 -755 577 41 -654 904 -662 -9 674 -896 603 -32 -669 876 -584 -72
2464 -72 590 -813 534 61 -517 782 -389 -219 666 -592 252 308 -714 630 -96 -400 733 -669
2482 -669 43 558 -833 647 -84 -606 879 -682 38 603 -893 642 -2 -589 885 -600 -73
2499 -73 651 -823 496 112 -691 716 -428 -158 768 -746 308 370 -710 818 -252 -407 747
2516 747 -714 191 456 -870 660 -157 -564 858 -695 26 596 -855 670 43 -643 836 -651
2533 -651 -38 701 -892 536 114 -756 934 -511 -231 778 -909 439 352 -852 849 -413 -366
2550 -366 864 -785 308 419 -908 813 -219 -436 921 -775 93 578 -918 688 -63 -689 1055
2567 1055 -645 -20 771 -1018 616 157 -744 1045 -611 -168 866 -965 544 231 -881 944
2583 944 -463 -296 843 -964 368 359 -915 841 -278 -455 881 -791 212 645 -946 701 -28
2600 -28 -696 1045 -716 -98 876 -1103 728 71 -861 1099 -751 -96 911 -1114 707 175 -840
2617 -840 1055 -578 -210 856 -994 494 305 -875 824 -382 -510 941 -759 170 554 -1011
2633 -1011 805 -17 -699 1027 -818 -10 799 -1121 838 30 -815 1223 -812 -25 792 -1187 763
2650 763 -33 -727 1021 -735 -108 725 -892 597 210 -787 827 -408 -310 896 -794 158 521 -1017
2668 -1017 867 -168 -726 1087 -916 106 770 -1232 989 -142 -740 1281 -965 149 698 -1151
2684 -1151 930 -185 -672 1066 -849 57 696 -940 555 56 -740 889 -488 -274 860 -931
2700 -931 385 528 -1016 953 -348 -619 1188 -1009 321 658 -1281 1126 -336 -597 1309 -1143
2716 -1143 346 642 -1105 1036 -320 -585 1056 -866 182 634 -958 718 52 -737 978 -579
2732 -579 -275 907 -996 416 441 -1078 1084 -442 -534 1225 -1167 437 556 -1300 1259 -498 -528
2749 -528 1187 -1242 452 490 -1176 1077 -394 -470 1071 -889 236 570 -969 748 -33 -704 1066
2766 1066 -652 -173 894 -1079 573 351 -1097 1143 -569 -399 1135 -1245 583 433 -1219 1316
2782 1316 -637 -330 1185 -1264 671 316 -1051 1119 -524 -362 907 -981 326 464 -961 814
2798 814 -60 -651 967 -622 -43 883 -1110 703 212 -1060 1245 -721 -263 1106 -1364 807 219
2815 219 -1136 1338 -805 -211 1023 -1297 815 179 -915 1182 -609 -171 942 -973 455 360
2831 360 -1009 843 -247 -573 1031 -784 69 789 -1144 810 34 -918 1331 -880 -72 990 -1356
2848 -1356 1002 -10 -1000 1349 -935 -96 980 -1280 869 41 -867 1144 -654 -104 833 -1061
2864 -1061 486 324 -976 970 -362 -509 1064 -957 218 690 -1209 915 -102 -838 1320 -998
2880 -998 75 907 -1313 1110 -117 -844 1336 -980 102 817 -1206 926 -64 -770 1137 -761
2896 -761 -43 824 -1042 604 249 -862 1025 -411 -366 1066 -999 390 593 -1168 1031 -261 -613
2913 -613 1253 -1122 270 646 -1303 1123 -285 -677 1274 -1068 313 716 -1180 978 -135 -703
2929 -703 1086 -807 96 783 -1077 667 168 -815 1077 -569 -286 975 -1056 499 347 -1087 1145
2946 1145 -446 -458 1146 -1192 478 511 -1210 1201 -454 -526 1223 -1065 436 569 -1147 1038 -298
2963 -298 -577 1121 -930 223 692 -1105 828 42 -775 1089 -702 -89 907 -1117 651 223 -988
2980 -988 1156 -607 -372 1082 -1165 656 331 -1072 1151 -582 -406 1118 -1139 465 417 -1064
2996 -1064 1034 -387 -465 1104 -1001 272 608 -981 908 -173 -685 1128 -839 31 812 -1115
3012 -1115 818 96 -893 1177 -715 -138 934 -1143 701 189 -1019 1143 -604 -218 987 -1149
3028 -1149 612 318 -963 1067 -447 -419 1015 -991 419 461 -1057 967 -276 -562 1054 -891
3044 -891 167 730 -1075 923 -125 -772 1200 -788 55 833 -1145 818 32 -913 1127 -741 -128
3061 -128 865 -1120 626 220 -940 1141 -551 -290 992 -1027 499 372 -1031 1005 -425 -440 1074
3078 1074 -1019 294 538 -1121 897 -294 -561 1126 -814 256 687 -1042 886 -38 -746 1173
3094 1173 -869 -6 782 -1061 778 41 -895 1135 -635 -147 951 -1065 596 288 -871 1043
3110 1043 -556 -291 964 -999 467 378 -945 934 -395 -445 986 -869 269 604 -999 877
3126 877 -171 -611 1051 -794 99 725 -1013 794 4 -758 1145 -709 -45 810 -1058 710 113
3143 113 -786 1054 -672 -160 911 -989 562 238 -800 1039 -440 -291 892 -938 385 371 -931
3160 -931 835 -325 -513 1018 -857 182 548 -1004 825 -125 -641 1078 -820 36 735 -1044 798
3177 798 -13 -725 1104 -754 18 738 -1051 686 66 -735 952 -514 -163 761 -915 472 226
3194 226 -814 879 -353 -369 921 -875 288 542 -930 875 -233 -640 1018 -834 195 642
3210 642 -1032 844 -164 -635 1043 -779 136 662 -964 764 -48 -662 886 -609 -42 671 -862
3227 -862 498 142 -780 884 -430 -290 856 -858 364 415 -933 905 -310 -474 976 -902 329
3244 329 472 -1018 900 -302 -466 912 -894 182 530 -928 766 -168 -549 872 -654 41 578
3261 578 -808 516 85 -633 802 -465 -247 767 -871 456 306 -858 934 -424 -334 879 -878
3278 -878 436 301 -989 935 -399 -358 906 -845 383 350 -820 769 -253 -367 799 -655 152
3295 152 456 -711 656 65 -541 751 -535 -94 689 -867 468 172 -754 925 -531 -224 781
3312 781 -924 535 226 -787 904 -501 -236 790 -789 416 254 -732 747 -317 -252 652 -711
3329 -711 196 443 -702 584 -76 -511 803 -522 -35 591 -865 547 99 -657 911 -542 -87
3346 -87 697 -938 606 97 -695 878 -534 -90 698 -785 502 190 -638 739 -317 -218 667 -644
3364 -644 260 333 -700 594 -117 -426 769 -570 91 564 -838 565 -26 -563 871 -583 22 581
3382 581 -872 576 -21 -583 845 -555 -8 517 -739 470 75 -516 704 -421 -185 579 -646
3399 -646 261 242 -646 584 -212 -362 739 -643 197 428 -758 614 -81 -502 770 -621 153 489
3417 489 -764 596 -146 -401 711 -599 86 478 -673 493 7 -473 663 -431 -90 522 -579
3434 -579 304 208 -565 598 -195 -263 699 -550 269 325 -706 611 -198 -325 746 -585 170 360 -736
3453 -736 653 -162 -373 700 -594 139 369 -614 518 -42 -368 657 -418 -18 476 -577 362 190
3471 190 -447 532 -351 -141 570 -614 290 236 -572 617 -195 -374 682 -633 253 287 -655 647 -219
3490 -219 -245 677 -594 159 299 -570 572 -122 -399 584 -434 37 359 -516 375 21 -463 619 -357
3509 -357 -104 554 -660 313 108 -553 566 -341 -178 630 -626 284 224 -560 576 -236 -217 547 -520
3528 -520 182 269 -518 519 -113 -301 558 -498 28 335 -520 383 4 -385 565 -313 -64 463 -583
3547 -583 332 83 -467 573 -290 -129 549 -590 265 192 -474 512 -217 -170 464 -517 234 285 -480 416
3567 416 -167 -283 538 -363 107 244 -549 403 -71 -362 504 -365 -15 376 -568 348 51 -432 529 -343
3587 -343 -85 428 -529 318 32 -531 467 -258 -132 386 -530 240 186 -462 493 -164 -222 469 -447 93 241
3608 241 -513 409 -98 -223 503 -426 40 291 -476 320 -44 -349 500 -347 20 326 -491 313 59 -379
3628 -379 519 -275 -67 405 -438 253 161 -407 445 -216 -190 393 -476 197 200 -358 402 -94 -241 403 -389
3649 -389 142 251 -475 345 -37 -349 454 -350 -1 258 -431 238 13 -340 414 -297 -18 395 -463 231
3669 231 95 -343 407 -248 -120 387 -415 187 176 -404 389 -119 -165 373 -362 129 232 -381 314 -33 -165
3690 -165 405 -328 9 273 -373 304 36 -341 414 -348 -19 331 -438 236 86 -375 449 -239 -61 346
3710 346 -393 229 155 -361 364 -168 -124 373 -363 158 153 -304 294 -56 -245 348 -290 43 241 -354 344
3731 344 15 -280 408 -265 -56 312 -415 222 41 -325 375 -267 -77 302 -425 202 41 -302 381 -252
3751 -252 -113 328 -307 146 151 -334 333 -155 -199 347 -250 2 232 -371 280 -18 -254 418 -280 1 297
3772 297 -423 301 9 -321 406 -179 28 308 -401 229 -41 -273 336 -197 -1 289 -272 180 92 -240
3792 -240 300 -102 -163 304 -308 51 235 -353 277 -24 -271 408 -275 -8 233 -414 306 -42 -258 415
3812 415 -286 30 271 -331 287 -29 -233 314 -160 -62 248 -338 127 85 -244 285 -75 -162 334 -284 40
3833 40 172 -379 326 -77 -211 388 -270 59 214 -385 325 -64 -201 397 -314 44 184 -381 297 -6
3853 -6 -267 301 -143 -27 247 -290 56 72 -265 290 -107 -171 277 -254 42 166 -346 260 -46 -162 359
3874 359 -304 76 213 -374 273 -95 -188 356 -306 69 179 -341 224 -38 -214 239 -197 -17 244 -237
3894 -237 166 78 -284 306 -87 -159 312 -262 99 210 -329 273 -87 -227 362 -337 95 190 -309 223 -22
3915 -22 -208 318 -259 47 150 -267 263 -6 -163 288 -140 23 203 -257 198 71 -233 203 -153 -79 313
3936 313 -234 95 153 -324 271 -96 -149 314 -348 64 163 -291 254 -99 -183 288 -283 61 182 -293 292
3957 292 -52 -211 295 -169 -1 184 -259 91 55 -247 254 -161 -88 291 -294 138 107 -282 266 -111 -124
3978 -124 315 -271 132 92 -293 335 -147 -145 261 -297 98 202 -267 217 -55 -219 235 -173 -37 224 -274
3999 -274 136 42 -225 264 -95 -8 295 -317 159 100 -230 343 -171 -64 263 -318 185 149 -322 352 -142
4020 -142 -128 296 -273 81 107 -279 188 -60 -179 212 -243 -6 146 -262 167 21 -255 285 -135 -82 231
4041 231 -281 155 100 -236 332 -92 -61 263 -315 155 94 -236 276 -97 -60 231 -286 105 113 -263 211 33
4063 33 -119 285 -221 14 110 -295 194 -16 -220 275 -178 -31 226 -316 219 6 -294 331 -174 25 247
4084 247 -323 195 71 -216 302 -125 -46 255 -251 129 82 -247 238 -110 -123 274 -223 0 199 -250 233
4105 233 -37 -178 238 -176 3 174 -303 205 2 -213 257 -168 15 266 -267 192 77 -234 258 -157
4125 -157 -82 228 -270 90 114 -267 269 -133 -139 239 -248 88 142 -258 252 25 -143 274 -215 18 281 -271
4147 -271 235 -40 -207 294 -242 38 173 -282 150 -19 -250 238 -169 -85 288 -286 136 53 -267 293 -132
4168 -132 -116 283 -279 96 126 -263 234 -104 -147 281 -204 82 144 -252 178 -30 -185 289 -215 2 186
4189 186 -233 166 -18 -266 289 -151 -75 225 -282 130 64 -243 267 -126 -93 280 -282 140 99 -254 208
4210 208 -83 -104 279 -259 67 138 -241 230 -65 -161 274 -236 30 200 -308 227 13 -176 280 -184 -22
4231 -22 211 -248 181 2 -177 311 -174 -92 218 -268 136 61 -231 250 -84 -67 232 -240 107 104 -290 277
4253 277 -65 -137 222 -214 -8 146 -287 224 13 -226 278 -235 -46 195 -304 242 47 -239 320 -182
4273 -182 -58 180 -276 201 71 -187 244 -171 -50 234 -224 160 78 -247 226 -114 -106 266 -184 85 186
4294 186 -279 248 -44 -163 322 -220 10 203 -277 253 -14 -151 281 -205 -23 196 -252 227 69 -216
4314 -216 216 -106 -93 186 -252 108 86 -275 240 -143 -153 239 -280 42 99 -286 250 -42 -136 275 -258 101
4336 101 91 -359 225 -30 -165 261 -216 4 142 -275 221 12 -200 228 -171 46 187 -224 168 106 -227
4357 -227 236 -99 -71 263 -198 83 162 -229 200 -121 -75 310 -294 118 158 -321 292 -120 -131 256 -221 111
4379 111 145 -308 180 7 -137 235 -171 -26 193 -200 163 53 -195 251 -117 -54 311 -245 89 64 -206
4400 -206 289 -144 -106 262 -307 175 45 -276 248 -150 -134 262 -227 105 111 -234 188 -124 -175 236 -234 16
4422 16 193 -240 184 7 -150 189 -129 -13 242 -230 133 75 -210 247 -117 -45 239 -250 153 34 -246
4443 -246 230 -44 -36 169 -206 71 59 -264 207 -104 -133 226 -184 44 171 -240 215 28 -191 248 -166
4464 -166 -33 188 -269 171 34 -200 318 -156 -2 215 -232 184 65 -244 287 -143 -71 218 -290 142
4484 142 79 -225 203 -117 -100 206 -236 64 117 -266 177 -68 -132 216 -197 -19 186 -268 191 -41 -203
4505 -203 286 -158 -3 154 -216 165 47 -157 267 -150 -22 188 -295 114 4 -213 245 -130 -100 125
4525 125 -211 53 57 -241 176 -63 -125 210 -158 46 152 -201 234 -36 -181 227 -278 31 150 -289 197
4546 197 -19 -159 160 -193 -26 177 -197 192 39 -158 195 -114 -18 200 -217 129 110 -164 206 -60 -92
4567 -92 187 -160 72 116 -206 163 -59 -120 244 -212 -12 141 -260 209 -84 -160 224 -148 -48 100 -228
4588 -228 113 -11 -175 242 -97 -28 110 -228 131 78 -215 190 -122 -30 202 -199 124 100 -234 181 -140
4609 -140 -114 232 -232 54 36 -197 219 -94 -78 231 -222 66 101 -285 175 8 -105 193 -180 42 191
4630 191 -191 89 48 -155 252 -112 -82 231 -222 153 45 -230 224 -106 -90 237 -268 86 78 -221 174 -80
4652 -80 -115 182 -181 53 127 -254 138 -18 -88 226 -170 3 111 -225 172 4 -182 258 -105 -69 205 -218
4674 -218 99 50 -133 185 -107 -71 260 -205 88 96 -191 234 -71 -68 150 -207 101 113 -165 172 -76 -120 217
4697 217 -132 0 128 -206 160 -7 -170 154 -160 9 118 -239 97 37 -147 237 -129 -38 146 -179 139
4718 139 52 -108 221 -80 -28 195 -208 129 101 -164 135 -66 -102 211 -123 20 75 -224 149 10 -137 221
4740 221 -129 24 124 -199 140 44 -120 159 -169 -35 95 -187 122 26 -157 201 -132 -52 170 -127 108
4761 108 56 -202 177 -75 -55 155 -219 120 87 -173 158 -45 -132 158 -171 16 83 -164 185 -42 -83 192
4783 192 -104 28 105 -168 127 6 -163 179 -116 -24 171 -180 79 15 -175 157 -108 -52 205 -166 148
4804 148 24 -110 171 -60 -39 166 -206 50 105 -170 123 8 -111 181 -101 54 113 -177 136 35 -104
4825 -104 131 -124 -15 112 -171 147 33 -127 170 -153 -62 143 -180 97 44 -133 167 -105 -36 226 -181
4846 -181 51 56 -149 168 -42 -5 214 -141 71 139 -113 130 6 -144 168 -165 44 77 -198 180 -7 -167
4868 -167 161 -93 -4 131 -171 136 29 -151 151 -58 6 217 -149 76 40 -89 83 -67 -2 198 -122
4889 -122 99 62 -182 172 18 -123 188 -191 58 68 -162 210 -30 -110 164 -93 9 116 -143 65 -8
4910 -8 -118 144 -164 -27 84 -171 45 9 -126 70 -64 -38 113 -149 40 146 -168 130 -66 -16 175 -144
4932 -144 56 75 -119 135 -46 -70 134 -107 30 74 -167 106 -36 -72 161 -85 4 104 -121 79 -7 -157
4954 -157 94 -65 -32 96 -139 41 25 -123 172 -38 -87 135 -138 43 85 -135 129 -60 -55 112 -189 32
4976 32 39 -137 97 -29 -84 186 -150 -1 105 -88 89 27 -152 113 -108 -82 140 -207 101 4 -232 137
4998 137 -129 -58 157 -192 111 67 -148 124 -69 -23 149 -126 51 51 -141 89 -52 -123 132 -105 56 76
5020 76 -100 94 -31 -53 118 -49 65 107 -156 104 -14 -145 114 -67 15 125 -180 83 42 -118 161 -63
5042 -63 -50 151 -127 73 34 -88 74 -16 -62 90 -86 35 9 -59 131 -25 -65 117 -54 -39 110 -116 93
5065 93 16 -128 130 -80 -69 118 -117 105 23 -106 158 -70 -34 90 -84 84 59 -138 101 -45 -51 122 -84
5088 -84 58 38 -130 88 44 -28 115 -69 24 79 -151 110 54 -85 168 -69 -15 70 -140 88 58 -99 142
5111 142 -86 -19 94 -128 104 32 -80 108 -24 -27 140 -107 58 31 -65 64 -52 -62 61 -36 9 82 -142
5134 -142 101 49 -52 126 -53 6 78 -96 79 -13 -68 144 -58 26 81 -132 94 67 -28 93 -82 -22 98
5157 98 -35 72 16 -99 70 -48 -68 76 -96 54 42 -110 69 -70 -74 133 -128 47 45 -116 57 -31 -49
5180 -49 81 -77 16 63 -92 73 36 -54 194 -3 -23 107 -123 37 31 -107 95 -49 -36 121 -100 24 19 -104
5204 -104 103 -29 -59 121 -94 -8 27 -128 90 -6 -82 97 -47 -27 111 -67 52 -15 -76 71 -25 15 73 -69
5228 -69 69 19 -65 96 -6 18 136 -149 -7 0 -88 93 -37 -41 111 -113 31 39 -126 62 -60 -73 82 -76
5252 -76 90 61 -56 102 25 11 78 -123 16 56 -105 60 24 -54 23 -29 13 108 -98 101 7 -119 122 -21
5276 -21 -47 104 -61 2 64 -59 121 -28 -48 64 -111 30 70 -145 108 -7 -153 101 -91 44 78 -137
5298 -137 26 -63 -105 124 -58 14 65 -59 50 -21 -111 85 -73 50 100 -130 51 53 -97 127 -21 -4 75 -55
5322 -55 48 25 -87 58 -22 -23 84 -62 6 84 -98 68 -5 -68 96 -113 31 79 -62 76 51 -69 83 -41
5346 -41 -21 82 -81 42 19 -77 23 -25 3 121 -68 79 74 -109 33 -11 -103 110 -75 3 38 -151 50 -9
5370 -9 -65 44 -101 -19 64 -96 27 -38 -112 54 -57 -65 80 -94 31 79 -46 78 25 -43 91 -107 38 45 -70
5395 -70 119 -49 -32 100 -77 38 21 -61 113 -8 -55 27 -82 33 54 -48 60 -17 -21 49 2 -17 39 -101 25
5420 25 -15 -72 94 -49 23 17 -80 -3 68 -109 96 -42 -57 60 -111 78 8 -65 101 -49 -49 35 -19 -11 53 -39 52
5447 52 12 -34 112 -71 -5 66 -34 -7 32 -89 40 -25 -45 74 -28 -3 12 -63 102 -34 14 119 -98 39
5471 39 32 -64 86 -43 -35 46 -50 32 116 -60 44 18 -48 84 -37 -12 60 -95 59 -55 -63 87 26 -14 48 -18 39
5498 39 64 -75 88 -68 -15 62 -54 -1 -9 -60 76 -12 -18 67 -51 13 -9 -85 93 -4 -19 89 -54 34 45 -74
5524 -74 75 29 -76 31 -36 15 51 -120 -30 10 -31 125 -70 -42 35 -61 80 -1 -44 40 28 -19 90 -65 6 22
5550 22 -56 60 -31 -15 94 -63 21 27 -71 111 -10 -32 83 -37 39 81 -4 44 -13 -17 75 -64 19 95 -43 35 9
5577 9 -101 95 -62 -1 48 -51 35 13 -52 29 1 -57 167 -46 -55 39 -70 74 5 -97 81 -16 3 91 -106 106
5603 106 3 -23 113 -26 54 58 -68 65 13 -121 84 -55 1 101 -74 56 23 -77 98 -100 -7 52 -27
5626 -27 11 7 14 67 -10 -11 98 -43 18 51 -95 61 -2 -17 120 -70 9 76 -23 30 39 -24 74 -15 -57 60 11 25 10
5655 10 -52 61 -25 1 22 -19 34 19 -28 82 -22 -66 95 -105 59 50 -25 -21 -34 -31 31 -18 34 67 -45 58 7 -22
5683 -22 79 -66 40 -15 -95 21 19 -9 98 -41 29 6 -38 36 18 -52 52 -9 25 50 -43 36 46 -112 49 -1
5709 -1 -62 78 -26 5 66 -18 81 2 -57 77 -48 -17 42 -36 -23 -4 -25 67 -19 16 32 -49 75 37 -94 54 17
5736 17 -39 80 -96 50 31 0 68 -51 10 33 -26 25 24 -126 59 -32 -59 49 -13 23 26 -46 75 -24 -36 110 15
5763 15 8 30 -115 97 58 -91 90 -14 -3 97 -43 -35 17 -27 27 -61 10 10 -25 22 11 -53 89 -1 -66 12 -74 39
5791 39 2 -67 77 -33 -34 6 -3 -9 81 -56 38 -29 -27 93 -53 -13 -23 -19 92 84 -87 75 -36 -19 29 9 23 88 3
5820 3 -8 -13 -52 97 -50 -28 -3 -50 -10 -4 -66 10 -13 69 -16 -60 16 -5 -41 68 -40 0 50 -36 72 50 -72 53
5848 53 -21 53 38 -64 30 25 0 96 23 -34 53 32 57 11 -25 50 41 -52 16 -70 -38 -1 -49 103 8 -28 95 -17 37
5877 37 28 -84 60 -44 -71 37 22 -1 51 -64 3 -7 -56 39 -33 0 89 -95 16 88 -65 66 -14 6 35 0
5903 0 25 -15 17 1 -55 -46 27 -17 5 9 -62 31 6 -71 16 -18 -1 64 -54 -5 -4 -53 34 -63 -10 54 -66 10 -7 -57 17
5934 17 -62 -87 11 -74 29 -14 -14 62 -94 -42 96 -61 43 31 -69 39 -35 -34 14 -61 -45 -19 1 -4 -22 -32 22 -12
5962 -12 -47 26 -71 43 -14 -70 66 42 -12 32 -73 1 60 -81 63 -25 -57 65 -46 45 62 -61 75 -16 -76 87
5988 87 -26 21 75 -45 17 42 -13 64 -14 31 21 -79 23 -59 -39 109 -94 -32 50 -64 74 -25 -50 40 -21 -44
6014 -44 54 -50 -9 88 -56 2 1 -20 56 -58 -2 9 -41 56 -17 -47 42 -36 -13 56 -61 56 -32 -33 21 -78 23 46
6042 46 -61 38 9 -33 -21 -23 -6 51 -33 1 62 10 91 -36 -32 28 -25 6 4 -52 10 17 -45 43 -18 26 8 -55 20 -63 -33
6073 -33 72 -21 -39 1 -25 40 -31 -13 43 -42 3 41 -26 7 21 18 67 12 -39 49 -54 42 39 -50 49 18 -12 50 8 52
6103 52 -23 -71 52 -5 -14 90 -2 10 84 -21 33 2 -14 4 -19 11 18 -54 41 46 -55 0 -30 -50 -12 -50 53 26 -52
6132 -52 10 -47 9 16 -53 66 25 -43 132 14 -17 4 -26 0 31 23 33 -15 -41 82 -17 -4 7 -27 36 63 -81 32
6160 32 -25 5 86 -22 3 47 -43 48 -13 -42 20 -88 11 15 -84 51 -3 -53 5 -15 -9 6 1 66 -16 -37 -26 -40 9 27
6190 27 -23 57 -40 -5 50 -63 -31 13 -39 34 28 7 68 -94 27 2 5 35 29 -36 30 14 -15 45 0 5 -19 -50 -4 11 -12
6221 -12 -7 -23 33 35 -8 64 -13 -47 32 7 23 57 10 37 -46 15 14 -2 -10 26 -72 -21 36 45 39 3 7 26 -49 24 0 -56 45
6254 45 -5 -42 51 -74 32 -12 -28 52 12 1 80 -42 42 34 -22 74 -24 -30 -22 -20 24 22 -30 55 -3 7 20 9 52 45 -13 19
6286 19 -3 3 66 -34 -53 27 -73 -26 -28 -20 52 40 -74 -4 -15 38 41 -10 64 -11 -18 38 -34 -44 40 -10 57 -19 -39 -29 -9
6317 -9 -3 25 -5 -33 31 5 14 -12 31 -10 -66 14 41 -36 -6 3 11 15 -19 -13 -18 -21 -8 -63 -100 9 -6 -17 17 -31 70 32 -48 42
6351 42 19 54 -1 -17 -9 39 -11 47 -11 -8 31 -9 -4 -14 -13 1 27 -31 36 -36 -34 -48 -40 26 -54 -27 -61 -19 23 4 -72 59 -45
6384 -45 23 53 -14 26 35 -16 12 29 24 -4 -17 -18 -1 -2 57 35 5 63 -31 -53 58 -43 -41 43 17 23 -4 -4 32 -38 9 0 -32
6417 -32 45 -6 9 23 -41 -17 -1 -32 38 -63 31 -33 34 6 46 -18 -42 -35 1 40 -3 74 -11 -42 9 62 -74 34 -3
6446 -3 -5 2 -74 12 -4 37 25 -28 -6 15 -33 16 18 36 73 -6 -1 20 -63 -8 32 -62 90 33 -37 -8 18 -36 6 25 9 8 -25
6479 -25 3 3 16 -4 42 32 16 47 -12 6 -18 44 5 4 12 -51 46 -2 39 33 -11 39 28 -22 45 -35 -26 -11 -38 -22 27 -50 -4
6512 -4 -24 17 46 28 -11 43 -29 -42 -35 -41 8 -37 6 9 -26 27 -11 29 14 -19 40 -16 -25 -19 18 2 18 -18 -57 13 -38 12 -20
6545 -20 -37 14 -64 23 -58 0 -55 -12 -17 -6 -34 -27 19 11 -25 -51 36 28 38 -10 40 12 -9 20 3 48 -35 -9 -14 5 23 42 10
6578 10 -26 67 1 -21 8 -61 10 -27 -4 1 -53 2 -24 10 8 -29 -55 25 39 43 -43 14 56 -17 -15 23 -68 -11 27 -28 -16 -28
6610 -28 12 65 -26 31 -5 -35 54 2 42 16 6 -8 0 12 29 -4 13 -31 -60 -10 -7 -4 -76 -78 -9 -25 -32 18 -36 7 7 30 -33
6643 -33 27 -21 -8 40 -13 1 10 -29 12 12 -41 21 4 36 1 -12 19 26 21 2 -31 -13 11 -47 -28 14 29 60 -91 -53 11 -11
6675 -11 51 5 -20 45 -27 31 9 -47 46 22 -8 -24 -48 5 39 -14 66 39 -17 -2 -22 19 -3 20 -28 -6 -1 61 15 -24 -2
6706 -2 -19 41 31 -71 -25 -51 -8 34 -52 -42 3 -1 -16 0 -51 -34 -2 -22 -56 -13 31 13 -17 -2 39 10 -29 8 54 -7 3
6737 3 18 11 -22 -41 31 37 14 -9 46 -1 60 -22 -12 -53 74 1 -47 -3 -5 19 1 -25 21 39 3 -26 -40 9 5 5 -39 -17 -40
6770 -40 29 -25 29 -13 26 0 -39 12 35 -7 1 44 -43 11 -29 61 35 -69 21 18 -19 48 8 48 -59 -21 23 -25 -6 -10 28
6801 28 1 9 39 5 32 29 -16 -5 32 -14 39 37 30 35 10 37 -34 25 8 -26 -21 -25 9 24 20 -33 1 -5 -29 -44 15 -15 20 -18 -31
6836 -31 -29 69 -5 -2 4 -30 -23 4 -4 -17 13 -41 10 -47 14 -42 36 15 -8 48 -16 -10 -4 -48 22 24 69 38 55 -18 11 -12 -7 6 20
6871 20 -2 -11 28 -14 -50 6 -51 -31 -29 41 3 -44 25 10 -28 -11 33 -20 1 65 -1 -27 -2 -17 -14 -24 54 -1 46 -18 45 35
6903 35 2 5 12 11 1 -14 -10 -21 13 52 -42 -25 -25 -31 20 21 26 -56 -70 13 -12 -66 25 -41 -62 61 5 -41 -28 -2 -3 -47 -39 -29 29
6938 29 -80 21 13 -37 21 4 32 5 -47 41 -20 7 5 -6 15 -20 42 84 9 -14 -16 -43 -4 -61 50 34 4 14 23 -4 -4
6969 -4 -44 -5 10 -43 18 39 11 37 -3 25 -3 5 -18 20 -2 -14 13 -50 38 2 -30 21 -14 49 2 16 -10 -68 -4 -35 -6
7000 -6 -23 -5 2 -61 7 25 -3 -26 40 -15 -39 -16 15 -19 9 -24 -11 34 52 -84 9 31 10 19 33 60 -7 27 8 -13 -5 8
7032 8 8 40 12 -12 -6 -6 -50 -33 -25 -12 -29 -31 22 -22 37 -35 16 21 -52 13 -4 1 11 -16 7 32 -16 -20 61 -5 -23 58 3 -2 -25
7067 -25 -13 38 -18 15 33 28 -15 24 -16 -19 20 -22 63 -54 8 -12 -5 -14 -12 -44 -2 -23 19 39 -77 18 -15 -40 20 -20 -2 -38
7099 -38 7 -16 0 -9 1 -41 -5 13 23 -23 -3 -22 -76 -27 -10 -30 38 13 0 -6 33 -3 -65 -39 17 -35 42 -27 -13 -14 -78 -45
7131 -45 22 45 -46 -50 -5 -2 31 -11 -37 40 41 2 51 -13 21 -2 19 53 40 -47 41 -13 49 24 66 16 -2 16 9 -40 4 25
7163 25 22 -22 -49 -31 -73 14 -29 12 34 -48 -1 -30 -9 -7 22 -55 13 -27 5 20 -33 17 8 -4 -23 25 24 7 12 5 -28 -51 37
7196 37 -33 22 14 18 -7 8 1 8 -3 -41 -23 -6 46 -12 12 -6 -5 38 -76 -31 2 -9 -14 21 -17 -46 -12 52 35 -51 5 -32 -42
7229 -42 -4 26 -6 -33 14 -2 13 23 15 -16 9 -27 -19 11 -43 26 -30 14 39 36 -13 23 18 50 -9 -27 -1 -53 -29 -2 -10 -4 -32
7262 -32 -41 -29 -17 18 21 5 11 -48 -3 -11 -46 -7 16 -24 -18 29 5 25 -29 39 -5 3 10 57 58 -65 -12 6 -30 -50 -49 36 -18 -11 -5
7297 -5 -57 25 -64 -6 -8 -43 35 7 -96 24 -45 19 3 -29 -6 -16 -7 19 42 -21 15 47 -34 -11 14 -2 24 3 -16 60 27
7328 27 68 -10 31 4 14 1 8 10 -17 -45 -22 -40 -17 42 -10 -44 -28 -10 48 -59 -17 34 23 1 24 -9 0 42 -17 36 -7
7359 -7 44 29 26 -10 13 40 18 1 -6 21 -36 12 -9 -44 -57 10 -22 6 -14 -32 48 -19 13 -4 -37 -15 -61 30 -1 -15 29 46
7391 46 -33 -9 -25 22 10 -24 -22 -26 28 -20 -18 -17 12 -39 -15 7 11 -3 12 14 -13 -45 22 -25 13 40 31 -15 -23 -11 44 -45 -49 -8 56
7426 56 -15 -22 14 -35 9 -22 58 -21 -31 35 -62 12 -69 -50 13 33 -48 28 -25 -42 42 -8 22 46 44 -32 30 -39 -28 -2 -28
7457 -28 -6 -9 -12 44 -47 66 -61 -8 19 2 39 -19 -40 -11 -26 11 39 20 16 -36 11 -13 19 28 -23 25 55 -4 2 26 -15 -5
7489 -5 -7 -2 94 22 -5 -4 42 -55 9 -62 -5 -6 -21 7 -23 26 49 5 -38 -25 -13 52 -10 -21 38 12 23 1 -6 -12 -24 -12 -8 -41
7523 -41 -3 14 5 21 73 14 23 -49 -25 -19 -21 44 -2 -23 -23 8 84 -51 -9 24 20 -20 -48 16 -14 11 -31 -13 -1 7 -1 -30 -26 -13
7557 -13 -4 48 -58 4 -21 15 -44 -17 -26 -42 -2 -9 -26 14 24 8 -4 26 35 -3 -4 0 -43 34 -1 -17 -23 -23 -16 -14 -11 -34 17 -17 0
7592 0 13 16 -65 -32 45 -6 -39 -3 -14 -39 7 -15 28 30 13 -37 43 38 7 45 -51 15 -62 72 -27 7 12 -18 13 1 -10 -16 -5
7625 -5 -37 -83 19 -28 12 4 -108 -21 -12 26 12 13 -21 -23 39 6 -22 -9 8 66 41 -32 -8 -18 24 18 -20 32 32 37 10 -1 -19
7658 -19 -27 -30 1 28 20 50 41 34 -36 19 -9 44 -15 -31 66 -5 19 -22 8 66 -15 11 6 14 -1 9 2 52 -1 -31 42 -31 -7 53
7692 53 4 1 -80 -31 -16 -42 40 -40 -60 -21 0 -47 9 -33 2 22 48 -50 -41 -35 -14 -62 30 4 -14 12 0 -35 -11 -36 14 8
7724 8 -23 -43 21 -4 -14 13 -32 27 -26 19 69 -57 32 17 38 -16 -27 -5 26 38 -14 17 -13 43 -22 -61 -45 2 3 -30 -76
7755 -76 0 11 -19 -2 26 -32 -29 21 -8 3 3 51 -32 -37 -15 -7 17 -24 -111 -4 26 17 0 -32 -46 20 -7 8 -34 -15 -43 -5
7787 -5 -35 -8 -60 -24 -22 -44 23 -46 26 -9 29 2 -26 -10 23 35 -4 16 -41 28 -35 17 -43 -9 18 32 -3 -24 -21 -21 16 -38
7819 -38 29 41 -107 66 15 11 43 3 25 31 45 68 -1 -1 88 33 36 -10 0 1 11 -9 44 -20 8 2 -48 13 4 -21 -18 -28 -26 -1
7853 -1 -28 -22 -22 27 -15 1 -9 -2 -57 10 30 -48 -13 0 37 11 -11 18 -3 58 42 47 -16 44 -67 25 -2 14 -28 10 -40 -20
7885 -20 2 -51 24 -9 -50 31 -27 29 13 44 -42 -20 -4 23 31 9 -27 -35 33 -34 20 -16 32 -18 -11 -4 23 -31 -1 -20 5 25
7917 25 21 36 -22 6 19 20 -35 20 -29 -65 34 -77 -40 1 7 -68 4 -20 2 -2 -31 20 18 -47 60 1 40 1 6 -35 44 -18
7949 -18 19 -23 -33 16 -15 17 44 14 -32 30 1 -14 36 51 -9 -41 -53 10 -29 11 25 -35 -7 -8 54 -15 10 27 13 -35 -93
7980 -93 27 65 1 49 6 -35 12 8 0 -24 -43 0 -28 34 -15 -68 12 -13 -8 17 41 -33 -4 -3 -14 -18 -58 -39 30 5 -7 17
8012 17 -5 -22 -53 35 16 -36 -33 -25 26 -34 22 -1 50 -45 -24 4 1 30 -13 -28 13 -11 -2 -6 -37 68 -34 42 -42 -2 -11 13
8044 13 43 74 -5 -24 -46 12 -26 -60 49 27 4 -11 23 33 5 19 51 12 8 -20 54 -12 -25 35 -32 -14 3 -28 23 14 -14
8075 -14 -6 -21 -32 33 -2 32 -19 -25 -6 12 -42 13 -8 22 32 -18 -9 -24 33 15 60 -76 38 37 16 54 -36 62 -10 -30 -4
8106 -4 15 3 32 7 -5 17 -7 7 16 34 -42 -40 2 -8 -11 -12 4 -9 -10 -37 62 0 -20 11 -26 13 1 10 -11 28 22 15 40 -70
8140 -70 51 6 -63 31 15 11 22 4 -22 17 5 3 16 16 32 43 23 25 61 -12 -26 72 -35 21 -22 23 -36 5 -33 -44 2
8171 2 -5 -24 27 -13 -25 -16 41 35 -19 -19 -57 -5 -9 1 -25 34 -10 6 -5 20
8191B0
$$ Imaginary data points
##PAGE= N=2
##DATA TABLE= (X++(I..I)), XYDATA
0 0 0 0 0 0 0 0 0 0 0 8 -8 8 -8 8 -16 16 -24 24 -32 40 -48 56 -64 80 -95 105 -127 144 -168 192 -216 248
32 248 -280 320 -360 402 -453 506 -567 632 -702 779 -865 955 -1057 1168 -1288 1417 -1562
49 -1562 1720 -1895 2087 -2299 2538 -2804 3104 -3445 3837 -4294 4833 -5477 6268 -7260 8548
64 8548 -10290 12782 -16647 23462 -38882 138147 -27420 -118844 194014 -225115 94215
75 94215 93523 -158639 149667 -72211 -76110 150005 -111863 30421 59277 -109175 72187
86 72187 18463 -91953 94725 -37571 -43890 118168 -106546 14797 75278 -135463 131640
97 131640 -28259 -89078 145213 -141584 52437 76990 -150433 144838 -70938 -49989 133844
108 133844 -138225 76505 28624 -108222 117279 -67253 -16285 86785 -88879 40713
118 40713 21934 -72779 66611 -8827 -47862 71430 -51606 -15546 79645 -90415 45289
129 45289 30726 -100661 116972 -56626 -37331 111231 -130960 77975 28877 -113622 132089
140 132089 -88068 -9177 103166 -127041 81090 -2561 -81320 112120 -68016 -4134 63974
151 63974 -86278 49329 20132 -62860 62698 -22336 -38039 73776 -53538 -3337 60215
162 60215 -86797 57063 14643 -81133 100621 -65306 -12721 88699 -112606 73741 4652
173 4652 -82095 114544 -79258 4234 69660 -103027 76696 -8985 -56864 85133 -63383
184 -63383 4977 48428 -67896 43211 7202 -49498 55350 -23931 -24364 58947 -52113 10352
196 10352 41338 -71077 58408 -5728 -52884 82731 -67377 10337 55588 -90411 73876
207 73876 -18221 -50010 89668 -76851 22638 41093 -80558 73025 -22229 -35149 68191
218 68191 -60305 16649 34745 -58555 44009 -3922 -39216 54164 -31241 -13041 48512 -55345
230 -55345 24054 26274 -61566 60651 -22395 -32703 72232 -68128 25070 34072 -75417 73787
242 73787 -29262 -30926 71998 -72967 31338 25659 -65139 65168 -28875 -22570 56600 -54202
254 -54202 20479 23904 -50067 43341 -8461 -29664 48407 -34494 -2862 38787 -51014 30199
266 30199 11008 -48271 56048 -30725 -15260 54109 -61827 33230 15100 -55503 64979
277 64979 -35804 -12513 53464 -62897 36562 10532 -49049 57400 -32859 -10405 44778
288 44778 -50577 25073 13502 -42861 43685 -16369 -20420 43928 -38840 8698 28824 -47622
300 -47622 37256 -2555 -35218 52723 -37990 -561 39180 -56265 39465 569 -40843 56602
312 56602 -40202 -60 39559 -54630 38074 520 -36993 50945 -33391 -2455 35689 -45894
324 -45894 27688 6831 -36084 41740 -21654 -12674 38001 -39839 15830 18150 -41498 39162
336 39162 -12009 -22827 44929 -39265 10162 26247 -46701 39879 -8844 -27468 47223 -39329
348 -39329 7754 27481 -46507 36935 -6248 -27892 44299 -33875 3308 28646 -42018 30079
360 30079 668 -29728 40618 -25816 -4457 31862 -39354 22374 8028 -33974 38451 -19810
372 -19810 -11484 35215 -37961 17394 13784 -36213 36927 -14972 -15386 36865 -35303 12887 17444
385 17444 -36853 33781 -10326 -19469 36846 -32248 7445 21179 -37355 30175 -5149 -23121
397 -23121 37280 -28524 2887 24693 -36707 26939 -475 -25487 36078 -24575 -1593 26318
409 26318 -34856 21654 4129 -27407 33083 -18720 -7400 28403 -31748 15490 10603 -29825
421 -29825 31068 -12616 -13236 31688 -30444 10913 15547 -32888 30202 -9878 -16871 32912 -29940
434 -29940 8682 16807 -32296 28228 -7621 -16647 30621 -25546 5835 17218 -28435 22385
446 22385 -2539 -18110 26999 -18839 -1294 20131 -26676 15663 5007 -23295 27028 -14082
458 -14082 -8246 26264 -28379 13651 10094 -27955 29945 -13676 -10092 28490 -30065 14090 9569
471 9569 -27271 28488 -13781 -9007 24830 -25670 11212 8973 -22707 21756 -7361 -10587 21603
484 21603 -17924 2896 14191 -21702 15598 1323 -18108 23510 -14697 -4207 21153 -26345
496 -26345 15082 4893 -22949 28075 -16729 -4340 22938 -28149 17868 3132 -21114 26747
508 26747 -16814 -2050 18843 -23403 13769 2629 -16965 19419 -9771 -5816 16262 -16303
520 -16303 4988 10041 -18102 14624 -926 -14221 21671 -14764 -1111 17685 -24688 16888
532 16888 1325 -19136 26190 -18944 105 18173 -25987 19156 -2099 -15731 23481 -17240
544 -17240 2618 12804 -19275 13865 -684 -10907 15016 -9127 -2619 11362 -12111 4401
556 4401 6531 -14139 11466 -1339 -10527 17082 -13471 708 13135 -19809 16270 -2320 -13201
569 -13201 21536 -18156 5267 11197 -21146 18643 -7152 -7985 18196 -17416 6850 5554 -14254
582 -14254 13789 -4787 -5402 10740 -8755 1245 7318 -9223 4590 3544 -10288 10311 -2549
595 -2549 -7630 13630 -12839 3053 9161 -16862 15167 -5645 -8136 17797 -17262 8242 5313
608 5313 -15914 17817 -9632 -2128 12380 -15761 9824 586 -9089 11674 -7908 -986 7177
621 7177 -7799 3561 2984 -7431 5343 1172 -6754 9295 -4960 -4098 11404 -11971 6295
634 6295 4588 -14320 15265 -8515 -3203 14110 -17612 10540 858 -11813 16830 -11956 1270
647 1270 8649 -13328 11254 -2329 -5814 9444 -7740 1822 4540 -6275 3210 1053 -5010 4545
661 4545 124 -5500 7154 -4750 -1859 9002 -10711 6486 1879 -10289 14041 -9093 -425
674 -425 9840 -14892 11598 -1745 -8187 13260 -12137 3722 5624 -10664 9864 -4492 -3427
687 -3427 7667 -6320 2614 2429 -4997 3148 1083 -3330 3607 -583 -4479 6284 -4007 -740
701 -740 6306 -9555 6205 358 -6942 10944 -9027 1670 6205 -10594 10644 -4172 -3986 9294
715 9294 -9812 5884 1397 -7000 7683 -5311 243 4147 -5443 2999 -283 -2311 2797 -438
729 -438 -1700 2046 -717 -1618 4423 -3543 317 3282 -6143 6005 -1682 -3885 7093 -7821 3974
744 3974 2495 -7307 8279 -5843 -241 6207 -7765 6289 -1692 -3730 6760 -5247 2288 1594
758 1594 -4516 3772 -1337 -842 2087 -2107 -439 1603 -1138 -93 2062 -3395 1768 1442 -3567 4997
774 4997 -3248 -925 4719 -5915 4832 -565 -4476 6431 -5640 2075 2802 -6236 5608 -2924
788 -2924 -1127 4670 -5113 2819 249 -2728 3940 -2031 -226 1637 -1990 1031 916 -1600 528
803 528 522 -2077 2186 -512 -2001 3106 -3153 1313 2151 -3999 4013 -2146 -1152 4410 -4547 2942 13
820 13 -3443 4775 -3436 697 1976 -4256 3340 -1049 -1202 2855 -2893 999 1038 -1658 1993 -531
836 -531 -1057 1563 -800 -170 1524 -1910 421 1046 -2214 2199 -880 -1635 2844 -2872 1331 1330 -3350
853 -3350 3366 -1756 -610 3292 -3692 2211 440 -2735 3800 -2521 -209 2284 -3420 2369 42
868 42 -2348 2747 -2051 -183 2330 -2578 1389 645 -2241 2811 -930 -1085 2629 -2759 1006 1520
884 1520 -3050 2683 -1189 -1780 3302 -2926 881 1608 -3486 3122 -681 -1719 3473 -3072 836 2103
900 2103 -3390 3080 -756 -2166 3587 -3051 658 2122 -3849 2938 -632 -2141 3798 -3145 570
915 570 2310 -3560 3120 -438 -2178 3564 -2687 388 2255 -3461 2247 0 -2472 3267 -2116
930 -2116 -698 2806 -3474 1878 1164 -3500 3783 -1739 -1297 4147 -4209 2033 1490 -4228 4727 -2417
946 -2417 -1372 4118 -4916 2606 973 -3965 4553 -2673 -819 3684 -3998 2222 995 -3240 3576
961 3576 -1285 -1446 3417 -2987 443 2447 -3870 2727 154 -3521 4616 -3105 -537 4181 -5592
976 -5592 3741 541 -4408 6223 -4251 109 4413 -6170 4734 -483 -3871 5776 -4526 703
990 703 3132 -5094 3664 -321 -2904 4118 -2483 -591 3274 -3467 1533 1967 -3971 3537 -523 -3129
1006 -3129 5219 -4201 357 3868 -6397 5027 -953 -4159 6850 -5918 1585 3723 -6773 6179
1020 6179 -2152 -2782 6178 -5667 2313 2192 -5080 4704 -1709 -2148 4126 -3442 237 2755 -3923
1035 -3923 2144 1286 -4077 4345 -1435 -2546 5638 -5193 1733 3415 -6745 6518 -2451 -3240 7274
1050 7274 -7438 3363 2425 -6991 7480 -4025 -1606 5937 -6795 3854 1044 -4762 5522
1063 5522 -2734 -1118 4105 -4076 1306 2279 -4155 2935 331 -3844 4907 -2863 -1598 5414 -6299
1078 -6299 3301 2022 -6587 7682 -4275 -1555 7034 -8351 5332 838 -6392 8357 -5689
1091 -5689 -66 5270 -7448 5139 -295 -4372 5855 -3863 -376 3936 -4406 2061 1815 -4234
1105 -4234 3773 -278 -3558 5475 -3790 -714 5211 -7063 4582 668 -6232 8325 -5863 -84
1119 -84 6143 -8861 6837 -861 -5238 8597 -6907 1675 4394 -7357 6153 -1510 -3652 5983
1133 5983 -4652 477 3487 -4942 2723 1143 -4273 4524 -1369 -3060 5753 -4855 872 4558
1147 4558 -7335 6054 -939 -5058 8528 -7334 1736 4571 -8805 8042 -2864 -3790 8081
1160 8081 -7949 3500 2843 -6845 6955 -3026 -2235 5809 -5180 1664 2705 -5082 3670 273
1174 273 -4104 5082 -2702 -2122 5863 -6136 2415 3235 -7517 7582 -2807 -3559 8514 -8732
1188 -8732 3900 3354 -8486 9199 -4721 -2463 7879 -8671 4817 1582 -6822 7528 -3971
1201 -3971 -1499 5780 -6053 2411 2528 -5270 4775 -514 -4094 5897 -3767 -1000 5809 -7214
1215 -7214 3806 1937 -7282 8483 -4675 -2275 7961 -9442 5642 1729 -7930 9564 -6006
1228 -6006 -799 7170 -8852 5634 530 -6082 7657 -4541 -1038 5263 -6183 2938 2132 -5560
1242 -5560 4963 -1236 -3653 6459 -4577 -139 5265 -7489 5192 844 -6411 8602 -5955
1255 -5955 -609 6998 -9409 6565 -265 -6770 9492 -6861 615 5791 -8763 6406 -516
1268 -516 -4896 7527 -5329 -49 4848 -6225 3883 1155 -5360 5566 -2274 -2724 6271 -5879
1282 -5879 1196 4196 -7349 6409 -1056 -5169 8558 -6948 1505 5502 -9115 7583 -1793
1295 -1793 -4983 9034 -7709 1927 4379 -8259 7089 -1829 -4283 7197 -5949 1059 4406
1308 4406 -6634 4528 240 -4867 6546 -3442 -1757 5935 -6764 3021 3036 -7255 7193 -2982
1322 -2982 -3637 8273 -7862 2975 3685 -8584 8468 -3070 -3534 8305 -8295 3348 3582 -7719
1336 -7719 7539 -2867 -3508 7262 -6378 1851 3745 -7084 5390 -459 -4542 6905 -4742
1349 -4742 -737 5798 -7037 4312 1602 -6808 7731 -4004 -2015 7307 -8350 4088 2298
1362 2298 -7511 8429 -4296 -2498 7423 -8048 4162 2438 -7189 7550 -3344 -2520 7081 -6866
1376 -6866 2430 3152 -6797 6204 -1546 -4108 6851 -5688 666 4923 -7465 5214 -85 -5537
1390 -5537 7982 -5159 -552 5962 -8089 5329 956 -6295 8019 -5200 -1048 6430 -7883
1403 -7883 4596 1101 -6480 7529 -4008 -1660 6382 -7181 3471 2471 -6481 6826 -2726
1416 -2726 -3024 6964 -6415 2119 3637 -7346 6283 -1544 -4222 7513 -6444 1012 4753 -7647
1430 -7647 6165 -746 -5093 7795 -5696 374 5419 -7865 5316 319 -5569 7696 -4993
1443 -4993 -954 5944 -7507 4520 1405 -6468 7397 -3932 -1862 6788 -7210 3328 2513 -6795
1457 -6795 7162 -2744 -3022 7009 -6747 2318 3605 -7225 6265 -1781 -4100 7366 -6003
1470 -6003 992 4535 -7503 5773 -337 -5062 7532 -5414 -59 5657 -7592 5067 440
1483 440 -5952 7659 -4849 -947 5966 -7609 4422 1307 -6050 7182 -3908 -1701 6254 -6698
1497 -6698 3320 2264 -6367 6403 -2436 -2836 6524 -6195 1701 3663 -6906 5911 -1269 -4323
1511 -4323 7235 -5766 952 4774 -7524 5804 -596 -4796 7552 -5648 394 4905 -7320
1524 -7320 5353 -238 -5027 6805 -4752 -343 5101 -6571 3894 1060 -5293 6337 -3167
1537 -3167 -1791 5867 -6079 2637 2752 -6347 6118 -2156 -3310 6929 -6427 1927 3638 -7363
1551 -7363 6557 -1887 -3795 7269 -6486 1884 3875 -6987 6095 -1568 -3737 6642 -5412
1564 -5412 891 3863 -6238 4499 -29 -4381 5914 -3763 -934 5140 -6026 3201 1892 -5907
1578 -5907 6417 -2805 -2470 6599 -6754 2834 2809 -6831 7016 -3018 -2815 6845 -6902 2902 2680
1593 2680 -6523 6397 -2606 -2597 6166 -5631 1876 2988 -5743 4863 -797 -3646 5668 -4123 -242
1608 -242 4479 -6006 3605 1025 -5398 6547 -3558 -1660 6072 -6904 3789 1797 -6255 7183
1622 7183 -3875 -1616 6216 -6958 3754 1455 -5793 6419 -3343 -1593 5142 -5641 2484 1979
1636 1979 -5015 4787 -1470 -2789 5155 -4118 491 3769 -5597 3940 317 -4642 6216 -4077
1650 -4077 -722 5209 -6865 4379 650 -5485 7087 -4560 -509 5275 -6793 4514 438
1663 438 -4773 6278 -3899 -540 4411 -5449 3080 1150 -4428 4712 -2030 -2018 4666 -4381 1093
1678 1093 3083 -5356 4342 -379 -3887 6065 -4610 326 4452 -6558 4915 -438 -4470 6670
1692 6670 -5209 562 4104 -6447 4923 -650 -3810 5819 -4221 348 3637 -5074 3409 443
1706 443 -3715 4557 -2373 -1411 4245 -4427 1636 2330 -4990 4535 -1234 -3092 5674 -4931 1210
1721 1210 3434 -6156 5322 -1280 -3334 6198 -5370 1453 3121 -5842 5053 -1490 -2894 5181
1735 5181 -4451 958 2806 -4688 3473 -138 -3095 4326 -2635 -780 3826 -4320 2126 1680 -4601
1750 -4601 4686 -1845 -2291 5192 -5143 1924 2402 -5553 5423 -2214 -2291 5474 -5415 2313 2118
1765 2118 -5001 5066 -2039 -1928 4557 -4348 1513 2096 -4300 3580 -694 -2583 4087 -2994 -265
1780 -265 3289 -4240 2557 943 -3979 4742 -2481 -1240 4557 -5164 2710 1437 -4754 5380 -2918
1795 -2918 -1373 4682 -5266 2839 1097 -4354 4854 -2531 -1160 3982 -4208 1894 1453 -3728 3632
1810 3632 -1076 -2126 3883 -3146 246 2786 -4265 2900 267 -3442 4643 -3042 -565 3892 -4968
1825 -4968 3205 638 -4020 5106 -3240 -444 3975 -4970 3066 469 -3649 4544 -2764 -640 3367
1840 3367 -4020 2076 1044 -3319 3486 -1371 -1613 3658 -3125 720 2246 -3961 3177 -298 -2896
1855 -2896 4283 -3261 55 3114 -4598 3329 -196 -3243 4682 -3309 184 3046 -4486 3281 -39
1870 -39 -2833 4157 -2858 -155 2852 -3624 2216 456 -2974 3313 -1662 -1038 3181 -3291 1183 1623
1886 1623 -3519 3302 -896 -2162 3937 -3312 843 2333 -4187 3374 -835 -2355 4107 -3483 753
1901 753 2280 -3998 3271 -604 -2357 3689 -2867 338 2443 -3495 2404 137 -2408 3366 -1947
1916 -1947 -643 2812 -3268 1593 1088 -3196 3238 -1370 -1432 3495 -3383 1274 1651 -3581 3447 -1096
1932 -1096 -1707 3590 -3372 1049 1806 -3443 3039 -937 -1905 3379 -2721 503 1971 -3288 2433 -51
1948 -51 -2133 3188 -2161 -329 2473 -3062 1891 570 -2777 3151 -1631 -802 2794 -3268 1451 1003
1964 1003 -2940 3111 -1366 -1195 2986 -2892 1238 1418 -2931 2797 -861 -1393 2976 -2628 585 1526
1980 1526 -2914 2400 -446 -1877 2768 -2282 143 2028 -2857 1983 45 -2064 2879 -1862 -262
1995 -262 2141 -2776 1789 551 -2361 2639 -1514 -740 2433 -2696 1234 813 -2506 2671 -1093 -1077
2011 -1077 2218 -2197 823 1119 -2190 2090 -679 -1222 2316 -1960 565 1183 -2390 1878 -381 -1332
2027 -1332 2205 -1768 151 1455 -2086 1521 -47 -1548 2060 -1250 -157 1719 -2104 1131 473
2042 473 -1806 2170 -1028 -736 1933 -2112 1027 820 -2086 2095 -879 -814 2137 -2046 780 883
2058 883 -1975 1893 -657 -1005 1892 -1753 355 1045 -1897 1365 -161 -1260 1847 -1183 -195 1467
2074 1467 -1873 1160 506 -1676 1939 -1019 -602 1893 -1998 962 581 -1952 2034 -989 -619 1824
2090 1824 -1947 905 667 -1677 1813 -752 -639 1600 -1462 499 820 -1498 1170 -181 -985 1471
2106 1471 -1087 -173 1277 -1600 888 320 -1535 1763 -938 -392 1640 -1894 1008 435 -1584 1914
2122 1914 -1088 -369 1413 -1736 956 198 -1314 1448 -767 -255 1202 -1203 462 491 -1096 968
2138 968 -106 -857 1189 -858 -183 1095 -1417 773 256 -1348 1572 -886 -337 1355 -1771 1117
2154 1117 190 -1324 1703 -1144 -32 1148 -1486 1039 -21 -939 1265 -806 -97 783 -1065 501
2170 501 339 -770 769 -146 -605 1031 -730 -81 963 -1297 846 156 -1104 1460 -1022 -156 1120
2187 1120 -1615 1126 -68 -1111 1505 -1173 163 866 -1415 995 -117 -715 1068 -724 -27 624
2203 624 -809 404 271 -757 617 -118 -653 936 -689 -75 902 -1207 843 158 -1046 1434 -1004
2220 -1004 -40 1100 -1549 1126 -199 -850 1400 -1060 175 664 -1185 922 -254 -550 832 -607
2236 -607 52 557 -664 291 340 -646 580 34 -657 921 -594 -107 903 -1143 746 113 -1009 1276
2254 1276 -903 73 938 -1348 1009 -147 -738 1243 -971 234 535 -901 695 -162 -435 602
2270 602 -490 -164 426 -487 51 395 -559 475 135 -656 953 -512 -111 872 -1060 700 88 -904
2288 -904 1197 -922 78 738 -1145 939 -175 -600 961 -780 258 425 -733 591 -85 -360
2304 -360 517 -260 -115 476 -458 -33 382 -673 359 98 -701 880 -577 -177 819 -1016 737 39
2322 39 -733 1119 -865 168 626 -989 842 -215 -437 793 -625 121 323 -561 394 48 -320 432
2340 432 -128 -227 518 -340 -31 528 -712 409 209 -677 883 -626 -178 749 -1018 685 -70 -667
2358 -667 980 -749 138 558 -939 671 -107 -408 688 -534 61 382 -502 273 123 -422 398 -74
2376 -74 -343 585 -388 -110 684 -720 505 170 -653 896 -634 -35 711 -982 691 -57 -633 865
2394 865 -663 55 501 -814 497 -71 -462 580 -420 -37 489 -491 159 273 -564 464 -56 -440
2412 -440 663 -469 -81 611 -837 538 124 -650 925 -625 11 657 -928 695 -15 -617 881
2429 881 -639 23 544 -763 550 -21 -544 571 -392 -206 534 -555 68 355 -614 595 -26 -524
2447 -524 745 -587 -61 647 -847 570 58 -639 928 -647 -29 610 -932 640 82 -657 817
2464 817 -522 45 604 -740 479 134 -545 734 -237 -276 609 -631 152 370 -758 604 -115 -588
2482 -588 803 -625 -3 542 -861 714 39 -622 939 -715 16 647 -904 624 -23 -635 842
2499 842 -556 -75 666 -784 518 189 -627 793 -383 -225 764 -664 295 345 -829 674 -261 -434
2517 -434 805 -732 132 535 -884 745 -84 -594 805 -670 135 626 -895 663 6 -673 928
2534 928 -569 -59 708 -873 516 165 -742 869 -442 -255 799 -890 401 258 -804 863 -350
2551 -350 -338 870 -785 254 524 -891 750 -183 -546 878 -734 47 566 -929 681 86 -723
2568 -723 977 -626 -71 786 -998 582 138 -850 1044 -554 -181 861 -1078 542 305 -803 941
2585 941 -429 -340 858 -825 359 426 -912 805 -188 -561 968 -799 21 677 -1049 746 -10
2602 -10 -828 1063 -731 -47 862 -1136 684 102 -862 1211 -687 -135 842 -1070 627 205 -858
2619 -858 938 -500 -252 852 -928 357 386 -856 788 -224 -513 949 -810 118 703 -1022 804
2636 804 9 -900 1096 -831 7 764 -1174 840 -27 -818 1119 -816 -18 839 -1047 729 64
2653 64 -731 1038 -588 -104 752 -963 431 283 -812 854 -308 -470 926 -785 219 663 -1112
2670 -1112 852 -71 -686 1198 -887 120 784 -1236 988 -183 -739 1187 -964 173 633 -1184
2686 -1184 850 -117 -652 946 -711 -32 656 -902 533 248 -819 886 -433 -417 955 -945 307
2703 307 502 -1120 1018 -290 -605 1200 -1118 324 699 -1222 1154 -313 -579 1263 -1076 364
2719 364 575 -1174 966 -275 -607 1022 -827 17 661 -977 679 137 -894 989 -460 -302 1001
2736 1001 -1040 397 490 -1155 1127 -441 -585 1239 -1243 474 526 -1294 1223 -456 -456 1236 -1151
2753 -1151 451 501 -1062 1009 -339 -485 965 -800 149 665 -950 615 21 -842 993 -574 -311
2770 -311 925 -1120 523 420 -1185 1246 -589 -425 1226 -1261 632 376 -1188 1333 -599 -420
2786 -420 1105 -1153 591 330 -1040 1070 -407 -365 947 -812 241 586 -936 715 26 -698 1032
2803 1032 -626 -118 918 -1172 670 218 -1100 1284 -758 -238 1133 -1391 791 185 -1093 1314
2819 1314 -748 -203 995 -1219 709 174 -884 1044 -552 -285 911 -918 349 487 -971 848
2835 848 -129 -626 1103 -755 5 875 -1202 855 64 -924 1308 -854 -99 999 -1350 986 28
2852 28 -973 1326 -869 -42 914 -1156 787 99 -912 1073 -618 -239 910 -950 398 412 -1003
2869 -1003 909 -298 -571 1085 -889 125 781 -1231 974 -94 -782 1329 -1006 92 870 -1339
2885 -1339 1080 -112 -870 1319 -1005 70 788 -1206 883 -15 -800 1103 -707 -148 863 -992
2901 -992 526 299 -972 982 -377 -458 1055 -1047 306 604 -1236 1080 -356 -664 1295 -1100
2917 -1100 323 761 -1291 1142 -252 -671 1242 -1063 252 686 -1154 896 -146 -698 1101 -774
2933 -774 -6 806 -1089 616 156 -876 1066 -524 -320 1029 -1105 495 447 -1121 1155 -413 -489
2950 -489 1145 -1184 494 473 -1191 1164 -461 -481 1159 -1074 381 601 -1124 996 -207 -612 1112
2967 1112 -853 116 739 -1119 760 77 -797 1041 -760 -212 857 -1132 602 297 -1016 1156
2983 1156 -639 -346 1083 -1227 558 377 -1109 1119 -528 -413 1053 -1094 489 460 -1077 1041
2999 1041 -350 -507 1102 -906 175 659 -1033 819 -51 -703 1142 -819 -49 801 -1178 798
3015 798 125 -877 1183 -701 -150 954 -1193 686 198 -984 1122 -657 -300 989 -1116 519
3031 519 307 -1067 1019 -459 -454 976 -962 346 568 -1059 916 -183 -642 1074 -867 152 676
3048 676 -1117 896 -53 -824 1153 -856 16 839 -1145 764 46 -903 1096 -696 -137 933 -1129
3065 -1129 622 240 -985 1076 -522 -307 983 -1024 447 420 -1055 1037 -371 -476 1077 -995
3081 -995 333 572 -1038 904 -200 -615 1131 -846 137 691 -1079 801 -24 -760 1065 -826 -78
3098 -78 738 -1116 697 131 -896 1080 -578 -223 882 -1051 598 293 -950 1064 -494 -333 980
3115 980 -995 444 377 -983 913 -337 -559 977 -923 270 604 -973 851 -112 -572 982 -772
3132 -772 39 709 -1018 756 32 -792 1137 -748 -30 818 -1079 627 87 -843 1078 -563 -164
3149 -164 834 -1029 513 253 -872 868 -464 -291 849 -923 324 413 -922 852 -218 -480 992
3166 992 -834 213 692 -1052 839 -115 -624 1057 -901 76 699 -1081 752 15 -654 1004 -703
3183 -703 17 718 -969 628 71 -758 949 -519 -198 770 -889 340 302 -832 887 -334 -466
3200 -466 947 -881 245 518 -1022 856 -213 -621 1076 -875 195 632 -1068 833 -152 -612
3216 -612 989 -834 89 645 -964 693 -12 -720 855 -586 -170 720 -859 466 198 -799 865
3233 865 -411 -323 847 -896 261 369 -945 893 -311 -511 945 -872 288 458 -1031 870
3249 870 -299 -496 888 -810 239 473 -837 641 -148 -544 817 -625 -7 550 -852 454 117
3266 117 -754 824 -447 -241 857 -853 398 302 -827 888 -408 -420 861 -985 371 323 -925
3283 -925 911 -389 -386 809 -795 275 355 -750 757 -186 -419 779 -664 114 509 -806 553
3300 553 46 -591 846 -506 -241 723 -900 516 145 -789 897 -497 -146 767 -953 463 224
3317 224 -804 897 -448 -195 713 -803 363 241 -689 662 -302 -326 676 -613 124 471 -748
3334 -748 561 -13 -563 836 -557 -108 628 -861 532 107 -714 894 -523 -92 703 -939 533
3351 533 129 -673 889 -534 -112 648 -742 398 166 -643 697 -332 -209 655 -585 167 366 -714
3369 -714 577 -65 -498 762 -609 51 571 -838 574 36 -634 905 -600 19 574 -827 593
3386 593 21 -623 762 -561 3 500 -713 354 71 -565 578 -338 -182 580 -639 218 301 -641
3404 -641 566 -187 -407 716 -605 90 402 -800 624 -77 -414 761 -666 137 481 -737 638
3421 638 -77 -429 758 -526 44 473 -741 448 16 -412 637 -370 -121 511 -572 224 212 -570
3439 -570 598 -240 -300 665 -667 215 328 -690 566 -230 -402 727 -625 181 419 -730 563 -147
3457 -147 -371 715 -586 84 338 -602 484 18 -419 575 -382 -3 468 -624 293 174 -490 629
3475 629 -288 -257 661 -616 248 234 -629 644 -294 -337 641 -644 208 270 -623 567 -202 -323 608 -577
3495 -577 168 437 -576 471 -45 -306 508 -385 -20 447 -563 322 71 -515 602 -326 -111 528 -592
3514 -592 305 206 -609 615 -285 -208 605 -600 254 187 -514 558 -218 -256 527 -503 165 303 -560 450
3534 450 -107 -291 552 -364 47 393 -571 339 34 -458 568 -353 -40 488 -587 373 143 -480 524
3553 524 -355 -170 485 -563 292 169 -543 521 -223 -184 498 -493 177 232 -524 455 -77 -242 493 -451
3573 -451 31 355 -533 381 -70 -390 573 -347 2 402 -507 347 15 -394 463 -300 -44 462 -526 309
3593 309 124 -514 508 -221 -188 431 -495 204 181 -452 434 -133 -249 474 -428 71 279 -473 387 -81
3613 -81 -306 423 -413 33 319 -515 352 23 -318 519 -341 -60 344 -484 310 95 -377 502 -239 -104
3633 -104 418 -442 223 149 -411 420 -167 -173 453 -408 158 185 -460 413 -116 -214 455 -358 79 281 -441 340
3655 340 -61 -267 465 -313 -52 309 -460 209 80 -331 435 -257 -69 405 -491 284 83 -350 407 -243
3675 -243 -120 411 -419 192 189 -363 423 -102 -156 366 -351 103 221 -403 315 -39 -264 377 -285 -35 282
3696 282 -426 238 27 -311 413 -269 -63 358 -456 255 83 -329 458 -233 -33 441 -430 231 124 -353
3716 -353 375 -204 -133 381 -326 49 184 -306 345 -10 -220 390 -311 -12 254 -420 253 46 -280 399
3736 399 -273 -36 329 -448 292 8 -303 399 -215 -21 318 -385 212 107 -336 297 -132 -99 277 -326
3756 -326 119 109 -300 318 -75 -210 376 -265 11 204 -408 317 -19 -258 368 -286 -19 278 -417 267
3776 267 16 -295 451 -303 -16 330 -356 214 93 -256 315 -159 -30 255 -314 140 112 -248 284 -58
3796 -58 -212 356 -304 52 266 -373 253 -20 -226 343 -252 70 320 -403 292 -33 -291 335 -292 21
3816 21 259 -331 258 13 -249 278 -197 -107 246 -301 143 99 -300 294 -71 -186 296 -280 33 224 -319
3837 -319 323 -46 -209 448 -300 34 259 -392 250 -24 -218 372 -236 57 253 -284 203 -18 -282 316
3857 316 -169 -57 249 -322 47 81 -273 249 -78 -227 378 -289 110 221 -339 300 -44 -228 365 -315
3877 -315 26 167 -330 311 -64 -231 314 -249 57 244 -325 226 -11 -220 287 -206 -21 209 -278 127
3897 127 68 -279 255 -65 -169 319 -292 59 122 -343 285 -69 -177 336 -319 81 144 -365 295 -87 -118
3918 -118 271 -218 34 186 -256 180 -27 -192 351 -118 -37 263 -284 137 111 -317 279 -91 -111 300 -297
3939 -297 72 114 -372 271 -114 -135 271 -316 93 85 -312 269 -73 -101 288 -248 67 200 -268 223 -69 -155
3961 -155 269 -180 9 236 -251 145 93 -252 226 -75 -141 311 -254 96 103 -271 310 -106 -143 316 -346 107
3983 107 123 -298 251 -157 -147 280 -217 43 126 -264 234 6 -179 223 -141 -12 212 -262 119 74 -263
4004 -263 284 -99 -89 307 -268 112 115 -292 304 -108 -82 269 -304 148 81 -332 254 -160 -139 236 -241 32
4026 32 144 -264 187 -63 -193 223 -157 -23 236 -282 188 33 -259 296 -164 -73 202 -308 190 79 -218
4047 -218 347 -177 -111 272 -280 119 103 -256 224 -86 -98 243 -232 84 155 -254 168 -82 -204 259 -254
4068 -254 -4 160 -302 175 19 -260 256 -158 -37 213 -312 244 16 -229 272 -174 -74 210 -277 171
4088 171 113 -287 284 -98 -69 257 -276 81 126 -225 265 -66 -89 230 -216 15 158 -253 200 8 -212
4109 -212 259 -240 3 182 -277 203 5 -220 287 -172 -70 277 -289 165 72 -229 299 -152 -75 242 -239
4130 -239 94 148 -171 285 -99 -124 227 -262 93 169 -252 261 -5 -206 244 -221 49 211 -267 265 18
4151 18 -208 258 -253 -43 231 -312 156 71 -187 314 -137 -74 296 -236 140 57 -234 261 -89 -130 255 -265
4173 -265 96 149 -228 243 -55 -166 290 -197 41 196 -313 192 -12 -207 222 -168 -10 207 -309 178
4193 178 41 -217 244 -208 -103 273 -298 113 51 -261 298 -107 -105 253 -302 64 97 -283 240 -127 -155 246
4215 246 -226 53 180 -319 220 1 -139 273 -214 -8 196 -301 137 47 -224 258 -252 -23 189 -306
4235 -306 153 53 -247 246 -179 -105 239 -248 130 81 -249 250 -133 -124 274 -214 60 146 -248 235 -22 -120
4257 -120 315 -181 90 169 -245 279 -20 -207 289 -158 12 215 -253 179 31 -215 288 -173 -68 238
4277 238 -281 160 39 -193 212 -166 -56 265 -215 60 95 -245 229 -95 -158 312 -225 74 162 -269 235
4298 235 17 -129 295 -180 25 195 -295 225 -18 -208 282 -221 13 193 -315 149 -17 -189 261 -122
4318 -122 -78 215 -236 171 62 -237 229 -63 -161 253 -200 66 178 -258 243 -93 -143 271 -253 91 155
4339 155 -270 247 41 -127 259 -211 26 178 -257 191 -33 -154 211 -227 -57 197 -210 90 -5 -254
4359 -254 184 -133 -87 246 -292 89 138 -278 223 -114 -99 288 -259 99 114 -323 275 -43 -143 282 -187
4380 -187 -20 116 -234 178 -40 -136 283 -122 32 186 -255 159 75 -197 242 -146 -20 216 -276 59 134
4401 134 -276 224 -61 -84 232 -250 170 63 -231 293 -110 -95 226 -222 86 151 -222 161 -24 -147 257
4422 257 -180 -16 164 -209 106 51 -175 254 -169 -27 239 -241 175 73 -268 271 -179 -41 232 -269
4442 -269 106 56 -219 306 -146 -94 257 -270 100 70 -228 196 -68 -175 285 -167 -31 96 -253 180 -30
4463 -30 -149 280 -165 -55 182 -204 162 12 -157 279 -133 10 246 -304 132 -15 -190 272 -153 -60 178
4484 178 -284 118 106 -219 210 -89 -123 277 -208 17 111 -261 188 -39 -195 216 -182 -24 204 -295 160
4505 160 -12 -194 221 -191 49 198 -243 102 -52 -156 264 -144 -22 207 -236 132 23 -234 204 -45
4525 -45 -60 178 -163 82 132 -305 147 -42 -152 248 -203 -2 179 -242 191 -15 -140 267 -204 55 154
4546 154 -225 149 13 -170 245 -180 -34 167 -249 140 61 -162 216 -106 -90 159 -197 94 64 -215 166
4567 166 -61 -133 240 -197 59 84 -246 205 -31 -149 241 -214 22 116 -255 163 -40 -131 187 -192 15
4588 15 125 -171 182 18 -175 201 -106 -96 214 -227 110 106 -198 255 -107 -98 174 -243 133 135 -243 190 -107
4611 -107 -98 262 -185 65 117 -232 171 -60 -129 204 -203 45 118 -210 121 46 -80 265 -154 -59 235 -191
4633 -191 153 91 -159 206 -134 -15 227 -201 64 126 -203 256 -155 -106 200 -204 111 93 -180 183 -76
4654 -76 -91 182 -241 23 135 -230 174 2 -143 196 -160 4 147 -224 185 33 -186 261 -102 -26 148
4675 148 -201 137 81 -197 255 -114 -60 142 -219 85 86 -182 251 -108 -114 176 -173 52 150 -164 149 -6
4697 -6 -94 178 -186 19 86 -224 185 7 -154 220 -163 -24 155 -185 160 18 -134 197 -101 -23 180 -165
4719 -165 82 30 -160 164 -92 -97 180 -141 32 73 -229 187 -76 -131 210 -133 40 121 -230 162 14 -115
4741 -115 135 -200 27 115 -209 106 12 -171 136 -114 -33 142 -196 92 25 -132 193 -141 -82 186 -213 90
4763 90 51 -221 197 -49 -75 180 -216 86 83 -162 198 -55 -89 151 -191 111 107 -166 158 -34 -189 143 -145
4786 -145 -50 146 -199 89 -28 -188 165 -169 -35 131 -186 99 -1 -122 187 -77 -105 149 -193 61 67
4807 67 -169 109 -80 -75 133 -150 20 63 -146 87 -8 -135 148 -129 9 134 -183 153 -21 -139 102 -156
4829 -156 -29 161 -228 123 -14 -120 189 -142 -34 148 -143 112 7 -110 131 -30 -39 170 -131 115 152
4850 152 -135 86 -18 -61 178 -158 7 44 -151 118 -51 -125 158 -144 7 96 -221 109 4 -145 170
4871 170 -180 -24 118 -220 105 48 -110 242 -70 -1 129 -164 75 6 -102 132 -34 -11 139 -133 80
4892 80 85 -138 135 -28 -66 134 -183 44 112 -200 138 -2 -137 156 -163 29 124 -191 58 -23 -112 125 -148
4915 -148 14 108 -144 104 65 -139 131 -63 -33 71 -143 77 97 -142 215 -33 -66 130 -186 57 22 -155
4937 -155 173 -77 -64 130 -98 9 82 -131 154 -9 -150 94 -138 -32 105 -172 60 32 -151 94 -75
4958 -75 -62 144 -166 105 63 -119 147 -54 -44 130 -85 0 33 -161 147 -29 -75 120 -126 81 93 -138 133
4981 133 7 -85 166 -93 -27 112 -133 155 -30 -109 116 -74 -18 121 -152 74 9 -93 134 -63 -41 148
5003 148 -158 38 49 -111 101 -53 -76 130 -120 15 97 -156 152 -70 -83 128 -102 14 70 -154 99 -11
5025 -11 -135 108 -101 -49 53 -166 64 2 -160 120 -119 -56 153 -192 89 -8 -88 107 -63 -8 109 -135
5047 -135 74 43 -108 81 -35 -44 93 -58 28 23 -148 115 -14 -80 145 -34 -22 74 -74 76 -7 -104 146 -89
5071 -89 -5 118 -172 7 69 -87 87 -21 -55 94 -121 -9 62 -116 100 -7 -58 103 -80 35 97 -134
5093 -134 119 -48 -47 155 -68 -26 63 -115 78 3 -111 106 -143 -3 72 -129 65 -79 -79 66 -110 -97 144
5116 144 -165 95 31 -119 69 -58 -21 81 -98 30 27 -123 81 17 -48 145 -94 32 62 -154 94 17 -70
5139 -70 123 -67 -2 129 -135 60 -50 -63 107 -46 27 94 -103 50 2 -89 91 -31 -43 49 -87 36 31 -100
5163 -100 63 -38 -47 63 -81 -32 27 -64 100 -30 -89 92 -101 -2 73 -94 89 32 -99 146 -104 -22 63 -81
5187 -81 83 -14 -60 57 -83 -16 85 -117 36 56 -103 120 -47 -61 123 -128 72 37 -129 114 -43 -98 112
5210 112 -111 15 101 -123 92 28 -107 108 -114 -12 55 -98 49 6 -98 96 -72 2 93 -72 81 5
5232 5 -85 91 -58 -21 76 -121 35 39 -104 112 -15 -56 73 -45 31 19 -104 39 -37 -36 107 -73 -11 27 -94
5257 -94 108 -3 -60 99 -70 -45 61 -118 50 11 -89 57 -98 -13 98 -97 31 -10 -144 93 -57 -91
5279 -91 42 -133 32 -35 -106 50 -51 -93 45 -75 43 90 -145 74 9 -103 70 -49 45 27 -51 90 -72
5302 -72 -38 106 -123 -12 75 -40 81 -8 -64 122 -107 -26 103 -83 31 9 -67 108 -18 -60 98 -85 -1
5325 -1 55 -129 58 -57 -89 127 -73 28 96 -74 90 -29 -79 65 -71 -6 87 -103 52 15 -115 67 6
5348 6 -49 76 -102 -30 85 -62 80 -15 -36 111 -37 1 56 -64 122 -12 -57 99 -113 0 12 -124 -2
5371 -2 -60 -44 57 -87 -33 47 -139 40 9 -89 103 -34 33 74 -110 0 0 -102 46 -46 0 74 -109 -13 3 -66
5397 -66 143 -58 19 114 -89 83 85 -65 64 -21 -29 63 -72 -7 18 -33 92 9 -58 43 -52 2 70 -58 42 1
5423 1 -74 69 -37 -33 64 -61 23 50 -102 93 -4 7 39 -77 44 47 -65 108 14 -82 79 -52 26 11 -32 28
5449 28 -22 -110 14 -46 -6 55 -36 55 8 -54 74 -47 -48 61 -120 71 14 -31 97 49 -44 50 -53 52 49 -82
5475 -82 77 -51 -30 62 -76 12 33 -79 40 -26 -33 105 -21 -28 74 -102 35 -26 -74 78 3 -28 45 -66 34
5500 34 63 -56 64 -105 23 24 -58 -13 -9 -111 118 -32 -59 -22 -36 -4 55 -42 40 -9 -8 88 -31 24 85 -100 17
5527 17 -26 -67 29 -38 0 49 -133 28 -18 -65 43 -16 -12 72 -20 -8 67 -38 58 -57 17 75 -19 41 51 -54 -6 -25
5555 -25 -74 60 -102 14 -14 -63 -2 -21 -30 49 -53 -45 44 -118 33 -35 -54 117 -90 -38 48 -82 19 -29 -36 17 -84
5582 -84 -37 72 -58 25 35 -24 82 15 25 80 -53 -21 5 -91 29 -17 7 87 -87 30 5 -14 61 17 -30 86
5608 86 -58 -11 50 -57 48 33 -77 23 -64 -12 41 -37 18 19 29 81 -27 -86 10 -13 32 28 -92 -38 -55 -48 50 -73
5636 -73 15 17 -51 57 -23 -9 69 -29 -37 42 -20 15 39 -66 70 -48 -45 10 -79 32 13 2 9 -12 -41 51 -50 43 64
5665 64 -36 44 -83 18 96 -95 27 73 -43 63 -28 -57 73 -47 12 19 -52 33 -6 -42 111 -17 21 0 -98
5690 -98 60 28 -66 30 -19 -15 50 -114 22 34 -90 36 -8 -4 90 -76 8 23 -49 7 13 -15 66 2 -45 67 -47 25
5718 25 24 -70 22 -29 10 87 -59 43 64 -100 104 2 48 61 -50 -12 -29 -87 27 -48 -41 35 -47 72 24 -55 39
5745 39 -61 -50 23 -67 -3 -13 -89 61 25 -14 97 -82 0 109 -54 36 18 -36 72 -4 2 79 -25 50 -17 -28 -21
5772 -21 -65 -12 52 -70 14 5 -52 12 -24 -41 73 -102 16 19 -29 40 -13 -32 79 -143 -4 74 -57 15 -47 -59 103
5799 103 -88 32 94 -30 35 22 -61 67 -11 25 49 41 45 24 -23 48 -2 20 87 -86 -3 54 -43 52 1 -66 -2 -81
5827 -81 29 7 -12 63 -60 6 39 -46 -58 15 -17 6 -7 -60 27 24 -22 67 -68 43 6 -18 90 -65 -5 30 -77
5854 -77 49 43 -29 28 -9 -36 67 -32 46 50 -39 35 -4 -11 6 -8 -8 34 -128 47 -41 -58 -13 -69 -60 26 -92 12 7 -5
5884 -5 66 -41 11 65 -54 4 27 -10 128 5 19 36 -1 -14 -13 -45 3 -15 -11 12 -30 -25 57 -54 1 23 -98 35 -13
5913 -13 -58 16 -38 18 -26 -68 7 -7 -21 -14 -117 9 -37 -41 67 -57 -47 71 -62 20 38 -94 46 -45 -25 57 -7
5940 -7 -10 -23 -81 30 -30 -36 35 -43 -29 65 -33 16 21 -24 64 41 -51 71 -70 7 27 -80 47 -57 24 3 -52 41 25
5969 25 -54 20 22 -18 12 -17 -17 11 -54 72 3 -46 8 -45 8 19 -58 99 -19 -32 53 -44 2 44 -60 44 -39 -65 39
5998 39 9 -17 29 -76 42 -4 -95 49 -16 -13 37 -30 -38 31 -75 48 -32 -28 22 -28 0 2 -45 48 -22 25 38 -46 3 11
6028 11 -40 -10 18 -44 2 -88 10 -18 -53 2 30 -26 -4 -79 6 19 -20 31 4 20 65 -61 26 15 -75 -6 -50 -34 20 -28
6058 -28 -29 70 -25 -38 55 -35 59 79 -5 46 -61 -15 40 -84 3 23 -93 71 -20 4 53 -53 29 -6 -79 51 -30 -27
6086 -27 61 -71 18 -1 -89 45 24 -33 75 -21 45 47 -59 47 14 -20 43 -40 35 3 -32 -3 -37 -36 -16 -63 -28 29 -9
6115 -9 41 14 -31 31 -54 -31 23 -19 -31 -10 -8 -18 -50 -27 32 -80 17 4 -10 18 -48 -30 -3 -67 33 37 -6 17 -21 -31 56
6146 56 19 -26 11 -9 33 14 -30 18 -17 -17 99 -54 -25 -8 5 26 -39 -2 23 -60 8 -46 -53 2 -15 -38 -31 -10 -1 60 -62
6177 -62 107 -8 12 21 -39 18 28 -11 19 16 -51 52 -29 -6 1 -79 35 43 -35 -5 -6 10 30 -50 28 -62 -32 22 -8 -41 -26
6208 -26 -49 -4 31 -64 42 -37 -111 77 -28 15 10 -69 37 -51 11 25 6 22 17 30 66 4 -31 38 -32 20 7 -61 16
6237 16 -17 -43 26 -27 -9 31 -41 24 15 -30 54 -62 -9 -8 -101 -5 -10 -6 56 6 -47 5 -80 43 62 -23 35 -57 -109 80 -64
6268 -64 48 84 -88 23 24 -59 6 -17 -16 50 -51 18 22 -48 -12 -23 -36 23 -92 -4 -5 -47 18 10 -40 8 -28 32 -15 -26
6298 -26 29 -6 54 25 -28 -2 5 -15 49 -56 -26 -26 -54 13 13 -18 66 24 49 82 -27 7 -37 -31 41 29 -37 18 -22 30 -24
6329 -24 -26 11 10 -10 30 -14 -33 -3 11 1 -13 -29 -15 5 16 20 26 58 30 -55 10 12 27 31 -17 -33 -30 -57 25 17 -29 63 -36 -51
6363 -51 8 -13 69 -27 -10 5 -16 -34 -22 -36 16 9 -24 -32 -27 -4 -34 -47 -33 34 -47 18 -16 -41 14 -24 27 27 -38 42 37 -32 58
6396 58 3 -4 6 -5 -27 0 5 -28 -23 16 31 -10 23 -14 -58 14 3 -22 32 -37 -2 -10 -61 18 7 -60 3 -57 -40 49 -26 36
6428 36 16 -15 55 -32 38 62 -12 1 -27 -91 69 20 26 13 -15 15 -20 -16 37 -16 5 3 -62 14 0 -13 31 -4 -14 -1 -23
6459 -23 16 32 -52 -9 36 -9 38 -51 79 10 16 -1 20 40 34 -45 -31 -28 -41 24 -8 -19 14 -65 12 49 -54 -3 3 -46 45
6490 45 -37 -8 17 -58 -38 -8 -4 -14 17 -36 -10 -7 -48 -31 13 10 12 0 34 11 -25 33 -51 55 32 12 -45 -14 28 3 -31 11
6522 11 -29 59 8 -23 2 -5 -43 0 17 45 44 -27 4 0 3 17 -6 -26 5 -16 -75 9 -38 -31 8 -10 52 -59 0 63 -42 -10
6554 -10 41 8 64 9 40 14 -11 8 14 -12 -22 -10 30 30 6 12 -37 -17 28 50 -15 13 -17 -36 15 -21 52 14 -25 -28 49 -25
6586 -25 22 32 -23 17 -35 35 -41 -18 40 -1 48 26 37 22 -1 32 46 -37 41 44 -15 -8 21 -84 -46 28 -81 -1 5 -16 36
6617 36 -39 4 -10 -9 53 -33 -33 94 -32 -8 -28 1 9 -14 26 6 2 -24 -8 -63 33 -4 29 5 7 -3 26 -50 52 9 -23
6648 -23 65 -51 -69 -29 -41 24 25 -37 48 -31 -6 45 -56 12 -6 40 3 -26 48 40 -21 -8 -12 2 33 16 2 -6 6 1 -32 -41
6680 -41 62 -1 30 4 -52 -4 20 20 14 -34 43 8 -2 -18 -1 -18 6 -22 -5 7 -61 -34 28 45 -42 23 28 18 -34 -10 -32
6711 -32 -36 42 14 -35 -21 0 24 -4 -50 9 25 43 28 -11 -3 52 11 38 -6 38 -30 7 1 18 -32 -7 8 12 29 44 20 22 -1
6744 -1 -12 14 -24 -6 26 -43 6 -40 -17 3 13 -2 -30 -24 -9 -5 -28 -51 21 27 49 -35 -21 18 31 7 23 22 37 -15 21 -29 -27
6777 -27 33 -29 -17 10 17 35 8 14 -43 -62 16 -52 40 -23 -34 -11 -36 -52 -29 -19 -42 5 11 0 -24 -3 -15 26 11 -7 12 32
6809 32 4 -25 -45 -21 10 -38 -6 5 21 -10 -16 51 30 -28 -13 8 28 -15 3 -32 3 -81 -60 -4 -32 48 -11 55 3 -16 -3
6840 -3 10 25 30 19 -3 -34 -49 44 -23 42 32 -55 59 8 22 -7 -39 27 15 -18 -14 44 -12 -13 1 -25 37 26 -72 -24 -40 -61
6872 -61 13 72 -27 -4 36 -17 -27 -2 2 51 7 1 -19 -6 -19 57 12 -60 29 -31 9 -45 -53 -8 49 24 31 -18 26 -35 -40 22 -75
6905 -75 22 -32 5 -33 -43 -22 -10 -6 -50 -55 -6 28 -1 -42 33 -16 -25 -1 -20 -22 23 -38 18 8 -2 -52 -59 53 -17 50 13 -1
6937 -1 -44 -14 -3 -36 -43 -29 -34 -33 -20 5 -30 -13 11 -26 48 4 6 44 49 -5 -24 11 -41 -16 9 -13 33 -47 76 50 11 41 -29
6970 -29 -56 2 0 -16 45 -9 27 32 -12 9 -2 55 7 -27 -27 -11 19 -5 -7 -47 -27 16 -14 -3 -47 -29 32 29 -22 33 -22 24 -7
7003 -7 52 6 -47 2 12 23 -6 -49 30 25 31 4 26 29 29 44 -17 14 -4 -23 -46 34 -42 11 29 20 -16 16 -2 30 1 50 -15
7036 -15 -45 -9 -22 27 -43 -7 -29 -5 26 10 -23 -18 10 -2 -11 18 31 24 -13 25 2 41 31 -18 14 -21 -6 18 13 -41 41 -22
7068 -22 -16 64 -27 10 11 55 -10 -19 -51 14 42 -27 -49 10 -12 -43 -33 16 -17 21 -8 -57 45 14 -55 6 17 7 -14 94 -3
7099 -3 38 -48 -28 34 -11 42 1 43 26 -29 -31 -46 11 -11 7 -58 -23 -36 24 0 -20 -16 15 -43 -27 5 21 -56 31 20 48 -9
7131 -9 -5 56 -6 -3 -12 -15 -69 25 -10 -3 33 -18 32 37 -15 14 22 -28 -45 -22 4 11 -35 13 -28 -20 -29 -19 -14 -43 -40 18 15 4 -2 17 -15 40
7169 40 -14 -13 -12 36 13 -56 -15 28 35 11 -9 -54 14 30 -5 26 8 2 17 -18 33 -6 -2 4 28 -8 -25 -54 5 -17 -1 29 -9
7202 -9 43 0 -3 -47 15 -62 -50 -31 -13 10 -19 12 37 18 12 -14 2 29 -4 -29 -44 3 4 -37 25 -31 -35 29 -9 -64 -62 57 -5
7235 -5 -20 -12 36 1 -37 -43 5 -13 31 30 -43 2 -11 -29 33 -2 15 -2 -4 16 26 14 -32 41 -30 18 -1 36 27 -84 18 7
7267 7 -14 -10 -31 37 108 0 36 7 6 1 27 11 19 -9 -30 -24 -4 14 -8 -22 -60 -14 -34 54 23 -13 54 -5 11 15 -8 -24 -24 49
7301 49 3 56 -4 -10 28 -41 -61 38 -16 -31 2 -12 23 10 23 53 29 1 15 -28 -1 -32 18 -60 -6 -30 -24 -34 -1 -74 -93
7332 -93 57 -64 -30 7 19 18 39 -37 -49 19 35 -17 1 20 -4 -17 17 29 -22 13 -7 22 16 -2 -65 7 -82 -38 -21 69
7362 69 -4 -17 4 1 -26 0 -17 18 6 3 8 -72 -24 8 -20 -29 -23 17 -56 -46 40 52 19 -20 26 -13 -12 -21 -36 -34 -1 25 21 -44 -11
7397 -11 3 -9 -4 -16 16 -1 3 -16 -60 -14 11 -34 -2 -6 -1 -26 39 -14 39 39 -59 -17 -2 -14 -22 -38 12 -11 -24 -30 -2 -6 40 -24
7431 -24 58 -1 -28 31 22 11 9 -23 -25 6 -5 12 -8 8 32 19 -24 -19 25 57 -19 -33 8 -19 33 -30 -56 -38 -33 -5 -8 10 -12
7464 -12 9 -29 -30 -10 -36 25 17 24 31 -43 2 -40 -53 21 -14 -6 51 -78 -30 -53 2 20 -3 -17 7 43 2 18 16 -56 -24 -3 -13
7497 -13 -25 -25 -11 -2 8 12 29 7 -22 12 5 -8 -4 39 -4 23 21 -5 43 -9 12 19 -37 1 21 18 -11 12 13 28 -12 47 24 0 -59
7532 -59 -19 -25 -36 2 49 -17 21 30 2 32 -46 -3 -29 -10 -17 -36 -37 26 0 -26 11 -19 7 21 26 -64 34 -76 -31 -11 12 19 -2
7565 -2 31 -10 -38 33 -2 -7 69 29 32 39 9 -7 -2 8 -3 17 -37 -36 23 -15 14 -5 47 -1 5 8 -54 -5 16 -19 2 -2 6 -16 -81
7600 -81 -42 17 73 19 3 -3 -61 -6 45 44 46 -27 43 -9 51 56 1 55 -15 -3 -24 -7 12 23 -6 5 -25 -17 38 -28 -33 -7 -75
7633 -75 -10 -61 -84 23 34 37 -12 -47 12 -18 39 28 21 -66 41 22 43 -1 -1 8 36 -13 -40 6 -17 -28 -49 2 -11 -23 -14 11
7665 11 5 11 -52 2 -32 41 -2 -42 -1 29 -26 10 1 -64 46 -5 -69 69 -5 -23 3 14 -34 -34 40 48 30 28 21 -38 3 26 -9
7698 -9 11 0 17 13 -31 20 -7 -51 -25 -41 0 32 -13 4 -34 -41 44 -35 9 13 -51 3 -38 -46 16 -5 -25 17 10 -34 23 -32 33
7731 33 60 -35 -10 -3 75 17 -13 -39 0 -6 35 -32 9 5 -3 23 37 7 20 -16 19 42 4 30 -6 -95 22 -52 12 31 -13 -8
7763 -8 -9 -23 5 -11 -31 84 -20 107 4 6 -5 17 -14 -6 8 53 -55 -35 12 31 -29 -19 -65 -2 24 -28 8 -33 -3 5
7793 5 -15 -25 -24 -6 2 -57 27 20 8 5 -13 -13 -13 -28 -35 29 -21 36 41 -40 -16 -46 29 -26 -40 -32 53 -35 -20 23 -7 45 -41 -39 19 16
7829 16 30 23 -33 5 -6 -17 -54 -47 2 15 -25 -37 51 -10 6 -11 -8 -12 27 -10 50 25 -1 37 -8 56 21 -20 33 -41 6 -42
7861 -42 -1 81 -40 -13 -9 -8 19 7 -27 34 11 9 -13 7 -15 42 0 3 -57 27 -2 0 -22 -25 -16 -42 -17 20 15 17 -14 34 0 2 34
7896 34 67 9 -10 23 4 -24 -28 23 -7 15 -20 32 18 -34 -45 -2 -30 10 40 12 -18 2 -17 -42 9 13 30 -64 4 -44 -16
7927 -16 12 -84 -26 18 23 3 10 22 1 -67 -30 -35 -5 40 -51 -38 20 25 -20 0 -14 -23 3 23 41 -6 21 8 -21 -14 2 -18 -7
7960 -7 32 -4 -18 -11 -11 -11 -6 -42 -25 -39 4 -11 10 56 -23 20 11 -5 15 -37 64 48 -62 -12 -6 11 52 -8 34 37 -6 -17 39
7993 39 -18 13 4 26 -32 -48 61 11 -18 4 -1 -78 11 -26 -40 9 -10 68 -6 -10 23 12 17 -24 8 24 -63 11 9 -27 -26 -2 -9
8026 -9 30 18 20 22 50 25 -24 -5 18 -34 44 1 -8 3 -13 -2 -20 13 6 -2 -37 -69 -1 26 -36 -4 15 -17 5 -9 49 -10 -3 47
8060 47 18 74 17 31 -21 3 21 24 -31 16 23 -50 -13 2 -29 60 -36 39 30 -36 -23 -35 -22 -16 46 34 -6 -1 2 5 13 10 -20 22 21
8095 21 -19 29 -49 -17 22 -72 -20 -7 -6 9 15 6 43 6 -28 20 35 35 -14 0 -36 14 1 22 13 24 17 13 26 -18 -75 -55 -24 41
8129 41 -10 3 3 -32 -20 -1 -60 39 33 3 7 14 -33 -6 1 45 33 -8 -21 26 -1 -13 -1 -20 -6 -16 53 39 3 -41 29 33 -51
8162 -51 -22 -18 3 -31 -31 -5 -5 -12 -130 -3 13 -41 1 -16 -18 7 -41 24 8 16 51 -2 -95 23 -5 20 39 -44 -69
8191f9
##END NTUPLES=NMR FID
##END=
