##TITLE=1H_1xp
 CDCl3
 8 sc, 
 3.11.2023
##JCAMPDX= 6.0         $$ Bruker NMR JCAMP-DX V2.0
##DATA TYPE= NMR FID
##DATA CLASS= NTUPLES
##ORIGIN= UXNMR, Bruker Analytische Messtechnik GmbH
##OWNER= root
$$ XWIN-NMR		Version 3.5
$$ Fri Nov  3 15:26:02 2023 Russian Standard Time (UT+4h)  she@DPX200
##.OBSERVE FREQUENCY= 200.1313
##.OBSERVE NUCLEUS= ^1H
##.DELAY= (6, 6)
##.ACQUISITION MODE= SIMULTANEOUS
##.ACQUISITION SCHEME= undefined
##.AVERAGES= 8
##.DIGITISER RES= 18
##SPECTROMETER/DATA SYSTEM= spect
##.PULSE SEQUENCE= zg30
##.SOLVENT NAME= D2O
##.SHIFT REFERENCE= (INTERNAL, D2O, 0, 15.7039)
##AUDIT TRAIL= $$ (NUMBER, WHEN, WHO, WHERE, WHAT)
$$ ##TITLE= Audit trail, XWIN-NMR		Version 3.5
$$ ##JCAMPDX= 5.01
$$ ##ORIGIN= Bruker BioSpin GmbH
$$ ##OWNER= she
$$ F:/spectra/data/she/nmr/H-F/1/audita.txt
$$ ##AUDIT TRAIL=  $$ (NUMBER, WHEN, WHO, WHERE, WHAT)
(   1,<2023-11-03 15:25:03.15 +0400>,<she>,<DPX200>,
      <created by zg, POWCHK disabled, PULCHK disabled
       configuration hash MD5:
       00 E9 B6 7A A2 85 ED C7 34 08 36 98 17 FE 4E 26
       data hash MD5: 16K
       0E A2 03 E7 46 08 43 35 81 F4 E5 1B D0 69 13 EB>)
$$ ##END=
$$ 
$$ hash MD5
$$ 7E 74 93 95 E2 00 7B 4D 3C D6 AA 41 FE 0B EE 93
##$RELAX= 
##$RELAX= 
##$RELAX= 
##$RELAX= 
##$RELAX= 
##$RELAX= 
$$ Bruker specific parameters
$$ --------------------------
##$DU= <F:/spectra>
##$EXPNO= 1
##$NAME= <H-F>
##$PROCNO= 1
##$TYPE= <nmr>
##$USER= <she>
##$AMP= (0..31)
100 100 100 100 100 100 100 100 100 100 100 100 100 100 100 100 100 100 
100 100 100 100 100 100 100 100 100 100 100 100 100 100 
##$AQSEQ= 0
##$AQ_mod= 1
##$AUNM= <au_zg>
##$AUTOPOS= <>
##$BF1= 200.13
##$BF2= 200.13
##$BF3= 200.13
##$BF4= 200.13
##$BF5= 200.13
##$BF6= 200.13
##$BF7= 200.13
##$BF8= 200.13
##$BYTORDA= 1
##$CFDGTYP= 0
##$CFRGTYP= 5
##$CHEMSTR= <none>
##$CNST= (0..31)
1 1 145 1 1 1 1 1 1 1 1 1 1 1 1 1 1 1 1 1 1 1 1 1 1 1 1 1 1 1 1 1 
##$CPDPRG= <>
##$CPDPRG1= <>
##$CPDPRG2= <>
##$CPDPRG3= <>
##$CPDPRG4= <mlev>
##$CPDPRG5= <mlev>
##$CPDPRG6= <mlev>
##$CPDPRG7= <mlev>
##$CPDPRG8= <mlev>
##$CPDPRGB= <>
##$CPDPRGT= <>
##$D= (0..31)
0 1.2 0 0 0 0 0 0 0 0.06 0 0.03 0 0 0 0 0.0002 0 0 0 0 0 0 0 0 0 0 0 0 
0 0 0 
##$DATE= 1699010702
##$DBL= (0..7)
120 120 120 120 120 120 120 120 
##$DBP= (0..7)
150 150 150 150 150 150 150 150 
##$DBP07= 0
##$DBPNAM0= <>
##$DBPNAM1= <>
##$DBPNAM2= <>
##$DBPNAM3= <>
##$DBPNAM4= <>
##$DBPNAM5= <>
##$DBPNAM6= <>
##$DBPNAM7= <>
##$DBPOAL= (0..7)
0.5 0.5 0.5 0.5 0.5 0.5 0.5 0.5 
##$DBPOFFS= (0..7)
0 0 0 0 0 0 0 0 
##$DE= 6
##$DECBNUC= <off>
##$DECIM= 32
##$DECNUC= <off>
##$DECSTAT= 4
##$DIGMOD= 1
##$DIGTYP= 9
##$DL= (0..7)
0 120 120 120 120 120 120 120 
##$DP= (0..7)
150 150 150 150 150 150 150 150 
##$DP07= 0
##$DPNAME0= <>
##$DPNAME1= <>
##$DPNAME2= <>
##$DPNAME3= <>
##$DPNAME4= <>
##$DPNAME5= <>
##$DPNAME6= <>
##$DPNAME7= <>
##$DPOAL= (0..7)
0.5 0.5 0.5 0.5 0.5 0.5 0.5 0.5 
##$DPOFFS= (0..7)
0 0 0 0 0 0 0 0 
##$DQDMODE= 0
##$DR= 18
##$DS= 0
##$DSLIST= <SSSSSSSSSSSSSSS>
##$DSPFIRM= 0
$$ [...]
##$SUBNAM2= <"">
##$SUBNAM3= <"">
##$SUBNAM4= <"">
##$SUBNAM5= <"">
##$SUBNAM6= <"">
##$SUBNAM7= <"">
##$SUBNAM8= <"">
##$SUBNAM9= <"">
##$SW= 18.0517328524113
##$SWIBOX= (0..15)
0 0 2 0 0 0 0 0 0 0 0 0 0 0 0 0 
##$SW_h= 3612.71676300578
##$TD= 16384
##$TD0= 1
##$TE= 0
##$TE2= 300
##$TE3= 300
##$TEG= 300
##$TL= (0..7)
0 120 120 120 120 120 120 120 
##$TP= (0..7)
150 150 150 150 150 150 150 150 
##$TP07= 0
##$TPNAME0= <>
##$TPNAME1= <>
##$TPNAME2= <>
##$TPNAME3= <>
##$TPNAME4= <>
##$TPNAME5= <>
##$TPNAME6= <>
##$TPNAME7= <>
##$TPOAL= (0..7)
0.5 0.5 0.5 0.5 0.5 0.5 0.5 0.5 
##$TPOFFS= (0..7)
0 0 0 0 0 0 0 0 
##$TUNHIN= 0
##$TUNHOUT= 0
##$TUNXOUT= 0
##$USERA1= <user>
##$USERA2= <user>
##$USERA3= <user>
##$USERA4= <user>
##$USERA5= <user>
##$V9= 5
##$VALIST= <valist>
##$VCLIST= <CCCCCCCCCCCCCCC>
##$VD= 0
##$VDLIST= <DDDDDDDDDDDDDDD>
##$VPLIST= <PPPPPPPPPPPPPPP>
##$VTLIST= <TTTTTTTTTTTTTTT>
##$WBST= 1024
##$WBSW= 4
##$XGAIN= (0..3)
0 0 0 0 
##$XL= 0
##$YL= 0
##$YMAX_a= 165538
##$YMIN_a= -142825
##$ZGOPTNS= <>
##$ZL1= 120
##$ZL2= 120
##$ZL3= 120
##$ZL4= 120
##$ABSF1= 10
##$ABSF2= 0
##$ABSG= 5
##$ABSL= 3
##$ALPHA= 0
##$AQORDER= 0
##$ASSFAC= 0
##$ASSFACI= 0
##$ASSFACX= 0
##$ASSWID= 0
##$AUNMP= <proc_1d>
##$AZFE= 0.1
##$AZFW= 0.1
##$BCFW= 1
##$BC_mod= 2
##$BYTORDP= 1
##$COROFFS= 0
##$CY= 11.3945322036743
##$DATMOD= 1
##$DC= 2
##$DFILT= <>
##$DTYPP= 0
##$F1P= 15.7292609196834
##$F2P= 12.9074282941183
##$FCOR= 0.5
##$FTSIZE= 0
##$FT_mod= 4
##$GAMMA= 1
##$GB= 0.15
##$INTBC= 1
##$INTSCL= 1
##$ISEN= 128
##$LB= 0.24
##$LEV0= 0
##$LPBIN= 0
##$MAXI= 10000
##$MC2= 0
##$MEAN= 0
##$ME_mod= 0
##$MI= 1.114404
##$NCOEF= 0
##$NC_proc= 0
##$NLEV= 6
##$NOISF1= 3.799351
##$NOISF2= 2.8
##$NSP= 1
##$NTH_PI= 0
##$NZP= 0
##$OFFSET= 15.70392
##$PC= 1
##$PHC0= -23870.07
##$PHC1= 10.05269
##$PH_mod= 1
##$PKNL= yes
##$PPARMOD= 0
##$PSCAL= 0
##$PSIGN= 0
##$REVERSE= no
##$SF= 200.130013532006
##$SI= 16384
##$SIGF1= 3
##$SIGF2= 2
##$SINO= 400
##$SIOLD= 16384
##$SREGLST= <1H.CDCl3>
##$SSB= 0
##$STSI= 0
##$STSR= 0
##$SW_p= 3612.71676300578
##$SYMM= 0
##$S_DEV= 0
##$TDeff= 0
##$TDoff= 0
##$TI= <>
##$TILT= no
##$TM1= 0
##$TM2= 0
##$TOPLEV= 0
##$USERP1= <user>
##$USERP2= <user>
##$USERP3= <user>
##$USERP4= <user>
##$USERP5= <user>
##$WDW= 1
##$XDIM= 8192
##$YMAX_p= 0
##$YMIN_p= 0
$$ End of Bruker specific parameters
$$ ---------------------------------
##NTUPLES= NMR FID
##VAR_NAME=  TIME,          FID/REAL,        FID/IMAG
##SYMBOL=    X,             R,               I
##VAR_TYPE=  INDEPENDENT,   DEPENDENT,       DEPENDENT
##VAR_FORM=  AFFN,          ASDF,            ASDF
##VAR_DIM=   8192,          8192,            8192
##UNITS=     SECONDS,       ARBITRARY UNITS, ARBITRARY UNITS
##FACTOR=    0.0002768,     1,               1
##FIRST=     0,             0,               0
##LAST=      2.2672688,     0,               0
##MIN=       0,             -142825,         0
##MAX=       2.2672688,     165538,          0
$$ Real data points
##PAGE= N=1
##DATA TABLE= (X++(R..R)), XYDATA
$$ [...]
1804i64J308n01r58P93J215j547m8J622n12r04Q33O53j428K73J113p01r52R96
1822B91M59j245k43J017k63r88J044M77r39oJ237m63q78Q17O42j191K91L26m84
1841i9l61N86L81j206J91P29n95l78Q21L65o17j3P47k42l63M83m8l86j19O10J7
1862E03o37J96j33r5k93L66j92Q7J58K50k24j1K24l44J10j3J9lJ97J75k12k54
1884a26J61j52K30R4j80J08j3j25j16J04J48n4k9j8k29k00O29p8o30N37L01n37
1906a75o7P45l35k57N41K0p51J31N81n71k18K10N5n74L52L97p0j86J43N54p05
1927a80k01O51J25n05M57N17q23j56N94m00o71J49P33p42m1O61k17m25N97L50
1947D73j046M57Q00m24o75Q10K15p10l7O62k35j009J045J2j053N94L77n06m11
$$ y = [-964, 344, -157, -1115, -322, 893, -654, -702, 920, 408, -496, 337, 990, -438, -165, 948, 247, -705, 291, 750, -495, -738, 279, 16, -972, 72, 549, -390, -396, 841, 378, -500, 317, 959, -232, 59, 385, -99, -460, 126, 507, -699, -508, 221, -374, -752, 69, 434, -183, -196, 551, 309, -54, 429, 381, -5, -124, 486, 503, -134, 62, -71, -166, -459, -93, -285, -198, -40, 210, -14, -25, 199, -145, -35, -48, -29, -32, 165, 340, 128, -126, 35, -117, 113, 207, 27, 135, 122, -3, -119, -15, 133, 79, 50, 32, -197, -397, 232, 154, -476, 61, 362, -175, -242, 503, 168, -89, 452, 472, -279, -148, 433, -138, -356, -146, -91, -665, -313, 84, 14, -172, -29, 525, -180, -381, 270, 395, -110, 347, 864, 41, -115, 479, 79, -592, -443, 290, -452, -493, 168, -49, -474, 123, 473, -573, -116, 684, 260, -415, 395, 610, -100, -137, 525, 290, -719, 326, 338, -715, -121, 256, -250, -661]
1966f61P38K20o79L12N86k90n26N07j31k51n9P40o74l73P06M2o53lP83m11m01
1987d78M42L59q72M26P37o20k60O89L3p36L34N04p40k29O22K04p16K32L32m15
2007a52n32J239j62r80M65K74k46m76P98Q7m88O8N44l60j97M73Q6o33J25L39n12
2028b40j56M70k51l97L18K84j94k60N19K0J69j13J60k92j60P11k63j23l14N95
2048D83n72k46M82j71n3j20J66p7o2P3K11J38l11L69J66m60L41K8l05J23K12m84
2070f9j85P1J79m49J06L93l07n0O9L25k53L97N6P9o0n6J09j86k67K40kj16J43
2093A67l19j51J89K12l59jp1J62O0q9M55Pq4J19j66J81q8l15L07k17j28J93o2
2116Bk42o5j25K80m4j57L63L5J6j33l7K01N31l60j9N9l77J52p1J15R6j98J87n05
$$ y = [-661, 77, 297, -382, -70, 516, 226, -300, 207, 76, -175, -234, 506, -168, -541, 165, 207, -446, -449, 334, -77, -478, -36, 323, -549, -123, 614, -6, -266, 423, 456, -280, 54, 558, -182, -411, 211, 415, -301, -69, 263, -152, -684, 555, 393, -587, -122, 152, -94, -570, 228, 315, -173, -105, 439, 79, -118, 355, 441, -192, -67, 272, -240, -396, 74, -177, -574, -256, 28, -166, -426, 93, 113, 282, 169, 329, 37, -123, 588, 325, 202, -112, 483, -89, -335, 147, -24, -77, -197, -31, -108, -170, -97, 114, 252, -59, 310, 476, 16, 357, 385, 80, 203, 415, -69, -254, -183, -4, -453, -347, 46, -261, -311, -242, 83, -170, 227, 283, 362, 302, 246, 355, 169, -98, 142, 140, 24, 167, -152, -303, -114, 98, -261, -262, -333, -171, -111, -200, 255, 262, 178, 297, 131, 312, 224, -91, 216, -1, -129, 64, 2, -240, -305, -430, -150, -194, -351, 12, 47, 63, -70, -107, 94, 625, 265, 246, 305, -72, 80, 9, 124, 220, 22, 209, -296]
2140b96J63J34M1l35J24K6M44j57Q0o8k19J66K36j22J38K7m55l21L61P5j96j51
2162c05L58n5m89L83J53l8j13L50rj1j37J15j94j26L73r5k55L41m03K6l70O02
2184A01k28j07K33J3m04K78L41l8j94K34M6l72K40L3o2k62M59r9k79m9J37k13
2206a92L0K47K24o33N8M37k11k19N60m83j8K79K26m7m38N19k94k13r3K85o1k21
2228b58K04P6n99K32N14k89m4J65J98l59Q7N37n07k00N55j68k12j89K40k64N7
2249b24J96Jl01Q2K94k41j18L00J95m25L22L46m97R9M18k08m13M55k6l12j58K81
2271F6j20l95J20J77K86o67M25K25j91K5L00l53M64O9k31k25q5J82k15K02j08
2292d9J12l36K06J37n33M02j2R7Q0j94L70l07K34K01m08J28r5J53n24K49N1M9
$$ y = [-296, -133, 1, 42, -293, -169, -143, 301, 144, 224, 156, -63, 103, 339, 217, 355, 382, -73, -394, -33, 42, -154, -305, 53, -2, -491, -108, 45, 7, -106, 244, 235, 224, 87, 202, 8, -118, 255, 160, -95, 246, -157, -131, -501, 101, -127, -234, -1, 12, -392, -114, 227, 189, -5, 229, 275, -97, 143, 176, 114, -148, 311, 212, -67, -116, 21, -192, -162, 85, 309, -324, -266, 171, -40, -259, 301, -182, -200, 79, 305, 258, -180, 339, 45, -168, -261, 24, -37, -258, -54, 22, -577, -345, 169, -120, -164, 1, 199, -160, -73, 464, -43, -243, 312, 144, -68, -257, -17, -281, -224, -28, -27, -328, -246, 48, -193, -311, -11, 184, -241, 81, 427, -70, 29, 447, 239, -174, 281, 255, -57, -215, 66, -54, -449, -329, -152, 134, -533, -108, 117, -74, -49, 251, -102, 362, 431, 200, -25, -110, 72, -143, 59, -49, 63, -273, -67, 70, -463, -61, -73, 24, 104, -90, 280, -27, 207, 408, 0, 128, 33, 186, -338, -89, -38, 11]
2314A1%l4J77k85J37l93kL32r5J56l0n1k6L5P3J92n3LO1R7k40Q3m15J36J66r7
2340f2q3j14L45m72J21K85J34K2k4M8k65l9L85q4J16m41P3j15j10K47j38K4j27
2363b74J54k5p1M95k35j75K24J64n44J64M10k2l99K12M23m65j45K76p5l81L20
2384C1p0k36M07Mr9l32K72J91k28k06M03p1j82qL53m86J30K65k79k44L50L79o27
2407b83L01K35n0o16M00K91k67j87M26m5l45L73j13m21L75K84l10o45P17j00m55
2428d35K10K1J43j80L26R0n19J23M81k04q7L00R5l12o9L33l28m04N02L56p36Q7
2450b07M05r7j99k3M22l82K2L00j35m89L64J87j85r7L38k62j51J54J10l79R6M01
2472A93j27m32K43J87j57q9N38k08l55K52j00j15N7K02m9j76L71j45j91J33L66
$$ y = [11, 11, -23, 154, -131, 6, -387, -389, -57, -152, 4, -26, -77, -103, -68, 5, 197, 144, 147, 208, 305, 65, 148, -267, -131, 35, -62, -145, -259, 86, -386, -265, 20, 154, 176, 152, 200, -65, -104, 281, 197, 313, -128, -55, -170, -280, -33, -171, -147, -274, -120, -145, -216, 279, 44, -131, 93, 257, -287, -123, 287, 265, -134, 78, 501, 36, -109, 167, 92, -289, 31, -39, -275, 132, 136, 37, -295, -23, 168, -60, -266, 137, 66, -116, -124, 229, -257, -127, 138, -141, -385, -35, 344, -283, 18, 253, 203, -413, -13, 278, 11, -176, 250, 205, -140, 233, 120, -301, 74, 358, 48, -597, 120, 20, -435, -225, -204, -61, -241, 85, 175, -344, -221, 260, 56, -31, 269, 364, 52, -17, 316, -12, -416, 86, 442, -294, -207, 198, 101, -98, -121, 301, -81, -59, 241, 106, -383, -19, 168, -17, -114, 224, -38, -189, -35, 75, -304, -208, 193, 66, -366, -123, 64, -93, -182, 356, 148, -207, 45, -55, -170, -113, 89, 40, -136, 235, 90, -101, 32, 398]
2493C98l05l82N14j44j61J45M4j22j84J70J31j38K45l09j7K67N7k00j64L3J15
2514gR6q2l38L34k31l9K55O1k25J67J71l06l22N39K74m34L21k11p2J78j65K27
2536A91k47QP3n8l0N3N9j74Q9oJ16k18J61k10nK91l16P2K85JK7m3q6N4J8j09k09
2563b13L36K9l3j83R8l02J04J51j87O7k7K91j05J31R8NN8k49O6m8n4J05R1k36
2587gj54K08k42K92j64J38j39J75J10j62N7j23l0J87L1n8j71j02K00k07P9kj85
2610b69N3J0K29jj03O9j48J97K30k45J03L7j39J34l17K03J56k26j76J31p8p1j63
2633c84L44j03J12R4r0j32M28L4j55RJ6O3j57o6l3j58L85j30j51j16O2O3L6j40
2657a69K15J15l35K89k10M80l74P2K77p6J4j17n9k9l9k7j38L01o31M44p8q0K96
$$ y = [398, 93, -289, 225, 81, -80, 65, 109, -13, -197, -27, 104, -34, 211, -98, -115, 152, 209, 9, -155, -122, -7, 89, 7, -331, 3, -228, -267, -12, 49, -176, -9, 162, -144, -466, 73, 347, -87, 234, 23, -49, 129, -36, 191, -56, -48, 25, -33, -63, -10, 49, -125, -36, -42, 74, -144, 17, -193, -198, 93, -223, -151, 134, 135, 162, 119, 33, 87, 105, -4, -213, 123, 152, 119, -64, 34, -268, -164, -13, -200, -133, -160, 131, 26, 157, 255, 260, 318, 69, 135, 87, 33, 138, 229, -7, -161, 47, -195, 97, -67, 71, -68, 107, 217, 55, 112, -11, -41, 146, 177, 119, -52, -154, 46, -161, -82, -84, -269, -216, -206, 23, 22, -81, -12, -160, 37, 267, 22, 125, 162, 23, 157, -160, 43, 199, -27, -203, -72, -150, -221, -384, -40, -143, -31, 63, -27, -159, 269, 303, 148, 157, 173, 236, 79, 13, -20, -178, 207, 77, -74, -190, -128, -65, -29, -169, 46, 161, -174, 115, -95, 385, 11, 83, 360, 284, 298, 181, 122, 93, 54, 27, -111, 190, -441, 3, -75, -155, 141]
2680A41j16j0J46k85J26J61k6J52j25j27J49o8J1k19K55j88Nqj17J24j04L61o55
2703d17N36j75J58oj82J38K57R8m74O7k19L16l9q8O7j01J00q5j58K16l5J11J34
2726B19k42J45J7P4j56J25k31K14j04J71k99J46N2k55J38k86L06j19o0R1J57q7
2748A6j32J38M0l5M3l3Q6K5QN9k05k76O4J96k93J39pJ53P9j80K7J74j35K5j45
2773a69L28L0j18J75j55m5k68K45J70J9k72j12J15MJ06j38J34J43R8k59K83j62
2795A52J8l57K36k22J03L0j35J60k7m5L90l86M2L16n85K03J2J20k59M35j76k69
2817b44L73j35M78m70K1Pl75M57Q3j40j28J33P2k03j80M10k41j84L42J56l06j55
2839b29N18l38k23J83R9M4J04j39m9j12K97j47k67K82j38J46j01J13m89M28j39
$$ y = [141, 25, 15, 161, -124, 2, 163, 137, 289, 164, 37, 186, 118, 129, -90, 165, -23, -18, -26, -143, -19, -123, 238, -417, 119, -56, 102, 96, -86, 52, 309, 407, -67, 0, -219, 97, 58, -30, 37, -64, 36, -49, -207, 9, -26, 85, 219, -23, 122, 139, 213, 57, 182, -49, 165, 61, 232, -67, 79, 131, -124, 14, -272, 34, -85, -145, -54, 103, 16, -116, 22, 62, 27, 70, 37, 123, 148, 156, 215, 10, -266, -202, -6, -299, -160, -167, -14, 65, -115, -88, 86, -49, -24, -169, 159, 189, 71, 246, 91, 46, -222, 23, 193, 212, -60, -172, -57, -53, 53, -85, 49, 192, 290, 31, 314, 152, 170, -187, 49, -173, -70, -40, -175, -15, -42, -87, 303, -83, -41, 275, -310, -107, -95, 25, -234, 201, 25, -244, 129, -6, 472, 2, 23, 30, -345, 112, 195, 55, -73, 60, 132, -71, -251, 159, -82, -266, 76, 232, -74, -229, 289, -49, -272, -89, 10, 54, 158, 19, -30, -142, 155, 8, -259, 23, -115, 31, -70, 43, -446, -18, -157]
2860a57K98p1rkn6l01K11K43m13M08J7k58j41J75p4L6J40n3j45R0K70l10K71l58
2884a89J86j1QK35k37k15M1K05J01l71J90J12K3r3r7J53n0j42q4K22P8j48J15
2907C2J22kk51K61L5j68j19j58L12K72j80m88M47l22M06j88J15j05R0k19K17J71
2929B80j51J04l11K1J98r9r1j3n0J80o4m8J48l60N14j69m21J30R1Q3j84rL40j89
2953g0K4J5K44l23K33k28K29j55O7o9J77l85K59o7J2L0q2J67m82L82K13j51Q2
2976A22k03j68M82k67o8J49k11Q2O7l20Q6O1J13j55J38N6l1r5K30l32L32k22L2
2999a22K96k37J20K9k34j34M83l08MP9o8K0l32L53m4j06k4J04J85j98K56j91J5
3022e4L34k47K23J28m05n3J24M16m85k47K23L4J63k87J16m7j3J99j24K32l82J87
$$ y = [-157, 141, 70, 61, 59, 3, -298, -87, 156, -257, 151, 168, -90, -231, -56, -130, -94, 46, -7, -152, -62, 208, -102, 169, -189, -3, -14, -6, 229, -8, -223, -182, 23, 124, -247, -57, 55, 78, -15, -112, 41, -9, -151, -235, -13, 65, -83, 32, 154, 152, -99, 162, 197, 29, -90, -248, 64, 336, 156, -332, 115, -207, 199, 11, 126, 21, 111, -108, 109, 280, 129, 233, -78, -57, 141, 42, -49, -62, -112, 68, 4, -44, 104, -256, 258, 89, -332, -202, -111, -28, -212, -221, 119, -70, -46, -31, 213, -110, 123, -105, 124, -31, 36, -33, 144, -241, 18, -49, -37, -7, -89, 78, -404, -22, 191, 40, 122, -81, -249, 233, -34, -102, 47, -164, -82, -15, -335, -249, -188, -75, -230, -92, -36, -67, -162, 68, -264, 68, -154, -122, 174, -63, 57, 86, -148, -282, 201, -107, -103, -24, -92, -72, -404, -51, -95, -201, -225, -121, 64, -134, 122, -69, -54, 280, 33, 256, 384, -21, -74, 50, 466, -19, -266, -43, -9, 154, -133, -17, -64, -77, 122, -2, 230, -152, 35]
3044C5R4q2j5J36j93R9M6k19j73L62q5J31j90P4n05L76J28P0r8j49M2J8J4M39
3068C55j96K3J06m92J18P5R6j93k3k8K1L20l62Q1L3M7p2K98k54l56L07J27k11
3091a80J80r2O3L19l04O1j93J1l4J11j63K68j11j50J73j05K86k17J0J60L8J45
3113B76q4k12R9J5j72J07N9l56Q9L5K03j4l30K52J83j78r1o1J56K14k78J21j23
3136i0O3Ml57jL45J3q2l3J65R4j15n2J75k81J08KN4O7J08j16k2l2R3o6j17K05
3162A32j91k10L93p1r6J8J77j65r0RM9K2k0j17K92k26J1K74j4o1ol44k7J55L43
3187B37m54L05j89Rj92J27O6J39L9j84L1K82j61K00J12m73k8qJ67k95K22J20K6
3210I8j52j75K56kO1j81L7K04q2Jo8L15k52j05R2j84K38n22N80j31j28q1R2J5
$$ y = [35, 129, 47, 32, 168, -25, 74, 120, -99, -272, 90, 5, 136, -54, 20, -485, -109, 19, 89, -9, -158, -116, -98, -84, 355, 159, 182, 288, -204, -86, -11, 85, -108, -131, -159, -138, 182, -180, -99, -66, -19, -91, 207, -47, -403, -96, 31, -180, 0, -92, -29, 290, -14, 47, -146, -135, -169, -58, -221, 47, -64, -214, -41, -146, 140, -77, -67, 93, 131, 276, 192, -20, 79, 94, -78, 29, 88, -268, -179, -144, 59, 45, -285, -33, 150, -28, -119, -180, -24, 190, -88, 33, -90, -27, -23, -380, -381, -36, -23, -105, -138, 27, 121, 6, -46, 129, -152, -44, -42, 12, 79, 187, 71, 49, 17, 110, 44, -73, 132, -59, -269, 124, 53, -43, -25, 152, -13, -103, -94, -45, -23, -43, -160, 132, -94, -83, 191, 177, 116, 110, -234, -261, -106, 237, -217, 88, -101, -92, -284, -157, -91, 48, 87, -97, -66, 216, 55, 255, 367, -106, -134, -142, 25, -270, -48, 72, 98, -54, -229, 27, 25, 86, -95, -58, 146, 64, 65, -3, 312, 60, -45, 47, -137, 101, -421, 159, 28, -100, -181, -89, -74]
3234g4l3l4j36J01J21L05j82j6j26LJ5K34q4M6j8Q9k20K07J9j86J11l34O5O5J2
3259e0P7n8n3J99n3j05O5p3P1J58q3p4J1L6k06L07l55j38K37K19j60j3j13N3R
3284i2OJ01K96n64K94m1Q7J5l4J02l30K24O3j14j26L9J46j68L16l15K40j51J02
3307I6k7k2n5m9J74j27Q2n7K27j63PL6l42L36j84j1j85M76j79l8J03j86n3K15
3331G4j77L8R3Q7k65R7j46M44q9o7k49K06L9r1j8P8j72k4J90K4q9j40K98k8k18
3356a05K06N9j23j1j38J57j47K03k36K62J11l18J11k27J17J08r1KKk01L27k65
3378a97L4L68l55K96q1j03J58L4r9J4j21K43l3k40j50K48r4J93n0j16K1l7K23
3401A56ql06J39J37M1p3j11K2J37o2o5jj46K34P6l93K95O4l11R9K24l1L8N4j07
$$ y = [-74, -107, -141, -277, -176, -55, 250, 68, 52, -74, -71, -56, 178, 94, 140, 122, 211, -9, 198, 217, 31, 142, -192, -127, -62, -50, 27, -31, -84, 115, 62, -43, 22, -51, 20, 178, 95, 21, 32, 68, -138, 169, -186, -324, -87, 132, -28, -41, -154, -101, -92, -86, 15, 311, -253, 41, 0, 87, 102, 68, 170, -160, 64, 127, 13, -113, -74, 72, -96, 220, -95, 145, -6, 96, 69, 47, -8, -57, 117, -10, 72, 15, 242, 79, 86, 122, -220, 116, -68, -79, -264, 212, 33, -5, 98, -88, -141, 74, -103, -65, 28, 115, -150, -53, -199, 245, 156, 89, -160, 46, 85, -6, -24, 54, -118, -142, 48, 72, -17, -157, 141, 113, -105, 101, 160, 37, 26, -112, 45, -102, 101, -135, 127, 238, -80, 31, -196, -79, 29, -62, -60, -58, -259, 68, -197, -163, 205, -150, 146, 65, -38, 120, 154, 55, 69, -52, 191, 158, -82, -232, 16, -78, 115, 65, -51, -30, -67, 156, 148, -158, -19, 118, 159, 86, -25, -3, 134, 72, 7, 6, -140, 94, 170, -223, 72, 136, -175, -76, 148, 117, 155, 209, 102]
3426A02l10K97k68j7J23n2J52k8k5j45K96l66L27k86J51j4J0l4K07l9j77Q6O2
3449E2r3J70k51P3j38M57l21r5J67K3k33P1k5k17L87m8J43j79J76k45J21o0m3
3472a08j5J97J4N2j47k52K69j7j26Q0j5J31j80l6J0R8O5R8j07J22k93N6K46j62
3496b0l9p6N88o41K82k16K65j69Q5LJ35j71j5j01O1N4J67l39J44J81l02K49k05
3519h0l2K11k65J83J4O2j84K64N0l24K74J72p22L01J94n0J31l24K72m7o6j2q4
3542f2J46r7m7N9j07L6j12J91P0r4L18m49J25J92j17K08k57mJ56k83p8L08m94
3565c92P16p53J78ML28m6M5R9j58k55M55k08L8o9L1R4k93L90j04K23l24J62j94
3588c3J10K4r7l6M4j58K30j07J91k55R5k32K78J2L9j87R7k44J76J63j4k93M08
$$ y = [102, -208, 89, -179, -196, -73, -125, 27, -1, -26, -171, 125, -241, 86, -200, -49, -63, -53, -87, 120, 81, -96, -10, 52, -41, 129, -122, -49, -187, 270, -51, -146, 21, 44, -189, -118, -143, -360, 27, -21, 122, -57, 119, -126, -5, -65, -108, -123, 74, 88, 140, -7, -259, 10, -7, -133, -53, -68, 63, -117, -153, -143, -45, 20, 118, 11, 133, -160, -104, 142, -20, -59, -135, 453, -188, 94, -122, 143, -26, 59, 62, 197, 26, 11, -90, -29, 25, 192, -147, -3, 178, -124, 125, -80, -112, 99, -166, 17, 31, 93, -91, 173, 223, -101, 173, 345, -377, -76, 118, 68, 199, -125, 147, 100, 34, 22, -62, 84, -13, -60, -1, -108, -72, -184, 7, 77, -17, 301, -148, -23, 169, 52, 260, 3, -1, 155, -128, -206, 102, -392, 324, -429, -251, -247, 81, 35, 80, 179, 21, -234, 221, 13, 51, -18, 13, 107, -186, 204, 100, 323, -1, 161, -33, 77, 101, 4, -32, 12, -146, 84, -23, 168, -87, 8, -224, 54, 66, 105, -82, 15, -229, -53, 110, 96, -197, 211]
3611B11k03%J35l61M60k26j34K63k82K05p3R7J92l08J05k6m23K15M5J44J1k69
3633b22L8J51K31k97q3LL99m41K06j97K59N9J06j25m1K88k94O7j70J84j51q8K8
3656i0k45M89m3l8jM4l78J39L30j74OO5r4J60p2j28j55K39o5q2J83l04M40L3j35
3681A24k22mJ68Q1k90J86O8n0J9J3k21Q9L54l02K4K35m11M9Q1Q6l32J69Q2P5k29
3706a58J45J00j28J07J4j00L1N9M4k52K44J20k01K44l08j42Q5J5J5l7R5om9p1
3730a34J92m14J38J06J35j53J2K53j38J19m17K49J41p1K21k40n7J14q5n4l25L10
3752i8M0Lq7K37k64J28j9J17K15j64K5n4J96k89p9J28j86K51k05J71J97l10K15
3775A68n8j47J16l0j25p3J25j8N9n7j76J52R1l05J99K04k78M36p06M23M8j32K56
$$ y = [211, 8, 8, 143, -218, 242, 16, -118, 145, -137, 68, -5, 92, 284, -24, 81, 55, -368, -153, -108, 36, 47, -222, -184, -33, 198, -99, -182, -179, 220, -221, -15, -212, 47, 106, 212, 87, 46, 334, 40, 107, -63, 121, -30, -118, -90, -335, 154, 111, 73, 72, 116, -262, -123, 207, 33, 39, 104, 10, 170, 98, -30, -185, 54, -11, -93, 90, -214, 226, 259, 124, -98, -102, 66, 147, -143, 43, 111, 61, 80, 93, -128, -39, 315, 13, 37, 272, -139, -90, -9, 77, -255, -86, -4, 71, -158, -13, 87, -41, 66, 80, -20, 11, 70, 114, -138, 106, 226, 25, 269, -39, -181, -96, -81, -66, -103, -8, -14, -63, -134, 58, -356, -218, -112, 23, -130, -118, 135, -3, 116, -301, -52, 89, 18, 239, -1, -58, 56, -29, -83, -408, -98, -58, -55, -142, 95, -169, -41, -60, 57, 272, 108, 133, 79, 275, -14, -93, 35, -151, 100, -105, 66, 263, -47, 168, 110, -37, 79, 49, -76, -149, -24, -42, 17, -40, -216, -64, 27, -278, -79, 125, -153, 283, -423, 0, 48, -84, 172]
3798A72j18q0P9r2j51L01j67NN0j2M1j41K30l18L14N7j65j35l3R0j21J80Q6K51
3822C23m16j21J46J53O0Mk54K1P6J27j69p2j20J06j04n6K15J45L2Nl1r7K29p1
3846A31j06K55k64o0k24N16k82J22N0p7K2M7K6j66P9qj06q1m9L47m3Q6n48O10
3870B77n0m81K70J80j8k39p1K61k11O7J13Q0l76j77L87k84O05l52q9J82j23k0
3892f9K34o4P2k09J22J71k75N2J33k32P2k99K78j1j23O6J76J40l05K2l4m5J6J23
3916A1L0K7J02n1m9J13k97K5J07j11j79L80k1j29K43k75J0on7R3j19O08l60j21
3940b6p7Q9m1K09k17K71j96j07J93j36p0K26J1K2Jk43K45k68J66J38l7p5K11l56
3964f7mLK25no0N6O4k73M1j06J14k74P9K11r1J13q6Q4j61j5L25q4n5n5Lj11K38
$$ y = [172, 54, -26, 53, -39, -190, 111, -56, -51, -1, -13, 28, -113, 117, -201, 113, 170, 5, -130, -163, -73, -194, -14, 72, 323, -93, -214, -68, 85, 145, 149, -105, -84, -8, 119, -50, -122, -242, -136, -240, -296, -81, 64, 96, 101, 70, -27, 202, 131, 25, 280, 16, -44, -268, 248, -34, 88, 138, 61, 83, 130, 156, -10, 69, 61, -45, -126, -175, 172, 129, 215, -333, 277, 227, -254, 16, 196, 178, -61, -132, 129, -82, -15, 98, 178, -198, -375, 12, -272, 333, -19, -108, 74, -49, -69, 165, 101, 173, -36, 86, 257, -18, 34, 167, -65, 7, -292, -14, -25, -148, -82, 94, 234, -71, -49, -83, -128, -112, 11, 41, 68, 170, 119, 70, 183, -114, -89, 18, -93, -272, 108, 87, -42, 201, -74, -64, -70, -127, -34, -153, 455, 95, -26, -103, -14, -55, 154, -63, 208, 12, -95, 98, -38, -108, 118, 129, 151, 152, -91, 154, -114, 52, 190, 153, 78, 289, -67, -71, -68, 157, 152, 92, 148, 212, -61, -20, -126, -12, -286, -207, 4, -87, 26, -60, 24, -137, -152, 173, 89, 34, -21, -18, -129, 109]
3991A09l55N03k01j0l13Q5J90M6K61p9p1j93J01k5k15L12k91L1K67l1K01m88K94
4014A28J7l26P3L58k38R8M8J07q3l27oL75j49p7M5j48J23l03J76j75K82k98M00
4037A00k9j25K85l70o6L07j26R6j1q9R1k14K45j59J97%J31j31k49o2K10k0J67
4060A78j90m8J45j20J9J7J4j10L71m26P5n8J04R1k64K59k13L19q5j48J90R3l63
4083a50J71j29K38p9k35J09R9K32k15j47J18M1o5O6j30K14j86j3P9P8J21j89j91
4106a63O5rK87j1Q0k86j97L18p3o0N16m08k15J07p2J20N4l5J44l19N02l78q6M9
4130g0P4r3K26k27N3N4P9N0j44J86p9j52j95l1L44K03n90L10k5l5j54J90J85l8
4154A21k44L7J7O8R7j90K5P8j17K33J43k49qJ08k0j02J36j39M34m80k47K37j34
$$ y = [109, -246, 257, 56, 46, -267, -182, 8, 54, 315, 236, 165, -28, 73, 48, -167, 145, -146, -115, 152, 121, 322, -166, 128, 145, -181, -108, 250, 12, 110, 158, 265, 182, -145, -151, 224, 75, -2, 43, -105, 18, -285, -109, -284, -2, -300, 100, 71, -54, 231, -139, -205, 102, -24, 72, 61, -28, 63, -151, 94, -65, 132, 132, 263, 132, -117, -179, 31, 11, 178, -12, -60, 85, -35, -16, 1, 15, -95, 276, -150, -75, -133, -29, 62, -202, 57, -156, 163, 78, -70, 120, 213, -150, 21, -108, 130, 51, -184, -75, 24, 256, 41, -106, 12, 53, -12, 54, -76, 138, -48, -61, 18, 96, 217, 28, -163, -98, -107, 180, 169, 249, -37, -234, 84, 11, -49, 467, 59, -156, -49, -121, -1, 53, 18, 162, -157, 345, -33, -119, -70, 4, -89, 137, -90, -37, 17, 96, 146, 2, 188, 109, -43, -238, -269, 75, 278, -312, -2, -27, -62, -216, -26, 159, 121, -123, -86, -69, -1, 96, -94, -69, 9, -108, 125, 268, 19, 11, 119, 99, -3, 133, -6, 428, -52, -299, -62, -196]
4177a96J09P5J16j43j76M18l48O6M7K84k03K72m64J0J39qj50K78j50Pj32l3M31
4200B49o49N95J1j07m41K94o9J01k9R8j04k6K9L6M46l62J51k14k01jL86k49Q0
4223B4K6J32k2k04Q3j46P6L06k5o18O87m22k3K84nj33l6M1J48m66J68N1k7K23
4247A22j06l2L04j15p7l0O9j92l6L1J04j4j09j58O3L51j48k06O3L2M5K35k60J59
4271I5m2n8l09M43L1r2J53k11q5K05l15J94Q9L1m07J59j2J00N6k25L53k64K0M85
4295C94n05J35j73J96K34l59j47O1J18J11K32n61R3j0R0m4L33k90l34N00J8j7
4317G5j62kJ5L7J57L8k12K41q1M6k35N7j92N7Q8k0J27k80J23K19l28J19qQ1k48
4342b88K06M4nK69l28J96o3n5N5L9j33J29l73M02k38K50j60m0o7K86o8p0J32J4
$$ y = [-196, -87, -12, 104, -39, -215, 203, -145, -79, -32, 252, 49, 321, -143, -133, 6, -2, -152, 126, -24, -17, -149, -182, 249, -400, 195, 206, 99, -342, -48, -117, -16, -45, 53, -51, -77, -48, -12, 434, 72, 223, 9, -192, -193, 193, -56, 24, 50, 182, 160, -44, 39, -107, -31, 275, 250, -368, 319, -103, -126, 158, 153, 20, -16, 25, 173, -293, -125, -74, -101, 122, 16, -16, 288, 173, 96, 66, 135, -57, -93, -62, 42, 28, -81, -239, -176, 175, 27, -179, -116, -84, -39, 196, -64, 95, 53, -5, -314, 129, 160, 68, 221, 10, -75, 130, -185, 9, 98, 129, -278, -119, -131, -31, 25, -200, 153, -111, -91, 394, -111, 24, -149, 47, 281, -78, -225, -164, -46, 65, 297, -264, -171, -181, -91, -135, 198, -92, -426, 74, 92, 75, -87, -89, -74, -37, 120, 158, -54, 187, 106, 152, -83, -26, -218, -161, -73, -93, 34, -246, -123, 96, -232, -113, -121, -40, -288, -82, -38, -43, 226, -102, 94, 31, -24, 31, 70, -63, 66, -307, 95, -143, 107, -53, -93, -160, 126, 58, -12, 120, 134]
4366A34k9k37K85j85K92j19n5k02n7j27K25n8j85K54j6K6M5R0J13k10J66K06n51
4389a95J14j22K36j4N0k29J55j04K7M8J6J00j01j7j35J59J77j01J20l76N5J01
4411c6L22l92K26j69jK6J49R6l28K26l2j05j4l6J0K82l67J57j09J78m2J2k59L83
4435A77j95r0K60k02k25L9J46M9p5J73m5k19K76k27K15k51J43M16k02k49M3J34
4457I1J5j88J80j67Q3K3j00J51k57M20l34j5O5K13j2j11k0j05J04M9J3j30Q0P0
4481A18p9n9K62k93J47k33J37q3L29m45J80k05K25L5k20J52Oo3R4J03o5P5k59
4504a41J56l2j71K21J85J04k27k30R0k24M29k47L12j94P6j49K38j43P0j93K10
4525A40K0k74N6j8q7P1J04q3PM2k8M6p2j69M04l71Q7j14J97o9J38l45K08J56J35
$$ y = [134, 105, -132, 153, -32, 260, 141, 86, -116, -173, -300, -75, -133, -318, -64, -80, -54, -9, 81, 194, -16, 150, 356, -195, -81, -203, 33, 19, 69, -160, -5, -109, -82, -34, -18, 82, -19, -36, -171, -12, 165, 64, 184, -192, -137, -36, 286, -106, 120, -49, -50, -24, 125, 221, -107, 119, 87, -18, -32, -68, -58, 224, -143, 14, -95, 83, 41, 53, -206, 177, -18, -108, 152, -50, -275, -236, -90, -41, -116, 57, 12, -207, 69, -158, 57, -194, -51, 365, 163, -86, -43, 91, 106, -82, 98, -69, 14, 37, -63, 88, -169, 251, -83, -98, -33, 180, 168, 57, 37, -68, 36, 85, 98, -32, 48, 118, 39, -20, 242, -51, 96, -137, 0, -83, 246, -199, -19, -224, 1, 36, -184, -32, -26, -89, 5, 108, 43, 118, -141, 15, -17, -188, 33, 218, 322, 95, -135, -45, -269, 160, -87, 225, 31, 107, -42, 196, 53, 123, -70, 140, 160, -114, -58, -76, -163, -92, 12, -71, -64, -22, -50, -4, -76, -245, 159, -212, -125, -239, -42, -111, 27, -318, -110, 46, 181]
4550A81K3R8j26j87n5o5K08j07K0l5J42N1n6k04K59rj9j71O5Q4k36J33j67l8K48
4575C7j74K06P2j65K05j14o5j51K43O3p4N9K5j07O0j04J39k9j2j11J47k60K15
4598A05j43j6J50j27j67K41k1R6n0r9p4J86J20j25Q7k76k9J86o4J59k79n0J5J0
4622a65J55O4k30K38M8O0l2j14qq9J10j00j54K71k6q7J40o9K15j84j79J07Nl5
4646e9k1P0R7k17l1M29l80L7l0P3k2N7k6q8j58K07R0j50K76l33K29J29k36n0J45
4671C8Kn2N7j48L5J24j29N3K45k43K18k27o2J22O7j13j22o7J47j04J10J72K8n9
4695I2r6j44m8L16l71K87R2m09K93Q1l9k94J70K01o5L6p9k5M3kJ56j45J03j49
4719DJ68k83j37K85Kk04K35Q4j87J15j51J95k93J20n4Q7j49L22k73oR7j57J08
$$ y = [181, 204, 302, 176, -11, -66, -131, 77, -30, -10, -45, 97, 148, 92, -112, 147, 138, 119, -52, 13, 97, -139, -6, -173, -211, 37, -137, 69, 141, -24, 181, 67, 2, -149, 94, 157, 83, 142, 167, 60, 120, 16, 155, 126, 114, 3, 150, -110, 105, -38, -54, 96, -31, -198, 43, 22, 118, 68, -31, -105, 81, 201, 76, 163, -113, -142, 44, -20, 139, -140, -190, -175, -165, -10, 54, -176, 62, 110, 170, 138, 24, 16, -73, 37, -63, -217, 54, 28, -59, 81, 12, 227, 43, -136, -29, -24, -59, -80, -10, 87, -130, -161, 268, -112, -75, -105, -32, -54, 3, -23, -111, -269, -62, 28, -122, 154, -179, 50, 179, -57, -107, 38, 40, -12, 45, -103, -68, 56, -73, -20, 225, -18, 200, -27, -89, 33, 100, -13, -135, -202, -55, -159, -49, 123, 151, 92, -4, -148, -196, 120, -251, 36, 128, -281, 12, 93, 54, -240, -70, 131, 66, 102, 23, -2, 41, 39, 195, 50, 153, 4, 172, -111, -248, 37, 39, -165, 70, 154, -33, 82, -69, 126, -167, -47, -101, -14, -163, 159, -114, -120, -23, -180, -72]
4742g2j08J55r2K57j15J3k11L51j13k00J62j52J09J08k09L5M04o32K16O7K95l02
4764c4L3N8j96N02j58k21J12O5k4j33K3n1J97k78J25k7j1M1K1j18Q0R1l64K39
4788b8k10L72j25k76K01o4J77M6r6L4j04J1P6K48q0p2k31J03k3P3Pl88N28k55
4812g6j73J93Rk31L65j38OK04o5o0r2j20P7K68k49Q5k1J70p6j56j68M67l27K14
4836A06k69K30nj65J17l6J53j68n9O5J13j59J39k7M7J55l44J10k81L98k61K52
4858A11k3j44J0K63l22R4Jj88K52p9J61j76M5j60K13j36M2P0n9pq3P9j23M9J23
4883A3j11J76J00l37K3j7J23L5k36J79J95m60J70J06J17n4J02M7m06R6nR9p8j42
4907b65K24L5Q5L0j15J53O6m60j51K49K09n1QJ57k97K72l93J25L06k51NK65lk30
$$ y = [-72, -180, -25, -117, 140, 25, 38, -173, 178, 65, -135, 27, -125, -16, 92, -117, -82, 322, -310, -94, -27, 268, -34, -1, 57, -139, 363, 205, -16, 96, 161, 137, 4, 27, -24, 173, -105, 20, -7, -18, 23, 44, -74, 6, 97, -267, -28, -238, 134, 9, -267, -66, -130, 47, 93, -3, 31, -73, -62, 14, 262, 182, 110, -121, -18, -41, 32, 39, -349, 179, -76, -249, -56, -47, -278, 87, -51, -45, 159, 94, 34, -58, -178, -101, 167, -82, 3, -18, 152, 76, -80, -248, 219, -108, 106, -163, 67, 62, -103, 14, -22, 131, -37, -96, -31, 82, -77, 62, 35, 82, 237, -107, 3, -278, 120, -141, 111, 88, -56, -46, 217, -105, -11, -10, -198, 54, -25, 136, -40, 5, -155, 58, -78, -36, 34, -25, -32, -115, -36, -159, -110, 13, -98, 78, 178, -159, -136, -153, -30, 5, -231, -52, 143, -317, -147, -41, 76, 22, 124, 171, -235, -139, -144, -45, -123, -265, -41, -6, 79, 109, -6, 147, 213, -247, -398, -149, 60, 9, 17, 174, -123, 149, -244, -119, 187, -64, -59, 206, 203, -27]
4931b7n5J74k24K73j81K74j73r4J63k7k37J00J88k05j70L28m0j13J13L0k10J06
4953gr9J19R2L7j7j23M2o1j39M30k79J92k48K03Q2k09P3l23jJ55J47k35p7J50
4977i6K95k55n2J51J39j84o4J02j58Q4K66j58j53O4R3q9j15K0K51k23J66m2M4
5000H6l09P6K32J4j27r1K75j60J67k21J37O9k22J72k55K34k45L78k02LPK35J54
5023D07m12r6M43l73J60Pl21K8L05m3k83K27J05k93J67m6J03m0k54K21n0n9K95
5046A98l44K48mj78NP5j07L25J26m14Q2M4j1N5j66j55K61Oj63K22j30J49j50Q8
5070F2J40m59L39k86J37L3p0L70j41j00R3l8k99L20K4K0j38j1R0k06K00r7j07
5093a24L4J51K0j15n7J10K46j14n25L85j26P0M85k58Om85M68l11K01k80N7K8J67
$$ y = [-27, -82, 92, -132, 141, -40, 234, 61, -33, 130, 103, -134, -34, 154, -51, -221, 107, 67, -46, 67, 97, -113, -7, -106, 13, 105, 142, 125, 2, 44, -17, -156, 274, -5, 187, -61, 142, 224, 15, 88, -235, -236, -81, 66, -169, -246, -96, 199, -56, -108, 43, 182, -2, -66, 36, -122, -38, 228, 70, -83, -19, 74, -15, -130, -110, 141, -82, 84, 42, 86, -223, -147, 85, 99, -28, -119, 156, -4, 163, -58, 79, 148, -74, 98, -157, 77, -168, 210, 8, 11, 18, 253, 407, -5, -101, 342, -31, 129, 136, -185, -157, 148, 105, -178, 49, 154, -139, 28, -18, 85, 45, -209, 12, -38, -97, 198, -146, 102, 98, -80, -75, 0, -107, 218, 344, -70, 12, 56, 45, 100, -66, -221, 40, 46, -117, 105, -25, 124, -26, 62, 202, -257, 82, -204, -67, -34, -104, 266, 125, 25, 118, 80, -219, 101, 125, 145, 7, -4, 86, -120, 80, -17, -124, -90, 61, 81, -34, -91, 19, 265, 151, -374, 11, -115, -45, 440, 182, 188, -297, 171, -140, 61, -219, -162, -134, 33]
5116C3Q4Q7k80J88m77N91m46R8J88o1l33M71j00Nr2L9j83J73j31J45J25r0K88
5139C22j53j34J26k38j53J96k36K99k74K30j84Q1K93l70K12m3M1R1J3o1j25j12
5161a79Q1M21m65O3Q6J19j88j65J91O3p5J02M3k9j8m40L60J70n11M82k13L58j49
5184A07o6O3j85L24j68j52r7K04K95m74J49j67N3J46j06J36n0K04l38L91m32K42
5206G9k09J11N9j54L08j36j9j01R6k4J0J8m0j27J49j54K04N2l12L2L04n8k07J70
5230E1o9j60K74l11J86P8o5KJ42j11j06K43On3R5n47J78J06J59K9k51k4Pl6M5
5255a32L06n0j50qL5j13K85k73J95j39r3O0L63k08k3l91R0L88j23n2O3K93k55
5278F8m3rJ88k54Q1Ol34N54n32K81M3j83l0Q0J5K15k7L3q8qJ50l82L23k20J72
$$ y = [33, 117, 204, -76, 112, -365, 226, -220, -122, 66, 5, -328, 143, 43, 48, -44, -5, -188, -15, -146, -1, 124, 34, 322, 169, 35, 161, -77, -230, -34, -270, 29, -245, -15, -199, -118, 175, -195, 17, -26, 15, 106, 119, 58, -67, -179, -98, 323, -142, -79, 7, 126, -62, -227, -36, 27, -48, 54, 97, 68, 50, -390, -30, 140, -371, 111, -102, 256, 107, 41, 104, -81, 243, 75, -77, -174, 30, 325, -149, 0, -167, -114, 32, -74, 62, 12, 216, -122, 269, -163, 79, -130, -19, 40, -114, 194, 58, 39, -62, 34, 10, 20, 38, -2, -129, 20, -134, 70, 122, -190, -158, 146, 88, -119, 51, -18, -178, 96, -215, -29, 49, -16, -14, 128, 17, -89, 154, 160, 107, 202, -345, -167, -61, 98, 127, -124, -148, -141, -177, -132, 174, 124, -26, -34, 1, -112, 173, -100, 95, -44, -137, -77, 286, 78, 55, -336, -246, 142, 19, -33, 30, 323, 68, 25, 16, 204, -50, 31, 37, -297, 257, -275, 6, 49, -134, -164, -84, -69, 146, 119, 152, 64, 56, 206, -176, 147, -73, 99]
5303I9l88P5M30j46Ml58M33l39P9K82j61P7K1j39q4R0l1k24L66m0K27l56J93j73
5327f3L3o0k5O7p7J93j18J41j47Q5l21J76K77j83n8l8P0P6N4N3j35M1J10l38J47
5352d0J7N3o9J26J3k45L12j48J02n2N6j10l30N35q6k72J90j1j24K7Ll4P9L9J6
5377D7K66l99J58k76K35J61l11J45J52j50L8K3Q5l77j23L78P6J41l23o2oK7L04
5400B09l74M48q6l91L32l93N49k97J68j70p7J48k18K52k50J25n2nn1K86j90J88
5422A51j05k9K0K8N1k59N3K51j39P6k28R3R0l2J98l28K36j46M1J3N7j75n8K94
5446A53o4k3J10l29J63J11k54J51L9q7n1J83J0k57P5K36j62j72l7N26k23k71L68
5469A95j03o7J12k05o8J77j74L7L85j21k23N1j98L23k68J31R7N1j33J72j70r0
$$ y = [99, -289, -214, 216, 70, 74, -284, 149, -190, -111, 171, 10, 87, 108, -31, -115, -25, -56, -280, 86, 46, 273, -83, 110, -63, -30, -90, -115, -48, -125, 68, -50, 91, -56, 29, -292, -116, 161, -22, -80, -118, -48, 28, 82, 135, 0, 41, 151, -187, -40, -23, 30, -39, 87, 100, -145, 167, 19, 121, 69, 125, 15, -315, 220, 134, -138, 52, 41, -83, -56, -53, -87, -8, 31, 47, 313, -86, 72, -204, 31, 192, -119, 26, 178, 28, 66, 89, 174, -203, -326, 52, 128, 269, -54, -116, -122, -95, 209, -165, 283, 197, -194, 138, -255, 294, -3, 165, -5, -82, 66, -152, 100, -150, -25, -77, -82, -133, 153, -37, 151, 46, 17, 37, 65, 116, -143, -90, 161, 22, 98, -130, -37, 53, 21, 219, -109, 127, -19, 22, 35, 92, -83, -141, 153, 89, 66, 176, -153, 10, 121, -133, 18, 57, -30, -81, 102, 112, -145, -70, 166, 4, -168, -205, 321, 98, -173, 195, 92, 25, 137, -68, -136, 41, -133, -96, 289, 168, -55, -4, -202, 121, -147, -16, 81, 132, -1, 171, 1, -89]
5491h9J23j20k28M02k14K81j24q2J08L20j88k98J16j27J70j76J22O7r8L4L7q1
5513d5O2L3R7q7k06K47O8J13j39k68m0J58j95K33J56j80j92L92l6j16q9K5l03
5536c12q6M73m5m3p4J31k0j26J02L83l4l52l9J98j81J48l6j63J4J19j1k68K20
5559bk23L52k42K40k46p9L60k61o5O1O0J30K2j93NR2J02m44L45Qj01K28k41J29
5583C7J19k44K03j2l25J89PM6J68j47k98M93j63%p4j84J25O1l3p6j89P9J13K18
5607A13K3j04m2q9J49N3j46j34K29J1m0l4o5N6J63q3k83L23o3j86L34J14l13o7
5631h1p9L07p5J7l42M53l99K46q1J15k99J97l2J2m9K35r3j99K24m27K79L0R6j86
5655a31N0J53o7j07J1j9q7J86N1k79L91j53L19n29K67%j27P3J56m5j62K11j74
$$ y = [-89, 34, -86, -314, 88, -126, 155, 31, -51, 57, 377, 189, -109, 7, -120, 50, -126, -4, 63, -35, -1, 36, -45, 17, 50, 147, 60, -146, 101, 169, 282, 143, -125, -165, -7, -202, 31, 187, 7, -185, 207, 171, 55, -34, -9, -312, -398, 75, 30, -13, -87, 44, 24, -102, 0, 383, 349, -3, -42, 156, -25, 123, 87, -76, -62, 57, 46, -222, -2, -225, 127, -115, 125, -121, -200, 160, -101, -166, -105, -45, 85, 107, -86, -81, 11, 113, -331, 14, 22, -79, 149, -92, 37, 156, -88, 115, 103, -222, -33, -26, 20, 188, 41, -257, 236, 73, 73, -1, -185, -60, 1, -32, -108, -297, -218, -105, 113, 136, 32, -10, -99, 50, 103, -43, -177, 52, 63, 23, -11, -76, -20, 143, 60, -223, 100, 37, -149, 185, 299, -14, -81, -160, 147, 72, 89, -253, 200, -199, 47, -34, 81, -218, -21, -53, -41, -90, 145, 52, -147, 77, -350, -71, -41, 55, -131, -81, 72, 5, -102, -91, -110, -197, -11, 40, -239, 152, -1, 318, -211, 56, 56, -71, 2, 158, 113, -49, 162, -12]
5678a2M5m0k6J91q7O1O6j6j74K73l42m8M3K33j41J43k00J15L5n12O21k16K1R8
5702A31j81M7nJ0j26j60M98j73p5Q2Mj47r0O9K19mN7q1L64j29j97J47j76J14j9
5727A79j76qL83k63M1M5j42j72J79R5k43J5J50j12K57k06o6J8J12q4J21L9l20
5750a58L22j80K02j55j97J00J00J0p6j5j39K25J7R0o5r2n1J54j72L6k29L35m0
5773B2r8n6J01p3k2K04k85L12M2j3O8m5l13j77J34J67R9rj8k28M4k3J38K29j41
5798E9m0O1l68J88R6l5J29L0k83O6L7J85j27J82k59K94m30P8K80k71R4j94K72
5821D4q1k50M79j51J74l63n4L81k09Q0k59Q0O4p9L5J82n5nJ61l9N2l83J80j01
5845a17J16L0j53O9L51l16rN6k59K72o6O0j0L5Q7No5R9k00J90l2k37K51p3O6j59
$$ y = [-12, 33, -7, -33, 158, 71, 132, 198, 182, 8, 281, -61, -109, -66, 167, 26, 169, -31, 84, 119, -393, 228, 12, 33, 131, -50, -3, -8, 2, -124, -284, 214, 41, -34, 48, 52, -95, -185, -116, 103, 99, 156, 75, 439, 310, 113, 260, 84, 198, 179, 3, -5, 378, 115, 156, 201, 59, -113, 66, 161, -82, -67, 83, -29, 228, 22, -44, -26, 86, 2, 123, 162, -158, 164, -16, 186, 31, -166, -66, 34, 44, -32, -47, -186, 39, 56, 146, 81, -11, -62, 92, -80, -44, -273, 62, 22, -76, -132, -31, -104, -126, 78, -207, 105, 147, 134, 202, 157, -156, -333, -199, -32, 67, 58, 40, -188, -144, -167, -29, 200, 59, 19, 80, -288, -100, -4, -39, 90, 120, -163, -97, -60, 125, -2, 180, -79, 215, -215, -137, 143, -128, -34, -228, 44, -37, -287, 192, 41, 215, -148, -202, 179, -30, 50, -209, -129, -65, -144, -109, 73, 18, 13, 174, 135, 187, -196, -16, -117, -1, 29, -124, -55, 296, -20, -29, 27, -232, 40, -26, 34, 24, 59, 146, 151, 86, 185, -15, 175, 143, -94, 157, 84, 150, -9]
5871iJ8J41p7J44j01j89Q6K4j56O9P6j1M1k56J64J97j23j67K99q7n4k01K6K84
5895A38j3j1J0j54j24J24R5O0m04K35J20n6J50l09j52J89P4j03J14k5J89j01j15
5918f9o6r2J02K49k04N0K61j25l62J21K86L2l04K16j34m8j04K63L5o0o2j20L6
5941i9l7L87k46j44J90j82M40l68J0r9J69J50j04k91J18K46l75M00k53j35K31
5962HP8j2J41j79q2%j14J44J19lpm1oj57q0j54K85k60J6K38m7N8Q1j32k67L3N08
5989A68j41j94O8P5j99L08j63j07K03n7J41j84O5j79K15J59l57J25L6J64n8j60
6011g2J53J45o7k0k30rL55k81j08L70j53L8o5O9l8k19L81l50R6J47k89L00L9l74
6035a82NJ69p1P5j61J19j73L67J45k15J61m19K83j17L06j21l19J13MJ2r5l6J10
$$ y = [-9, 9, 150, 73, 217, 116, -73, 13, 37, -119, -50, 26, 15, 56, -200, -36, 161, 38, -129, 170, 83, 29, -172, -146, 138, 125, 114, 124, -30, -154, -30, 65, 125, -279, -44, 76, 20, 170, -139, -291, -102, -28, -131, -17, -42, 147, 46, -69, -135, -227, -125, 124, -80, -30, 231, 106, -256, -135, 151, 183, -121, 95, -39, -87, -191, 72, 107, 47, -15, -135, -99, -136, 251, 5, -139, 51, -131, 309, -59, -49, -148, 21, 171, 67, -224, -106, 140, -235, 165, -88, -223, 8, 86, 74, 215, 36, -46, -46, -160, -16, 103, 100, 93, 52, 46, -111, -191, -345, -60, -320, -304, -66, -113, -55, 26, -106, -373, -340, 168, 27, -167, -99, -24, -223, 85, -78, -185, 18, -39, 102, -82, -17, -196, 19, 178, -179, -54, -18, 146, 88, -72, 81, 226, 159, 139, -91, -100, 255, -26, -134, 236, 83, 121, 56, 125, 87, -132, 249, -101, -5, 142, -147, 153, 192, -182, -177, -8, -79, -4, -165, -46, -219, 148, 293, 78, 239, -180, 103, -14, 292, 171, -148, -35, -31, -19, -114, -150, -40]
6058d0k30L43l09K68j33r1j28K70J32r5j04K5p5P7J14oJ80k22M0L1j46J3j2k5
6082a23L77j89m2p1J04k01l9L16k71L19k16k59J83Q8P3J24j03K42n54K16J83j27
6104C0j00K6j36j50L24J16k3p2J5P3j27R0j02L1K7J9j20Q2R6k16m9J79k4M1j57
6129a27K01j32j12J15K97n18K39M3j19P0l8K5R4P8L7l76j36L41n7pL3J98j91O2
6153B0n2j48J51k2Q3k0J73k56J4L0j34L35j30J17l34K15J8k81J9J34R1MJ68l33
6177a38J64M2o6J83j26j00K31l92K80j21j82j5L31M5j00l20L63j86N3P3K2l2j78
6200a69J20j7k8J18k48Q3R0j62J21J52q4K2P2j77Kj0K0j5L24p0m31R8J48L1J20
6225A10R2k09O0j70J42q5j22L22j62J0oo9J86o5n7k00M10k79K40l25L58k23q4
$$ y = [-40, -270, 73, -236, 32, -101, -192, -320, -50, 82, -13, -117, -92, -167, -90, 24, 18, 198, -24, 16, 47, -99, -86, -98, -123, 254, 65, 23, -48, 56, -145, -184, 132, -139, 180, -36, -295, -112, -24, 49, 173, 70, 312, -242, -26, 157, 30, -70, -44, -180, -330, -6, 110, 87, 15, 30, 103, -24, 66, -36, -5, 22, 41, -79, 3, 99, -117, -166, 13, -11, 30, -127, 74, -58, -170, -55, 242, -276, -37, 6, -113, -43, -81, -56, 38, 116, 153, -223, -359, -18, -75, -82, -49, 149, -42, 20, -32, -180, -29, -51, 32, 12, 185, -71, -57, -27, -161, 174, 44, 161, -173, 42, 60, -221, -202, -68, 23, 27, 195, -138, 26, 68, 2, 185, 59, -41, 190, -202, 78, -43, -225, -240, 91, 136, 36, -284, 79, -107, -54, 19, 41, 9, -169, -49, -66, -94, 24, -224, -141, -51, -213, -92, 60, -24, -2, 70, -107, -105, -115, -95, -110, 214, 144, -287, -189, -41, -10, 110, 202, -7, 53, -117, 25, -60, -182, 140, -22, -12, -18, -87, 99, 34, -23, -223, 187, -92, 148, -177, 181, -42, -126]
6248a26M4Q1K73l29K15k84L96l20m4J2J35rQ2o1K2n8K78l48J28K47j96M5j99J33
6272A17Lk7J48m22K76Rk2J01m60M20k72m3J62p9K48l81J52k58M92l14R9j86j89
6295d26K21K92K06m34M7J81j21K00j81j22J48j79j38J52L12k17o5K07j84n6M09
6316B52k35j35K36rj38L2J07K26k22q4K9p9l15K19n5J64m3o6J49Pk35K4K06P3
6340A08l9p2r5N5K20j50r6j16L07j33l01L31j21J4Q7J95k49J62j71K09j95P8J93
6363B21j78j8m4Q1N2j27n4NQ1j17k2j1j5K45N0r9j0QR4j41L6r3j37j4L54j62P6
6390F1K8k74r0K84J19K1p0J78o6k50m1L91k63o6K24k46R8O2J76m20L4J60O0k01
6414i1P8j37K63k67K20J05Nk57J42J09rj84PJ80j91K1k16N9j6L20j39o1OK4J04
$$ y = [-126, -82, -1, 272, -57, 158, -126, 270, -50, -94, -82, 53, 44, 126, 65, 87, 29, 307, -41, 87, 334, 138, 183, -16, 117, 120, 93, 241, -181, 95, 104, 82, 183, -277, 143, -129, -172, -10, -89, 159, -222, -70, -328, 164, -150, -51, -237, -426, -205, 87, 293, -141, -94, 87, -34, 166, -15, -137, 11, -168, -306, -154, 158, -59, -124, 83, -101, -157, 252, 17, -118, 118, 109, -29, 3, 110, 336, 114, 30, 59, -20, -335, -116, -171, -7, -50, -116, 33, 40, -195, -171, 35, 108, 69, -3, -98, -43, 177, 27, -69, -185, 122, -11, -312, 19, -102, -88, -1, 194, -55, 107, -64, 145, -50, 28, 221, 43, 25, -19, 62, 114, -13, -67, -62, 19, -98, -120, -131, -146, 99, 149, 50, 40, 48, 142, 1, 37, -56, -193, -207, 147, -15, 61, 89, -185, -275, 9, 128, 149, 79, 257, 191, -59, -100, 291, 28, -38, 186, -60, 38, 100, 276, -144, -110, 50, 110, -91, -13, -150, 113, -154, 66, 171, 176, -81, 61, 170, 161, -23, -16, 164, -27, -6, -222, -163, -179, 141, 2, -59, -53, -29, 75]
6439G5P2k40J37Q5J49l19Mq1o7N1K67J05p8k66p2L61m31J4L21l27M64j61j55O9
6463b3P4pj65r4J0L31l19N04l85J82j31L05m7l29n3k7K82k3r4J93j75O8j30r4
6487a47K76P8M0l19L8L8k19L03Kj86K8k0n1K04k01L00k01q1O0J88l50N97k43k45
6511a11j05J33J46P0l43J77L32m39J33j85J30J87K7p3q9J59k69M9k8J20L56m73
6533i6j38J53M6J71k12J65R0k51R2Q6j1j61N7RL13m65J09O2K66k40k7J8Kj04j18
6558a84L04k84J07K32l70J37J10j18J05J02k37L2J76j23r9J89N0j66n8n5P6P4
6580@J8J72m57J40J64j49J72L4R6l01J40j08p1J15J23j86L45j57o5K37k97j06
6602a41J96J51q2m63K31J14J88k20K22m7k82j8R5o8j09K08O3m4j24J62j9j03P2
$$ y = [75, 147, -93, 44, 129, 278, -41, -37, -118, -185, -134, 133, 238, 160, -106, -178, 183, -248, -234, 87, -240, 224, 63, -92, -23, 51, 44, -121, -215, -205, 126, -193, 311, -74, 108, -23, 282, 235, -94, -147, -174, 108, 85, -9, 184, 9, 77, -53, -147, 129, 207, 247, -72, -34, 4, -215, 88, 90, -96, -68, -88, -139, 65, -136, 164, -37, -118, -58, 130, -220, 377, 134, -111, -216, -83, 63, 133, -210, -33, 299, -140, -7, -192, -62, 125, 152, 79, -10, 149, -120, -71, -99, 21, 377, -96, -234, -81, -35, 136, -76, 89, 179, -72, 20, 106, 95, -66, -9, 0, 313, -152, -43, 19, 285, 45, 18, 36, 38, -66, -184, 120, -164, -57, 175, -195, -58, 52, -66, 39, 141, -96, -64, 112, -11, -110, 79, 129, -37, -95, -150, -74, 0, 18, 190, -267, -127, 37, -112, 60, 94, 190, -111, 29, -79, -150, -35, 88, -98, 247, 90, 25, 262, -35, -141, 55, 206, 124, -339, -108, 6, 194, -26, 196, 149, -133, -151, -56, -124, -233, -25, 38, -6, -130, 32, 13, -90, -18]
6625a8j11Q3O9Q0j54R9o4J45j64M0J25k93J84j03R5J32k16J58N8O2N0pk56J73
6649A67j32J72j22j71n3J37n6jp2L8n4Q8R0J25j08k89J76Q2j5o1o1j24K70q6J28
6674F8j32K75k87L73j74l4k35M09q1l89K14J3j7%J1j01K8L23m93K05O3P9k10N0
6698d2p7J79j01J03k9Lk32K52k94n9L11o7m2J21L9j57Q1k21K8K49Pm2L1l49J99
6723a09R7J60j60J67L3j94j6J28r4J15L6l55P7m4K31j47K43l81L14j41l1R0l15
6746b96K83N5J12l33K19Lj05Q8m2m6O9j56J70j30K18l82N02k96K33k42m7L94j20
6769A51r2k99K39K05k29P6J71m09J51Nl6k04M12r4j11k00K67p4j5M0k16L19K89
6792C46j51m02J57J9lj92L34j08r2K8J82k12K53r0j86L32l05J16m5Q1o9j40K57
$$ y = [-18, -129, -46, 23, 103, -51, 48, -16, 129, -35, 5, 130, -163, 21, -82, 13, 145, -71, 87, 145, 207, 257, 250, -6, 167, 35, 207, 85, -86, -139, -2, -58, -59, -131, -93, -147, -59, 31, 156, 48, -241, -65, 17, 2, -59, -120, -244, 26, -60, 68, -64, 211, -76, 297, 123, 89, -146, 263, 182, -207, 7, 20, 3, 3, 14, -87, -59, 264, -229, -24, 39, 118, -92, -42, -119, 60, -41, 62, 33, 36, -196, 56, -238, -297, 14, -53, -95, 26, 65, -92, -11, -232, -204, 45, 52, 10, 41, -308, -109, -12, 148, -12, 155, 188, -6, -22, 106, 12, 127, 163, -192, -115, -159, 72, -75, 168, -213, 101, -40, -71, 19, -296, -13, 42, 154, -179, 40, 43, -62, 26, -16, -62, 7, -149, 21, -109, 109, -273, 229, -67, 166, -76, -123, 271, 151, 59, -240, -1, 204, -25, 51, 222, -187, -36, -31, -67, -271, 141, 47, -64, -264, 3, -71, -86, -46, -262, 57, 346, 195, -207, -50, -31, -34, -226, 108, 0, -92, -64, 118, -94, 159, 69, -117, 215, -90, 26, -19, 62, -7, -147, 110]
6815A10O4k81P8K06j95o0K90P3n38K13M7J2J75j66K32j86o2j57M3p5M4J12j58
6838a79J41j35K95n8j58o9K7J26k4ok46J80J11J40k01M9l1P5l5j61M21n5q7k20
6862a00J91k88j11J78L88k7l64Q4j74K7J92j13J36J82k89j02M47l09j93L6J05
6883a04J66oLk27Q4RK38l78J33j65M65j79n8M7j62j46L55J70l03J30k9m8R3Q2
6907A70J99l81K27l61K24j01r2K01n6o5M1j33J16r2K12l71K39j43J83M7J08j27
6929D5O1k37j3l6J66q6L7L01m34JO3J22j23K2L59k30m0jj0J81q0N2k80K02p7M4
6955IN1j02qJ13k1n4o5J10Lj47O1l5K78j6j89PR9j07m6M9K15Oj45k39O4R9Mo7
6983g3k7K50m80J40K82j09J11R6k13j44J69j51J65J64j54j33R9j04q7J42J67k49
$$ y = [110, 174, -107, -29, 177, -18, -78, 212, 285, -253, -40, 7, 19, 194, 28, 260, 74, 12, -145, -102, -177, -133, -21, -179, -38, -173, 122, 64, -94, -163, -136, -10, -34, -40, -286, -106, 5, 145, -56, -7, -38, 37, 2, -159, 262, 207, 120, -100, 91, -197, -308, -130, 258, 231, -133, -49, -223, -196, -4, -117, 19, 201, -88, -190, 257, -52, -245, -209, -104, 62, 56, 59, -168, -84, -75, 163, -215, -82, -247, 218, 39, -19, 28, -134, -280, 75, 245, -58, 72, 43, -5, 88, 170, 369, -12, 215, -146, 78, -23, -115, 86, 30, -35, 6, -127, -11, -103, 109, -262, -23, -166, 17, 64, 172, 45, 106, -131, -144, -180, -14, -100, -63, 238, -196, -195, -132, -10, -133, -111, 248, 18, -22, -23, -33, 148, 68, 120, -160, 42, -35, 9, 60, -42, -50, 63, 42, -12, -77, 33, 36, -111, -50, -85, 193, 177, -12, -5, 94, -13, -59, -10, 205, 211, 66, -173, -109, -10, -6, -73, -100, 150, -330, -190, 92, -17, 94, 190, -23, -167, 2, -149, 16, 180, 26, -107, -8, -112, -199, -57, 110, -139]
7005a39K49m4j97L5O0M8o9O8j34K82j21R9N5J0N3l25O4M8K8j15k08J54j7J32N
7030B1k5Nj72j30K60K4O1RJ0N2l09K39l62M81k41M22l63n1%N7J4J43k9N5l65K19
7056B5k2k5J81M9m03M04l66K85M2j95P7j03j90L03o9r7R9ML6p3L91k51l80M9R3
7081a36K41J81j64J58j56K1k22l7M47l88k10L22L3P5k96k1K96k07n6K23q9J56
7103A71k17q1J43p4J78j82j8R0l2k6K45j60J65k64j5j30O7J78NM9j01K56K2q6
7127A83j46j20J07k4o8J58%P2q4K9M3k11jJ16Jq1q8K9K26N9k99l7j57K77J52m53
7153c17L71J02k05J24p0n2j27K66l75J79M5k5J70j43J81j97p9K54j89M9O6mn7
7176c3J94m16J82j6K51l5j32k4M9o8Q4q4J07J57j60k08j26M00o8J85k38m2O1r6
$$ y = [-139, 110, 66, -131, -96, -36, 12, -57, 11, -123, 159, 38, 137, 192, 202, 255, -70, -6, 42, 70, -45, -253, -99, -116, 16, 21, -4, 1, -171, -301, -41, -17, 44, 53, 63, 115, -194, 45, -317, 164, -77, 345, -18, -69, -69, -12, 2, 145, 116, 171, -194, 25, 3, -22, 159, 208, -195, 209, -157, 128, 170, -25, 52, -51, -241, 62, -7, -104, -5, -1, 35, -38, 353, 102, -278, -229, -136, 105, 286, 122, 280, 124, 145, -77, -114, 333, -55, -265, 57, 90, 165, -131, -152, 144, -63, -119, 104, 15, 171, -46, -127, 16, -58, 120, -62, -80, 10, -22, -48, 197, 37, 202, -62, -77, -207, -140, 38, 43, 92, -9, 247, 269, 183, 37, -83, 24, 0, -68, 90, 90, 162, 78, 107, 150, -61, -62, 54, 55, -26, -114, -85, 141, 200, -99, -136, -293, -16, 136, -317, 54, 156, -49, 75, 5, -47, -174, 92, -283, -104, -59, -84, 86, -57, 124, -73, -152, 102, -87, -38, 28, 24, -33, 161, -255, -73, -89, 162, 127, -5, -29, 20, -48, 36, -48, 59, 216, 56, -152, -278, 122, 54, 239, 1, -41, 20, -76]
7200g6K55j70K37l41J40j17K3Rj31K42l23K60r1K16k99L4J55j6J42j86j84L62
7222A41k97L8L36Mj53L1rj7q8QJ39l16L1J82q8K30N1k82J74j83K07o6k15j1K86
7247A33n6o8j57Q5J85J22m42R1K45r5j6o1J85j2J57k53j51k13P45m82M9M7j72
7270a34K93o9j31M9O3l08l2N7J47J20j43L4J78j29Q4L0j44l9J71k4M9j0j29o1
7294g8J16k0J04l15J40K03j1k85J44M5K16%j04l58K88Q5O0l97M86m18J30k54N0
7317a73J08R5j82L64r4k3L2j79K5MJ24m0k59K95j14m5J41p6O1Nj59j2J64o7k18
7342b23J09K00O7k01R4pl28J48K15L47l68J3j30J85p0l3P0j4k00o2K90L3k63K17
7366H9J16l18J52Q3p4q7n7Q2J35l34K25Mmk64J47q0J10K90j89J4r9Q9j66j28K48
$$ y = [-76, 179, 9, 246, -95, 45, -72, -49, -40, -171, 71, -252, 8, -83, 133, -166, -132, 23, 7, 149, -37, -221, 141, -156, -118, 218, 222, 69, 100, 91, 74, -14, -6, 133, -183, -152, 30, -58, 172, 223, -59, 115, -68, 139, 73, -142, -153, 133, 77, 9, -148, -63, 122, 244, -198, -107, 138, 43, 27, -34, 151, 139, 296, 43, -108, -321, 424, -58, -9, 38, -134, 159, 90, -41, 8, 71, -237, -269, -212, -65, 55, -88, -54, 124, -5, 79, 109, -35, -74, 97, 73, 122, 112, -17, -78, 38, 18, 122, -193, -53, 150, 139, -146, -2, 43, 259, 259, 155, -203, 85, 170, 230, -167, 319, -99, 31, -223, -173, -65, 30, -152, 212, 118, 95, 127, -52, -27, -23, 101, 61, -198, 97, -17, -62, 79, 3, 64, 69, -90, -102, 62, -5, -223, -114, 86, 153, -48, 46, 39, -289, -141, 74, 421, 53, 66, -64, 121, 51, 18, 88, 74, -126, -188, 102, 135, -128, 89, 205, -113, 39, 122, 48, -39, -96, -14, 121, -213, 12, 16, 12, -252, -105, -185, -75, 215, 26, 40, -59, 30, -136, -264, -16]
7391a6L8o8N0Q8k81J47J11J30p2j58K81k75r0K1l2K08k11RK15j38L4p2j9K21n20
7416c99K45J33O4oj20K05k99L94j81j3L02l08p1K2R5M5p5L8n3j54J74r3R1M3k19
7441a40L22j14J38p2m3n8Q6j36J57j51n8KJ58O3j97J02k69L02q9o8j52KJ44m2
7465a13J11q4L98n95K13J69k87P9O1P0J96r4l92M12j46M6p8j98K05P2j75j6J81
7488C5K37k27n2J24p0j47J09j31J76K24j07j56j68q2O7o9L6K17O8L4O3p0pN7k13
7513e2j01L06j48J32k00M5j26J27O1k68J85J39m2ml5k5j55M6J03R2P9k50K78k43
7537e6J52J11r7j60J70n9j20p0j90M74L0k39K23k22j55K19k32M19q2rk60J3P6
7560f4j12L82k08j71J46O0rM3j86L61j50j86Pj9L82k80j1k2M0Q3j31R6j12k26
$$ y = [-16, 22, -46, 4, 92, -189, -42, 69, 199, 127, -31, 250, -25, -115, -94, -126, 82, -129, -120, 95, -43, -9, -81, -100, 121, -399, -154, -21, 43, 37, -83, 122, -177, 217, 36, 23, 325, 17, -54, -32, 63, 108, 33, 71, 18, -136, 38, -55, 36, 79, -140, 182, 68, 206, 134, 91, 33, 119, -17, 140, -11, -69, -67, 91, 154, -43, 59, -210, 92, 3, -65, -217, -215, -71, -113, -2, -86, 312, -283, -70, 99, -188, -109, -48, 22, 218, 124, -268, 144, -2, 44, -34, -232, -27, 45, -130, -146, 35, 272, 45, -7, 117, 47, -100, 9, -122, 54, 278, 171, 15, -153, -235, -168, -237, -201, 16, 84, 118, 181, 111, 104, 161, -52, -153, 153, 5, 137, -63, -18, -144, -17, 44, -224, -39, 100, 58, 54, 19, -6, -161, -115, -12, 80, 159, -91, 187, -56, 96, 207, 110, -50, 120, 61, -59, -129, -319, 155, 185, -54, 169, -53, -208, 11, -221, 198, 116, 107, -153, -140, -64, -176, 206, -2, -173, -27, 33, 24, 67, -119, 242, 92, -94, -87, -106, 276, -4, -15, -37, 3, 86, -45, 51, -61, -287]
7584b87J62J81l75K12k8K71j53K64m04J70J37j88r5J64J27j56j79Q4O9K6k0K16
7606A98n4j99j57J52l3J0M6R3j72O8K08m49J66l9N02l97J09o6J4J17l94L00O4
7629H7j98J24Q0m40L13l5J1p4Mj91L58o8J06j9m9L60l18J88r2r0j8Q8j86r5J88
7654C4q4K06j33QN9k51m0J40K48N5l13J5J36j79K35r6J20l5n4M4Qk46J66k47M65
7679B61j62q7L5R0k2j92K20r1j12J04K1j47M40m36Q9J06l45K82J48J0k16k00K23
7702A9k45R6L37p5k23L11j94j80N4L71k97l8j54K23Q7J63j49K5j19o8L46l71J84
7725A03l9J00k07K7J07j46l14J06M52k08M7p2R4M1p6J33j77j13p5J39J88j57R4
7748D7k34J68J11l24L03j92N6KP9r6j97L41r6J00j20J61k3l37L65j88j41J17K69
$$ y = [-287, -125, 56, -319, -107, -135, 136, -17, 247, -157, 13, 150, -38, -133, 31, 158, 2, -177, -93, -24, 2, -18, 198, 144, -55, -212, -60, -93, -83, -37, 56, -116, -48, 160, -289, -123, -162, 340, -57, 52, -14, 0, 117, -277, 23, 87, -111, 13, 93, -347, -34, -69, -58, -132, -128, -319, 39, -29, 77, 58, 9, 369, 51, 239, 147, 57, 39, 127, -59, -154, 34, -50, 156, 23, 31, 90, -161, -201, -61, 187, 242, -71, -56, 80, -99, 136, 40, 160, 125, 71, 115, 123, -123, 43, -204, 261, 99, 12, 47, 137, 115, -77, 143, 52, -60, 44, 65, -82, 358, -78, 11, 117, -228, 54, 202, 212, -4, -204, 19, -226, -130, 207, 132, -91, 220, 26, -154, -100, 271, -26, -64, -218, 5, 92, 255, 106, 131, 12, -56, 290, -81, 103, 64, 164, -43, -16, 91, -55, -369, -263, 189, -19, 28, -44, 50, 91, 15, 148, -29, -142, -217, -78, 110, -47, 47, -187, -19, 92, -232, 71, -121, -65, -63, 16, -80, -277, 64, -32, 68, -52, 109, 86, -251, 114, -74, -215, -98, 171]
7771A71k91J35K7J84k43n1J72l5L6j00j9mj86R0K62o2r4q9R4j89L41j46j1K1j37
7796a24j33K87K8j93K51k26J28J00m3j62P5M7M8j83K01k21J19j65K28J9L8j57
7818c8J11J45l56K92j84j64L6K0J50k07K50K21l33n7J13R2n4j71J96j9j16K87
7840B14j19k70K54L7j15j08L06Ol82K79n8J44k26K14l29R7J66N0k5q0j80O2J5
7863d8K69k03O6R0k55n9R4K90m11o8K33n4Q3M6j42l8j02K17M79l32n7Q7j71Q0
7887I4k34L59l4L%k51j06L59k98J08o7R0k79K69j37J50p1J98k23j04L53l1m1J9
7911A26n3j02j13J36Ko9l0M00n57K29J03R0k19j77J99J3J12J68q4j01j0j33k8
7934i8k15K87QJ29q2J57l69L38l09K89j92KN9J08n1j04J95j80J64j97K82j19p6
$$ y = [171, -120, 15, 42, 226, -17, -68, 104, 69, 105, 5, -14, -18, -204, -114, 148, 86, -8, -97, -3, -192, 149, 3, -8, 13, -124, -257, 30, 58, -135, 116, -110, 18, 118, 75, -87, -12, 35, 83, -100, 101, -120, -1, -166, 62, 81, 119, -38, 73, 218, -138, 154, -30, -194, -158, -138, 12, -195, 55, 276, -57, -114, -1, 91, 37, -134, 62, 43, -73, 214, 95, -175, 79, 116, 1, -107, 199, 205, -177, 102, 44, 188, -38, 176, -153, -56, 110, 160, 135, 55, -125, -63, -48, 221, 18, 84, 174, -81, -140, -46, 244, -167, -235, -2, -56, 27, 73, -69, -107, -209, 8, 487, 155, 98, 185, 14, 94, -140, 219, 185, 188, 188, -63, -169, 190, -108, 0, -67, 23, -256, 13, -124, 26, -45, 153, -70, -174, 179, 148, 107, 126, 73, -29, -142, -6, -4, -73, -103, 297, -260, -31, 72, 162, -57, -234, -35, -22, 90, 258, 174, 73, 63, -70, -98, -313, -26, -18, 111, 29, 186, -183, 155, -154, 135, -57, -55, 4, 112, 61, -43, 152, -28, 136, -61, 221, 102, 26]
7957B6p6L0J32l19J84l7j09K82l39M69k11j26L50o8P5j66j7n1j26J78j19J48P3
7980A83k24J82l41K64k05L47Qk03n0J75k53J75J57j74J9J3k60l9J21k02L01k1
8002b7l8NM6k92M28n1k74j1J11K83j50j40k7k38L18L40k41j93r8N19l59K17k35
8025a07L51j11p4j92N5J13j00j3K59j5j48O6j75L7l5L72p8l90J75qJ60j20j52
8048a30M36Rl32J24n3P1pm1j53k9O8L25k56j5j21L1Q4j0J6J24j30RQ5j44J08L6
8074A05k69M59L3m23J05j24J03k46K20J34j64K46j08J87J4m72P1Q6QJ70l5j38
8096c8J73L2j79k11J14l7J94M4j55L6j9J42j16q2j32J95n0K17j45k4k8KR2j25
8120a00q8J34J34J54l41J56j80l41N82l04O4K78m72K59K95j26%n0jJ17l76P5J03
$$ y = [26, -50, -20, 112, -207, -23, -60, -169, 113, -226, 243, 32, -94, 256, 188, 263, 97, 80, 29, -97, 81, -38, 110, 183, -41, 141, -200, 64, -141, 206, 214, 11, -39, 136, -117, 58, 215, 41, 60, 73, -187, -226, -105, -307, -6, -27, -65, -60, -14, -306, 122, 71, -203, -214, -103, 180, 30, -110, -137, -375, -57, 283, 42, -151, -249, 270, -89, 128, -107, 244, 133, 59, -133, -78, 35, -65, -78, 181, 166, 18, 84, -91, -54, -89, 283, 205, -185, -10, -18, 142, 22, -130, 306, 315, -17, 107, 54, 125, 118, 77, -76, -105, -37, 288, 32, 17, -104, -73, 11, 1, 17, 141, 11, 20, 105, -39, 69, 105, -164, 295, 328, -95, 10, -114, -11, -257, -37, 97, -67, 179, 71, 258, 272, -200, -129, -43, -35, 135, 100, -38, 135, 167, -12, -223, -109, -146, 48, 92, -63, -27, -46, 96, -20, -102, -234, -39, -89, 128, -17, -41, -69, -67, 25, -100, -188, -54, 80, 234, -107, 49, -131, -472, 110, -194, -130, 148, -324, -65, 230, 104, 104, 54, 53, 170, -206, -131, -28]
8143b8J79k68K03j36K01J9j24r3O1J77j44q5J82k81L2J08k40L78k37J32K6r1K9
8166@K3P9K54k01P2m52Q6N3J46k26Q4J78o4L2q1Q9j79K54k33P1K8O7k1J59q8
$$ y = [-28, 151, -117, 86, -50, 151, 170, 46, -47, 14, 191, 47, -38, 144, -137, -105, 3, -237, 141, -96, 36, 62, -29, 0, 23, 102, 356, 155, 227, -225, -139, -86, 60, -166, -82, 96, 32, 64, -17, 72, -107, 147, -86, -15, 13, 80, 59, 218, 130]
8191A30
$$ Imaginary data points
##PAGE= N=2
##DATA TABLE= (X++(I..I)), XYDATA
0@%%%%%%%%%%%%Qj6J6j6J6k4L2l3M1n6O4p2Q8j04J20j37J61j85K09k41K74l10
34a65L50l94M43m99N61o25O96p74Q58r50J053j166J287j420J564j723J899k092
52a097K305k542K807l104L442l827M270m790N411o161P091q285R876j2121J5546
67H821k1476L4615j19742M7819J11187j74637Q8241J42363j17682q6051J70575
78H4033n478j27403Q7165J00501j39480m4322J08514l8750j09761P3279N2284
89D0582r8408k5536Q8494k0147o1679O3868O7327n9049k1805P5679Q25p0182M1092
102B1061O9091o5550n4785O5311j3794j00214L6754P8512p1512l2671J00057j2650
114A9610r4451O7804P4172q5078r543R9812m4696q6860P3884L6747q7666K1966
$$ y = [0, 0, 0, 0, 0, 0, 0, 0, 0, 0, 0, 0, 0, 8, -8, 8, -8, 8, -16, 16, -17, 24, -32, 32, -40, 48, -56, 64, -73, 88, -97, 112, -129, 145, -165, 185, -209, 234, -265, 296, -329, 367, -407, 451, -499, 554, -612, 675, -745, 819, -904, 995, -1097, 1208, -1334, 1473, -1631, 1811, -2016, 2254, -2536, 2875, -3286, 3805, -4480, 5396, -6725, 8821, -12655, 21960, -97782, -49963, 61224, -113413, -25172, 117191, -491, -86542, 84033, 78555, -48848, 38317, 138818, -662, -44984, 63530, 24780, -84981, -11702, 40582, -57826, -83362, 5132, -15015, -76694, -12826, 54501, -4548, -26353, 49326, 50151, -20031, 21061, 90152, 24602, -30183, 35128, 21334, -78880, -42126, 36386, -35126, -67797, 32260, 19610, -74841, -7037, 67135, -17943, -27486, 72326, 27630, -59230, 14654, 51401, -36265, -14299]
126a4299Q3219o2002n7387O6857k626p4525L9582N9601m9094j6386N5899j5380
138A3459m7701L2318K8593l4104j209L4351j2823k8436J4949J5627k0317q262
150a3555K0224N53k2309N245K2842r956j4723K1194M455l2326M215K7631j8886
163e396j3519L7138R92l7733J6929K3037l5242j987M2080j6879k9978L3174L506
176A6122m4286J6397L4112l2746j0012M0661j4832l3258L3215J3769l6223J4096
188b985L1931l0528j6399L4373p251k8898K3418J5619k9808O93K2588j7341j5259
201a9847K2557L854j9941P577J6168j0770o707J4829M439j0714k1Q714n703j2241
215g806O261Q781j2892p020J6684j510k0719J1646J8941j8435n833K8178n417
$$ y = [-14299, 68920, 6918, -50469, 16388, 13762, -60763, -21181, 38420, -10674, -27060, 28839, 13459, -34242, -1924, 26669, -7435, -8644, 25707, 12884, -15552, -603, 15024, -5293, -13555, 6669, 7222, -15087, -9842, 13000, 3044, -11679, 9515, 13970, -18356, -14141, 13490, -5396, -18915, 18223, 19215, -18518, -1589, 21448, -13794, -15781, 26299, 9420, -20558, 12616, 16122, -28164, -11767, 22345, -10401, -20413, 20248, 5416, -27842, 5373, 19142, -17081, -2985, 28946, -1582, -17981, 16392, 9141, -19757, 3661, 19280, -10528, -9835, 12753, -4588, -19847, 2710, 6564, -13377, -5800, 10368, -402, -7109, 7720, 12159, 1445, 1424, 10138, 4435, -7806, -1545, 7236, -5656, -12676, 4008, 2498, -18221, -6575, 12366, -6069, -11902, 16276, 10859]
228A0859k5350K0007J5421k9935k52L1114j7731k4918K8290O422l4792R524K8550
241A7209k4241j4222L2274j133k7616J7682K0154k4219n460K6245p400k1730J4618
254B161J1194k0119l894J7956n425j5093J0241J0290j2322m242J6211N93j4451
267f900O170J3681j1365j0112J5627K368j8719L608J6258j3606j0938J9429J374
280F875k0481J0279J6649j7823p191K2596k839j9908J3327J2990j8951k639J8535
293A1419p955j4987J3813N748j7599J712J5262q722q868J2425L786j1185L112
306b039R787n495n308P240J934q038J2O558l502o867M681L586o262j951P020r34
322D22n715M590N315n721r21P838k044o374M676L995p448j669N978k623n208M259
$$ y = [10859, -14491, 5516, 20937, -8998, -9250, 21864, 4133, -20785, 7505, 13927, -20865, -11341, 17209, -7032, -21254, 11020, 9887, -17729, -47, 20107, -4112, -9572, 16673, 9273, -12457, 2161, 13355, -6764, -10658, 7298, 1873, -13220, -2979, 7311, -5011, -9253, 6958, 7551, -6900, -730, 12951, 1586, -8526, 7101, 9469, -9250, -5642, 10616, -2990, -13928, 5501, 6875, -13606, -3327, 13322, -4501, -11692, 10904, 8065, -11843, 1484, 14474, -4477, -7116, 11419, 3464, -11523, 2290, 8038, -9561, -7849, 7413, -1309, -10177, 2248, 6034, -5151, -2039, 7748, 2253, -3055, 4185, 6119, -1919, -1907, 4651, 1149, -5718, -1037, 2549, -3713, -5664, 1356, 422, -5293, -703, 4612, -1109, -2030, 5808, 3764, -2610, 2066, 6061, -1387, -3056, 2922, 299, -4909, -650]
338f50J600m793J600L882k855j420M262K33k828J579K323j428p24J054j39j307
354C89k15p62p20n69K61k07K6P84N87R41M62O7M90K11o31p00k51L7j211p49J415
375c45K39r36J233J134j563k51K101j553k006K283M57k993J457L262k326r79L223
392B437j013l212J860J132m382P61M408k475k195N074O15l594K006K222l821k95
408d72K371l619k266L466J89l251K514K769j886n14K741o34j983J776O40k006
424a65l11J975k77k326R04K297j914l081K144J061m503O49M759k631k473O784
440B892Q94o126M301O832p731m205R375k474j0661O722N140j1722m22J2146o506
455a545r083J2924M125j4197M700J2833r691o716J4610L78j4151P065R470j3271
$$ y = [-650, 950, -3843, -2243, 1639, -1216, -2636, 1626, 1859, -969, 610, 2933, 1505, 781, 1835, 1696, 389, 174, -588, -1308, -1877, -1616, -1823, -1797, -1013, -426, 515, 977, 1044, 1534, 1745, 1114, 414, 163, 200, -1011, -1760, -345, -106, -1042, 191, 1325, -238, -489, 1612, 59, -1947, 336, 793, -2200, -743, 2519, 193, -786, 2437, 1424, -1788, 72, 1204, -3178, -2417, 1991, -484, -2679, 2395, 3010, -584, 1422, 3644, -177, -472, 1899, -1720, -3986, -520, -331, -3582, -1068, 1701, -185, -699, 2042, 1408, -575, 1201, 1841, -165, -476, 1499, 1222, -1104, -200, 2097, 183, -2898, -754, 307, -4196, -3547, 1212, -1419, -3892, 2892, 3786, -2340, 1961, 8793, 1062, -3143, 6232, 3758, -6903, -181, 4959, -6763, -7185, 4961, -1545, -10628, 2296, 6421, -7776, -3076, 9757, 66, -6650, 7960, 8338, -5813, 1252, 10722, -2549]
469b549n243J3381k839j3215Q037Q190j1803l213J3032o43j0662P963Q646r925
483h43l817J2173m00j2221N788J0787j2158q294J3704K41j6737O739J4261j3825
497d602q152J8931m25j8726J2110J5993j8717o110K2801n986k0774J6745J3039
510A6127k3478j587K2406j2313j7740K0055P136k2527M594J9616j4457j2728J8992
523D096M240j7928O770J6520j1420r670J4317J979j5916L256J3376q507j1016
536i903J1801N585j5678k01J5911o458j3373J3107Q432j7141J146J9166q665j4004
550a0275J7092O488k0991L262J8901j3789j2953J8917M12k0712Q206J4514j5861
563f789n090J9083l389j5429J1938J0071j3909P3J4765n369j0532P577K991j0232
$$ y = [-2549, -7792, 5589, 2750, -10465, -2428, 5762, -6041, -9254, 3778, 3135, -7527, 436, 9082, -843, -4660, 7513, 7113, -5108, 680, 11467, -691, -8985, 4719, 4960, -11777, -5038, 9223, -4602, -12754, 6177, 5752, -12974, -864, 15129, -3588, -9698, 13103, 7117, -13657, 3088, 16127, -7351, -8938, 13468, 1155, -16585, 3470, 10606, -11921, -7327, 12289, -2168, -14896, 4096, 8336, -9592, -2822, 13698, 2278, -7392, 6925, 8904, -7012, -3756, 9620, 1113, -9903, 1898, 7483, -8195, -8396, 7515, 1057, -12316, 791, 9223, -7918, -6772, 12394, 3729, -10275, 6817, 13305, -7686, -4424, 14477, 688, -12265, 6652, 7064, -13648, -5442, 9072, -6789, -11879, 7204, 3815, -11614, 324, 10395, -3514, -3441, 11324, 5955, -4577, 3000, 5991, -4241]
577d241M12Q742l455o242L932J940p430k070O619J997l466L632O311l875m176
592a370N603R77p326K515O774n976m924P186q72r597L447N068q519n40R416j700
608A62m397Q620J550q354K723N525o846m13Q577k994n080M183j922p951L381L357
624A21n584J803P072n600l398P243l93m927O587L914o965P45N239o250l715P151
640C043K8o126K792K968o168k399M864j13k943L779L587k535j498L153P31m309
656a146k66M434p63m381L287M374o803k465O619l247q310P403N617q630J316J1721
672H760o345r808R739K712j2368M462J2365q461n980J1591k039j3640O540Q860
686F388j0096k644J2453k651j0480O680N804q885r81J0080k577p589M973N077
$$ y = [-4241, -3829, 4913, 1458, -4784, -852, 1088, -6342, -8412, -1793, 204, -3262, 370, 6681, 2806, -1370, 4233, 5210, -2116, 399, 7173, 1197, -3727, 3459, 2587, -7010, -3563, 1505, -7014, -7554, 1862, 162, -4235, 4385, 5935, -2419, 304, 5829, -1017, -1430, 7147, 4153, -927, 3256, 1334, -6617, -3236, 121, -5463, -3660, 3412, -2188, -5586, 1657, 1264, -3663, 2924, 6838, -127, 618, 5857, -393, -4108, 3043, 3071, -3055, -263, 2705, -3463, -5862, -998, -1111, -4054, -275, 3312, 777, -721, 2432, 3163, -1146, -1412, 3022, 2259, -2122, 1165, 5539, -1264, -3729, 2890, -357, -8667, -1264, 4353, -4277, -2961, 8760, 2415, -7393, 2346, 5058, -7310, -2848, 9517, 1056, -4924, 6667, 4628, -9012, -2472, 6388, -3708, -6352, 6101, 3450, -7030, -350, 5454, -3431, -4412, 5668, 3091, -4498, 475, 5552]
700E552p465k595P943J59p958K563O487n266m974P932K468r703J916R338o732
715c35o448J0476J913j1956L516J0747r234n993J2500M49j2752N750Q506j0700
729c561l540J2758j863j0466Q177O315j0910k065J0225l297q221P149M593q215
743b921o18P381k879n825N303L836n967j445O551o93o318L048N089n167k852O220
759B743L83o740K090O003n588m270P749L93q289M166O682o276l294Q154m97p756
775d347M708M854p095j417P494k565o512N435L077o623KN430k437l269L657J405
791A797l402N81L295j362k192K203J675k225r99J977K65k820j8K310j274k435
807b624K079J276k593J51L308j582k384L552J367l744J113K987k102j823K524
$$ y = [5552, -1913, -4508, 3435, 3594, -4364, -1801, 4686, -580, -5554, 2378, 4846, -4857, -2941, 6397, -335, -6783, 3693, 5606, -6350, -2834, 7913, -1321, -7314, 5186, 5635, -7117, -1367, 7139, -3561, -7101, 5657, 3794, -6672, 1505, 7820, -3090, -5155, 5070, 1773, -6448, 701, 5294, -2921, -3539, 3842, 963, -4862, 441, 4277, -1690, -3135, 3416, 2723, -3595, -547, 4542, -625, -3477, 2743, 3126, -3614, -1524, 4479, -1109, -5379, 2370, 2763, -5526, -1360, 5322, -954, -4248, 3906, 3409, -4347, 361, 5215, -1880, -3297, 4197, 1632, -4880, 555, 3632, -2991, -2989, 2441, 4, -3265, 392, 1797, -1605, -1024, 2271, 909, -1283, 920, 2595, 370, -629, 1348, 1613, -1207, -1225, 1085, -189, -2624, -545, 731, -1862, -1711, 1597, 15, -2369, 1183, 2550, -1194, -81, 2906, 804, -1019, 1505]
822A505J2l010J187J433k464o53K399p41j574J258P76o87N7R90j18L05J86j51
840G10L81m32n17M25Qj294L63P81j403j199K024K0k006J638J472j546j91K186
858A420k65j708J545O71j573k21J433p36j824J457L82j561n9J170l93j060Q20
875e02N55o63R4J019P5p37M41R52n58j053J126L60j838k36J439p06j174J147O15
894C56j424L68J723j117q28J613J27j590K11J795j252o49J473m8j565Q07M71r32
912d61k32J051o7j362N93O68m25j45O50k04j15L42r3o09L82K11n2J36j66L13k88
933A27l63M14K12j88m6j50j90J84l17j73J15O04k49p75M01K89p49J000N41o29
953E8M04N29q53n93J491o8j084L05M21j229k62O53l01q36J287N96j666M48J202
$$ y = [1505, 1517, -1493, -306, 1127, -1337, -1990, 409, -332, -1906, -648, 128, -559, -502, 488, 370, 675, 861, 710, 1091, 659, 142, 567, 575, -719, -356, 425, -978, -2177, -153, -133, -2139, -501, 971, -575, -766, 1420, 1155, -553, 992, 1663, 90, -131, 1302, 566, -1258, 199, 581, -980, -1039, 131, -262, -1322, -502, 53, -610, -516, 503, 578, -159, 282, 1234, 676, -377, 749, 1109, -729, -965, 474, -232, -1406, -259, 356, -1068, -700, 1023, -94, -922, 691, 818, -772, -561, 1234, -18, -667, 806, 758, -807, 0, 471, -461, -693, 358, 291, -1071, -478, 190, -235, -380, 270, 66, -49, 293, 200, -409, -27, 184, 132, 268, 102, 415, 127, -236, 178, 390, 202, 156, 6, -184, 0, -317, -490, -375, 229, -20, -795, -394, -105, -854, 146, 687, 58, 462, 991, 138, -455, 1036, 968, -116, 189, 610, -619, -881, -228, -529, -1365, -78, 518, -1148, -700, 502]
972E02m23n23J350P87j362l19J067r09p74J350J70j514O4O12j036j306J736J102
990E74j608K17J690q96j200J883R52j318N11J225j419j371J452j25j632P01J150
1007G86j530q07P95l56l56R94O17n74N62M24R9o26M17R02J82p04q35N99q44o39
1027h94J90Q21r52j24O16p48n25J026J146o53M38R92o80r73J143K58j67q1M23
1046A256j328p53O5j71J23j03P79n22n74oP59L40L8O96J162m29j547J132L42j312
1066e3K45J708j880j543J380k80j984J327K215j998q75K457m17k057J918K374
1082B537k401k33K241j057k819K196J842k671p46K221j114k854J995J651j763
1097i75m39K577m16k957J840K457k397m44L420n32l906J507K521l006j096L778
$$ y = [502, 79, -444, 906, 1693, 331, 12, 1079, 170, -604, 746, 916, -598, -534, 78, -958, -2264, -528, 574, -1034, -817, 873, -23, -1223, 660, 1612, 294, 805, 2030, 611, -760, 692, 567, -1065, -364, 786, -744, -1551, -756, -1112, -1468, -474, 143, -431, 131, 555, 654, 28, 445, 1347, 1529, 825, -10, 589, -255, -894, -704, 117, -835, -959, -343, -1091, -1616, -590, 556, -97, 341, 1333, 653, -320, 823, 1081, 914, 833, 1256, -72, -825, -760, -931, -808, -911, -132, -654, -1228, -1234, -475, -135, -97, 599, 1761, 1332, -215, 917, 1259, -53, 192, 1900, 20, -1523, -143, -423, -2407, -1080, 1135, -863, -1738, 719, 302, -1755, 163, 2537, 136, -97, 2144, 1087, -1732, 464, 2306, -365, -1111, 1110, -4, -2858, -863, 788, -975, -1414, 1163, 747, -2210, -370, 2087, -310, -754, 2666, 2134, -1772, -265, 2256, -750, -1846, 1932]
1113A932o22m056K279K227l758j001N124j098m077L534K540m509J06M313j748
1128A186l386L223J568m261M05L746k140k897L162Q54l538J71L222j076j992K344
1144E91J306k984j58K783o10k620K165J999l263o74L322j158l154K373K407l264
1160i39r03L648j062l759L134K169m166L15M215j713l696L327J200l306M97L514
1176B475j613k423K755L58l291O66K816k001j509K241J114k454O4J845q32k138
1192a927J629J461j662L3K057m38k069P50J480j942o85K350p8k049P07J173j595
1209h05q75K192k56j441J334R45j244l82J582m60j220M41J194j043j52Q30j29
1226E11j023j3N13k5o69L22O94m08p64R46O5n07j56J521m66j143J315L88j594
$$ y = [1932, 1310, -2746, -467, 1760, -1998, -2999, 2125, 1027, -3050, 484, 3024, -1485, -1379, 2934, 1186, -2200, 1023, 2591, -1670, -1265, 2481, 341, -2556, 606, 1460, -2078, -1907, 1315, 239, -1753, 591, 1897, -1087, -1245, 1538, 928, -1692, 473, 2472, -791, -1465, 1857, 699, -2455, -82, 2325, -939, -1842, 1806, 744, -3015, 119, 2288, -1878, -1563, 2652, 939, -2757, 570, 1770, -1536, -1039, 2475, 862, -1561, 1194, 1552, -1739, -1073, 1743, -258, -1767, 474, 1588, -866, -802, 1043, 211, -1927, -298, 1163, -499, -466, 1591, 1153, -916, -166, 1314, -628, -1313, 1037, 959, -1090, -383, 790, -805, -1680, 512, 256, -1185, 149, 1094, -150, -532, 1050, 590, -630, -189, 1005, -38, -190, 640, 511, -512, -525, -12, -37, -706, -384, 310, -98, -862, 84, 149, -358, -514, 1007, 541, -602, 713, 1101, -493]
1245d93j29J681m09j666J562L57k166P5J886j091j670K155J129j994J78J818j074
1262A49j157J567P78j410j65J753p12j633P82Q39j361p28J523J53j864O66J894
1279A074j706q00K150M25k645J600K104k122j277K429N13l045J032K245k394j240
1295a657K595n28k818J816K300l130m67L341k97k822K078J954k784p27L070o11
1311A313k600J456J471k231j232K827n89k723J561K221k379j089L034j41k310
1326a411J441K148k415j058L230k38l026J013K784k974j254L031n48l086J668
1341f95K277k733o76L030n11k626K134J579k298o86L065o47k422J504J244k166
1357f27m84K150n61k221J645J068j659o47K078l5j907Q04J853j560p71K075l49
$$ y = [-493, -622, 1059, 650, -1016, 546, 903, -1263, -1188, 698, -393, -2063, 92, 1221, -773, -595, 1223, 149, -1008, 559, 1337, -73, -238, 1515, 803, -830, -48, 791, -570, -1298, 225, 378, -1486, -820, 1074, -632, -1432, 718, 1143, -1502, 98, 2202, 80, -1197, 1232, 1745, -1300, -268, 1977, -417, -1657, 938, 410, -2408, -592, 1708, -1422, -1889, 1452, 1155, -1667, 411, 2365, -419, -1146, 1924, 1313, -1287, 169, 1640, -591, -1823, 1004, 415, -2308, -747, 1474, -905, -1994, 1040, 899, -1411, 30, 2178, -237, -1295, 1935, 1697, -1329, -316, 2468, -506, -1760, 1271, 723, -2363, -695, 1582, -1151, -1827, 1203, 692, -1934, 200, 1779, -519, -1205, 1860, 1213, -1209, 295, 1539, -627, -1111, 1039, 478, -1743, -98, 970, -689, -1336, 742, 707, -1200, -396, 1457, -103, -874, 1201, 852]
1374H52j633O30J540j957l39J793k91j799R09J431j723o68K062k9j995J013J161
1391I57j318l85J788n44j442J174P95j133n88J093j76r96P54O12j009J57R53p05
1409a3m43N91K98p53m7P90l52m56J11M77j98j80M60J75o85N09J23o97Q9N59m31
1430g3j97%L20j74m63P64R7o58K8K42m4L57j94M21l02J16Q4j84j45q4L07P2m60
1453a70p3L07l49k92J7N40p4k40N72l30l61N53L77n03J52L14k81m04P96l45l87
1474a81M97Mm61l31J01J58m56K27Q43m50n86R03p8m67O37N35l69j87K9k40j47
1495a9k34N98j71m20L0j77m64J92N06l22K07L83Q2m72N46M19j84j23N43l08o98
1516h6r7K51p5l39K37m37K44q3l06J99M14L88r4JN1n2N1j20K98P7n1j17n57n0
$$ y = [852, -781, -151, 1389, -568, -907, 886, 595, -1204, -295, 1136, -587, -1255, 807, 778, -1217, -204, 957, -361, -746, 1042, 498, -944, 230, 1025, -108, -696, 397, 221, -775, -21, 591, -418, -261, 692, -13, -456, 135, 433, -320, -367, 423, 71, -385, -274, 203, 5, -175, 285, 460, -225, 284, 407, -290, -201, 358, -73, -270, -270, 50, -124, -587, 177, 274, -384, -356, -114, -158, 199, 5, 426, 124, 240, 324, 140, -5, -89, 218, 290, -170, -243, 64, -285, -577, -560, -20, -94, -334, 238, -92, -453, 100, 477, -26, 126, 440, 159, -245, 551, 206, -181, 316, 320, -141, -472, -371, -213, -669, -442, 401, -49, -635, 268, 190, -277, 360, 895, 526, 339, 368, 128, -19, -253, 345, 174, -246, -216, -393, -857, -665, -159, -481, -274, 109, 191, -281, 265, 684, 500, 377, 920, 612, -86, -183, 68, -7, -346, -109, -546, -302, -385, -691, -492, -78, 310, 216, 217, 268, 216, 267, 147, 445, 522, 471, 354, -203, -253]
1540b53J79k04k21M6J31q5L8J50l6lP65k81j33J20L19k80r9K74j2k46l09K63o20
1563d97j57Q08k88m66N71L40j101M80P81k80l09O26P61j372O3N44l63k42M05J86
1583D90p47j22N53o09l86Q48M42o07m4M70k21n32N71P16o10p7N75p23l83P04K56
1604E64q54Q4R93j031l92M22N10q97J62Q50n54o17J258j10m66L27N50o45j57M49
1624D46j45n29N89Nk34l44J89l77j89K82K43J70n83N75k9m05M19K43K01l72M9
1645B04Q5l12J59L41l35m72M31j11k20l88O03l46j33M95O9k26l4J54j61K34M44
1666D81N1m22J58l81K72K15o21l6K78J47l16l01M36j12k16N68n1n40M78K89j48
1687B29n6O31m91o38M17M47p74k65Q49l21o30O81M2r43K06P76j30o00Q07J55r11
$$ y = [-253, -74, -278, -499, -453, -322, -407, -369, -219, -255, -258, 507, 226, 93, 213, 532, 252, 153, 427, 415, 169, -140, 123, -497, -654, 154, -134, -600, -29, 311, -790, -310, 471, 191, -118, 508, 1269, -103, -40, 504, 141, -101, 304, 490, -257, -379, 174, -435, -821, 27, 469, -138, -182, 288, 67, -465, 106, 822, 212, 135, 710, -13, -396, 308, 564, -290, -206, 787, -244, -636, -214, 296, -601, -439, 411, -143, -760, 498, 388, -78, 249, 799, 154, -3, 446, 301, -228, 361, 366, 132, -212, -23, -400, -589, -307, -64, 106, -477, 98, 69, -336, 83, 326, 527, 155, 204, 289, -23, 136, 477, 142, -330, 101, -10, -230, -618, -15, -361, -494, 1, 70, -156, -190, -36, -197, 37, 481, 532, 110, 268, -113, 159, 374, -247, -283, -5, 142, -174, -475, -39, -151, -367, 201, 150, -390, 88, 377, 229, 173, 804, 313, -325, 92, 539, -235, -500, 349, 28, -602, 79, 121, -822, -616, 160, 30, -570, 237, 392, -519]
1708e19M80Q32k25o42O12L59r26k68R88p56q30J034M32j471J54J286q84o40J283
1727B99K00r68nJ431o12q52J265K35j628O45J062j027q70J291J40j573L38J429
1745H00j006j009J768lj674O54J594j089q34J401L58j590M23J368q43j253J486
1762E51R0j653K91J633r87j259J799L1j707P04J884j303r21J962k13j741O45J576
1780A382j295q75J542Rk045R49J146j319j054J842L48j919R63J340j316m96J690
1797H92q6j629J201P38j211m13J171k6j564O58J092j155r39J568j50j092O79J022
1815G56j417n0J498q6j327P57Q81j035l06J043m64o50R8Q72j009n14J318n2j303
1834i90Q55O33o04j94R71j83r28N42O39p25j15P17n58q08Q76no38N3P38k50m39
$$ y = [-519, -39, 793, 568, -74, 538, 897, -29, -297, 691, -65, -895, 139, 571, -900, -746, 540, -344, -984, 299, 499, -469, -474, 957, 345, -507, 758, 993, -635, 10, 1072, 45, -825, 466, 606, -967, -629, 800, -206, -1215, 553, 550, -1124, -470, 1124, 35, -799, 602, 960, -630, -207, 1161, 318, -935, 551, 641, -1012, -721, 912, -75, -1334, 465, 496, -1211, -507, 1377, 74, -847, 1115, 902, -839, -194, 1382, 87, -788, 754, 763, -1282, -333, 813, -506, -1560, 282, 630, -1289, -326, 1014, -302, -798, 892, 806, -823, 378, 1116, -95, -508, 663, 637, -927, -269, 823, -332, -1271, 297, 147, -945, -266, 756, -661, -711, 787, 701, -626, 131, 1012, -23, -329, 714, 250, -400, -302, 570, -439, -953, 365, 313, -990, -135, 498, -106, -300, 671, 488, -440, 102, 741, 16, -99, 618, 60, -748, 128, 123, -515, -462, 276, 26, -413]
1855d13MO68m16j89O58k34n4K63P3o24J12M37j06k77K41n9k08j90N35n57j93N50
1877B1n4j24J03j40J32J61j38J09j90j03M13k35J55k81J53M7L8j08K29J8r1j64
1899d9K67k23j46M0K05p3l13L44J23m19M25M92m06k99N64J73r26N82J33o55r7
1920b58P62j56o53J78M1m23R6M98k7m61L02N52l13j34N47J81j218O58L57o29l54
1941d54P39k84m90K88O10q14k04Q99j16p03N78M20o15l26J197k88r07P45K89o97
1961a33j78Q13k18p57L74L04o67K4P13r9j062J005L76q21K76P63l68o42N21O5
1981B89p76J88Q66k28p49M35P50j052j12P97m77l40M53M63p99J8Q85n37n98P85
2001B61J0m65J62P20m88l78L01J1m96J74O43o66m79L94M22n29K73L66l44J2K64
$$ y = [-413, -409, 259, -157, -346, 312, 78, 24, 287, 360, -264, -152, 285, 179, -98, 143, 84, -124, -314, 221, -336, -529, 21, -33, -157, -54, -194, -62, 99, -39, 70, -120, -223, 190, -45, 110, -171, -18, 29, 67, -41, 188, 206, 115, -49, 218, -5, -151, -111, 94, 21, -292, 52, 175, -244, 181, 673, 267, -32, 532, 705, -221, 361, 494, -161, -258, 504, 348, -305, -127, -86, -509, -413, 85, 58, -403, -101, 451, 138, 4, 551, 732, -486, 172, 529, -100, -454, 285, 1, -489, -201, 409, -405, -609, 290, 174, -529, 49, 469, -146, -472, 725, 437, -470, 275, 564, -133, -311, 502, 284, -473, -99, 205, -462, -438, 275, 176, -886, 119, 495, -326, -50, 713, 345, -297, 224, 289, -487, -299, 567, 339, -410, 25, 775, -277, -389, 408, -69, -409, 44, 507, -292, -274, 611, 74, -524, 261, 271, -194, -32, 688, 200, -178, 123, 134, -362, -188, 455, -211, -690, -296, 126, -403, -130, 236, -108, -96, 168]
2022A68J56l56j22O74m85j44L77M1m30J58K42m10j01R5j76k42M99Q0j89j63M93
2043A65p4k75J95M60j5k16K02k87o6o3J61k36j26k27J73k06k65M94P2k8J55K2
2065A5J84l43N24O7k44J20J0j22j65J51k40P4j85m8O3m5j0J62k36J08K33m7j20
2088i4N1L99j25j3n9o4j6M51o01J24k80j81L44P8l40j95K81l2J98j58P84l57r4
2111A01J37Q9o6Rn41L63k78J37j54J1p3J13mk08M9J48L44k87J52k3MJ22J61r6
2135B10J9j49J13L6j05q9j38j89K25Q5l07j51P9j0J96M82k25q4j9K78Jl07J59
2158A10R5n0j73K55M5k78k7k07K3j45K26O3j71K53M17n65j40M55j81o6K96P1k42
2181F4j73M04p5k28J24K7l43m2K25j81k71L68J08k71K43J70k95J29M36j77k82
$$ y = [168, 324, -32, -154, 520, 35, -109, 268, 309, -121, 37, 279, -131, -232, -137, -313, -555, -56, 24, -165, -328, 165, 91, -184, 11, 471, 456, 240, 442, 155, 89, 26, 187, -49, -175, -402, -229, -435, -700, -206, -134, -162, -7, 15, 199, -144, 380, 447, 203, 323, 333, 211, 46, 197, -43, 31, -154, -202, -139, -184, -194, -32, -268, -160, 73, 26, -94, -43, 356, 231, 218, 159, 95, 79, 530, -71, 53, -227, -408, -64, 14, -326, -521, -240, -272, -74, -232, 552, 195, 101, 238, 327, 261, 270, -271, 92, -186, -49, -203, -192, -265, -152, -156, -364, -315, -167, 177, -110, 42, 19, 23, 145, 306, 210, 229, 80, 193, 229, 124, 35, -103, -292, -67, 18, -289, -440, -361, -371, -175, 307, 82, -2, -21, 257, 258, -49, 110, 205, 155, -18, 237, 282, 4, -23, -230, -207, -352, -126, -63, -234, 19, 436, -129, -269, 186, 5, -61, 235, 306, 64, -109, 295, 220, -8, 116, 143, -200, -242, -17, -198, -469, -101, 7, -264, -21, 149, -146, -17, 419, 242, -40]
2202d0J36N03l85k74J78p8k10j82K40n6m89O41K08n19L4N51j04k53K87L35m71
2223E2M0L61m0n86K64K10n14J65J78n03j47M48K56m91K14M64j19k49J55K24l30
2244E2KJ74p7m46N44ol87m3M39m04m3K59k05j69K3M02m16N6M00j81J9J44J98k63
2268G2k5K22J31o02JM35l04k97M01Q3n65N4M80j15j15L44q2k55K09m6m2P6J11
2291A71J0l75L12k85J37n5K57l06j48K3J8Q8p4J16j43O7K7L69m4n2l2j27L78k47
2315H5J2K38m35K27L4k86K33k10l5j96R2J21L7J9mJ50q0j81J26K06j44L4L28l38
2339C3N5q0K64l82r1K79k21P9r8J93k00J24R7J84l63L5L10j98L15j40N1l52K21
2362A15j34j37J81j01n5p3K27J37k50N4K85R4j75P4Ml43j45M88l17J87N7K23k96
$$ y = [-40, 96, 599, 214, -60, 118, 40, -170, -352, -112, -168, -657, -16, 192, -327, -293, 258, 154, -99, 188, 523, 52, 92, 453, 413, -173, 91, 301, -213, -48, 130, -373, -520, -72, 184, -307, -93, 371, 252, 3, 158, 382, 52, 54, 228, 151, -295, 249, 243, -144, -187, 252, -152, -195, 64, -141, -310, -287, 115, -301, -245, 155, -26, -7, 137, 335, 72, 47, 269, 400, -202, -201, 234, -70, -367, 34, 117, -448, -394, 86, -29, -144, 200, 118, -137, 72, 26, -16, 60, 171, 181, -194, 118, -167, -30, -85, 172, -134, -282, -259, -241, -153, -227, -111, -254, -187, -160, 209, 165, 113, 81, -46, 332, 85, 97, 335, -100, 127, 161, -125, 108, -102, -137, -333, -241, -120, -83, -64, -68, 82, 2, -179, -53, 153, 9, 43, 371, 33, 88, 8, 272, -110, -201, 78, -143, -64, -162, 31, -169, -45, 52, 236, -127, -92, 218, 20, 335, 195, 246, -106, 115, -19, -156, 25, -76, -131, -204, 23, 160, -90, -36, 249, 343, 168, 242, 246, -97, -242, 246, -71, 116, 173, 396, 100]
2385A00l04M78k97l07L17L68o23p9M77l2m48O42j68j45j38P49l49k64r6K65j74
2406b8l62M03J02m82J07K17l26j34N67q1k67K98K01p8k26O24j67o29j07O81m18
2427a05l19N01j9l89L04J67l63J39L04j33l05Q4O63n14j66M39j83k54J52L21q5
2448B39m55O42q4l16l09J50J34j46N84o41l1L39Q4n11K0O85o27q4N72J71m35j71
2470a90L40j4k39M43l63J63k01K10J4m04M60p6l04K18J89kk88j32K06l86K70L57
2492B71M4l80P4O1l15L12j4j85K95l44q4J09r7J95R2J3O0k12J97k2N6J9k47Q7
2516a5J39k45J02L17P9n42Q5m5L0J08K91l48J6p2n7K65M8j64K37k69K07J16l70
2539h7Q2J16j43K24l77J77p4L82l74n7L99k89L7q1J96j34L11j44l4l5kM4r6N4
$$ y = [100, -204, 274, -23, -330, -13, 355, -268, -347, 130, 98, -350, 292, 124, -21, -159, 590, 241, -23, -119, 146, -28, -390, 13, 115, -367, -260, -43, -369, -503, 64, -17, -284, 14, 215, 137, -89, 535, 368, -261, -368, 313, -105, -424, 77, 58, -331, -27, 140, -223, -84, 220, 87, -218, -134, 529, 15, -151, 288, 105, -149, 3, 324, 239, -216, 426, 342, 26, -283, -133, 1, -145, 439, -202, -233, 106, 190, -321, -301, 384, -243, -327, 245, 416, -19, -190, 150, 136, -103, 340, -23, 140, -61, 149, 163, -241, 219, 143, -161, 57, 246, 244, -44, -176, 30, -356, -86, 271, 315, -65, 9, 70, -245, 67, 53, -132, 163, -181, -265, -156, -253, -58, 34, 47, 107, -105, 92, 70, 126, 145, -102, -15, 124, -121, -19, 298, 377, -165, -80, -125, -95, 13, 304, -44, -28, -100, -157, 108, 156, -8, 229, -40, 167, 283, -87, -5, 111, -32, 192, -185, -8, -82, 300, -74, -131, 268, -21, 16, -65, 131, -3, 308, 164, 130, 95, 93, 137, 41, 95]
2563I5l56K00M58m62JK28l60J0J10L3M5p5j47L79k69j8J41J80K3k08J36J97k51
2586I0j52K98l14n9K23N4j72N4R4l08J5K37O0k64K36O5n7j71L27k80J16j45J37
2609H4p1L15m34j83L96m0k68l9R5l4L0j71N08j20j2J9J08n1KL7KK01l79J43l75
2634b37L28j77q5k5R5M2j84K16n4K14k87o7M51O6l2l5l18L32k51j3j4K0L9L7m75
2659d14L29j63M3J23k3ML5p8J43K11j93r2L97j89n1P1m05M01k24P6r8Q9J88l84
2683b04J6J34q5N0J17j65Q4J54K27n97K67JL7J81l33K63j62J31l66o0L38k19M00
2706B09k80K13j53K46l72M81o73K23J79l5k10M08j73j38J21k52N8N8R0k49Q5K9
2728a35L11j28J95l16K3Q4j18J95K54K7r3l20K2j16K19m15L26m8K0J82o7j79K30
$$ y = [95, -261, -61, 397, -65, -64, 164, -196, -186, -76, -43, 2, -73, -220, 159, -110, -128, 13, 193, 216, 8, 144, 341, 90, -62, 236, -78, -137, 86, 140, -32, 22, 116, -192, -177, 60, 120, -144, 92, 157, 100, -71, 256, -24, 92, -53, 84, 13, 328, -106, -289, 107, 67, -201, -240, -145, -179, -149, -320, 188, 68, 56, 75, 183, 132, 134, 171, 173, 374, -5, 138, -237, 91, -86, -171, -196, -101, -59, -243, -27, -81, 133, -154, -221, 230, 296, 264, 229, -89, 243, -8, -21, -35, -15, 24, 61, -414, -85, -248, -205, -82, -105, -101, -66, -144, -1, 210, 17, -75, 322, 133, 82, 153, -252, 149, -75, 1, -97, -8, 180, -204, -188, -54, -139, -89, 28, -137, -53, 101, 328, -269, -2, -1, 36, 217, -116, 147, -15, 116, -250, -310, 28, -191, 209, -71, 142, -11, 235, -137, 344, -329, -106, 73, 38, -172, 236, 63, -75, 46, -206, -148, -90, 0, -249, -164, -135, 176, 48, 243, -73, -50, 34, -84, 111, 365, 392, 299, -21, 1, -115, 104, -311, 15, -33, -13, 169, 102, -77, 153]
2751A53j04J76j91NN5j41K60l15J89r5J53j27M6nJj91K28j78Q9q1K5J00k06M1
2775a13J51k71K31m5J63q6Q1m7p8j5K02j64Ql75K02j14J01K21j01k15J80K72M6
2798B34k77J44j41J11r5k0J27k85J22N7j02k07L12n2R6l69J76P7K46l68L2M3J00
2821c9J63N7j67J87r9l8J82J1j42r2nk93L99MK27m00J09k9K01j87j09M8r8l86
2845d96N66j62mJ56r2k8j01m5K10j51J12O6M3l93L34j36J92k82J49P3k3J04k62
2868a70J69R5P8k02q4J12J27j00p9J01j32j02K74k46J66n0L71m61q3J69J33j18
2890c2J85J88j78l91L83jl18N99o66K37K30k37j38K05j06P1j64qK44o4l71L66
2912C4J93j73j46j09L61q3o4J10j45L3j30M2J37k02P9K1n0J92j47L0P1K29m71
$$ y = [153, 49, 225, 34, 39, 94, -47, 213, -102, 87, -8, 145, 18, 64, 59, 60, -131, 97, -81, 8, -73, -48, 52, -154, -113, 38, -233, -2, -47, 116, 30, 111, 64, -14, -29, 173, 9, 17, -358, -156, -270, -169, 52, -49, -264, -84, 188, 234, -43, 101, -40, 71, -24, -44, 83, -202, -80, -23, -125, -332, -20, -72, 24, -345, -169, -92, 154, -214, -182, -139, -39, 124, 181, 14, 201, 102, 64, 246, 257, 115, 23, 18, -275, 124, 128, 355, -45, 64, 35, 236, 49, -60, -12, -110, -496, 70, -92, -96, 60, -32, -60, -161, -206, 4, -147, -35, 31, 74, -319, 15, -121, 71, -211, -62, 11, -12, 92, -170, -1, 94, 172, -30, -114, -2, 125, 25, -54, 47, -85, -187, 87, -159, 7, -43, 328, -133, -216, -47, 86, -32, 153, 341, 163, -228, 155, 154, -164, 435, -231, 6, 236, -1, -139, 66, -40, 31, -133, -141, 103, 39, -332, 34, 227, 54, -92, -201, 160, 77, 13, 123, -22, 11, -119, -77, 60, -142, -63, -42, -92, 100, -47, -17, 54, 283, -188]
2935a88J72k48J29J50J20p9k10m5J48j42J68j98J01J49P8j38Q4q7N8J86k80p0
2957a42J44J67k20J40J40O0m00O5M25k59j74oj10K05J11q5q1j64K9O5j22J38O2
2980a2j22J99K5pk37J28j0N3j25N5J66j92j90O51n09lK06Q6m01m5M68j10Ol4k72
3005b26J95J19l1L8j07j88n1K02n2j0L50m44K45k7K10k63Q2k0Q8k66L09M2l3j78
3029a6l3j4J17K56j85k67K90k86O0k1j09K01j32N6L02l20K90mj48J07o7R1J9k44
3053e7J27k39J99j61K15k69J03k00L05l50K49j57k7J61L51j12k30K32k98R3K29
3074A64j44K07j76J75l2l37o8q4K84q9J29K3J5k08J03J75Q1j06j01K30n5rk7m7
3098A03j18K5j2k35J81j46K61j14k06L1K54k75n1N08p1O7j6j83M45k69k07lO8
$$ y = [-188, -16, -264, -135, 15, 135, 56, -154, -199, -51, -193, -25, -223, -122, 27, 105, -33, 51, -36, 22, 208, -72, -142, 2, 169, -51, 89, 229, 289, -111, -46, 379, 120, -54, -60, -170, 35, 146, 61, -20, -184, -155, -90, -212, -74, -12, -134, 65, 90, 83, -154, -26, -36, 17, -108, -53, 113, -79, -269, 382, -127, -130, 76, 162, -239, -284, 184, 74, 80, 46, -226, -31, 88, 57, 95, -12, -200, -251, -49, -101, -111, 239, -205, 40, 13, 223, -40, 42, 22, 110, -156, 153, 195, 162, -16, -49, -63, 54, 310, 125, -142, 148, -138, -78, -99, -208, -7, -139, -83, 219, -101, 189, 185, 37, 144, 77, 168, 187, -57, 70, -169, 30, -131, 84, -185, -82, -282, 23, -327, -78, -235, -262, -101, 250, 138, -92, 140, -158, -65, 164, 20, 227, 51, 226, 194, -143, -211, -295, -11, -100, 29, 52, 67, -141, -38, 137, 218, 112, 11, 241, 186, 177, 150, 103, -15, 10, -2, -237, -56, -202, 59, -55, -261, -230, 24, -251, -302, 206, 135, 202, 186, 3, 448, 179, -28, -31, 37]
3121C7j06R0P3Q7k12K32n8j98j20J04j28J28j9KJ48O6j63K19P5k80J23k3J96l48
3145g5J9J57j07j69P6N3j8M4j29K57k92J11j5R8K0J44jj47O4J37j89q7J36p2j20
3170a05J33L96o74J90J61pq0J83m23M94m49J20l1L4m3K71j69K9j36N7K23m13K64
3193B5j80K83k35J38j73J53o8l8J84k14J19j00K03j02r9K17j20j9j67L48n37K59
3215a23K73j64p2J11j01j31l0K26L59k73Mn0k1q5M99n02J37j23J02r9l96K59K41
3238D1q1n9J0J07O6k84K98Rj00L4Oj85J7K6M2J06k38K81l68K62r2L00l78K18J25
3263A63j29R9k62j45K49j09JK10k60J15J46k59K14j38j55K34p5l04M68k05K19
3284G7l4n4k08K45j45J91Q5k5J04l90L07j61o6O4J77k20j31K19K52m84L05l25
$$ y = [37, -69, 21, 94, 181, -31, 201, 143, -55, -175, -71, -199, -71, -90, -88, 60, 126, -37, 182, 257, -23, 100, 77, 273, -75, -56, 101, -6, -175, -99, -46, -64, -20, -149, 108, -184, -73, -88, 10, 30, 174, 173, 26, 90, 227, 38, -49, 87, 15, -105, 28, 424, -250, -60, 101, 94, 14, 197, -226, 268, -181, -61, -92, -58, -101, 170, 1, 30, -106, -49, 174, -239, 25, -155, 128, -107, 31, -142, 11, -57, -95, 89, -125, -6, -106, 97, -5, -104, 113, -7, -26, -193, 155, -382, -123, 150, -14, -86, 25, -76, -207, -237, -11, 348, 75, 79, 29, 8, -77, 422, -80, 57, -66, 36, -63, -459, -200, 41, -40, -99, -89, 18, 84, -200, 98, 107, 7, 41, 47, -138, -121, -95, -53, 53, -185, 96, -272, -10, -102, 198, -180, 38, 163, 34, 133, -129, -274, -25, -134, -133, 77, -183, -68, 78, -181, 33, -105, -260, -26, -101, -405, 63, -142, 77, 43, -11, -219, 26, -119, 72, 157, 132, 236, -154, 153, -8, -74, -10, 167, -53, -184, 35, 287, -197, 108, -217]
3306b17K1K85j81j0J53pK2j85J76J69k48P6J52n07M47j44N3J2J12k97J02p3j97
3329b86P4J78n6n3L36j18K7j14L1J38j66j2j07M7K94l15R6j21j27Q8P9J70j94
3352a11L8Q4K39j94oj30N4Q0j01J22j29J97q9J19j88j03P1J99m25K9L60j57M0
3375ak44K84j03j14K11l2K3j76l1J76J3m4L42l9m88O0J89n6K27m46K24J43j27
3398iJ90j95J35l25J13K8J18j61L6J15p4j10K93k25M6N5K4k36J42j03R1k74K56
3421g0N1l02L70j28K90m86N50l88K33k87N11l38M7j34K66l13K91k90J2J94O4K8
3443A71k90J1K49k49Q5J62n1J60k80N0j40J23J92k88J50j29J31J67m60J89q5j69
3465c01K93Q6o1j42L29l66J31P7J83o0q0n7l32L44j55M3L1j35K6j19M47k51R7
$$ y = [-217, -196, 89, -92, -102, 51, 44, 66, -119, 57, 226, -22, 54, 206, -301, 146, 2, 55, 67, 179, -118, -16, -89, -286, -212, -34, -90, -143, 193, 75, 102, -12, 19, 157, -9, -21, -128, -81, 213, -102, -6, -127, -254, -166, -87, 83, -111, -73, 11, 250, 56, 50, -80, -26, 54, -47, 75, -54, 143, 54, 173, -15, -118, -47, 152, -273, -244, 116, -41, -1, -245, 39, -64, -178, 33, 1, 24, -152, -183, -7, 6, -38, 304, 265, -223, -163, 26, -30, 197, -249, -25, 118, -9, 181, -14, 121, -204, -91, -63, 55, -106, -70, 45, -29, -139, 154, -71, -25, 30, 54, -182, -40, -143, -52, -326, -70, -19, -321, 49, -79, 211, -275, 275, -113, 120, -167, 344, 6, 53, -81, 185, -128, 163, -127, -115, 79, 143, 171, -119, -108, 141, -108, -23, 139, 88, 248, -32, 18, -122, 1, 193, -95, 55, -74, 57, 224, -236, -47, -132, -301, -8, 78, 17, -125, 204, -162, -31, 46, 229, 169, 89, 32, -300, 44, -111, -68, -37, -172, -146, -265, 182, -69, 28]
3488B8k06M47l82K01J82j18m2J22M8j53r1R7j06L0K7k81J17M6n7j7J93p0k21R1
3512a15K35J7j59K3J04n3M8j16j1M1L02k34P1j88J26n9k91K68J86k10K13k93K02
3535A07j86p7L53j55J7j47L97m6m69M1jJK76j0j59OJ47k70J30J25k07K28k10k
3559a11R6J36j48p5K71n7j18L9m3j32K98l10K6L2L27k55L59m19J07m9k35J22L31
3582A92j42J52L7j77j86J17Q7k29K87r7N2m9j23J21j65j52P0P2K68k92K00r8q3
3605a38L23o9q4N2KK2j56N0k54L49J0q2M1k9j63K8oJ61J33j10j14K35k85K84k09
3630iQ8J36j54PJ66l13Q3j21J41j17R5Q8j69J35K9j65l1J52K08k92J56p2K5n5
3654A1j79%N8J27M6l01N09k46R2n7K23m37L41j92J60k8j05J35j32j47r4J40M0
$$ y = [28, -178, 269, -113, 88, 270, 152, 110, 232, 280, 127, 36, 133, 27, 57, 84, -197, -80, -34, -91, -108, 85, 15, -206, -115, 120, 137, -22, 1, 105, 52, 100, -16, -27, 14, 316, 82, 153, -35, 91, 32, -259, 9, 195, -15, 198, -95, 107, -79, -156, 197, 42, 59, -88, 309, 263, -206, -165, -166, -165, 111, 101, -58, -52, 95, -175, -45, 80, -127, 101, -109, -111, -15, 121, -27, -102, 169, 112, -6, 33, -10, -142, 156, -154, -128, -96, 231, -24, 335, -84, 23, -26, -261, -139, 192, 50, 202, 239, 62, -124, -7, 80, -149, 138, 41, 93, 44, -79, 42, -123, -275, -205, -133, 135, -157, 43, -55, -138, 185, 116, 32, 84, 86, 108, -48, 2, -252, 97, 107, 25, 66, 37, -126, -98, -104, 57, 190, 80, -34, 201, -84, 200, -9, 79, 215, 61, 68, 234, -79, 4, -117, 24, -93, 2, 90, -79, 56, 85, -80, -111, 41, 249, -43, 113, 41, 66, 11, -168, -168, -110, 17, 63, -238, 271, 25, 117, 60, 283, -154, 187, -5, 155, 127, 22, 157, 25, -122, -216, -76, -36]
3677c6j34K91J01n75M66j66J81j38J88k62J17M9j02p3J94N7l47K72j71N9k46J43
3699a32j4J44Nj17L12k30p6p4K16l8Q5N8l21J67j2J25k26L04k27l4J5j5J41k40
3723a84L73j03k19Jj45L43j45J94j54J57k01K37l78K34l4j95R4J98K24m23L51
3744B25J4k54J75j70j43L27k01J39k69J38J8n7K79k78N2N7j98J47j12J0O6K87
3766B52j37r3M9R3j28k9k03J96j47K58k5mj08l6p3Oj4L00J2k69J24J07k83K62
3790A10j61P4j07j24K53k82K95n7o9K03l85L98M0k2k77j23M4O9J66J85l2j09k22
3813a33q5M02M1l14rQ1N4k47J69J06j04K69j44j72N4K3n0J57q6Q1j52K14K93m22
3837B6j3P7j65L32k25n5k7j13l5J1K90J53k00j34K08K9p4M6M2j3J13k72R9k79
$$ y = [-36, -170, 121, 222, -353, 113, -53, 128, -10, 178, -84, 33, 82, -20, -93, 101, 158, -189, 83, -88, -29, -275, -132, -146, -2, 3, -114, 198, -32, -108, -182, 34, -4, 81, 139, -182, -15, -27, 98, -128, 176, -51, -85, -70, -85, 56, -184, 189, 86, -133, -132, -277, 66, -79, 115, -39, 118, -83, 154, -224, 10, -24, -219, -125, 73, 297, -126, 225, 239, -15, 160, -10, -153, 174, -27, 112, -157, -19, -1, -58, 221, -57, -5, 52, -146, 1, -111, -101, -35, 252, 115, 22, 71, 164, 36, 7, -196, 0, -147, 111, 86, 82, -26, -62, -135, -129, -143, 157, 169, -100, 24, 131, -152, 110, -51, 23, -84, -208, 45, -237, 58, 1, -68, 135, -250, 148, 188, 166, -111, -234, -190, -121, 45, 230, 198, 89, -133, -218, 184, 225, -89, -98, -17, 37, -210, -41, 65, -39, 230, 86, -86, -32, -9, -59, 98, 12, 93, -59, 155, 448, 26, 13, 90, -75, 257, 32, -23, -50, -163, -198, -187, 103, 256, 56, -78, 130, 159, 85, 131, 173, 160, 273, 1, 100, -179]
3861a79J30M6q4j30L38j37j71P9PR8R7k50oj07P10n33J26J74k31R4R7J2l41J79
3885A8K3L9N7J22l74%K13L3r5k81K65J17L7l41K19m5j0k90J44M13j62l7J60k03
3909B2J26j48j72K92P5j24J3J08k61P7J3J14k8k64K79J19M0j38P6k16p4P1J23
3932A23rm6k33M63k10m6l4P4q7k23K86j24k0J83m50J95J8L45m07K54j55K74k46
3955g5J63K14k27q0Q6K7L8j59K33k44jj5MQ7k11J45j51k2k7K16l7K14l9k27L21
3980B33k81n2J48J68j49j74L12M9n1k96M9J40p1p3j38M3M19n40M0L38j53k12K16
4003c5K04k22k8L40M7l92J7K45k12q6J67J0j11j72R0k0J67j95J83J9k65K41L27
4026C19m29L47j62rK6l2J03l13N1J5J16J88k54j0J72Rn0j91K59k88L22k21n4J59
$$ y = [-179, -49, -3, -87, -217, 121, -16, -187, -108, -101, -3, 94, -156, -162, -269, 441, -92, 34, 208, -23, 71, 168, 180, -161, 18, 41, 80, 137, 259, -115, -115, 98, 131, 36, -245, 20, 137, 174, -167, 52, 7, -3, -293, -149, 264, 102, 65, 225, 22, 148, 0, -172, 120, 195, 71, 84, 192, -69, 8, 21, 135, 107, -157, 122, 241, 281, 143, 219, 3, -71, 0, 123, 114, 68, -165, 298, 88, 42, 8, 82, -5, -228, 58, -66, -86, 97, -353, -158, -140, 205, -202, 52, -103, 171, -75, 88, 302, 75, -5, 81, 108, 146, -13, 220, -24, -25, -40, -36, 51, -160, -15, -166, -188, -215, 1, -36, 178, 139, -88, 233, -48, -100, 48, 216, 67, -107, 205, 254, 203, -93, -44, 96, 25, -48, -186, -143, 276, -264, -224, 114, -39, -251, -35, 169, -53, -81, 259, 306, -86, -69, 176, -36, -122, 45, 55, -56, -228, -138, -158, 9, -186, -3, 16, -249, -8, 319, -110, 237, 75, 66, 92, 60, 163, -150, -99, -84, 32, 220, -34, -44, 128, 137, 87, -104, 155, -133, 189, -32, -86, 73]
4050G3j43R8l66K61K02k94L47k93K09k28mm9J30j8J16p0J2o6J65k00J89l16M36
4073A91j3k94J26O3J59r3J5l41J68L6K8p4R2k96J62L7l7J10j30Q6Q6o9j84K94
4097A22Q7m30J98Q8j13K50k49J26j74J00Ll70l8L42J14Q2N5k18Jr2q2K04j56p9
4121b29K29jJ47k93K50J55j65P1j61k8j31J81K9O0o2j50J37MQ3m1k81J48J04l11
4145b55J27J6K21j99N4K35k03j07R5k08K57j1n0M0N7l7o5k2j23K68R1l08J55l8
4169a0KN9j13K20k42MK64j49q3L49l23J9m31N27k12L62p6k87K3J82K50l11L6n4
4193Fm8j2R1qJ1j34L3m9J31Q8j85k0J16J99r1o7j10L0j12J88j03Q1q9j43K1o3
4219b39N03o04M67p0j7J80L2k72J26k04M67j42k43J08j12N7j94o1K17O7l26J93
$$ y = [73, -70, 28, -338, -77, 125, -169, 178, -115, 94, -134, -138, -187, -57, -75, 41, -29, -17, -83, 82, -118, 71, -245, 191, 178, -116, 10, 73, 232, 139, 154, -187, -19, 17, 45, -29, 63, -233, -71, -34, -71, 39, -91, -5, 81, 12, -172, 122, 209, -221, -23, 65, -48, 202, -47, 79, -95, 5, 8, -362, -400, -58, 56, 138, 193, -25, -24, -116, -198, 6, -150, -229, 0, -1, 146, -147, 103, 258, 93, 164, 3, -25, -156, 25, 54, 114, 52, -98, 39, 43, 126, 85, -196, -48, 56, -255, -128, -112, 109, -90, -36, 199, -4, -111, -16, -224, 33, 22, -28, 12, 69, 32, -33, -55, -178, 90, 181, -127, 28, -10, -8, 51, -62, 158, -84, -80, 184, 35, -48, 301, -22, -3, -434, 93, -119, 243, 167, -120, -97, 85, 335, 24, 60, 6, -42, -54, 37, 29, 40, -94, -61, -110, 21, 109, -76, -96, 20, 219, 128, 61, -49, -19, -131, 57, -46, 35, -54, -197, -176, -239, 264, -340, 127, 57, 40, 220, 252, -20, 106, -98, 369, 227, -16, 92, -20, 37, -157, -218, -1, 66, -260, -67]
4241f7J77m35K89K9O4N9k8q6p5r6K38J34j62n8j02L84j07j12k62K66k02K55J12
4264B15k77o4j43K86j16p2K41mk05J11J81l36R8P6M9K46l77R5K21r7k22j43k5
4287b62Q6j5n5K48q3QJ35P4j43m6j91L54j02J73J2j82J09k55J04n8Q8kJ88j37
4311D8k11L37l16p9k8p9J63K04m1J56K6k49P7Pm2L09l96K2j12K24j18L2j19P6
4335a09OL29k11r1l12K55L02j96N0o3K87l48QM5Qp5K19L1l49K86j55K87m27J88
4359c5J4OJ78m19M08k99Q1J38l2j38J03rr5K99j9l51M4K74k21Q1Q2j14q0L1J3
4384f0J50j03J28K25k96j1n6J05j38k78M75k32p8J90O1o4K79j61j84j4K16j84
4406c0K36l98J05J91J28n5k18Q3M3l0J73j32J70n87j2K47q5L38l08K27j89K67
$$ y = [-67, 110, -325, -36, -7, 57, 116, 88, 2, -73, -169, 69, 203, 41, -17, -119, 265, 158, 46, -216, 50, -152, 103, 215, -62, -126, -269, 17, -99, -171, 70, 66, -139, -28, 153, -183, -85, -9, 40, 286, -91, 4, 225, 128, -94, -237, -262, -176, -191, -246, 2, -81, -73, 62, 136, -7, -53, -244, 110, 8, 181, 193, 11, 120, -135, -31, -89, -1, -3, 185, 48, -163, 174, -142, -221, -249, -328, -165, 39, -2, 154, 180, -69, 8, 15, -27, 282, -114, -92, -204, 20, -98, -66, -185, -109, -103, 226, 15, -76, -388, -133, 169, -27, 23, -40, 247, -101, -93, -48, -40, -115, 104, 135, -214, 72, -83, 204, -223, -35, -21, -15, 163, -256, 152, -147, -66, 72, 40, -98, 5, -4, -99, 200, 181, -170, -126, 148, -73, 8, 90, -24, -104, -73, -60, 90, -13, 115, 340, 44, 33, -23, 82, -56, -334, 141, -91, -169, 21, 82, 18, 297, 136, -48, -62, 154, -30, 206, -192, -87, 104, 232, 177, -41, 42, 85, 55, 228, 96, 266, -321, -333, -86, -171, 167, -141, 86, -103, 164]
4428A64k80j08J46J09j3l02J41J23r0j01M00k38m1K08k87J07l9K54J01k11J65
4449B08l47j11J40Q9k1K89k92J2Q2J84m44K41k56J32J1K92j99k22K43J43k52O5
4471a3p2K01k17j12K17J06j6j84L38l18K28m3l31k5J24J62pk9NJ70O5l58J87k50
4495a72K47r7k19M18M9P4l87Q8n4j71K90j28J10l0O7K16k04J54l08j52J67J1r2
4518a23J61L2n9j25J59j07J23J45j70J85l10j08L56l42k6j70N19m3J05R2k54O9
4540A09n4j46K7j01N90k61j48j47K92j13m1Q0j96Ko6K38Q4j31O4L7p6j18N1L0
4564Fk62N07n63L98m9K45j33j11j18J9M56j21m43k9O6J03M9P5j38O4M9O5j91J05
4588D9j19k6K5m7L35k45K24k14M0J27L0O6l69qJ1r8n0L53l21n4M02j17j33n0M06
$$ y = [164, -116, -224, -78, 31, 18, -284, -143, -20, -110, -211, 189, -49, -90, 118, -169, -62, -101, 153, 254, 43, 208, -139, -250, -110, -21, -42, 247, -45, -33, 49, 233, -211, 30, -226, -94, -83, 209, 10, -212, 31, 174, -78, -13, -85, 116, -101, -213, 4, 110, 94, -90, 248, -70, 158, 115, -216, -241, -117, 45, 38, 9, 14, 184, 249, -109, 78, -172, 75, -22, -241, 177, 226, 300, -87, 1, -53, -224, 66, -62, 48, 18, 85, 301, 97, 251, -57, -209, -42, -31, -123, 38, 70, 11, -114, 45, -62, 61, 206, 36, 221, -89, -197, 159, -183, -209, -379, 140, 97, 202, 294, 40, 109, 55, -91, -64, -165, 425, 164, 16, -131, 161, 48, 7, 87, -109, -107, -173, 65, 149, 18, 82, 119, 43, -75, -24, 6, -256, 251, -312, 86, 37, 282, 149, 38, -80, -61, 395, 274, -169, -198, -132, -29, 20, 95, -43, 21, 70, 135, -56, 49, -70, -96, -71, -118, 217, -28, 196, -18, 22, 149, 179, 245, -124, -132, -121, -219, -269, 84, -237, -291, 111, -6, -139, -189, 217]
4613B17k60O5K83l80K72l16K09L5j01L6K7j64n9K37m4n6o2O1pJ55R2l12l5q7K37
4638D3J40m3j60J44k25K07o6j43K5O3J02j72J61p4q6M8K54k81M5R8m3J72k82J2
4662f1R3L8j98J14P0j19q9J28J01m9p3L40m12N8m6N3m8n3J19j8r3J43l2N2j7k14
4688b13N7K23M1l06J26o7J47J25o3J82l48K12k13J16l0O7j44j0l5J32L5K4QN7
4712A23M4j06j22J19l17Q8L06n3Lj0o3P0p5j14K62l36L13l94J21q8J96O6P0l31
4736b28KL34k13Q5qR5J4J6l85K90l4J49k4mJ56l51m4J85k2j11L17k92n1KJ85o8
4762eJ08J51n58M70k62K32m36L75j51o0J21k8L64k08j07L8o4K35n04M5K46j63
4784a61K35r7j97K39J37l2o2Jj7QM7n1k04J84J41l95J34L7K51m07L4K14n2J69
$$ y = [217, -43, 22, 305, -75, 197, -119, 90, 125, 24, 60, 87, -77, -136, 101, 57, 1, -61, 0, -7, 148, 240, -72, -107, -194, 43, 183, 140, -20, 124, -101, 106, 40, -103, -78, -15, 87, -85, 76, 2, -84, -36, 218, -63, -18, 80, 37, 209, -73, -61, 32, 70, -128, -14, 56, -63, -152, -24, 77, 28, -45, 295, -117, -59, -105, -52, -100, -153, -34, -52, -145, -2, -34, 18, 1, -213, -156, 67, 108, -198, -72, -139, 8, 133, 70, 252, -96, 116, -97, 19, -11, 56, -88, -98, -133, -1, 34, 58, 66, 123, 167, 61, -61, 58, -259, -171, 135, 82, 85, 75, 12, 82, 7, -107, 155, -181, 132, -262, -141, -229, -33, 33, 103, -228, -226, 108, -105, -20, -28, 67, 81, 97, -288, 2, -32, 117, 93, 89, 245, -106, -150, 35, 13, -98, 219, -73, -124, -122, 63, -5, 103, 254, -304, 166, -96, 136, -300, 75, -76, -136, -15, -43, 321, 113, 6, 44, -20, 215, -289, -244, 2, -161, 74, -23, -220, 19, 156, 124, 62, 63, 46, 54, 101, 50, -154, 30, 171, -224, -90, -53, 198, -209, -175, 39, -13, 156]
4808A56k74M8Ok39L18L9K21j34q6j71J04n9J5P0j2L7o9M15j76j54j8r9N8l8J74
4833A32o3j36J75n1J73l56K19l1m5L1j71J82j87K85j24k02m0J91j76J00N4J53
4855A13l03J57Jj49J07L04k79KJ71j06k0N6n0k20K89j88K88j65pj49J43np7L64
4879B77l01r6J78k13l3MK76m00L84j65L54j36l96N80k97J53j38k02O3L69k30l9
4901hj70j58K70L1K30l54P6J28J90j52j4K1k3N6J98q8k38L67l10rj05J51l40M12
4925A61j02M9l83J51J77o9R8P2j87M0J98k57q6J91O1j20j9M2J4j33j42K17j46
4948a73K38j84J41j78L45k60J38l18R4J96j41K7j39R5J55q3N2o7j92J58j75Q7
4970a84J86L3K1m0o8J32j99J26l3L46j90N0j96K58j25l42M50k02K45j09l14K85
$$ y = [156, -118, -70, -64, -303, 15, 54, 275, 141, 55, -116, -12, -71, -56, 14, 2, 39, -30, 385, 209, 55, 37, -62, -4, -42, 132, 69, -67, 108, 57, 230, -126, 93, 62, 17, 48, -123, 59, -128, 157, 33, -169, -209, -18, -194, -94, -40, 113, -190, -33, -32, -181, -74, 230, -49, -47, 124, 18, -2, 54, 4, -216, 73, -115, 173, 8, 1, -148, -5, -10, -87, 277, -24, -120, 58, -155, -188, -184, 92, -308, 76, -89, 265, 129, -267, 313, 16, 169, 31, -171, -108, 261, 31, -8, -178, -336, -66, -35, 195, -159, -83, 45, 235, 83, 69, 90, 67, 123, 321, 233, -5, 362, 52, 43, -62, 89, -251, 161, 59, 108, -275, -124, 53, -16, 82, 154, -33, 7, 205, -52, -138, 53, 114, -6, -25, 17, 31, -102, -244, -27, -173, 65, -119, 22, -156, 189, -71, 67, -251, -157, 39, -102, -75, -214, -119, 36, -47, 5, -62, -254, -96, -271, -184, 2, 35, 56, 16, -52, 80, -119, 7, -26, 320, 130, 180, -16, 242, 117, -225, 225, 23, 268, 159, -155, 130]
4992A30rj99k8K01r7L07k58K49k47J30j26r6J79r7l9K25j64K0k5j72k0K01k68
5015b03L90o5j06j16K19j57Q1l0K7j02K59k23o9J34k42J55J09j47J19K57n22K69
5037C7Ln9k93M03K17l55N0j15K02J0k43mJ2K61k5N3k92M16l38j42K36j19J29q7
5061d3P0J04k4O8j37m8K42q0j50J42r7n2P2j72K79j36j20o0N0N2K50r8k19L10
5085B03j70J63p7k65J48N5j0j49K15j11m7o2r0J66o3j85K79k11J60j7K25l17K11
5108E1j11J5J69l0j54L09p6k81J52l25M3J67J55j08k09L17L0r8m4L3j06K24p8
5131D5qJ25J0l99j7J21L7J20KO4j42K17l84K71J63k12l1ll5L5j86K15j94K32j19
5156g3M8l5jP0Q0j53L92n32J20J93k94L20j04J96l61P7R8j29O3j23N7Q6N7l08
$$ y = [130, 121, -78, -106, 95, -2, 305, 47, 296, 49, 179, 53, -43, 136, 39, 0, 225, 61, 81, 56, -116, -136, 65, -203, 187, 122, 16, -100, 119, -38, 43, 13, 40, -62, 197, -26, -95, 39, -203, -48, 61, -86, 33, 290, -232, 37, 40, -19, -312, 91, 308, -47, 3, -112, 90, 100, -143, -147, -135, 126, 101, 154, -138, 278, -60, -202, 34, -85, 44, -43, 27, 131, 107, 175, 38, -10, 232, 152, 2, 144, 47, -5, 67, -105, 174, 38, -82, -142, -92, -40, 210, 112, -107, 203, 33, 196, 119, -146, 2, 57, 47, -102, 113, 2, -45, -107, -197, -31, -94, -279, 0, -211, -51, -68, 157, -160, 51, -60, -45, 124, 94, -60, 249, 173, -108, 44, -281, -238, -71, 84, -24, -233, 84, 114, 16, -28, 5, -101, 123, 45, 37, 162, 172, -227, -244, -123, -86, 34, 36, 100, -42, 175, -209, 62, 225, 13, -18, -21, -56, -21, -207, 8, -186, 46, -73, -25, -60, -61, 9, 89, -64, 328, -204, -84, 109, -185, 135, 31, 227, -134, -57, 41, -88, -25, -148, -91, -5, 52, -256]
5180b56J08P2N8j61o1L64j56L2L3R1k2j52j46L3O2QKK49m39K35N1J06k05K01M2
5205A49m2L1l13L06n4J51l23M6J64j42P7k58K2N4p6K21o8jK5L6l11L69O7KJ6q3
5231F5L9j78K42l27M5J82K8j96lJ71j62J98Kj29ll5J57R8J7P4j76L4k39n5P1M05
5257C25m92M20j70K20m31M17k01r3j98p4L96k25J63p8j1j15K02J47j98m1j05K1
5279a21j33K35P9M7l27K89k25J33O0j61j53L51k66R2K86k8l08M5J32j04J40k51
5301a88M47k24k37J03K2p1p7M26q6k85K56roJ37l26K26j54N0K09l34q0L10k00
5324i1P3q9J11p3Non5K65n7k33K35m1j7L2j28om5K29l68M02j7r2l4k05K63R4j05
5351D7j09r1J73j31K0J39Mk9j42J68r2q8J55o1m9L26l84L88n4j09o8j24m5K2L98
$$ y = [-256, -148, -76, -18, -179, -240, 124, -32, 0, 33, 124, 102, -50, -196, -163, -101, -93, -91, 158, -281, -46, 5, 111, -94, 107, 149, 107, 138, -175, 131, 77, 228, -95, -49, 115, -27, 50, -208, -186, -132, -208, 13, -55, -56, -31, 5, -306, 63, 130, 132, 148, 65, 104, -74, 168, -159, -114, 68, 96, -100, -103, 68, -94, 104, 106, -23, -26, -61, 96, 194, 211, 285, 109, 143, -96, -151, -80, 325, -167, 253, 83, 303, -128, 289, 88, -5, -203, -277, 119, -106, 57, -21, -32, -147, 55, 202, 4, -37, -142, -121, -254, -19, 60, 107, -220, 69, -156, -23, 37, -124, -277, 74, -192, -100, 186, 158, -150, -105, 27, -77, 63, -188, 259, 35, -202, -99, -77, -148, -225, 201, 115, -170, 86, 77, 71, 208, -118, 108, -46, 4, 213, -121, -201, 109, -91, -18, -107, 4, -69, -64, -70, -125, 140, 83, -150, 85, 44, 27, 59, -69, -75, -120, 109, -259, 143, 126, 34, 0, -205, 58, 152, 47, -62, -153, 20, -111, -91, 48, 52, 23, -119, 49, -43, -131, 24, -37, -86, 240, -144, 244, 190, 81, 13, -111, -156, -134, 264]
5376B64k15J01K8k35n6J45j43K97j71k19L97j78j14M36l82j26J87J56Lj68J33
5397A40k97N3Q5M0n3j63L79m55J56K16Ml8j06N2j75Q4N4j85K92k5k4M3p7j89M04
5422B15j96K10j38o3j54q4J46R3j44J29L11l07N7j91J7Q6k7L64j64j06k52K75
5444G7R4P5l62J46j39Q3J8k8R3OJ24k28K48m29L24j11O6J11o9q1q1p8J07j31J53
5469a2J04o3q6R6k33J49j67K57J50j32M4q6m3Q5O2k00M21n03L2J49j08O4m0k63
5493c23J56J64K33k08m9%k04J83m0K87n3r1r0j2j04J98r1K4P2j70R7r1M40k82
5517D6J56l47Q0L73l91K25k69J55k33M11l27J44o9J11j87J2L02k28K18k41M7J09
5539I7J25j18r8k3p6K1J23j52J99r2p0J47qj69J69l09L50nq5j41l7K80k02J9P3
$$ y = [264, 49, 150, 178, -57, -113, 32, -111, 186, 15, -204, 193, 15, -99, 337, -45, -171, 16, 172, 175, 7, 140, -157, -104, -19, 21, -32, -195, 184, -271, -115, 101, 105, 67, -39, 13, -162, -78, -24, -209, 83, 58, 34, 77, 0, -189, 215, 19, 229, 91, 28, -126, -210, -64, 29, -115, 14, 325, 18, 75, -116, -99, -13, -40, 324, 160, 54, -198, 77, 171, 246, -116, 30, -109, -26, -8, -36, 57, 63, 187, -41, 207, -222, 102, -9, 57, 168, 99, 18, -63, -141, -34, -165, -12, 92, 29, -57, 39, -194, -45, -212, 45, 195, 63, 107, 21, -22, 63, 125, -75, 346, -157, -125, 24, -84, -20, -60, -323, -167, -3, 230, 22, -27, -27, -231, -48, -88, 199, 146, 55, -35, -47, -151, 47, -44, -20, 52, -118, -21, -112, 328, 46, 202, -145, -65, 308, -83, 142, -127, 28, -205, 206, -121, 23, -46, 65, -122, -110, 192, -36, 182, -59, -12, 97, 222, 104, 6, -17, -93, -72, 51, -101, 98, 6, -64, 83, 75, -94, 75, -234, 116, 111, 26, -115, -152, 128, -74, -55, 18]
5564A8J24k85J57P1l56O50l72K21l17K17n0p1J8J16k13L1j05K30O3j33J59n3K0
5587A40j32j31O2j9om2J21o8L63k50r2J24J8j19J24l14Q1p4J63R7J74j79M6j85
5611i8K10j37P4j98K85p2k4j99J06K09j37j17o7J30J8j57L02j26J52k10O5j90
5633a81K61M4k7k90J43j7J74J19k91K15rK8K9L9k60l6O5K54k62j91j82N40j38
5656B7k02J25J06j10K95l46J55k33J32K4K12j02k39L08r4R3l04K2KJ21L46l90
5678e2L5R0m6L29j30l89K28PrK4j67M16j7m12K43k98J6J05k08Q9Q9k0L07m23J80
5703a3n2K38J84k53j35J80k46L3o2P1K27j2j51j23L10j59j23J22k18j4K31J72
5725B07k62J33j51K14j72j44J06O4j57L42n53K27L61l18L06n6n0k22M2K80p2k82
$$ y = [18, 142, -143, 14, 85, -271, 379, 7, 228, -89, 128, 78, 7, 25, 141, -72, -41, -146, 84, 147, 14, 173, 120, 140, 8, -123, -61, -80, -86, -128, -7, -75, 288, 38, -54, 70, 88, -31, 93, -221, -140, -214, -51, 46, 220, 41, 87, -98, 112, -25, 49, -149, 136, 64, 40, -159, -53, 156, 19, -98, -165, -35, -17, -174, 128, 2, 154, -56, 9, -181, 80, 124, 97, -193, -50, -67, 107, 226, -65, 150, 141, 169, 198, 237, -23, -59, 6, 260, -2, -193, -375, 165, 27, -175, -50, 56, -54, 241, -105, 50, -183, -51, -27, 185, 83, -156, 152, 58, 151, -153, -131, -129, -8, 338, -52, -17, 73, 27, 356, 226, -163, 65, 72, 63, 87, -80, 336, 319, -93, 150, -148, -132, -27, -235, -146, -57, -77, 230, -193, -13, -65, 173, 357, 104, -31, 149, -97, -64, -126, -55, 172, 160, 9, -114, 196, 37, -86, 36, -182, -196, 35, 207, -55, 78, -73, 141, -31, -175, -69, -5, -162, 180, -373, -146, 215, -103, 203, 147, 97, -125, -83, 197, 125, -157]
5747a57K17l2k25L28k03J47m1k01N9K72o0j58J88o9q2P6Q7P0k23M5j35Q9J45J89
5771C26n98K85m0nK03k12p0J38k30J8L32j62M6n7j48J80R2m24M26j19J09k20J51
5794B1j07j5L21j86l63L54k57L28k89o4K40m8JJO2Q5M6r1p3K12j13j0J11j52l
5819A1n9Q7j06m8l6K8J19q2Q9Km1K5J78j48o7K52j63M9l9m2R3J23l8j75j21K96
5845A87l8j80N1R9M8j12L4k78L1J56q0K27K0k20KJ16j07J02q2K74k67J03P8j30
5869C4n4J46o7J1j26L1q7j11J99J32n8j06J89k42O6P3J9j21J61j50Q6l2n7K20
5893A56o3j0o9Q0m79L28J46j35K81m12K79p0qO8k12N9l7R3j27R7K40l29j35L13
$$ y = [-157, 60, 28, -197, 131, -72, 75, 34, -167, -108, 164, 104, -54, 134, 65, -17, 59, 146, 216, -7, 38, -97, -8, 137, 326, -272, 13, -27, -32, 171, -41, -111, 27, -203, -185, 147, -15, 31, -26, -174, 6, 98, -326, 100, -19, 90, -130, 21, -86, -101, 220, 34, -329, 25, -232, 96, -193, -257, -17, -65, -64, -63, -1, 84, 130, 39, -34, 178, 65, 55, 166, 14, 11, -48, 39, -67, -115, -151, -123, -4, -86, 3, 5, -36, -11, 167, 19, -48, 204, 41, 90, 51, 9, 102, 225, 187, 12, -109, 187, 149, -31, 20, 119, 167, 55, 89, -189, -158, -2, -82, 145, 165, -55, -53, 63, -44, 58, -24, 250, -17, 86, 164, 34, -20, 126, 59, 70, -56, -25, -112, -223, -24, 108, 50, -56, 133, -109, -43, 30, 49, -72, 89, -61, 25, -7, -64, 156, 93, 83, 14, 94, -385, -57, 89, -46, 235, -177, 102, 32, 24, 92, -120, -61, -98, -5, -132, -35, 205, -124, -259, 54]
$$ [...]
8191I9
##END NTUPLES=NMR FID
##END=
