##TITLE=1H_1PEM31
 CDCl3, 8 sc, 
 26.7.2019
##JCAMPDX= 6.0         $$ Bruker NMR JCAMP-DX V2.0
##DATA TYPE= NMR FID
##DATA CLASS= NTUPLES
##ORIGIN= UXNMR, Bruker Analytische Messtechnik GmbH
##OWNER= root
$$ XWIN-NMR		Version 3.5
$$ Fri Jul 26 13:56:16 2019 Russian Standard Time (UT+4h)  she@DPX200
##.OBSERVE FREQUENCY= 200.13155
##.OBSERVE NUCLEUS= ^1H
##.DELAY= (6, 6)
##.ACQUISITION MODE= SIMULTANEOUS
##.ACQUISITION SCHEME= undefined
##.AVERAGES= 8
##.DIGITISER RES= 18
##SPECTROMETER/DATA SYSTEM= spect
##.PULSE SEQUENCE= zg30
##.SOLVENT NAME= CDCl3
##.SHIFT REFERENCE= (INTERNAL, CDCl3, 0, 15.7039)
##AUDIT TRAIL= $$ (NUMBER, WHEN, WHO, WHERE, WHAT)
$$ ##TITLE= Audit trail, XWIN-NMR		Version 3.5
$$ ##JCAMPDX= 5.01
$$ ##ORIGIN= Bruker BioSpin GmbH
$$ ##OWNER= she
$$ F:/spectra/data/she/nmr/H-F/1/audita.txt
$$ ##AUDIT TRAIL=  $$ (NUMBER, WHEN, WHO, WHERE, WHAT)
(   1,<2019-07-26 13:55:10.71 +0400>,<she>,<DPX200>,
      <created by zg, POWCHK disabled, PULCHK disabled
       configuration hash MD5:
       00 E9 B6 7A A2 85 ED C7 34 08 36 98 17 FE 4E 26
       data hash MD5: 16K
       1C 6B CE 03 61 78 15 EF 9D 92 4F D1 46 B5 AF E9>)
$$ ##END=
$$ 
$$ hash MD5
$$ 8F 31 61 83 D3 F6 BE FB 32 78 BD 2F CE 44 C0 21
##$RELAX= 
##$RELAX= 
##$RELAX= 
##$RELAX= 
##$RELAX= 
##$RELAX= 
$$ Bruker specific parameters
$$ --------------------------
##$DU= <F:/spectra>
##$EXPNO= 1
##$NAME= <H-F>
##$PROCNO= 1
##$TYPE= <nmr>
##$USER= <she>
##$AMP= (0..31)
100 100 100 100 100 100 100 100 100 100 100 100 100 100 100 100 100 100 
100 100 100 100 100 100 100 100 100 100 100 100 100 100 
##$AQSEQ= 0
##$AQ_mod= 1
##$AUNM= <au_zg>
##$AUTOPOS= <>
##$BF1= 200.13
##$BF2= 200.13
##$BF3= 200.13
##$BF4= 200.13
##$BF5= 200.13
##$BF6= 200.13
##$BF7= 200.13
##$BF8= 200.13
##$BYTORDA= 1
##$CFDGTYP= 0
##$CFRGTYP= 5
##$CHEMSTR= <none>
##$CNST= (0..31)
1 1 145 1 1 1 1 1 1 1 1 1 1 1 1 1 1 1 1 1 1 1 1 1 1 1 1 1 1 1 1 1 
##$CPDPRG= <>
##$CPDPRG1= <>
##$CPDPRG2= <>
##$CPDPRG3= <>
##$CPDPRG4= <mlev>
##$CPDPRG5= <mlev>
##$CPDPRG6= <mlev>
##$CPDPRG7= <mlev>
##$CPDPRG8= <mlev>
##$CPDPRGB= <>
##$CPDPRGT= <>
##$D= (0..31)
0 1.2 0 0 0 0 0 0 0 0 0 0.03 0 0 0 0 0 0 0 0 0 0 0 0 0 0 0 0 0 0 0 0 
##$DATE= 1564134910
##$DBL= (0..7)
120 120 120 120 120 120 120 120 
##$DBP= (0..7)
150 150 150 150 150 150 150 150 
##$DBP07= 0
##$DBPNAM0= <>
##$DBPNAM1= <>
##$DBPNAM2= <>
##$DBPNAM3= <>
##$DBPNAM4= <>
##$DBPNAM5= <>
##$DBPNAM6= <>
##$DBPNAM7= <>
##$DBPOAL= (0..7)
0.5 0.5 0.5 0.5 0.5 0.5 0.5 0.5 
##$DBPOFFS= (0..7)
0 0 0 0 0 0 0 0 
##$DE= 6
##$DECBNUC= <off>
##$DECIM= 24
##$DECNUC= <off>
##$DECSTAT= 4
##$DIGMOD= 1
##$DIGTYP= 9
##$DL= (0..7)
0 120 120 120 120 120 120 120 
##$DP= (0..7)
150 150 150 150 150 150 150 150 
##$DP07= 0
##$DPNAME0= <>
##$DPNAME1= <>
##$DPNAME2= <>
##$DPNAME3= <>
##$DPNAME4= <>
##$DPNAME5= <>
##$DPNAME6= <>
##$DPNAME7= <>
##$DPOAL= (0..7)
0.5 0.5 0.5 0.5 0.5 0.5 0.5 0.5 
##$DPOFFS= (0..7)
0 0 0 0 0 0 0 0 
##$DQDMODE= 0
##$DR= 18
##$DS= 0
##$DSLIST= <SSSSSSSSSSSSSSS>
##$DSPFIRM= 0
$$ [...]
##$SUBNAM2= <"">
##$SUBNAM3= <"">
##$SUBNAM4= <"">
##$SUBNAM5= <"">
##$SUBNAM6= <"">
##$SUBNAM7= <"">
##$SUBNAM8= <"">
##$SUBNAM9= <"">
##$SW= 24.9336996594482
##$SWIBOX= (0..15)
0 0 2 0 0 0 0 0 0 0 0 0 0 0 0 0 
##$SW_h= 4990.01996007984
##$TD= 16384
##$TD0= 1
##$TE= 0
##$TE2= 300
##$TE3= 300
##$TEG= 300
##$TL= (0..7)
0 120 120 120 120 120 120 120 
##$TP= (0..7)
150 150 150 150 150 150 150 150 
##$TP07= 0
##$TPNAME0= <>
##$TPNAME1= <>
##$TPNAME2= <>
##$TPNAME3= <>
##$TPNAME4= <>
##$TPNAME5= <>
##$TPNAME6= <>
##$TPNAME7= <>
##$TPOAL= (0..7)
0.5 0.5 0.5 0.5 0.5 0.5 0.5 0.5 
##$TPOFFS= (0..7)
0 0 0 0 0 0 0 0 
##$TUNHIN= 0
##$TUNHOUT= 0
##$TUNXOUT= 0
##$USERA1= <user>
##$USERA2= <user>
##$USERA3= <user>
##$USERA4= <user>
##$USERA5= <user>
##$V9= 5
##$VALIST= <valist>
##$VCLIST= <CCCCCCCCCCCCCCC>
##$VD= 0
##$VDLIST= <DDDDDDDDDDDDDDD>
##$VPLIST= <PPPPPPPPPPPPPPP>
##$VTLIST= <TTTTTTTTTTTTTTT>
##$WBST= 1024
##$WBSW= 4
##$XGAIN= (0..3)
0 0 0 0 
##$XL= 0
##$YL= 0
##$YMAX_a= 952624
##$YMIN_a= -597053
##$ZGOPTNS= <>
##$ZL1= 120
##$ZL2= 120
##$ZL3= 120
##$ZL4= 120
##$ABSF1= 10
##$ABSF2= 0
##$ABSG= 5
##$ABSL= 3
##$ALPHA= 0
##$AQORDER= 0
##$ASSFAC= 0
##$ASSFACI= 0
##$ASSFACX= 0
##$ASSWID= 0
##$AUNMP= <proc_1d>
##$AZFE= 0.1
##$AZFW= 0.1
##$BCFW= 1
##$BC_mod= 2
##$BYTORDP= 1
##$COROFFS= 0
##$CY= 11.3945322036743
##$DATMOD= 1
##$DC= 2
##$DFILT= <>
##$DTYPP= 0
##$F1P= 18.9103706918063
##$F2P= -1.10871071338519
##$FCOR= 0.5
##$FTSIZE= 0
##$FT_mod= 4
##$GAMMA= 1
##$GB= 0.15
##$INTBC= 1
##$INTSCL= 1
##$ISEN= 128
##$LB= 0.24
##$LEV0= 0
##$LPBIN= 0
##$MAXI= 10000
##$MC2= 0
##$MEAN= 0
##$ME_mod= 0
##$MI= 1.114404
##$NCOEF= 0
##$NC_proc= 0
##$NLEV= 6
##$NOISF1= 3.799351
##$NOISF2= 2.8
##$NSP= 1
##$NTH_PI= 0
##$NZP= 0
##$OFFSET= 15.70392
##$PC= 1
##$PHC0= -9014.993
##$PHC1= 7.400974
##$PH_mod= 1
##$PKNL= yes
##$PPARMOD= 0
##$PSCAL= 0
##$PSIGN= 0
##$REVERSE= no
##$SF= 200.130013532006
##$SI= 16384
##$SIGF1= 3
##$SIGF2= 2
##$SINO= 400
##$SIOLD= 16384
##$SREGLST= <1H.CDCl3>
##$SSB= 0
##$STSI= 0
##$STSR= 0
##$SW_p= 3612.71676300578
##$SYMM= 0
##$S_DEV= 0
##$TDeff= 0
##$TDoff= 0
##$TI= <>
##$TILT= no
##$TM1= 0
##$TM2= 0
##$TOPLEV= 0
##$USERP1= <user>
##$USERP2= <user>
##$USERP3= <user>
##$USERP4= <user>
##$USERP5= <user>
##$WDW= 1
##$XDIM= 8192
##$YMAX_p= 0
##$YMIN_p= 0
$$ End of Bruker specific parameters
$$ ---------------------------------
##NTUPLES= NMR FID
##VAR_NAME=  TIME,          FID/REAL,        FID/IMAG
##SYMBOL=    X,             R,               I
##VAR_TYPE=  INDEPENDENT,   DEPENDENT,       DEPENDENT
##VAR_FORM=  AFFN,          ASDF,            ASDF
##VAR_DIM=   8192,          8192,            8192
##UNITS=     SECONDS,       ARBITRARY UNITS, ARBITRARY UNITS
##FACTOR=    0.0002004,     1,               1
##FIRST=     0,             0,               0
##LAST=      1.6414764,     0,               0
##MIN=       0,             -597053,         0
##MAX=       1.6414764,     952624,          0
$$ Real data points
##PAGE= N=1
##DATA TABLE= (X++(R..R)), XYDATA
0@%%%Qk4L2l2M0n6P2r0J14j44J84k24K64l20L87m62N45o36P45q70J002j152J325
$$ 0 0 0 0 8 -16 16 -16 24 -32 40 -50 64 -80 104 -120 144 -176 211 -251 294 -342 403 -467 535 -617 708
26G08j514J724j959K212k495K812l154L530l946M402m902N448o046O705p431Q228
$$ 708 -806 918 -1041 1171 -1324 1488 -1666 1864 -2082 2320 -2582 2866 -3180 3525 -3906 4322
42D322r104J0080j1168J2380j3744J5289j7055J9097k1484K4323k7771L2058l7558
$$ 4322 -4782 5298 -5870 6510 -7234 8055 -9000 10097 -11387 12936 -14835 17223 -20335
55b0335M4907n5289P1193r8861J60346n19929K00676J025324o90620l65155M39883
$$ -20335 24572 -30717 40476 -58385 101961 -417968 -217292 808032 117412 -247743 192140
66A92140m8173p21622L90628Q31265l09046q12401K14855L94612k25530p173N20189
$$ 192140 143967 -577655 -187027 644238 335192 -477209 -262354 132258 -93272 -100445 419744
77D19744j27947o23237J9731M54789m7261j41234J76150q0349l72421J72820M69475
$$ 419744 291797 -331440 -311709 143080 95819 -45415 130735 50386 -322035 -149215 320260
88C20260r5760l61489O9270J12101j59169N7830K60885j56845l11785J74802L10596
$$ 320260 224500 -136989 -67719 44382 -114787 -56957 203928 47083 -264702 -89900 220696
99B20696r6610j53944N0508q0951j42728J88184K29409j31361j73850K9848l1269
$$ 220696 124086 -29858 20650 -60301 -203029 -14845 214564 83203 -90647 -60799 -92068
110i2068o068K79005J32953l56191k61870J82052J28767j3817K26677Q7353m85047
$$ -92068 -98136 180869 313822 -42369 -304239 -122187 6580 -7237 219440 306793 -178254
121a78254k87281M77456L58753l00534j69397J81476j87648k93842M09726M94112
$$ -178254 -465535 11921 370674 70140 -99257 82219 -105429 -399271 10455 504567
131E04567l39070m62754K04706J77331k51360J04195M32866k03539n54559J40883
$$ 504567 165497 -297257 -92551 84780 -166580 -62385 370481 166942 -387617 -246734
141b46734M68893q1741j97868J94064l2620m08795O9749N03753j9038m19752J9021
$$ -246734 222159 140418 -57450 136614 103994 -304801 -235052 268701 249663 -170089 -151068
152a51068K46309j03470q2590K47176K4378l35402n2666K77688L7517j55317M7824
$$ -151068 95241 -8229 -90819 156357 180735 -154667 -207333 70355 107872 -47445 379
163C79O5816j38325k6168J93196M0420j62465o1134L4904m157P4942J27911p6006
$$ 379 66195 -72130 -98298 94898 135318 -27147 -88281 -53377 -57534 17408 145319 69313
175F9313j91777P966J39640M5070N277o972j39688j15266J42173J80975m5994
$$ 69313 -122464 -114498 25142 70212 75489 68517 -71171 -186437 -44264 136711 90717
186I0717r0179O138o9067p0618J63004J58829j49357j66063Q2826M3649q1377
$$ 90717 538 6676 -62391 -133009 29995 188824 39467 -126596 -43770 -121 -81498
197h1498J24577J88683j87490k81028J32176K32947q7303p4506J37805p4569k53173
$$ -81498 43079 231762 44272 -236756 -104580 128367 41064 -33442 104363 29794 -223379
208b23379J27673L29754r7137k81896Q5895J46407j61209m1367K58412O144k93263
$$ -223379 -95706 234048 136911 -144985 -59090 87317 -73892 -115259 143153 149297 -143966
219a43966O236K49234m4283j61656J28391R4638k20108q3034K44272P7699j93135
$$ -143966 -137730 111504 67221 -94435 33956 128594 -91514 -174548 69724 147423 -45712
230d5712k6315J25347n7150p8611J35425O1293j75409o1754J53964M2203r5575
$$ -45712 -72027 53320 -3830 -82441 52984 114277 -61132 -122886 31078 73281 -22294
241b2294J5016N0179p5600l0243J07334K4234r7191j0640N4849k9366k0167P5600
$$ -22294 -7278 42901 -32699 -62942 44392 68626 -28565 -39205 15644 -13722 -33889 41711
253D1711J7528q1737j7738M3299r459M066N9903k8999j02929K2126J00817j1935
$$ 41711 59239 -22498 -40236 3063 -6396 -2330 57573 28574 -74355 -52229 48588 36653
265C6653m8980L5007r486q3720L8107J14525m6126j06400N8092O9159q6238k8771
$$ 36653 -12327 22680 13194 -70526 -32419 82106 35980 -70420 -12328 56831 -29407 -58178
277e8178J18533J636j28657K1795J07670o1753p8909J09787N8969j40225m0354
$$ -58178 60355 61991 -66666 -44871 62799 1046 -77863 31924 90893 -49332 -89686
288h9686J44778J1771j29339K7662J05776p0053q1450J02623N4551j18445k0790
$$ -89686 55092 66863 -62476 -34814 70962 909 -80541 22082 76633 -41812 -62602
299f2602J24899j2084j22462L3941J03849m7141o5524O2686K1236q3314J1636
$$ -62602 62297 50213 -72249 -38308 65541 18400 -47124 15562 36798 -46516 -34880
310c4880R7364k5218r0596K9997O1022l9950k5352N6374J568o4748P754N1498
$$ -34880 62484 37266 -53330 -23333 37689 -2261 -27613 28761 30329 -34419 -26665 24833
322B4833j7221k3780L6633J435n7871K725O1175M286l6334k613n289k2246L2584
$$ 24833 7612 -16168 20465 21900 -35971 -33246 27929 32215 -4119 -6732 -12021 -34267 -1683
335a683N4654k8699o3266J0022L6897l836O075K0744l7730m8768L8993N7071k1607
$$ -1683 52971 24272 -38994 -28972 7925 4089 10164 30908 -6822 -55590 -16597 40474 18867
348A8867k7608K1596j4191m8507L2614P4382k0911o8653L602K5676j3548K4700
$$ 18867 -8741 12855 -1336 -49843 -17229 57153 36242 -32411 -28809 -3133 -16681 8019
360H019N9778l5897j00228N142Q9210K0301l5745l597j3236m5813K2800Q8338
$$ 8019 67797 31900 -68328 -63186 26024 46325 10580 6983 -6253 -52066 -29266 59072
372E9072P872q0934l4029K8322R198R474M5138K547p1736l8017M7102M8964L886
$$ 59072 66944 -13990 -48019 -19697 -10499 -1025 44113 46660 -25076 -63093 -15991 32973 36859
385C6859j1735l0577n0623L5P4900N3266l4951o3891k3288J8374M2188M0973r484
$$ 36859 25124 -5453 -56076 -56041 18859 72125 37174 -26717 -50005 -31631 10557 51530 42046
398D2046o4000m4720K7469O1554L2223j5416m4900m0296J37M4373M6689K356m6385
$$ 42046 -21954 -66674 -39205 22349 54572 39156 -5744 -46040 -45903 -1530 45159 47515 1130
411A130n2986m244N4847N8899M187n0627n9017j9754M3283P5339K5862o1138p7115
$$ 1130 -51856 -56100 -1253 57646 61833 11206 -47811 -67565 -24282 51057 76919 15781 -61334
424f1334m351O0577N6970J3099l6813o8692l9572M2705Q1758K7296m5131n6693
$$ -61334 -65685 -5108 51862 64961 28148 -40544 -80116 -37411 44347 71643 26512 -30181
436c0181k3096J7901N3821N1228j5568q0379n6889K8580P6045M8153j4034o2607
$$ -30181 -53277 -35376 18445 69673 54105 -26274 -83163 -54583 21462 69615 55581 -7026
448g026o0542M820P4951O3823k1742p8811m9255J9943O3202N6376J339o5524p0973
$$ -7026 -67568 -62748 12203 76026 54284 -24527 -73782 -53839 9363 65739 67078 1554 -69419
461f9419M158P1635N4528j0390n0337n1062j7466M7510Q4705K5430p2557q3523
$$ -69419 -65261 6374 60902 50512 175 -50887 -68353 -20843 63862 89292 16735 -66788
473f6788n494N6612N9355K7111l3794q6229m5504O7004J02315J4014p1014o6996
$$ -66788 -72282 -15670 43685 70796 37002 -49227 -94731 -27727 74588 88602 17588 -49408
485d9408k1685K6895P2725N8913l5869r6625l7302N3458O6919K7372j6735o3059
$$ -49408 -71093 -44198 28527 87440 51571 -45054 -82356 -28898 38021 65393 48658 -14401
497a4401o9968R580R4823O8907k8855p6300m9532M694O0420P4734J268q9266p5534
$$ -14401 -84369 -74789 20034 88941 60086 -16214 -65746 -61052 -632 74102 75370 -13896 -89430
510h9430K3764Q0502N3389m373n5545p2185j5055P3259P9592p700p3934n4608
$$ -89430 -65666 14836 68225 63852 8307 -63878 -78933 -5674 73918 66218 -7716 -62324
522f2324J600M6456O6680L2157n1948r3021k7813O6563P9341J3644n0303o6593
$$ -62324 -60724 -14268 52412 84569 32621 -60400 -88213 -21650 57691 71335 21032 -45561
534d5561l0448M0813Q7614M4575n7457r9332l1283O0012P7337K6848l3960o7797
$$ -45561 -76009 -35196 52418 96993 39536 -59796 -91079 -31067 46270 73118 39158 -28639
546b8639m8422K7868Q8810N1105m6829q5077l6160K7623O1116N8795K516p7905
$$ -28639 -77061 -49193 39617 90722 43893 -41184 -77344 -49721 11395 70190 72706 -5199
558e199p9894J7361Q9572N3558k2150n9615n8501j4192O6815R2684L356q9790
$$ -5199 -85093 -67732 21840 75398 53248 -6367 -64868 -79060 -12245 80439 83795 -5995
570e995o6151J7543N2744M4738J9505l9705q2590k3036P6153P4224q541m9640
$$ -5995 -72146 -54603 -1859 42879 62384 22679 -59911 -82947 -6794 67430 58889 9249
582I249l9382k6834J4534P5328N0961n5724q8551m825N9712M3603J5362j2561
$$ 9249 -30133 -56967 -42433 32895 83856 28132 -60419 -65244 -5532 38071 53433 40872
594D0872o2977o0655L6921R7914K5285o4989n5207l750K0656M4448N0690j7971
$$ 40872 -22105 -82760 -45839 52075 77360 12371 -42836 -46586 -25930 18518 69208 51237
606E1237q9072m6654N2751P0242J5715k1000l8865n0439n936P2990P0066k6101
$$ 51237 -37835 -84489 -31738 38504 54219 33219 -5646 -56085 -62021 10969 81035 54934
618E4934q2613m0810K0981M8203N1286J6176n5449p9420n058P5075O0054j2452
$$ 54934 -27679 -68489 -47508 695 51981 68157 12708 -66712 -71770 3305 63359 50907
630E0907n1286m2170j2231L2095O2359K9398m5026o8446j3486M3617M3848J2869
$$ 50907 -379 -42549 -54780 -22685 39674 69072 24046 -44400 -57886 -14269 29579 42448
642D2448j5816m1148l9779J5133O7462L6117m0407n4392o956K0488K0543K8231
$$ 42448 26632 -14516 -54295 -39162 28300 64417 24010 -30382 -37338 -16850 3693 31924
654C1924Q648m9135n0150L2419O7785J143m4929j3483K028j3900J9865N5218p105
$$ 31924 40572 -8563 -58713 -26294 41491 42634 -2295 -15778 -13750 -27650 -7785 47433 40328
667D0328p3943j9150N6095K5318j8991N817j50n5648j9925P8234N4073n4705n5813
$$ 40328 -33615 -52765 3330 28648 9657 15474 15324 -40324 -60249 17985 72058 17353 -38460
680c8460J5873J2089o610M3662L9660o3898p8806L6215P4782l318k4134J2285
$$ -38460 -22587 -10498 -17108 26554 66214 2316 -76490 -40275 34507 31189 7055 19340
692A9340k3143n5798K7200Q6148P25o9932j5070K3933j1860M911N8835Q173p7050
$$ 19340 -3803 -59601 -32401 53747 54472 -15460 -30530 -6597 -18457 -13546 45289 53462 -23588
705b3588l5054N2237L2334j8586L026J1414l8694l0074M7181M6979l0068m0109
$$ -23588 -58642 -6405 25929 7343 10369 21783 -16911 -46985 196 47175 17107 -23002
717b3002J3463J4258j6946M520L0806n693l6193j01K9868R39k0742L789J5052
$$ -23002 -9539 4719 -12227 -7707 23099 17406 -18787 -18888 10980 11919 -8823 -5034 10018
730A0018j0529j4381J5449J6408j8099k0374J7993K4996j2304k3288N796J1117
$$ 10018 -511 -14892 557 16965 -1134 -21508 -3515 21481 9177 -14111 -8315 2802
742B802r930J623K6142j562l9613q413L7879J3943k4004k513J4883j9303k1712
$$ 2802 -7128 -5505 20637 19075 -20538 -28951 8928 22871 -1133 -3646 11237 -8066 -29778
755b9778L1724L3149k5901k9049J8410R108k5240P671M0880r232m6647L699L4718
$$ -29778 1946 35095 9194 -19855 -1445 7663 -17577 -9906 30974 21742 -24905 -21206 13512
768A3512p392j7681K4232J0863l8638j3857L7724J0309k9403N039K8532j9543
$$ 13512 6120 -11561 12671 23534 -15104 -28961 8763 19072 -10331 -5292 23240 3697
780C697l5465K0095L4570j3052j8351J5526j428l1626N178M4165O021l5812j1031
$$ 3697 -31768 -11673 22897 9845 -8506 7020 5592 -26034 -20856 23309 29330 -6482 -17513
793a7513J4848m216n708K5956J8091k9353l2626J1011K6707N068k460K634j2935
$$ -17513 -2665 -6881 -12589 13367 31458 2105 -30521 -19510 7197 12265 9805 12439 -496
806d96k6068K707L7797K0707k3780k8586J532J1089K905J2130J5797j7541l6410
$$ -496 -26564 -23857 13940 34647 10867 -17719 -16187 -5098 -2193 9937 25734 8193 -28217
819b8217M666L8599O832k3682j161R518j8448r558L5064J8971l7299k3746K8687
$$ -28217 -23551 15048 21880 -1802 -2963 6555 -11893 -21451 13613 32584 -4715 -28461 226
832B26J5106k0567L336K0168k3797k8569L4955L8426l1687l6698K0905J7185j8315
$$ 226 15332 -5235 -1899 18269 -5528 -34097 858 39284 7597 -29101 -8196 8989 -9326
845i326J1104L1681k8743n1461K4029N4564q941k9569J0075m482l6386J7402O4184
$$ -9326 1778 33459 4716 -46745 -22716 31848 22907 -6662 3413 -1069 -37455 -20053 44131
858D4131j934o2617j4640K9585K492L503L7110l056o6822k4775N4963L9364j5106
$$ 44131 42197 -20420 -35060 -5475 -2983 520 37630 34574 -32248 -57023 -2060 37304 22198
871B2198j3993q748l1177n801N2972L7202l2485m4027m411J1799J5501K8083Q839
$$ 22198 8205 -543 -31720 -37521 15451 52653 20168 -23859 -28270 -16471 -970 27113 35952
884C5952l6034l6153Q679L2207K0917R69k2209l1966l580L1115K5999j798j8539
$$ 35952 -82 -36235 -27556 4651 25568 26537 4328 -27638 -31218 -103 25896 24098 5559
897E559k5016j3614K4480L9022j593l5936j6742O930Q481K0619K3749k1213m9318
$$ 5559 -19457 -33071 -8591 30431 28838 -7098 -23840 -16910 -8429 12190 35939 14726 -34592
910c4592j304M3560J7703j1950m307j5743l2109J3767N9599J2769m9272k7721
$$ -34592 -35896 7664 25367 13417 9110 -6633 -38742 -24975 34624 47393 -1879 -29600
922b9600J0455M659J6082M1225m355o7130k6875M9768L6904r103m581j1029m5314
$$ -29600 -19145 -14486 1596 42821 38466 -28664 -55539 -5771 31133 22030 17449 6420 -38894
935c8894r824O5690M2464m1074m2719L837J909L368M4164K5589n4971n5165K5732
$$ -38894 -48718 16972 59436 18362 -24357 -20520 -18611 -15243 28921 54510 -461 -55626 -29894
948b9894M6552N814j942k558l9117l1412M1575N7025j0832m3942j5600p25P114
$$ -29894 16658 22472 20530 17972 -21145 -52557 -10982 46043 35211 -8731 -24331 -25056 -17942
961a7942L7390K8669l4118n1255J638L2653J9513J1955m275m1901l1865L2440
$$ -17942 19448 48117 13999 -37256 -35618 -2965 16548 28503 24228 -17673 -49538 -17098
973a7098N0110J643k5656j8535k0943m391M5349M3376k6652n4654q706K2956J8897
$$ -17098 33012 34655 8999 -9536 -30479 -34870 10479 53855 27203 -27451 -36157 -13201 5696
986E696K3521R947m1989m8276J8023N3082J5751j5982j7350k6965j6191L6118
$$ 5696 29217 39164 -2825 -51101 -33078 20004 35755 19773 2423 -24542 -40733 -4615
998d615M9441r710m6387j8749O943J3144L1363K3752l3620n3646M033M3908J9834
$$ -4615 44826 35116 -11271 -30020 -23077 -9933 21430 45182 11562 -42084 -38051 5857 25691
1011B5691l100q531l1437k9917K9015N7394K629m3680k3509R66O503K8412L3613
$$ 25691 22591 14060 -17377 -47294 -18279 39115 41744 -1936 -25445 -24479 -17976 10436 44049
1024D4049j9168n5518j3226L6456K8923O393n386k9659l5918J2367N1218K1601
$$ 44049 24881 -30637 -43863 -7407 21516 27909 22523 -7136 -43054 -30687 20531 42132
1036D2132k3956k9727j8107l19L3387M0488r545m8871k3686J5872K5159K4289
$$ 42132 18176 -11551 -29658 -29977 3410 43898 34353 -14518 -38204 -22332 2827 27116
1048B7116J0098l1262m5652L524M5043K3242j0215j6928k3569j9918K3551N0029
$$ 27116 37214 5952 -39700 -36176 8867 32109 21894 4966 -18603 -38521 -14970 35059
1060C5059N376m3121k6845P500J3752K0318K3258j4881m8963j4257L8444L2124
$$ 35059 40435 -2686 -29531 -22031 -8279 12039 35297 20416 -28547 -42804 -4360 27764
1072B7764k943j5596k0909k2069J1029M3802J8431k9536l2214m827J2356K3812
$$ 27764 24821 9225 -11684 -33753 -22724 21078 39509 9973 -22241 -27068 -14712 9100
1084I100K4633q956m0778k0631K0910K8891J2104l597k3770l0403M342M0183K3193
$$ 9100 33733 24777 -16001 -36632 -15722 13169 25273 21676 -2094 -32497 -28155 12028 35221
1097C5221j6852k6125j4573k093K0852L3758K357l7180k6694J1158K3843J5642
$$ 35221 18369 -7756 -22329 -24422 -3570 30188 32545 -4635 -31329 -20171 3672 19314
1109A9314M941j6596l1543p306K9366K7353k576j9423j9750r717J5222L0994Q195
$$ 19314 24255 7659 -23884 -31190 -1824 25529 22953 3530 -16220 -25937 -10715 20279 28474
1122B8474k4663k3811k052J2362K1010J6663j3107l4383j0146K4319K1525Q11
$$ 28474 3811 -20000 -22052 -9690 11320 27983 14876 -19507 -29653 -5334 16191 17002
1134A7002p142j5298k0088N603L4541J6141k2547k3517r74O216J0007J9205L652
$$ 17002 9860 -5438 -25526 -19923 14618 30759 8212 -15305 -16279 -10063 -56 19149 22801
1147B2801k8120k2719J4394K5994N784p441j0608j5113m788K0032K2337n059k2048
$$ 22801 -5319 -28038 -13644 12350 18134 10693 85 -15028 -19816 216 22553 17494 -4554
1160d554j1833L781J2425J4445K955j6093j7296J293J4632J2307K141j0099j6084
$$ -4554 -16387 -12606 -181 14264 17219 1126 -16170 -14877 -245 12062 14203 4104 -11980
1173a1980m587J4119J5066k80j0250j0481n554O341J6461P563j2045j5531j349
$$ -11980 -16567 -2448 12618 12338 2088 -8393 -13947 -7606 8855 16418 4373 -11158 -12507
1186a2507Q882R024N270l734j3129q006Q387J3398L158o604p947n158J824R829
$$ -12507 -3625 5399 10669 6935 -6194 -14200 -5813 7585 10743 4139 -3808 -8966 -7142 2687
1200B687Q008m320j0363l964L520O235N042L36p300p861J733Q972M619l215m853
$$ 2687 10695 6375 -3988 -7952 -4432 1803 6845 7181 -119 -7980 -6247 2725 7344 4129 -724
1215g24k873p53L356O216J287o998n375L191N008o8j265P08k479l484K609N636
$$ -724 -3597 -4350 -994 5222 6509 -489 -5864 -2673 2335 2267 1002 1710 -769 -4253 -1644 3992
1231C992j834n079J400L125k686j501M629M72n786N8O191j212n771K213M896k928
$$ 3992 2158 -2921 -1521 1604 -1082 -2583 2046 2518 -3268 -3210 2981 1769 -4002 -1789 3107 179
1247A79l015M235N92n693R47P582j293p510O58M776p61p30L994j723p576Q57Q214
$$ 179 -2836 1399 1991 -3702 -2755 4827 3534 -3976 -3318 1458 697 -33 3961 2238 -5338 -4481 3733
1264C733J835m413k349j521j334M408O355j631o758k975N17L232P521K191j0104
$$ 3733 5568 1155 -1194 -2715 -4049 359 6714 5083 -1675 -4650 -4133 -901 6620 8811 -1293
1279a293q544M922P300J280K982l39j3449q824J4790J5811p284j1613P77k512
$$ -1293 -9837 -4915 2385 3665 6647 6308 -7141 -15965 -1175 14636 7352 -4261 -3484 -5996
1293e996m994J4102J7127j3445k3460M385J5577o83O05R318j0558k3129P197K8004
$$ -5996 -10990 3112 20239 6794 -16666 -12281 3296 2613 3218 12536 1978 -21151 -13954 14050
1307A4050J644j7216j721P66j0648O617K5577j002k8712o900J7167M651j946R960
$$ 14050 15694 -1522 -3243 -2477 -13125 -6508 19069 18067 -10645 -17545 -378 4273 2327 12287
1321A2287l609k5050k962K7838J0916j6204p894J786p418J732K3218O800k5420
$$ 12287 8678 -16372 -19334 8504 19420 3216 -4678 -2892 -10310 -8578 14640 21440 -3980
1334c980j6472J2538J3159K311L973m279k0446q606K0092K0484l512j5659j2292
$$ -3980 -20452 -7914 5245 7556 11529 7250 -13196 -21802 -1710 18774 15262 -397 -12689
1347a2689l928J0566J9495N929j4333j7824p189R371K2641J2431j6754k4063k007
$$ -12689 -16617 -6051 13444 19373 5040 -12784 -19973 -10602 12039 24470 7716 -16347 -18354
1360a8354J2345J0294J2243L736k4947k6506J5405L3017K673j5211m803r836j4244
$$ -18354 -6009 4285 16528 20264 -4683 -31189 -15784 17233 19906 4695 -108 -9944 -24188
1373b4188J8801L6242p078l8127p154J7967L359M853J8824j0433l9033j801L8499
$$ -24188 -5387 30855 23777 -14350 -21504 -3537 -178 4675 23499 13066 -25967 -27768 10731
1386A0731J2461j8438m271j546j9530L761L8808Q377l7382j7307J7994P274k12
$$ 10731 23192 4754 483 -1063 -20593 -16832 21976 30353 -7029 -24336 -6342 932 720
1399G20J8050M77l7635j5200L5141K3634j5410j1894n49j4499k822L3411K0491
$$ 720 18770 19247 -18388 -33588 1553 25187 9777 -2117 -2666 -17165 -19987 13424 33915
1412C3915k8114k9694O184J5191P910J2292N72k7636k0641J7251K7826P210r594
$$ 33915 5801 -23893 -17709 -2518 5392 17684 18256 -9380 -30021 -12770 15056 22266 12672
1425A2672j8505j8580M946K8796J6325j1425j8386j3769m299K0750L0665m155
$$ 12672 -5833 -24413 -19467 9329 25654 14229 -4157 -17926 -22225 -1475 29190 25035
1437B5035l4211j4550J2029R933J2056J6730j3786m0074l922L7250J6544j3602
$$ 25035 -9176 -23726 -11697 -1764 10292 27022 13236 -26838 -30760 6490 23034 9432
1449I432n061o093k3308L479M3152J3252l7297k0730J5005M165p3K4234N545m1524
$$ 9432 4371 -1722 -25030 -21551 21601 34853 -2444 -23174 -8169 -4004 -4077 20157 25702 -15822
1463a5822k0558L5750K4067j6550o377N124k1775j2306L8467K7469l2520l0070
$$ -15822 -36380 -630 23437 6887 510 5634 -16141 -28447 10020 37489 4969 -25101
1475b5101J5566J1493p200J6440J7009l2124l4048K4871L6748o846j5958J616
$$ -25101 -9535 1958 -5242 11198 28207 -3917 -37965 -13094 23654 16808 850 2466
1487B466j2307j6386K4347L5212j3008l5803n107J2850O507J4264J2769k0418
$$ 2466 -9841 -26227 -1880 33332 20324 -15479 -20586 -7736 -1229 13035 25804 5386
1499E386l1656L787K7242J3192j889r419k0526j2026J9294K6491P29j6310j4554
$$ 5386 -26270 -22483 4759 17951 16062 6643 -13883 -25909 -6615 19876 20605 4295 -10259
1512a0259j0380O026K7127J4101k0189k1944Q79O932Q226J7994K174l0382j9019
$$ -10259 -20639 -14613 12514 26615 6426 -15518 -14639 -7707 519 18513 20687 -9695 -28714
1525b8714K1581K1553m866m180m35j8648j0083K8788K3426k1030k2777P409N043
$$ -28714 -7133 14420 9554 5374 4939 -13709 -23792 4996 28422 7392 -15385 -7976 -2933
1538b933m251J7451J5519k6898k8254J9523K6086p701p144P488j4892k0748K3274
$$ -2933 -7184 10267 25786 -1112 -29366 -9843 16243 8542 1398 8886 -6006 -26754 -3480
1551c480L3907j5036l0767M322J0613p579J0286K3845j5483l6662N409L1118L027
$$ -3480 30427 15391 -15376 -11054 -441 -8020 2266 26111 10628 -26034 -20625 10493 13520
1564A3520j0132M011p486k2981P638L3844M100k5063r574N050j307P612J9427
$$ 13520 3388 7399 -87 -23068 -15430 18414 22514 -2549 -12123 -7073 -8380 -768 18659
1577A8659l277k6754r028J5705J1463K672R79j0290j6500L139J9578P628p197
$$ 18659 15382 -11372 -20400 -4695 6768 9440 10419 129 -16371 -13232 6346 13974 6777
1590F777p946q057m144J2694J6404m550j5829m659K839L218J0960P841j3577j7173
$$ 6777 -1169 -9226 -13370 -676 15728 11178 -4651 -9310 -6471 -3253 7707 15548 1971 -15202
1604a5202N940J4324J226q12J417j1651j1992J3669J9137p031j4834J874J527
$$ -15202 -9262 5062 6288 5476 6893 -4758 -16750 -3081 16056 9025 -5809 -3935 -2408
1617b408o043R740J6350j0852k2395M831J6509j709l364P485o384j8215O719K2796
$$ -2408 -8451 1289 17639 6787 -15608 -10777 5732 4023 659 8144 1760 -16455 -9736 13060
1631A3060j239j6455O3M079p720L724J8285k362k1577k373J4667J646l881O931
$$ 13060 11821 -4634 -4571 -492 -8212 -4488 13797 11435 -10142 -12515 2152 3798 -83 6848
1645F848j345j6344j272J8179N140j0936k671K215n814M15J3689K987j3771n706
$$ 6848 5503 -10841 -12113 6066 11206 270 -2401 -186 -6000 -5585 8104 11091 -2680 -8386
1659h386O745K328M6N681j189j1266j796R833L231l558K13j605o601K078J0030
$$ -8386 -1641 687 733 6414 5225 -6041 -7837 1996 5227 1669 1882 277 -6324 -4246 5784
1674E784J00q009k28K619l544J135Q535j857j0647R45Q393j778l983N540M08r578
$$ 5784 5884 -2125 -2353 266 -3278 -2143 6392 4535 -6112 -5167 3226 1448 -2535 3005 3413 -6165
1690f165O34J0914r43r065K895N573o254k469R523P85j0856O47R694k904p133
$$ -6165 -5531 5383 4440 -4625 -1730 3843 -2411 -4880 4643 5428 -5428 -4781 4913 2009 -5124
1705e124O325M790r174k699J0485M08r855K109Q507m902o665P403M456q910j819
$$ -5124 1201 5991 -3183 -5882 4603 5011 -4844 -2735 5772 870 -5795 1608 6064 -2846 -4665
1720d665R513q06r422L039P667m595n088O589K014q546j03R131o90p657J787M217
$$ -4665 4848 4042 -5380 -2341 5326 731 -4357 2232 4246 -4300 -4403 4728 4038 -3619 -1832 2385
1736B385m410j225P404L91q554r98O605J68k633K804J60o695n15P776K258m864
$$ 2385 -2025 -3250 4154 4545 -4009 -5007 1598 1766 -867 1937 2097 -4598 -5113 2663 4921 57
1752E7j630K28k229J659O703L99p074k940K942J984J976K828k970p171l30P094
$$ 57 -1573 -1345 -3574 -1915 4788 5187 -1887 -4827 -1885 99 2075 4903 1933 -5238 -5568 1526
1768A526L145j631j470l553m217L571Q611P49p098l636P65R11M138N660l084r907
$$ 1526 4671 3040 1570 -1983 -6200 -2629 5982 6731 -367 -4003 -3238 -2327 1811 7471 4387 -5520
1784e520k081O967M687K17o46m930o864K515J0538L338o383n627j374K13N195
$$ -5520 -7601 -634 4053 4270 3624 -1306 -8170 -5655 4883 8221 1838 -3789 -5163 -4950 245
1799B45Q054j498j1197m893N788O163K247O98m873r355k59J1360P184m753p128
$$ 245 8299 6801 -4396 -9289 -3501 2662 4909 5607 734 -8621 -8880 2480 9664 4911 -2217
1814b217l327q72M319R687K403j0093r373K559P946N252J042m389r152l785Q094
$$ -2217 -5544 -6416 -2097 7590 9993 -100 -9473 -6914 1032 6284 7326 2937 -6215 -10000 -1906
1829a906J0400O55p635p451k403N002R448M121o456j0003l276N601R099M852m769
$$ -1906 8494 9149 1514 -5937 -8340 -3338 6110 10231 3775 -6228 -9504 -3903 5196 10048 5279
1844E279j0582n308N685R853M583l852r351o837L375J1106O717m535r803o131
$$ 5279 -5303 -10611 -4926 4927 9510 5658 -3693 -10530 -7155 3951 10668 6133 -3670 -9801
1858i801K173R299Q635j997j1212p917L088R370P332k39q846j0152j48J1354R618
$$ -9801 -7628 1671 10306 8309 -2903 -10820 -7732 1638 8970 8731 -115 -10267 -10415 939 10557
1873A0557j872r160p782j198P521J1162K572j0536j1292K35R174Q414J984n847
$$ 10557 8685 -475 -8257 -9455 -1934 9228 11800 1264 -10028 -9793 -619 7795 9779 3932
1887C932j0906m985Q289J2702K645q829r662l070N158J0128O513n592j2952n699
$$ 3932 -6974 -11959 -3670 9032 11677 2848 -6814 -9884 -4726 5402 11915 6323 -6629 -12328
1901a2328P176J1285M527m846r904p282L387J1849Q160m669j2127o670M214R756
$$ -12328 -5152 6133 10660 5814 -4090 -11372 -7985 3864 12024 7355 -4772 -11442 -7228 2528
1915B528P457j358j0356r882J706J2112Q854k803r871p770J84Q378J0604J471
$$ 2528 9985 8627 -1729 -11611 -9905 2207 11061 8258 -1613 -9383 -9199 -821 9783 11254
1929A1254j0996j1278J142J0460Q404L01o932j0075l744Q669J2797J789j0505
$$ 11254 258 -11020 -9878 582 8986 9287 2355 -7720 -11464 -2795 10002 11791 1286
1942A286r853o67O669Q770M998n612j2668n427Q642J1828K424o734q636m867L298
$$ 1286 -8567 -9234 -2565 6205 11203 5591 -7077 -12504 -3862 7966 10390 3656 -4980 -9847 -6549
1957f549J0996P759n600j2759n238O253R293M950k233r099q867K127J2426P922
$$ -6549 4447 12206 6606 -6153 -11391 -5138 4155 9105 6872 -2227 -11094 -8967 3459 11381
1971A1381m841j0289n164J806P117Q641J185j0464j0595K475J1113O393k060n968
$$ 11381 6540 -3749 -8913 -7107 10 8651 9836 -628 -11223 -8748 2365 8758 6698 730
1985G30p376l400P561J2211J160j1331q450J949O162O185L914m358j2101m684
$$ 730 -6646 -10046 -2485 9726 10886 -445 -8895 -6946 -784 5401 9315 4957 -7144 -11828
1999a1828J0037J0956p41p039n420l510J666J0260P719p183j2592j658P499N873
$$ -11828 -1791 9165 8424 1385 -4035 -7545 -5879 4381 12100 4917 -7675 -9333 -1834 4039
2013D039K421o28p450q803L102J2348M976o694p296k380P68N459Q127J8j0600
$$ 4039 6460 5832 -1618 -10421 -7319 5029 10005 3311 -3985 -6365 -5597 -138 7989 8007 -2593
2028b593p307M379Q452L228j355m446o557j964P529R017j134q843n489J849N034
$$ -2593 -9900 -5521 2931 6159 4804 358 -6199 -8163 -634 8383 7249 -1594 -7083 -5234 -200
2043b00N059K103m512q236k499P314Q029l11o399m925q64K947O197M374m249r242
$$ -200 4859 6962 2450 -5786 -8285 -971 7058 6747 348 -4577 -5441 -2494 3703 8077 3828 -5414
2059e414k404O736O210J2k631m050m808Q64Q975N366o075p888N4L218K183L876
$$ -5414 -7818 -1082 5128 5140 2509 -1541 -6349 -5485 3490 8856 2781 -5107 -5053 -1835 348 4224
2075D224J936o783q147L739R469J200m736j780j596k994L442Q594K9r649l820
$$ 4224 6160 -623 -8770 -5031 4438 5638 902 -878 -2474 -5468 -2026 6568 6597 -3052 -6872
2090f872N198L080j08K476n39p744l098Q173O239l946m778O61q79j270N273N314
$$ -6872 -1674 1406 1298 3774 3235 -4509 -7607 566 6805 2859 -1919 -1258 -2137 -3407 1866 7180
2106G180n054p975J667O126N67j091J097k213n422J668P463J456n580k876J551
$$ 7180 2126 -5849 -4182 1944 2511 1420 2517 304 -5118 -3450 4013 5469 -111 -2987 -1436
2121a436M92O96L362P87n388l690L617M481n89k015n42j377j693K734M354q91
$$ -1436 -944 -248 3114 3901 -1487 -5177 -1560 2921 2332 317 -225 -1602 -3295 -561 3793 2902
2137B902n145j448L144J598n67P85K22l412k034L823M020k316l719O56J616j099
$$ 2902 -2243 -3691 -547 1051 484 1269 1491 -1921 -3955 -132 3888 1572 -2147 -1491 125 -974
2153i74N49L331r23m723l04M675P44l083M51J914k622j994M218K660m286k525
$$ -974 -425 2906 1983 -2740 -3044 1631 2375 -708 -257 1657 -965 -2959 1259 3919 -367 -2892
2169b892L582J251l265M69L805j978m187K386M193k894l276L217K183l862j252
$$ -2892 690 1941 -1324 -855 2950 972 -3215 -829 3364 470 -2806 411 2594 -1268 -2520
2184b520M556k3m521P92M389j750l891K284L184k810k176L357J122m011l69M462
$$ -2520 2036 2013 -2508 -1716 2673 923 -2968 -684 2500 -310 -2486 871 1993 -2018 -2387 2075
2200B075lm128L76L124j101k201K334J957l319k164L354K311k327j412J577m63
$$ 2075 2072 -2056 -1680 1444 343 -1858 476 2433 -886 -3050 304 2615 288 -1124 453 -10
2216a0j572J567K965j605l479L44K758L71q51L73k98k382l79L505K119k679k909
$$ -10 -1582 -15 2950 1345 -2134 -1790 968 1339 488 861 563 -1819 -2198 1307 3426 747 -2162
2233b162R08J292k05J239J588k393l946J034M897P05k996r45L36j741N50M807
$$ -2162 -1254 38 -167 1072 2660 267 -3679 -2645 2252 2957 -39 -984 -648 -2389 -1839 2968
2249B968J118n339l300L213K847q14O36P18m032l169M363N478k008m334j62N60
$$ 2968 4086 -1253 -4553 -1340 1507 693 1329 2047 -1985 -5154 -791 4687 2679 -1655 -1817 -1257
2265a257q04K933M113k813o513K17N116J632r33J35k114m038J265O366J965m644
$$ -1257 -2061 872 4985 2172 -4341 -4124 992 2624 1691 1826 -288 -4326 -3061 3305 5270 626
2281F26l284M49N97J950L698k80n519l230L182M220R04j041k736l254L7M678L535
$$ 626 -2658 -2209 -1612 338 4036 3756 -1763 -4993 -1811 2409 3313 2272 -464 -3718 -3681 997 4532
2298D532j559m298k566O73L614L451n49l975l242J53L325M223N89m638m407Q66
$$ 4532 2973 -1325 -3891 -3218 396 3847 3298 -677 -3919 -3766 -441 3782 4371 -267 -4674 -3808
2314c808M088K769N95k070m818k625M676O304n36m923k382m67O74M573M589l545
$$ -3808 280 3049 3644 1574 -3244 -5869 -1193 5111 4575 -348 -2730 -3197 -2523 2050 6639 3094
2330C094q072n10N663K773J0L12l525o097J961Q696K348n844l650L47n57K346
$$ 3094 -4978 -5488 175 2948 2958 3270 -255 -6352 -4391 4305 6653 809 -2841 -2494 -3051 -705
2346g05O496J84q780m200N187M598p5K17j743n882j828P832N552l954n149p64
$$ -705 5791 5975 -2805 -7005 -1818 2780 2705 2922 1179 -4703 -6531 1301 6853 2899 -2250 -3014
2362c014k24J361N739K543o439o341K235N113K067M98j495n546l054N347O524
$$ -3014 -3238 -1877 3862 6405 -34 -6375 -4140 973 3040 3538 2043 -3503 -6557 -1210 5314
2377E314n89m687k891j414J670N694L369m378o287o34L437L809K535j492n960
$$ 5314 4725 38 -2853 -4267 -2597 3097 6466 2088 -4199 -4833 -1396 2413 4948 3456 -2504
2392b504l558L709N798J159k015l765l817P95O491M095l482n363j786J061L347
$$ -2504 -6062 -2353 3445 4604 2589 -1176 -4993 -4198 2293 6388 2906 -2457 -4243 -3182 165
2407A65M882J23o749m925L342N046J578j23k484n506j631O701N769k546n143j942
$$ 165 5047 5170 -1579 -6504 -3162 1884 3462 3339 855 -4651 -6282 419 6188 3642 -1501 -3443
2423c443k84J670N414L053n672o574J370N006K252P97r06n269l892M585O772j05
$$ -3443 -3727 -2057 3357 6410 738 -5836 -4466 540 2792 3589 2683 -2586 -6478 -1893 4879 4774
2439D774m138k817j484N18N202M249l503o470q38L483K723K045L1m781m771K569
$$ 4774 636 -2181 -3665 -3147 2055 6304 2801 -3669 -4507 -1024 1699 3744 3775 -1006 -5777 -3208
2455c208O220J550k499l044k625l96M590M950j909n715k125J539K683L484R21
$$ -3208 3012 4562 2063 -981 -3606 -4002 588 5538 3629 -2086 -4211 -2672 11 3495 4416
2470D416m612n055J265N063K423n32k166m160j819M438N378p98m450k420r1J340
$$ 4416 -196 -5251 -3986 1077 3500 2968 802 -3358 -5177 -739 4639 3841 -609 -3029 -3120 -1780
2486a780M090K973l828n683j2M180K538M77m55l956l565K778N825P34l447k598
$$ -1780 2310 5283 1455 -4228 -4240 -60 2478 2955 2500 -1456 -5021 -2243 3582 4316 869 -1729
2502a729r64o9L704M053j870n474j641K873K248J506N79l302m405J221N186J954
$$ -1729 -2693 -2762 942 4995 3125 -2349 -3990 -1117 1131 2637 3216 -86 -4491 -3270 1916 3870
2518C870k306k103j764j031K760M524m26m777k317J354K158J913J215k218m256
$$ 3870 1564 -539 -2303 -3334 -574 3950 3524 -1253 -3570 -2216 -58 1855 3070 852 -3404
2533c404l03L812K612n47j764k284j542K183L907N15k995k221m10J105K714K063
$$ -3404 -3707 105 2717 2170 406 -1878 -3420 -1237 2670 3185 190 -2031 -2441 -1336 1378 3441
2549C441k032l771n57K571J927N89m18k513k488J618L780P73k153j451r73k35
$$ 3441 1409 -2362 -2919 -348 1579 2168 1750 -763 -3251 -1633 2147 2920 767 -684 -1657 -1892
2565a892K053L018j012l670r20J660J316Q52P25j909k965M98L208J271j492r84
$$ -1892 161 3179 2167 -1503 -2423 -763 553 1405 2130 221 -2744 -2246 962 2233 741 -243
2581b43q84j112J399L051J8l019j233R37P35Q20J484r68l019l70K649J286p96
$$ -243 -1127 -2239 -840 2211 2229 -790 -2023 -1086 -351 469 1953 985 -2034 -2404 245 1531 735
2598G35n50n08j350L15K554R77k079j465P20N12K88J184o1j999r87J523J354k18
$$ 735 185 -323 -1673 -1358 1196 2173 94 -1371 -651 -139 149 1333 1272 -727 -1714 -191 1163 945
2616I45m77m37q05k05J514R64r08j135q8K48N67O58j14j038n36M48N03M57L4o68
$$ 945 468 31 -774 -979 535 1499 591 -544 -632 -384 183 841 727 -311 -847 -399 104 561 595 -73
2636g3r01M11R47J6l88M0l22n75M94J059m45r90L59N47l51k89R32j75r08R1J058
$$ -73 -974 -563 384 400 12 52 -270 -845 -351 708 263 -727 -368 179 -172 -461 471 296 -612 -521 537
2657E37k16r43M59O59m89n22Q11K47j041J53J204l24j101M62N70m74q8O37l1j036
$$ 537 321 -622 -163 496 7 -515 296 543 -498 -345 859 535 -566 -104 466 -8 -96 541 510 -526
2677e26N1J131J40q78j7J90n82J01J195K28j536n89Q85M54o9J05Q1r87p92J062
$$ -526 -475 656 796 -82 -99 91 -491 -390 805 1033 -503 -1092 -207 247 178 283 364 -623 -1415 -353
2697c53J532l17j325m95K91K78O22Q51l92j784o10J467J421l66p49n35m38j16
$$ -353 1179 862 -463 -958 -667 -389 233 1084 692 -1092 -1702 -235 1186 820 71 -464 -902 -1018
2715a018J400J417q40k115l00J239Q63K74J25q72j637J31K195J171j298j428j96
$$ -1018 382 1799 959 -1156 -1456 -217 646 920 1045 173 -1464 -1333 862 2033 735 -693 -889
2732h89J83O92J444K54j893j748R84J801N75n44p18j298p08J786K171n33k278
$$ -889 -706 -14 1430 1684 -209 -1957 -973 828 1403 859 141 -1157 -1865 -79 2092 1559 -719
2749g19j133Q00R35J152P95j512k374l09K544J742n56j494j119o09P76K486J286
$$ -719 -1852 -1052 -117 1035 1830 318 -2056 -2365 179 1921 1365 -129 -1248 -1857 -1081 1405 2691
2766B691k100k838J63J958J342N63n66k094j729J138L153J294k214k143k86N71
$$ 2691 591 -2247 -2084 -126 1216 1779 1213 -881 -2610 -1472 1681 2975 761 -1382 -1668 -1097
2782a097J443K074j53k983k181J607K719O87q54j315j617n66K226K803o38l096
$$ -1097 346 2420 2267 -716 -2897 -1290 1429 2116 1262 -53 -1670 -2236 -10 2793 2155 -941
2798i41j307J121J342J274O32j654k866l07L070K074r48j848j195l40J073K532
$$ -941 -2248 -1127 215 1489 2121 467 -2399 -2706 364 2438 1490 -358 -1553 -1893 -820 1712
2814A712J021k576k833N14K321J582K4j098k258j328J986L159O55k575k297j38
$$ 1712 2733 157 -2676 -2162 159 1741 1765 667 -1591 -2919 -933 2226 2881 306 -1991 -2129
2830b129J281K026J507j006l142j743K036L141Q08j708j956j255J84K676K555
$$ -2129 -848 1178 2685 1679 -1463 -3206 -1170 1971 2779 1071 -885 -2140 -1956 720 3275
2845C275r87l607j519J472K216J012L29j820l021k24L397K647j560k395j081J9
$$ 3275 2288 -1319 -2838 -1366 850 1862 2191 371 -2650 -2874 523 3170 1610 -785 -1866 -1847
2861a847R93K607J267k759l303P54K789J110k18p02j906j775J853L492J85k860
$$ -1847 -854 1753 3020 261 -3042 -2288 501 1611 1393 691 -1215 -2990 -1137 2355 2540 -320
2877c20j686M82Q45J438J689r27l409j081K666K389j82j310j403j456O18L131
$$ -320 -2006 -1524 -679 759 2448 1521 -1888 -2969 -303 2086 1904 594 -809 -2265 -1647 1484
2893A484J747k060k920n26J502J769J344m39k534k155J166K815J396j050k139
$$ 1484 3231 1171 -1749 -2275 -773 996 2340 1901 -633 -2788 -1622 1193 2589 1539 -600
2908f00j513J02K250K234k30k546k139L06K358J969j88j946j954m06J686K454
$$ -600 -2113 -2011 239 2473 2243 -303 -2442 -2136 222 2191 2003 57 -1897 -2303 -617 1837
2924A837O59k266k419J7J718J736M99q66k264j330J656K839K39j746j559k77M21
$$ 1837 2496 230 -2189 -2172 -454 1282 1781 915 -1349 -2679 -1023 1816 2055 309 -1250 -1527 -1106
2941a106J761J783r23k953q09J889J763L2n59r91j739K67K761J503j871k005q1
$$ -1106 655 2438 1515 -1438 -2247 -358 1405 1437 878 -113 -1852 -1585 1176 2679 808 -1197 -1278
2958a278O60Q31J438L15k463j991J199K423N61q02r40j173p56J766K425l73k543
$$ -1278 -618 213 1651 1966 -497 -2488 -1289 1134 1695 893 -47 -1220 -1976 -210 2215 1842 -701
2975g01j241O89J108J092Q46j182k411m51K183J685l54j189j160n49O69J913J050
$$ -701 -1942 -1253 -145 947 1793 611 -1800 -2251 -68 1617 1263 74 -1086 -1635 -966 947 1997
2992A997j303k103k33J175J341M38l53j411j169N31K000Q88j103j330m53M63J001
$$ 1997 694 -1409 -1642 -467 874 1312 959 -452 -1621 -1090 910 1798 695 -635 -1088 -625 376
3009C76R13j23j364j258N82J566P38p61q66o89q6R55J462j71j632r87N58J142
$$ 376 1289 1166 -198 -1456 -874 692 1430 669 -197 -886 -972 -17 1445 1274 -358 -1345 -787 355
3027C55L92J91p82j250l85J508J184m00j188l82j23L46J324M45j129j393J53J176
$$ 355 747 938 156 -1094 -1479 29 1213 813 -375 -757 -880 -534 790 1235 106 -1287 -1134 42
3045D2N94O7k22r98p90P29J483K22r26q22j89L36P56Q41l22j133p22Q04P38L24
$$ 42 636 703 481 -517 -1307 -578 905 1127 201 -621 -810 -474 282 1123 801 -332 -1054 -250 488 812
3065H12l45m35p41J11R86M90l10o99m81M8P60M10q5o70l88K2N16N14qn87o12K47
$$ 812 467 32 -709 -598 388 878 568 -131 -612 -564 196 606 521 -149 -537 -515 1 515 507 -80 -692 -445
3087d45N18K29q8j15n38k16N34M84j84m48p6o4K19L58K90k13p23J17M40J14j27
$$ -445 73 302 214 99 -439 -655 -121 363 179 -269 -345 -409 -190 168 458 245 -478 -361 79 193 66
3108F6J33j63n16K86N91%n17o9K95r2J03K80r3l83k38O25M0l16QM6p3OJ35Q3l61
$$ 66 199 36 -480 -194 397 397 -120 -189 106 14 117 397 304 -79 -317 308 348 32 40 86 13 19 154 237 -124
3133a24l6L50n0j53l3K2j65P1M10j44l27qJ38O7PR0j30m28J29L72J63k33j38j88
$$ -124 -160 190 140 -13 -46 -24 -189 -118 292 148 -179 -187 -49 18 25 115 -15 -443 -314 58 221 -12 -150 -338
3157c38J20J64M53j69m92j94K32K93K72nl09n92J08O32K77k7l52l39j52L91P41
$$ -338 -218 -54 399 230 -262 -456 -224 69 341 336 27 -565 -457 175 452 425 73 -266 -418 -27 714
3178G14m0p72k97N8L20N17J86m08q52j79Q28N29o1l50n78l40L53Q91L45q16p72
$$ 714 674 -98 -395 -337 -17 500 686 278 -574 -753 75 604 543 193 -385 -725 -372 519 864 48 -724
3199g24Q1L24O72L90k45j137l99O98Q04K88m28o57p54M57J036O55o57r52k50J91
$$ -724 -643 -319 353 743 498 -639 -1038 -340 464 752 324 -333 -1087 -630 406 1061 404 -548 -798 -607
3219f07P66Q35k82j085p02M35J101M95k24q07r31J48J111R66l99j026o88Q9Q96
$$ -607 159 994 712 -373 -1075 -640 461 956 732 -75 -1006 -858 253 1219 820 -206 -894 -805 91
3238I1R94J05j232r83J86R99O75K41p52j274k74J075J218j56q62q63k58M59J386
$$ 91 1085 1190 -42 -1025 -839 160 835 1076 324 -950 -1224 -149 1069 913 51 -812 -1070 -611 775
3257G75N22j017j410k01R58J037M33n59j403o03O96J483N64q50j101p05M87J521
$$ 775 1297 280 -1130 -1331 -373 664 1097 538 -865 -1468 -772 711 1275 425 -676 -1381 -894 627
3275F27Q73p37j498n83O01J168R03k81j507j009M67J634Q20n10j155j026M7J419
$$ 627 1500 763 -735 -1318 -717 451 1354 1073 -434 -1443 -976 658 1478 968 -187 -1213 -1166 253
3293B53J265k52j504j030J81J203J204K2j273j448j3J502J214j21j091j247l95
$$ 253 1518 1266 -238 -1268 -1087 116 1320 1342 69 -1379 -1392 110 1324 1203 112 -1135 -1530
3310a530J152J490K21j193j443n1R67J287N32q64j674o06J229J571L76r64j379
$$ -1530 -378 1112 1333 140 -1303 -1354 -387 900 1432 568 -1106 -1712 -483 1088 1464 500 -879
3327h79p18P81J755P01q65j650o03O74J594P62n64j570j055O73J645J012o45j482
$$ -879 -1597 -816 939 1640 775 -875 -1478 -804 790 1552 988 -582 -1637 -964 681 1693 1048 -434
3345d34j041N34J431J133l42j559j249M19J458J126l17j297j165R1J221J348k7
$$ -434 -1475 -941 490 1623 1281 -278 -1527 -1108 350 1476 1159 -138 -1303 -1212 9 1357 1330
3362A330j346j369M9J355J153R3j076j255m58J198J563R5j219j362N7Q31J031
$$ 1330 -16 -1385 -1336 19 1172 1265 189 -1066 -1524 -326 1237 1332 113 -1249 -1192 -361 670
3379F70P10q33j684l56J156J235K66p46j104o68N00J702P71j032j476l50P51J066
$$ 670 1380 547 -1137 -1493 -337 898 1164 418 -686 -1354 -854 848 1619 587 -889 -1239 -488 578
3397E78P57k56j529j154P90J664N67o82j163o56M5J350J214m38j485q91L88J152
$$ 578 1335 1079 -450 -1604 -814 850 1417 735 -428 -1084 -1039 311 1525 1087 -398 -1289 -901 251
3415B51Q14M3j048j331n8J357J220j83j226p59j51Q32J075L28r66j445K4R43J041
$$ 251 1065 1108 60 -1271 -1329 28 1248 1065 -161 -920 -1071 -239 836 1164 198 -1247 -1223 -280 761
3434G61J34p56q47l38N18J307L91r50j121j81P96Q42K93j97j093o29N45J221M70
$$ 761 895 139 -708 -1046 -528 779 1170 220 -901 -1082 -286 556 849 652 -441 -1070 -525 696 1166
3453A166q32p52l54L48P58P40j89j347o85Q24J010R4l88l86q40J2Q94J157l99
$$ 1166 334 -418 -772 -424 334 1074 885 -462 -1147 -323 687 781 393 7 -833 -821 73 1230 831
3472H31j321l91M29M79O49K36q36j264J38J322O13m03n99l82m12M10J109M74j190
$$ 831 -490 -881 -452 27 676 912 76 -1188 -1050 272 885 482 -117 -499 -911 -501 608 1082 -108
3491a08p46K52M92L25J93K14q91p95P14J055Qo59l33q2j67O25O65k06j001j83
$$ -108 -854 -602 -110 215 408 622 -269 -1064 -350 705 713 54 -279 -361 -528 97 762 556 -445 -628
3511f28N84N30r5p3k15n55l7Q57L71n14n00M4K10J03M30q3n33n36K28P23J82l28
$$ -628 -44 486 391 318 103 -452 -489 368 739 225 -275 -231 -21 82 512 429 -104 -640 -412 311 493 165
3533A65k19l49K3K90N29L0o89l93K48N13Q3L1q5o39k70M78P17M2n91l47K14JK44
$$ 165 -54 -403 -380 -90 439 469 -220 -613 -365 148 231 262 177 -462 -732 -254 463 505 -86 -433 -219 -218 26
3556B6M64j05o75l03O08L76k14j01J74l94j74L36N81k81n59K01K63k17o2L77m9
$$ 26 490 385 -290 -593 15 391 177 76 250 -144 -318 18 599 318 -241 -40 223 6 -56 321 272
3577B72n13P6M75o7l62J2L17k16j43K83J48n47J6K70K93m74m6K48o3k29K75K49
$$ 272 -241 -165 310 243 -119 -107 210 -6 -149 134 282 -265 -249 21 314 -160 -206 42 -21 -250 25 274
3599B74l08l92J90L78j61n1J59p1m87L18M09M3n17l5K47L5j47L21J02l71k05L83
$$ 274 -34 -426 -236 142 -19 -70 89 18 -469 -151 258 301 -216 -251 -4 31 -116 205 307 -64 -269 114
3621A14K45m51p3K80Jl18L24K10k50l41L46K72k61l96K94J58k10n9M49q1n58K8
$$ 114 359 -92 -165 115 116 -202 122 332 82 -259 87 359 98 -298 -4 154 -56 -115 334 253 -305 -277
3643b77M89Kk07jK7l12j55N70K70l77n06J74J87J16J92J66l49o37J46O90J24k29
$$ -277 212 214 7 6 33 -279 -434 136 406 29 -477 -303 -116 0 192 358 9 -628 -482 208 332 103
3665A03r2l00j29J37P59M1n52l78J19K80J68K36p3n38k35L26N93K5m71j46q9K8
$$ 103 11 -289 -418 -281 478 519 -33 -411 -292 -12 156 392 319 -219 -454 -128 465 490 19 -127 -216 -188
3687a88L19M05k63o22j00M54K17J04j38k51k87j8O84K85n15m76l5K68L34K70r9
$$ -188 131 536 273 -349 -449 5 222 326 188 -63 -350 -368 316 601 86 -390 -425 -157 177 447 348
3708C48n41n08L57O28K67l39m50l65J31M41P33j91p93l57jP47M33j78l25n48k04
$$ 348 -193 -701 -344 284 551 212 -238 -603 -472 -31 702 511 -282 -639 -640 107 540 362 37 -511 -715
3729g15O11P76J0o30o54J25L91N08L47l97r31k78P58Q29p5m12n71l16K18Q78L89
$$ -715 -104 672 682 52 -602 -477 -86 422 769 372 -559 -837 -79 750 675 263 -308 -624 -406 472 861
3750H61n95p38j46L71N86J47K0p50n98L96Q97K93n55n68k99J55O95N64k91r58
$$ 861 266 -472 -618 -247 339 486 506 -244 -842 -446 451 744 189 -379 -678 -523 172 736 445 -513
3770e13l99M42P51L26j13n92p39O7R86N99k40o69p07J62O09P89m2p05p58k7P29
$$ -513 -912 -470 281 607 494 -98 -837 -770 216 815 575 -94 -801 -639 -30 759 717 12 -746 -773 -44
3791d4Q09P3p46p20pN60P50K16n39j004j94O69Q19K52o44q64k92N00R24M70n90
$$ -44 765 838 92 -628 -635 -75 675 891 352 -652 -846 -177 642 894 250 -614 -906 -406 518 988 398
3812C98r65l69N82P30M39k98r96m99L97R98L64m11p36m55KJ007P43l49r37n08
$$ 398 -567 -936 -354 376 815 517 -479 -978 -581 417 781 370 -366 -821 -819 188 931 582 -355 -863
3832h63K71P51N10J13p84r33Q3J056O48j54p71n88j26O88R38J75j165o32O7O96
$$ -863 -592 159 669 782 -2 -935 -852 204 852 698 -73 -661 -787 -99 839 1014 -151 -783 -716 -20
3852b0P16K43p48r60m6O90R34L3o11p86k70N05R24L33n84j050j09M55P10N47l79
$$ -20 696 939 191 -769 -815 -125 809 842 231 -555 -825 -320 604 937 353 -697 -806 -351 359 906 527
3873E27j091l52M72Q57M32l39p35o13K44Q96N93l95r18l62K31P28N55j60q09o23
$$ 527 -564 -916 -444 413 845 506 -229 -842 -598 298 891 496 -422 -784 -553 175 730 570 -239 -862
3893h62K94P85N07q2o81p23J86O93O23j61o25m34j47O72P34M1q33n41jM80N89
$$ -862 -568 217 724 642 -39 -762 -576 117 740 579 -46 -480 -627 45 779 820 -13 -554 -555 -75 514
3914E14K30n40q15k29Q12O17P9n04o38j34K72R25J60n58p10j13L32O35L59l18
$$ 514 744 204 -611 -840 -28 589 668 164 -474 -608 -336 589 749 191 -519 -632 -300 335 694 376
3934C76q20l51N79N40L09l50n10m31J79O46M68k78o95k69J04O05M20j3o66m88
$$ 376 -444 -795 -216 324 633 283 -227 -658 -479 167 635 357 -338 -607 -503 102 522 509 -157 -645
3954f45K44M59M65p5m90m22M5M81N71k17l58l79j46N55M22M6m91n54J33M22L76
$$ -645 -401 58 523 448 -42 -464 -419 62 633 416 58 -321 -467 88 510 556 65 -489 -356 66 442
3975D42pl92m89o1M83M63m7l45k93k82K63P17k3m52m03K3K94K61J85o5m62l50
$$ 442 435 43 -446 -507 -24 439 392 47 -246 -528 -265 452 429 -23 -426 -403 -109 152 337 272 -190 -540
3997e40M14L07J05k30j29k14K5K66M22l12k92j88K96J18J84j7k78k61J17L81Q2
$$ -540 -126 181 286 56 -73 -287 -262 4 426 114 -178 -366 -70 48 232 215 -63 -324 -207 174 256
4018B56J4k47o6j82L33K17l2l26j57J33J21J73K0k96j46K0K74J39j5k76j05o4
$$ 256 270 23 -43 -225 108 325 293 -33 -190 -57 64 237 257 -39 -185 -165 109 248 233 -43 -148 -212
4040b12J47J82%j04j23j04J70J19J02k36r9J16n0M8J30L9k31l3K16K4r3J2j7j22
$$ -212 -65 117 117 13 -110 -214 -44 75 177 -59 -158 -42 -92 -44 86 125 -106 -139 77 101 8 20 3 -119
4064a19k9J52O1j98R3n8K22j23J6M9j55nJ24J76k47j04K75m6j04P8J35j57k39
$$ -119 -148 4 65 -133 -40 -98 124 1 17 66 -89 -94 30 206 -41 -145 130 84 -20 58 193 36 -203
4087b03K68Q6k8j39n0L1o1R3J70q1j73l3R5O9l0Ll5j61M7J49J09j27j47Q1M4O
$$ -203 65 151 123 -16 -66 -35 -96 -3 167 86 -87 -120 -25 44 14 17 -18 -179 -132 17 126 -1 -148 -67 -23 -17
4113a7L6N2j28j40K2K27M8j79M6k7Q3mR9O9k04j85K02K77j13j54N7n5j50K03K53
$$ -17 19 71 -57 -197 -175 52 100 -79 -33 -60 23 19 118 187 -17 -202 0 277 164 10 67 12 -138 65 318
4138C18q9m76JK39J75j62J73q2l07j12N37J66l83k04L8k1Q1J97K69l15m60J88
$$ 318 229 -247 -246 -7 168 6 179 97 -210 -322 215 381 -2 -206 -168 -189 -108 89 358 43 -417 -229
4160b29M03k1n8o7r5l02J93M95j39k52j84J10M5J39J45N9m01j92K45L44q9j51
$$ -229 174 153 95 28 -67 -369 -176 319 180 -72 -256 -146 -101 38 183 242 -159 -351 -106 238 149 -2
4182bo7p7J3K34K80k20m05M7J94K15j06R7j00m02R3L56J43j95k36jR9J27K41R3
$$ -2 -69 -146 -133 101 381 161 -244 -197 -3 212 106 203 103 -299 -206 150 293 98 -138 -139 -40 87 328 421
4206D21n21l05J37M18J58j77j92l7k62J92M77K7m34k90J34K57K49J1p4m55k67
$$ 421 -100 -405 -268 150 308 131 -61 -98 -360 -168 309 336 -98 -388 -254 3 252 263 189 -266 -533
4227e33L43N50N1l98j25j28j08L86M31j06n92j85L70K45l4J66r6o17lM69M45l02
$$ -533 -190 360 411 13 -112 -240 -348 38 469 363 -229 -414 -44 201 167 333 237 -380 -383 86 531 229
4249B29m52J45j8p0L34K78l76m71J18M14K51k42l9k21k36J54N29J62n67k79J45
$$ 229 -223 -78 -96 -166 168 446 70 -401 -283 131 382 140 101 -120 -356 -202 327 489 -78 -357 -212
4270b12J86R4K54j52m37l42M90N87j87m75mr1o7O13K20k12p47o4N23K80O4j18
$$ -212 -26 68 322 170 -267 -609 -119 468 281 -194 -198 -289 -356 257 477 265 -482 -546 -23 257 321 203
4292B03k66m85J73O68K59j49o12k31J63L04L58J01n07m59J27M87L14j25k60k76
$$ 203 -63 -548 -375 293 552 403 -209 -440 -277 27 385 486 -21 -480 -353 134 448 323 63 -213
4312b13k74M41M48J04n63m25K29K31K72M7j63l88k44L92M56N5l57k96J8NL97K50
$$ -213 -487 -46 402 506 -57 -482 -253 -22 250 297 134 -254 -498 -106 350 405 48 -248 -230 -225 172 422
4334D22k14n58k14L72M02Qj50j46l76R5N38L43l58m60j70L22K84K36M8l72o02
$$ 422 208 -350 -564 -192 210 218 68 -78 -454 -359 179 522 164 -296 -466 -144 140 376 424 52 -550
4355e50K32O46K40m14j41k78j44L44O26K7p88k88K66K88K94N6k33n87k28N81N23
$$ -550 -318 328 568 154 13 -265 -409 -65 561 588 -200 -488 -222 66 360 416 183 -404 -632 -51 472
4376D72n7l92k51j06J41L65K93k49n68j34M39L26L4k31l59k33J70O45J13l36m14
$$ 472 415 23 -228 -334 -193 172 465 216 -352 -486 -47 279 313 82 -277 -510 -340 305 418 82 -332
4397c32M0J14K60K20m6m73k31J79N71J05k58l70k7k0L66L47q1n05l76L55L29J40
$$ -332 -292 -178 82 302 256 -217 -448 -269 302 407 149 -221 -248 -268 98 445 364 -141 -517 -162 167 307
4419C07q0k69k37k0M01L15j24l63j74P7J80K83K2k02n54Q9L74K64p1j55k13j39
$$ 307 227 -42 -279 -299 102 417 293 -70 -244 -167 13 296 318 116 -438 -349 25 289 218 63 -150 -289
4441b89K21K53J13k73l64J06J59K63M2j95j85k15K92K34N7j92j03j36J31J81M0
$$ -289 -68 185 298 25 -339 -233 -74 189 231 36 -149 -364 -72 162 219 27 -76 -212 -81 100 140
4462A40J1k62k58K91K83j23J08k50m4J0K59N5r4k79j45K51J90q5L8k7k49N5K35
$$ 140 151 -111 -369 -78 205 82 190 -60 -104 -94 165 220 126 -153 -298 -47 143 58 96 69 -180 -125 110
4485A10J6L6j32j62M1K2J97J24k92q6o1K39Q9j50K1j78j4N3J79k8j24j4L9n6J23
$$ 110 126 162 30 -132 -91 -69 128 252 -40 -126 -187 52 141 -9 12 -166 -180 -127 52 24 -100 -114 -75 -131 -8
4510hJ11j23n0q3J15J34n4j17j3l1K6K74j25p3RL3K3l8L1j00O1%Q7on5M3j00Q5
$$ -8 103 -20 -70 -153 -38 96 42 -75 -88 -119 -93 181 56 -17 -8 25 48 10 41 -59 2 2 89 83 28 71 -29 56
4538E6p3N7L1j07Q4q7l0J23o6n1L5N3M5j16m1P2j10J27R7p5o0l0R1jj48J75N3
$$ 56 -17 40 71 -36 48 -39 -69 54 -12 -63 -28 25 70 -46 -87 -15 -125 2 99 24 -36 -66 25 24 -124 51 104
4565A04k08QK3K09j50L2%l1J2O2P6j87r1M7J05Q5m5k2jj64J07J38k9r1m5Q8j0
$$ 104 -104 -96 -73 136 -14 18 18 -13 -1 61 137 -50 -141 -94 11 96 51 29 28 -136 -29 109 80 -11 -56 32 22
4592B2n0J77o6k18JQ6J87q3n4p7j4M1Q7J06j39Lj83O1J76oJ4p7q5j65K88N1q5
$$ 22 -28 149 83 -135 -134 -48 139 56 2 -75 -89 -48 39 145 6 9 -174 -113 63 57 71 -6 -91 -256 32 83 -2
4619brj74J42P7N1N3j75o6O2M8J06m3r2j98J51Q3J47O0k51r6J28J00j7L5p2j21
$$ -2 -11 -185 -43 34 85 138 -37 -103 -41 7 113 70 -22 -220 -69 14 161 221 -30 -126 2 102 85 120 48 -73
4645g3n0J42J51K3k00Jq1QK29K5l9l06n6K43J09R2j66m2j72J9K33Q2j18p8k17
$$ -73 -123 19 170 193 -7 -6 -87 -79 150 175 136 -170 -226 17 126 218 52 10 -162 -143 90 172 54 -24 -241
4670b41J19J81J43j05k27p3J61N8J52j03j22j05r9L10J16q5j03j01%R5K39n4q4
$$ -241 -122 59 202 97 -130 -203 -42 16 168 65 -57 -162 -261 49 165 80 -23 -124 -124 -29 210 156 72
4693G2k01J6J29K16l7n0j83j58J34R2J92j18j27j75K29J02r4O5n9k42J12J05K31
$$ 72 -129 -113 16 232 195 145 -38 -196 -62 30 222 104 -23 -198 31 133 39 104 45 -197 -85 20 251
4716B51j86j36k1M3R2Q7L9j39k38KK87K2pl7j99m4Q3K20o3q2j60J60m5J19J87
$$ 251 65 -71 -92 -49 43 130 169 30 -208 -206 81 103 96 59 -140 -184 -101 119 56 -26 -186 -26 -71 48 235
4741B35j77k16KQ6K53j39J0n9j61K6J88K17j52k34l5N1K27P5mk14j57K5J22K06
$$ 235 58 -158 -156 -70 183 44 54 -5 -166 -140 48 265 113 -121 -156 -105 122 197 193 -21 -178 -153 -31 175
4765A75o2j47k15J05O1J39K4j57r5K5J61J73j10j29l5o2M8K73O8k76r9nJ02N9
$$ 175 113 -34 -249 -144 -83 56 80 -77 -172 -147 14 187 77 -52 -87 -149 -101 172 240 -36 -135 -140 -38 21
4789B1R1j5j17k36J21K44N8j73j11q1J10J08J87q5k37o7J56J54nl5j65j56Q9K13
$$ 21 112 97 -20 -256 -135 109 167 -6 -117 -198 -88 20 207 122 -115 -182 -26 128 123 88 -77 -233 -144 69
4813F9J88n4l54K27j89L1J99J58k30j72l4K25N0n5k5j80p0J68J42P1k00L4j79
$$ 69 257 203 -151 76 -113 -82 117 275 45 -127 -161 64 114 59 34 -146 -216 -48 94 165 -35 -1 -180
4836a80J35J45J06n9k51j22K06K05q8p1o9j48O1J25K33q5j01j92L6J98J05j08
$$ -180 -45 100 206 147 -104 -226 -20 185 97 26 -43 -191 -130 -5 228 143 42 -150 -114 84 189 81
4858H1j34m5r7K27J88j67j65j7%R1J48N9j61k08O1L08J8j13pj63j9J21J52J07
$$ 81 -53 -98 -195 32 220 53 -112 -129 -129 -38 110 169 8 -200 -139 169 187 74 67 -96 -115 6 158 265
4882B65k50j20o4J14O7K6J27j59k68K25J65l9kj71K2M3K3Q6j14j78L9K57l6m3
$$ 265 15 -105 -169 -55 12 38 165 6 -262 -37 128 89 87 -84 -62 -19 4 90 -24 -202 -163 94 58 15
4906A5O3j01k23J04K50M1p1k16R6O0kJ92n0j79j78J51K36Rj49k2q3n2J09R0P3
$$ 15 78 -23 -246 -142 108 149 78 -138 -42 18 16 208 158 -21 -199 -48 188 197 48 26 -57 -109 0 90 163
4931A63j74k25R6J76J1Q5j07j09j21J33J28L8o5j32J35r6qK23r7j77o1K04O1q1
$$ 163 -11 -236 -140 36 47 132 25 -84 -205 -72 56 94 29 -103 32 -64 -72 151 54 -123 -184 20 81 0
4955@l3J7l2p4J30J41k20k8J01P2o4m6L7J5j36R3J24Lj74P3%M9p4Q3J5j11k1J54
$$ 0 -33 -16 -48 -122 8 149 -71 -99 2 74 10 -36 1 16 -120 -27 97 100 -74 -1 -1 48 -26 57 72 -39 -60 94
4983I4Pr8J1O2j1j20J01qM4k07K4K18l9j95J76q2q4Q0L6J27j77k2o5J10m3O6P5
$$ 94 101 3 14 76 65 -55 46 38 82 -125 -101 117 78 -117 59 -23 -107 -27 9 136 -41 -63 -128 -18 -61 5 80
5010H0j17J0N8P1j75L1J21p7J4p1P7J48k59L3J44mj19N9j03O8pJ00l8m3j17K34
$$ 80 -37 -27 31 102 -73 -42 79 2 16 -55 22 170 -89 -56 88 84 -35 24 -79 -11 -18 82 44 1 -116 118
5036A18L6j63Ljp1J2J79L2J9k30K3O7j64J31J30j28j44J09J9J68j22n2M5j05R5
$$ 118 154 -9 -6 -7 -78 -66 113 145 164 -66 -43 24 -140 -9 121 -7 -151 -42 -23 145 23 -29 16 -89 6
5061FJ1J00j08j52P7Q4m1J04l9K4k17R5J85n4r8Npp4J88R2m9j40l6m3J91k2l5
$$ 6 17 117 9 -143 -66 18 -23 81 42 66 -151 -56 129 75 -23 -18 -25 -99 89 181 132 -8 -44 -87 104 82 47
5088D7l1L0j23J52P5j23j38P6M4O9R8j57r3q8O9K94j51k8Lj11JQ2P1J12j18k18
$$ 47 16 46 -77 75 150 27 -111 -35 9 78 176 19 -74 -162 -93 201 50 22 25 -86 -85 -3 68 180 62 -156
5114a56O4J64J16j67J8j55m6J16J73K1k65j74J74R2N9P2ok51j20K86J85m2j38
$$ -156 -92 72 188 21 39 -116 -162 -46 127 148 -117 -291 -117 -25 34 106 100 -151 -271 15 200 158 20
5137B0q4n3O6J18M9q5j49KJ44J8J14j7k04j51J23K08L8j16n2k02J79J86J27j54
$$ 20 -64 -117 -51 67 116 31 -118 -116 28 46 160 143 -61 -212 -89 119 157 41 -11 -213 -34 152 279 125
5161A25j31j99P3J54J77j83j2j43k3K54O5o7j37k9m4P8J37m0k6j37m3L0K63n5
$$ 125 -6 -205 -132 22 199 16 4 -139 -162 92 157 90 -47 -76 -120 -42 95 55 29 -108 -151 -121 142 87
5185H7j31q8K0pK13J19j94j82l9J58J81M1j4k38j22J65J72P8k18j50n7K23j9J87
$$ 87 -44 -132 -112 -119 94 213 19 -163 -202 -44 137 178 164 -74 -196 -31 141 219 1 -149 -206 17 -2 185
5209A85l5j22k34K64O1L0o1j37q9QJ05J72n3j40q8K3J40Q2%k43l5K2J30O8Ok5
$$ 185 150 28 -206 58 119 149 88 -49 -138 -130 -25 147 94 -46 -134 -111 29 111 111 -132 -167 -145 -15 53 59 34
5235C4k44L3N5K45j57j5n9l3Q1K00p4q5M4j37L4J47J53k13j66m2R4K76r2K8j45
$$ 34 -210 -177 -122 123 -34 -49 -108 -141 -60 140 66 -19 25 -112 -78 69 222 9 -157 -199 -105 171 79 107 -38
5260c8j02L2P7J80J6k24M0j09J17K00l1j53j69O9J60J52p3j40j25J5R6J74l6j17
$$ -38 -140 -108 -31 149 165 -59 -19 -128 -11 189 158 5 -164 -95 65 217 144 4 -121 -106 -10 164 128 11
5284A1j04Q8j3Q0N4l5j27j66J45J29O3K4k66j4M7J35M3l1j00j18M9J13J27q6l7
$$ 11 -93 -5 -18 62 116 81 -46 -212 -67 62 125 149 -117 -131 -84 51 94 63 -37 -155 -106 7 134 48 11
5309A1j56L4J22Q6Q2j52j20K0R7N1M0jj90N3k3J83m5r0oq1N8R3J20j28j13p9Q2
$$ 11 -145 -111 11 97 179 27 -93 -73 24 75 115 114 -76 -23 -46 137 92 2 -4 -85 -27 66 186 58 -55 -134 -52
5336e2K08r8L1j07k35K22P5j4L9q9n0kO4R2l9m2j34l3J59M3P4q4j96K0J46P1P
$$ -52 156 58 89 -18 -253 -31 44 30 69 -20 -70 -72 -8 84 45 3 -131 -164 -5 38 112 28 -168 -148 -2 69 76
5363G6j12o1l2L0J97k6o3k7q4P1J57l0j27pj32K28J65k9m1j66Ro0J75q1rm1p9
$$ 76 -36 -97 -129 -99 98 72 9 -18 -102 -31 126 96 -31 -38 -170 58 223 194 153 -13 -4 -64 111 30 21 -20 -99
5390i9K9J78p1K1m1j01J2P8m0R8j60k5J24k4M8P9q7k7n0N3Q8l0j20l4R9n1P0l7
$$ -99 -70 108 37 58 17 -84 -72 6 -34 64 -96 -121 3 -21 27 106 19 -8 -58 -5 83 53 -67 -101 -2 -53 17 -20
5418b0k8Jk5oR8J09k39P1j10J79J14k8p7j45Q8j9O6Kj04P9o6Q4J16j37Q6m9j61
$$ -20 -48 -47 -72 -78 20 129 -110 -39 -149 30 144 116 39 -106 -18 -37 29 31 -73 6 -60 24 140 3 89 40 -121
5445a21Q7O5o0N6r7O8O5l6j05J81n3r8RR8n4m1L4l9pJ9N8j22L5O3K4N1q2r5K52
$$ -121 -34 31 -29 27 -70 -2 63 27 -78 103 50 -48 -39 59 5 -36 -2 -41 -48 -29 29 -93 -58 5 29 80 -2 -97 155
5474A55j62Q2P1r0Lr7J22m7pm7J1O0l3q3M8J8K8j18K1R2j38M2M9J5MM7p2J27p4
$$ 155 -7 75 146 56 59 -38 84 37 30 -17 -6 54 21 -62 -14 4 32 -86 -65 27 -111 -69 -20 -5 -1 46 -26 101 27
5503B7J8j13J30N2o4n1n8j0N7J8Mj40K7O4k9J77n1q6qP3Q8p5q1J26j67j37J95
$$ 27 45 -68 62 114 50 -1 -59 -69 -12 6 10 -130 -103 -39 -68 109 58 -28 -36 37 125 50 -31 95 -72 -209 -14
5530a4J40m1j82l7J44j1O5M2m5k02P5J03l5K9n4k5KLK6J03p0j60J08L0J28j2J7
$$ -14 126 85 -97 -134 10 -1 64 106 61 -141 -66 37 2 31 -23 -48 -46 -43 -17 86 16 -144 -36 -6 122 110 127
5557A27j49j67J14J62l3q4r5M7O9rJ12pj01j25P3J41m3N8k07k4k0K27P2r8j84
$$ 127 -22 -189 -75 87 54 -30 -125 -78 -9 -18 94 87 -14 -139 -66 75 32 90 -117 -141 -161 66 138 40 -144
5582a44O9N5Q0L0on7j93N4J06K69j81j10o2J8J49J47j00r3j81K2K65j1k2j0k24
$$ -144 -75 -20 60 90 84 27 -166 -112 -6 263 82 -28 -90 -72 77 224 124 31 -150 -128 137 126 104 94 -130
5607a30m0J30K81j21r8j64J0M5J91R1k56J0j42J60K12k06k8m9m1MK42J10j40k00
$$ -130 -170 -40 241 120 22 -142 -132 -87 104 195 -61 -51 -193 -33 179 -27 -55 -104 -145 -141 101 211 71 -129
5631a29n2K02q8J43j5l7k73J11K75l9qj70j43K08N3J60J9l11j75P2K96kl2q0l5
$$ -129 -181 21 -67 76 61 24 -249 -138 137 98 90 -80 -223 -15 38 198 217 -94 -269 -197 99 97 65 -15 -50
5656e0q3R7K20Q7k94j01JJ47J20O3j22k45k7J79J03Pn5j99l7R3J66J13o9l05L8
$$ -50 -133 -36 184 271 -23 -124 -123 24 144 207 85 -160 -187 -8 95 102 47 -152 -189 -96 70 183 114 -191 -153
5681a53Q6K44j64J32j71j98K23N6J62j59q9j78J72l4J05J03j38j53o4L51qJ2j54
$$ -153 -67 177 13 145 -26 -224 -1 55 217 58 -31 -209 -37 -71 34 137 -1 -154 -218 133 125 137 -17
5704a7r7r2L23R0k5j52j21PJ07P2O6j45j69K2J28K11l8q3j23Rk4K02Jj20j63J5
$$ -17 -114 -206 117 207 182 30 -91 -84 23 95 161 16 -153 -131 -3 208 170 87 -36 -27 -51 151 152 32 -131 -116
5730a16Q6J41n3Jk15j02K26J78K2j96j57O9j4K86j19Nm2j53Q3R1J33q3J7k05j4
$$ -116 -30 111 58 59 -156 -258 -32 146 168 -28 -185 -116 -130 156 37 42 0 -153 -70 21 154 71 88 -117 -131
5755a31J01K36j1l17J0O9J34q9J92q4k18j5J34R8pp0j2j71J12J81Nk04o4J5J53
$$ -131 -30 206 195 -122 -112 -43 91 2 194 110 -108 -123 11 109 102 32 20 -151 -39 142 147 -57 -121 -106 47
5780D7J9Q4k6j74j43J56P7O6o6j50M8K2m9J87l7j6j66L0J01J18J6k39j4o6O6J03
$$ 47 66 150 124 -50 -193 -37 40 106 40 -110 -62 -40 -89 98 61 45 -121 -91 10 128 144 -95 -109 -175 -109 -6
5806fK9p9j26R7Q8QO7k6j95R6M3J53p8o0j08K0J07J7K9l6m6n2L7O9l4J35r4j75
$$ -6 23 -56 -182 -85 3 11 78 52 -143 -47 -4 149 71 11 -97 -77 30 47 76 40 -6 -58 -21 48 14 149 55 -120
5834a20J6J55J7L3k36R3l5k0J64p8K2j39N2J01JJ3j7q3o5R6J06j4j03o1Q0NO6
$$ -120 -104 51 68 101 -135 -42 -77 -97 67 -11 11 -128 -76 25 26 39 22 -61 -126 -30 76 62 -41 -102 -22 -17 49
5861D9r8L1J9j00J78M2o9o2l6K1O0q4R9m3n6J17l4L3pj00N5j9k7J41l2j11JJ38
$$ 49 -49 -18 1 -99 79 121 52 -10 -46 -25 35 -49 50 7 -49 68 34 67 60 -40 15 -4 -31 110 78 -33 -32 106
5889A06j64RP5R1k2j21j25J79r6K6j1J1L0k3J02J2k46J43M6j20NJ31M0j34q1K7
$$ 106 -58 -49 26 117 95 -26 -151 28 -68 -42 -53 -42 -12 -35 67 79 -167 -24 22 -98 -93 38 78 -56 -137 -110
5915a10J71j46M4J10q2Q0j00O7j21J08L8p6Q3j26Q7P1j13L7NK1j32P0m4L8M9K
$$ -110 61 -85 -41 69 -13 67 -33 34 -87 21 59 -17 66 -60 27 98 -15 22 27 48 -84 -14 -58 -20 29 31
5941C1q4J20qN3m1M7p7j11J33N3j50l4J35K4o6l9M3lq9K5O4M5j30K3J1o1M3N7
$$ 31 -53 67 59 112 71 118 41 -70 63 116 -34 -68 67 91 25 -14 29 26 -63 -38 26 71 -59 -36 -25 -86 -43 14
5969A4R4j86Q5n9lM1J16j09pj42K47o0j9O7p3q3N7J36Jrj85J42p9L7N3k5j12o
$$ 14 108 -78 7 -52 -55 -14 102 -7 -14 -156 91 31 12 79 6 -77 -20 116 117 108 -77 65 -14 23 76 51 -61 -67
5997f7R3O2Q6r5m6j08m7K24k6l3m0j28J04jP5J2k18L1J74K9o9j9l1o3J5J37L5
$$ -67 26 88 174 79 33 -75 -122 102 76 43 3 -125 -21 -22 53 65 -153 -122 52 81 12 -7 -38 -101 -86 51 86
6024H6j1k14l7K0J77J48j15o0o7J5K8N1L1p2q9m4K13K5p4Q5j97P3l5K18j02l8
$$ 86 75 -139 -176 -156 21 169 54 -6 -73 -58 -30 21 52 -20 -109 -153 60 85 11 96 -101 -28 -63 155 53 15
6050A5j04l7J52J54k0j01p1p1R8N6J39j59r2p7K2J44N5k1k49P9L4K4K40k01o7
$$ 15 -89 -126 26 180 160 59 -12 -83 15 71 210 51 -41 -118 -96 48 103 82 -167 -88 -54 -30 210 9 -58
6075e8j16Q1J22MQ4k27k5J8J03P3m5o7j30M4J28J73q6j26j03L3J04J13nm8j34
$$ -58 -174 -93 29 33 117 -110 -135 -117 -14 59 14 -53 -183 -139 -11 162 76 -50 -153 -120 -16 97 92 44 -90
6100i0j4N3J14J62k13j63l0J66J07M7l1k32k0M1K44o6Qj65j35K00R0J05j21j61
$$ -90 -104 -51 63 225 12 -151 -181 -15 92 139 108 -124 -144 -103 141 75 83 -82 -217 -17 73 178 57 -104
6124a04m3J21J40K2j4k13r6J05J81j5O1k52l6M6J66J49j00j04j57p1J19L12j08
$$ -104 -147 -26 114 136 122 -91 -187 -82 99 84 145 -107 -143 -97 69 218 118 14 -143 -214 -95 217 109
6147A09j11j53K7O6K74j90M8k38J8J34K26j29j06n8p2K10O0L7j34r2O5rQ4J90
$$ 109 -2 -155 -128 -62 212 22 70 -168 -150 -16 210 81 -25 -83 -155 55 115 152 18 -74 -9 -18 66 256
6171B56j53k80m1J44J53J02j41j2j90J8J77J76j5k25j05j0J53J40p3j50r7l2K57
$$ 256 103 -177 -218 -74 79 181 40 28 -162 -144 33 209 194 -31 -136 -146 7 147 74 -76 -173 -205 52
6194E2P5m0j61j19J02P6K08n8q9j76l2P2K12L5k38n2l1J68J42M9j20j85J5J11
$$ 52 127 87 -74 -193 -91 -15 193 135 46 -130 -162 -90 122 157 -81 -133 -164 4 146 195 75 -110 -95 16
6218A6J65P0j63j14j36P7J40J02o3k74L4Q4J12J23j08k45NJ71J03mrk37oJ6K36
$$ 16 181 251 88 -26 -162 -85 55 157 94 -180 -146 -62 50 173 65 -180 -175 -4 99 95 86 -151 -157 -141 95
6243I5M2p7r8Jj25J07J54J0j45j07Q5J27Q7m9o6k06R9k1R8J17j00q2p5J27J01
$$ 95 137 60 -38 -37 -162 -55 99 109 -36 -143 -58 69 156 107 41 -165 -66 -87 11 128 28 -54 -129 -2 99
6268I9L2j22m7p9R7M4J26j18j06j06J57j0N6R1k47M7L7J12M7m7o5j08m2J90J18
$$ 99 131 9 -38 -117 -20 24 150 32 -74 -180 -23 -33 23 114 -133 -86 -49 63 110 63 -2 -110 -152 38 156
6293A56n5j74o0J46l5J22o1L5j77n2J37O8q8K3m4Oj0P5J35j77r3J42M8l6K5K9
$$ 156 101 -73 -133 13 -22 100 39 74 -103 -155 -18 50 -38 -15 -59 -53 -63 12 147 -30 -123 19 67 31 56 85
6319H5j75q8J73NJ19r1m1l6K0M0N0j48M6m6J25M9j29O1K2j53k3J40O7j96K8O8
$$ 85 -90 -178 -5 0 119 28 -13 -49 -29 11 61 -87 -41 -87 38 87 -42 19 41 -112 -135 5 72 -124 -96 -28
6345b8PO9j0j9L9j66P6l0J31p6j2k8l2M9J06j15Ooj0J00m3jJ08j79K2P5O3J5p8
$$ -28 -21 48 38 19 58 -108 -32 -62 69 -7 -19 -47 -79 -30 76 -39 -33 -39 -49 51 8 7 115 -64 -42 33 96 111 33
6374C3j2J7p7O6M0L9p5l8m2J26j07l7O2O2n7KNj8l0O9m0J9J9k9m5J77j42o7O5
$$ 33 21 38 -39 27 67 106 31 -7 -49 77 -30 -67 -5 57 0 2 7 -11 -41 28 -12 7 26 -3 -48 129 -13 -80 -15
6403a5j16Q0J18m5p1RJ2m5K9J38n8j02K2O5N2k8Nj28P2L7M5o9J7pL5j40R6JL1
$$ -15 -131 -51 67 22 -49 -40 -28 -73 -44 94 36 -66 -44 21 73 45 50 -78 -6 31 76 7 24 17 52 -88 8 9 40
6432D0j5k29J78M3O6r0O8j47O6JJ36N9k37J5j2Q9J7J4l8j48K6J23J07k8j16o0
$$ 40 25 -204 -26 17 83 -7 61 -86 -20 -19 117 176 -61 -46 -58 31 48 62 24 -124 -98 25 132 104 -12 -72
6458g2o9K44n8J07n5k03MK7J26j6q5J4j08J07J66k1j25j42M4Q4%N7Lj51j9J15
$$ -72 -141 103 45 152 97 -106 -102 -75 51 35 -50 -36 -144 -37 129 108 -17 -159 -115 -31 -31 26 29 -122 -141 -26
6484b6J14J13j43q7p8K2J74p8J22k00j5N3J43J1r0M0j63P0J7J53j06l3j42O5J03
$$ -26 88 201 58 -29 -107 -85 89 11 133 -67 -82 -29 114 125 35 75 -88 -18 -1 152 46 13 -129 -64 39
6509C9k0J9j4j75K0J03J4Q8o5p4r0M5J91P5n0j43j06J05J5J71o1j53r1Q4O5J92
$$ 39 19 38 24 -151 -131 -28 -14 74 9 -65 -155 -110 81 156 106 -37 -143 -38 -23 148 87 -66 -157 -73 -8 184
6535A84j79j60k7J76N9M5j15n0r5P1J26O0l8j11pn6J57J41N3l10j01M7J84O8J1
$$ 184 5 -155 -182 -6 53 98 -17 -67 -162 -91 35 95 57 -54 -61 -117 40 181 234 -76 -177 -130 54 122 133
6560A33j75j51J15J18PR7j58k09O7J34J10P6n6k46k8J81J29J1j15j59m5J03J64
$$ 133 -42 -193 -78 40 47 144 -14 -223 -156 -22 88 164 108 -138 -166 15 144 155 40 -119 -164 -61 103
6583A03J0r5o8j27J45J02J14j42q0j78J09J61J04j4k06l5j00K20J81o0j89j88
$$ 103 113 18 -50 -177 -32 70 184 42 -38 -216 -107 54 158 144 -62 -97 -197 23 204 144 -45 -233
6605b33R6J69K16q9p2l23R5K39J62q1k70jj26K28J45jj11k74L1K25J76j31n4q8
$$ -233 -137 32 248 159 87 -236 -141 98 260 179 -91 -92 -218 10 155 154 43 -231 -200 25 201 70 16 -72
6629g2j33J81K33l8j27q9j30M8L04l1r5k76n6J63O2K20M3j89k36O6K56P1K6k89
$$ -72 -205 -24 209 171 44 -45 -175 -127 177 146 51 -225 -281 -118 -56 164 207 18 -218 -152 104 175 201 -88
6653h8r6P2J66J46m0j61j41N9J45R4Rk11j49N4K27J04j02j42p3QJ80J92r2j94
$$ -88 -184 -112 54 200 160 -1 -142 -83 62 156 165 -46 -195 -141 86 190 88 -54 -127 -119 61 253 161 -33
6677c3n3j00J10K63r7m4j14n2P1M2K24j83q5j25M6K35M9o6j59q4L9K10J10j48
$$ -33 -86 -186 -76 187 90 46 -68 -120 -49 -7 217 34 -51 -176 -130 105 154 88 -71 -155 -116 94 204 56
6701E6k12J7M6J41L9L4j33j95M9J60J69k7j39j27K6P8J21R2j66j29M3Q4Q1K7q3
$$ 56 -156 -139 -93 48 87 121 -12 -207 -158 2 171 144 5 -122 -96 -18 103 195 29 -100 -57 27 108 135 52
6726E2j83k5O6K37Pq4j09j01K5K01J07k22n6p3P3J57J14j48j25M9j37K37Q3j32
$$ 52 -131 -156 -90 147 154 70 -39 -140 -115 86 193 -29 -85 -158 -85 72 186 38 -87 -38 -175 62 145 13
6750A3rn4j42K16j0P4j24q9l3K06J57j58l2j74qJ60N0P7j70j03J13J24l3M9m5
$$ 13 4 -50 -192 24 14 88 -36 -125 -158 48 205 47 15 -159 -167 -7 43 120 -50 -153 -40 84 51 100 55
6775E5m8j10P1R4Q9k10JJ11j23J10J7P7j46j30R2P6R0q9Qj54K2P2J37j32rj4r0
$$ 55 7 -103 -32 62 151 -59 -58 53 -70 40 57 134 -12 -142 -50 26 116 27 35 -119 -97 -25 112 -20 -29 -43 -133
6802a33J41M0k0n6p1l4K08p5J10o2j35k7J53L7J9q4l9k3Q4Q0l7j83M6mP7k6m8
$$ -133 8 48 28 -28 -99 -133 75 0 110 48 -87 -114 39 76 95 11 -28 -51 33 113 76 -107 -61 -65 12 -14 -62
6829f2N4m4j7l1KJ40k7j7PL6m5Q9J1p9L9p2N5L4m4j43P0O7o5N0j17J64l6k2j3
$$ -62 -8 -52 -69 -100 -98 42 15 -2 5 41 -4 85 96 17 56 -16 39 73 29 -114 -44 23 -42 8 -109 55 19 -3 -16
6858a6rQ8m9l4Q2j33N5Pl0P9r0M0r4P1M8J21j06p7J1k8L9O9%p2k1l4J83J8r0p
$$ -16 -25 63 14 -20 62 -71 -16 -9 -39 40 -50 -10 -104 -33 15 136 30 -47 -36 -64 -25 44 44 -28 -49 -83 100 118 28 21
6888B1p3k6LO1L7MK3m4l4O1L2k2K2j22J02J3Kl6r3Ql7K13O0j45m6j6J6M0L5k2
$$ 21 -52 -78 -75 -14 23 27 50 6 -28 33 65 43 65 -57 45 58 60 24 -69 -61 -98 115 175 30 -16 -32 -16 24 59 37
6918C7k5j08L7OJ18N7n1o2p7p7J27J63j42q8qM5J16o6N0j23r8J34M1M8p0n9p7
$$ 37 12 -96 -59 -53 65 122 71 9 -68 -145 -18 145 3 -85 -93 -48 68 2 52 -71 -169 -35 6 54 -16 -75 -152
6945a52J25N4J15oj57j69J21K77j08Kj82k3rK22l5O2j80j48K13L2O9m7j25r9J
$$ -152 -27 27 142 136 -21 -190 -69 208 100 102 -80 -103 -112 110 75 137 -43 -191 22 54 123 76 -49 -148 -147
6970a47J42J36kj83rPL7J42L7j63r9K3M5J62N9j61j62L7m8K69qn6j60m8N4J21
$$ -147 -5 131 129 -54 -63 -56 -19 123 160 -3 -102 -79 -34 128 187 26 -136 -99 -147 122 114 58 -102 -150 -96 25
6996B5J60j04j78r8J41J89M0j45q2j04J8K45pP2k50j13J72J16P8r2o3k71J31K08
$$ 25 185 81 -97 -195 -54 135 175 30 -52 -156 -138 107 100 172 -78 -191 -19 97 175 83 20 -251 -120 88
7020H8R6N4k75k07J51J03J12P4j69k28O2J26J80j16q6j22q1K25J82L1j01l05J63
$$ 88 184 238 -37 -244 -93 10 122 196 27 -201 -139 -13 167 51 -35 -157 -238 -13 169 200 99 -206 -43
7043d3n0K49K2L2m07q1J88J68J39j45j64j40N0K60J35j19j36j77J40J01J11O8
$$ -43 -93 156 178 210 -197 -278 -90 78 217 72 -92 -232 -182 78 213 94 -42 -219 -79 22 133 201
7065B01k88j62J02J83K23j17k48k5o2J87J79l3j21j70JJ92J03L8k61p5j69K78
$$ 201 -87 -249 -147 36 259 142 -106 -131 -193 -6 173 140 19 -151 -150 42 145 183 -78 -153 -322 -44
7087d4K46P2k65j46l9J93J52J3K6k44k14J97L31r9m7l18oJ28J16J27q4k87N1L1
$$ -44 202 274 9 -137 -176 17 169 182 208 -36 -250 -53 278 179 132 -186 -192 -64 52 179 95 -192 -141 -110
7111a10J67J68j55j54r9O1K13J34j56j87j9MK42N7P5k38j82P4J46J34j11j19j29
$$ -110 57 225 70 -84 -183 -122 91 225 69 -118 -137 -133 109 166 241 3 -179 -105 41 175 64 -55 -184
7134a84J1J2L85N1k83j12k3J22J81nj93o6j63K70K46k7j68j37j38K1L15J87l08
$$ -184 -173 -161 224 275 -8 -120 -143 -21 160 155 -38 -104 -267 3 249 222 54 -83 -221 -200 115 302 -6
7157fj89Q7nK02J61j78j35j09K6J34J91p8j65j36J41J15K0N5k34j58J35J90J43
$$ -6 -195 -108 -113 89 250 72 -63 -172 -146 -12 179 101 -64 -200 -59 56 76 131 -103 -261 -126 64 207
7180B07j01j58m7rJ32J10L3k74q1O4J48K2J20n1j88j03J84K04Ok05n9l6M2O8J51
$$ 207 106 -52 -99 -108 24 134 167 -107 -188 -124 24 46 166 115 -73 -176 8 212 218 13 -46 -82 -40 28 179
7205A79j12j67m9L6K64Nj38k8j83R8J64J91j07k06L9o7R2P8J9j20o8JJ65Q5p2
$$ 179 67 -100 -149 -113 151 156 18 -10 -193 -95 69 260 153 -53 -14 -81 11 89 108 -12 -80 -79 86 171 99
7230I9j42rP2k2K5Q3j67p4M9J35RJ9o2r0m4O3J75N6j62j27P4J5K8N4O4j49l5k2
$$ 99 -43 -52 20 -2 23 106 -61 -135 -86 49 58 77 15 -75 -119 -56 119 175 13 -114 -40 -25 3 57 121 -28 -63 -85
7258h5J01qJ9lr3k9RK25o9j10rK8OPJ27p7j68L1J27k0M2M1P3k01l0K03nj48Po8
$$ -85 16 8 27 24 -69 -98 -89 136 67 -43 -52 -24 -18 -11 116 39 -129 -98 29 9 51 92 165 -36 -66 137 132 -16 -9 -77
7288g7J28n4P3j6r4l6P6K5K6l9j02J20L6N2j13l1q0P1k2J29r4nN3Ol3k8J51j19
$$ -77 51 -3 70 54 -40 -76 0 25 51 12 -90 30 66 118 5 -26 -106 -35 -57 72 -22 -27 26 32 -1 -29 122 3
7316CN5j47J11q0M9J47o8j01nR8l4j30P1kN7j5M4j9j07J26j00J50j40O7K4l9q5
$$ 3 58 -89 22 -58 -9 138 70 -31 -36 62 28 -102 -31 -33 24 9 53 34 -73 53 -47 103 -37 30 54 15 -70
7343g0Q0q3J3J13k2J26j91L0k9N6N6l5p0L4o9Q0K2L9p7m7K6N2m8LK5m4p2qJ12
$$ -70 10 -73 -60 53 31 157 -34 -4 -33 23 79 44 -26 8 -61 19 41 80 3 -44 -18 34 -14 -11 14 -30 -102 -110 2
7372BN2k8J6o9j9P0R9j8o6j9j04J07j5RJ9j10K4J07J1m5k3k5m3J22M6J5J21k97
$$ 2 54 26 42 -27 -46 24 123 105 39 20 -84 23 8 17 36 -74 -50 57 68 23 0 -25 -68 54 100 115 236 -61
7400f1K0QJ56J2p6j36rJK20j9m7j31j1m2J53P8j7j79r5J27N8Q3K1j32q2j8J90
$$ -61 -41 -33 123 135 59 -77 -86 -85 135 116 69 -62 -73 -115 38 116 99 -80 -175 -48 10 93 114 -18 -100 -118 72
7427G2J7Kj24j11P3P0K38j84j01r1n1K03J31P5j62k27M0O9J87K6j38r3j30J54
$$ 72 89 91 -33 -144 -71 -1 237 53 -48 -139 -190 13 144 219 57 -170 -130 -61 126 152 14 -79 -209 -55
7451e5K31l0j30r4q4R4K10K0q2k04k2K1K26J33j56j47j69R5K65rNn5j73o0K30
$$ -55 176 146 16 -78 -162 -68 142 162 80 -124 -146 -125 101 234 78 -69 -238 -143 122 113 118 63 -110 -170 60
7476F0J56J4k93j04J32M7J93n6j53j73j32L27J77j4j61j33j34K69J20L4k18k16
$$ 60 216 230 -63 -167 -35 12 205 149 -4 -177 -309 18 195 181 20 -113 -247 22 142 176 -42 -258
7498b58J15J85J17J16k04j31j55J38K81k0q9k13m6J1K18K42k04k41r0J90J68M2
$$ -258 -143 42 159 275 71 -60 -215 -77 204 184 95 -118 -164 -153 65 307 103 -138 -228 -38 130 172
7520A72q3j70j79J20K69R8L2l32j99J24K60N0M1k21k76J9K74K56j02j39j97RJ67
$$ 172 89 -81 -260 -140 129 227 259 -73 -272 -148 112 162 203 -18 -294 -275 -1 255 153 14 -183 -174 -7
7543gK79o1k11l73J81J81K18M2j85j80l7O2K68J70k63l03m0J10L34k9l9k74q0
$$ -7 272 211 0 -373 -192 -11 207 249 64 -116 -153 -91 177 347 84 -219 -259 -149 185 156 117 -157 -237
7566b37K03K34l0n5j97k10J13K59J81j10k76j53O7L65R3j19j18k88J11K55J87
$$ -237 -34 200 170 115 -82 -292 -179 80 261 151 -125 -278 -211 154 247 128 10 -278 -167 88 275
7587B75j10j63k22k7K91J21O6l85qN8R5J98J03k18k79l8K47J19O6j69k97N0J69
$$ 275 165 2 -220 -247 44 165 231 -154 -162 -104 -9 189 292 74 -205 -243 4 123 189 20 -277 -227 -58
7610e8K38Q5j90l15M7K6L61L3k74p4j90K33J16J31m5k97r1Q4K99J37j15k33j33
$$ -58 180 265 75 -240 -193 -167 194 227 -47 -121 -311 -78 38 169 124 -173 -264 -180 119 256 141 -92 -225
7633b25NL29J40r7k48p8M4J88J55m9k92j56R4K50K03r4j64j19j25J78K72p1k06
$$ -225 -220 109 249 152 -96 -174 -130 58 213 164 -128 -284 -190 60 263 169 5 -114 -239 -61 211 140 -66
7656f6j22n7K28L16j22j01k90p6L24K43r3j17k08l9M8K31Q8j44j30p6M3K40P2
$$ -66 -188 -245 -17 299 177 76 -214 -290 34 277 184 67 -141 -180 -132 99 187 43 -87 -163 -120 120 192
7679A92j18j99NL3J58Q9n1j42j48K1K63M6m8j58k05J87R4J71p4j25p1JP1J23K
$$ 192 74 -125 -120 -87 71 160 109 -33 -181 -160 103 149 101 -57 -262 -75 19 190 116 -9 -80 -79 -8 115 117
7704A17j62j33J20N9P6jq6j49N8Q7Q5L9j34m2L2jK18p7j03j27l1P5J18P9j28k3
$$ 117 -45 -178 -58 1 77 76 -10 -159 -101 -14 71 110 -24 -66 -34 -35 183 106 3 -124 -155 -80 38 117 -11 -34
7730c4p0N2J43Q2k05M1p0J02M9Q7p4j26m3O2M7R1j73k8O9j08K35m8ln8q2Q0J0
$$ -34 -104 -52 91 173 -32 9 -61 41 90 177 103 -23 -66 -4 43 134 -39 -67 2 -106 129 81 78 20 -62 18 28
7757B8J6M1M1q7r4R8p0N0l3j00N8K2K3J37j20q0R5j8J09Qj38L9l5ml2M3pK7Nl4
$$ 28 44 85 126 39 -55 43 -27 23 -10 -110 -52 -30 -7 130 10 -70 25 7 116 124 -14 25 -10 -14 -46 -3 -10 17 22 -12
7787a2J6J9Ml5r5J37r7J01J8j17K2M0n5J07M6j83OJ08q3K2J0J19o9p7j6N1qM1
$$ -12 4 23 27 -8 -103 34 -63 38 56 -61 -39 1 -54 53 99 -84 -78 30 -53 -31 -21 98 29 -48 -64 -13 -21 20
7815B0L6Rq6L8O3n3l1M4l8M4kj0O4m1m3j01R5J0Q0pj47KM0k5J15q7knj20J58l4
$$ 20 56 65 -21 17 80 27 -4 40 2 46 44 34 98 57 14 -87 8 18 98 91 -56 -54 -14 -39 76 -11 -13 -18 -138 20 -14
7846a4M6k3J4OJ3K6N8l5r1m3M2n5M7J6L0r7j2J38k8J14k19OML8J05Ro6j50N0N9
$$ -14 32 9 23 29 42 68 126 91 0 -43 -1 -56 -9 7 37 -60 -72 66 38 152 -67 -61 -57 -19 86 95 29 -121 -71 -12
7876a2j9J32j39l1J18n7N5j0p1m3N4o2J0kK03L3k35N0KM9O4q6p8J7J39J9j25M7
$$ -12 -31 101 -38 -69 49 -8 47 37 -34 -77 -23 -85 -75 -77 126 159 -76 -26 -24 25 89 3 -75 -58 81 100 -25 22
7904B2r0r1J99O0p8l4J1j16R0J94o4j49L3m4N0N4N9n5j49n1J27J15J7n8j03N6
$$ 22 -68 -159 40 100 22 -12 -1 -117 -27 167 103 -46 -13 -57 -7 47 106 51 -98 -149 -22 93 110 52 -51 5
7930EM4oL6p7n9n6o6J78R7qj52m1M0Q5J20P7j49k50J49j5J94o7j10qq6K22M6L9
$$ 5 49 43 79 2 -57 -113 -179 -1 96 88 -64 -105 -65 20 140 217 68 -182 -33 -48 146 79 -31 -39 -125 97 143 182
7958A82j86j62O8L2K87j54j00j00K7J70o4K33k03r0j31J54J36M7j52q7r7J26K06
$$ 182 -4 -166 -98 -66 221 67 -33 -133 -106 64 0 233 30 -60 -191 -37 99 146 -6 -93 -190 -64 142
7981A42N1n4k73r8J33J75J28o8k78m5K9K37N5k9k18Rl1J73O4Q4k17k22J48J17
$$ 142 193 139 -134 -232 -99 76 204 136 -142 -187 -158 79 134 105 -113 -104 -135 38 102 186 -31 -253 -105 12
8005A2J14k9m6k47l9K27K20j2j43k15J9J68K10Oj69k41j0N8K75qp3k06o1J28J37
$$ 12 126 97 51 -196 -235 -8 212 200 57 -158 -139 29 239 245 76 -165 -175 -117 158 150 77 -129 -190 -62 75
8030G5J77j85j47j65J01J93J52j53j96p4P7K30J71r4k72r6Q3K10J18q4j50j76
$$ 75 252 67 -80 -245 -144 49 201 48 -148 -222 -145 85 256 162 -110 -206 -123 87 205 121 -29 -205
8052b05O3K07J54o8k51n6K0J61J97j9j95k50PL64j2J32k34k37O5J88J12P4j12
$$ -205 -142 65 219 151 -100 -156 -136 25 222 203 8 -242 -235 129 117 249 15 -222 -157 31 143 217 105
8075A05k65o7J33K62Q2j28l78mK04K23j0o4k92K1jL46QK5l03j74J03J97J36m0
$$ 105 -160 -227 -94 168 250 122 -256 -260 -56 167 157 93 -199 -178 -179 167 175 200 -103 -277 -174 23 159 119
8099A19j38k10J54J06J99j20j22j24p5K88J06ok94j21O5J56K44m0k20k08P3J62
$$ 119 -19 -229 -75 31 230 110 -12 -136 -211 77 183 177 -117 -238 -173 -17 227 187 -33 -241 -168 -6
8121fK47j1k19k00J0R7K69l5j73j13o9J29K86K1j61k14j22J55K85l2l3j87j41
$$ -6 241 230 11 -189 -179 -82 187 152 -21 -134 -203 -74 212 233 72 -142 -264 -109 176 144 111 -76 -217
8144b17J37K01K9l4j26j94P4K21K7L4j76k60K76J33l6n8n6p0K5P3J29m3q1k39
$$ -217 -80 121 150 116 -10 -204 -130 91 118 152 -24 -284 -8 125 89 31 -25 -95 -70 3 132 89 8 -231
8168b31K41M9P3J4k11k7PR2J39Oj03j28K0L4J61L5j39j48o8J98K5J52j30
$$ -231 10 59 132 146 -65 -92 -85 7 146 152 49 -79 -59 -25 136 171 32 -116 -184 14 39 191 61
8191F1
$$ Imaginary data points
##PAGE= N=2
##DATA TABLE= (X++(I..I)), XYDATA
0@%%%nN%Kj0J6j6J6j8K6l2L2m0N2o1O9p7R3j12J24j38J59j82K05k30K58k90L27
$$ 0 0 0 0 -5 0 0 2 -8 8 -8 8 -10 16 -16 16 -24 28 -33 36 -41 52 -60 64 -74 85 -97 108 -122 136 -154 173
31A73l63M03m51N01n54O13o78P51q33R19j011J120j245J382j537J715j923K168
$$ 173 -190 213 -238 263 -291 322 -356 395 -438 481 -530 590 -655 727 -810 905 -1018 1150
49A150k457K809l248L809m553N578p070R419j3529K2000m5670K21537P62849p39337
$$ 1150 -1307 1502 -1746 2063 -2490 3088 -3982 5437 -8092 13908 -31762 189775 952624 213287
63B13287p02902M96510J52485n72393K67409P89277l74399q66327K61322O31389
$$ 213287 -489615 6895 159380 -413013 -145604 643673 269274 -597053 -335731 295658
73B95658j80176j79899L65673j06364o10138P4527N70853j3937k96095R9971J7399
$$ 295658 115482 -64417 301256 194892 -415246 -340719 230134 216197 -79898 20073 37472
84C7472k75460J50551M41370j44061m45254O5853K37173j04121j4201K16830j14259
$$ 37472 -237988 -87437 353933 209872 -235382 -169529 67644 -36477 -50678 166152 51893
95E1893k89917J78968L24570j43857k53298N7093L2389q4649J58969J98628j73661
$$ 51893 -238024 -59056 265514 121657 -131641 -74548 -42159 -126808 32161 230789 57128
106E7128k22393P8258Q6524o33J61717N3382l51832k15885K90688K36372p5343
$$ 57128 -165265 -87007 -483 -1116 160601 213983 -137849 -353734 -63046 173326 97983
117I7983L9883J9898l85784j88462N13241L51463l97279k97338K18298m490k08507
$$ 97983 137866 157764 -228020 -416482 96759 448222 50943 -246395 -28097 -32587 -241094
128b41094L34746M05003m03594n19196K58857L37651k01679k0102L37046j79628
$$ -241094 93652 498655 95061 -424135 -165278 172373 -29306 -49408 287638 108010
138A08010n12936J84799N41796r7400l45480J13395O1990l03467P3252M80822
$$ 108010 -404926 -220127 321669 224269 -121211 -7816 54174 -249293 -176041 304781
148C04781m4216m79496Q742L38079n0728j56627J72916L6973l07355l5795L22951
$$ 304781 260565 -218931 -210189 127890 77162 -79465 93451 130424 -176931 -212726 110225
159A10225N6160k16180N38J04164r5618l9474J72640K7132j91947n6432J05909
$$ 110225 166385 -49795 -49257 54907 -40711 -80185 92455 119587 -72360 -128792 -22883
170b2883M1573L1137O6447q8956j73012M5491J80441K5752p4176m0317q3116n0175
$$ -22883 18690 49827 116274 27318 -145694 -100203 80238 105990 31814 -8503 -91619 -141794
182a41794J60508J65654r6866j53371J1812R154k8543J29164J18661j68545j77910
$$ -141794 18714 184368 87502 -65869 -54057 -44903 -73446 55718 174379 5834 -172076
193a72076J15913J19313o7204M5062J25902j74851k47589J67762K76333j00450
$$ -172076 -56163 63150 -4054 41008 166910 -7941 -255530 -87768 188565 88115
203H8115j60512R9913q384j93051J15173L03364j17485l22896Q1909K17792j14356
$$ 88115 -72397 27516 19132 -173919 -58746 244618 127133 -195763 -113854 103938 -10418
214a0418q4587K13725J7119k86055o15K79713j9744k07305Q1294J21602j78299
$$ -10418 -95005 118720 135839 -150216 -150831 128882 109138 -98167 -16873 104729 -73570
225g3570q3372K43624Q4342k24788n8393J58186j3805r8477R9223O6149j62210
$$ -73570 -156942 86682 171024 -53764 -112157 46029 32224 -66253 32970 99119 -63091
236f3091o1158J72294N6906j25812j6767O9243m7301l7739R6173K6758j07733
$$ -63091 -124249 48045 104951 -20861 -37628 31615 -15686 -53425 42748 69506 -38227
247c8227k0323P8084o092l3783N5044J5417q5350j9982O6103Q077j8493L3210
$$ -38227 -58550 19534 13442 -20341 34703 50120 -35230 -55212 10891 18968 475 33685
259C3685k0893q4844K8584J09158j4838p9147J8283J7203n8754K7900J03522m3165
$$ 33685 12792 -72052 -43468 65690 50852 -28295 -10012 7191 -51563 -23663 79859 36694
271C6694j15155N0324R0048p0437m7797J03600J3478j27758Q994J21167l9398
$$ 36694 -78461 -28137 61911 -8526 -56323 47277 60755 -67003 -58009 63158 23760
282B3760r2517Q6587O7910j28049n0331J45617K7589j38737O874J18004m9287
$$ 23760 -68757 17830 85740 -42309 -92640 52977 80566 -58171 -51297 66707 17420
293A7420r3264Q8275O8729j12234l8430J22677L485j25318K4560J15736m1011
$$ 17420 -75844 12431 81160 -31074 -69504 53173 56658 -68660 -44100 71636 30625
304C0625q6523N3913M2784p2757k503R2017k0477r7214K7545P7790l3735m2596
$$ 30625 -55898 -1985 40799 -31958 -34461 57556 37079 -60135 -32590 45200 11465 -31131
316c1131M7851J1236o2734M144O0856j1664l8203K5837J0665m8260K875O2812
$$ -31131 16720 27956 -34778 -30634 30222 18558 -19645 6192 16857 -31403 -28528 34284
328C4284N50n2221n877J5785p020K2683L9386l4155o3220J9348N3734m067j5779
$$ 34284 34834 -17387 -23264 -7479 -14499 8184 47570 13415 -49805 -30457 23277 19210 3431
341C431R762k4944l4806M2333N7431l0448m6320J7718N757l2894K7505O3943k9410
$$ 3431 13193 -11751 -46557 -4224 53207 22759 -23561 -5843 -86 -32980 -5475 58468 29058
354B9058p6540J0739N0755l433J803L3709l7018q4474K3419J02075J1555o5193
$$ 29058 -47482 -36743 14012 10579 12382 46091 9073 -75401 -51982 50093 61648 -3545
366c545j7742P892j9242K4152P0936j0809r2273k5592N7102K8368l785J7939r238
$$ -3545 -21287 -13395 -32637 -8485 62451 51642 -40631 -66223 -9121 19247 15462 33401 24163
379B4163o4634k0601O5165M9099k2160l6227k3446k0039K2122P1009K8232o1332
$$ 24163 -40471 -61072 4093 53192 31032 -5195 -28641 -48680 -26558 44451 72683 11351
391A1351o6527L690M6278L9715J2933l1257n9346j8357N2675O1281M231m4573
$$ 11351 -55176 -51486 -5208 34507 47440 16183 -43163 -61520 -8845 52436 56667 12094
403A2094m7212j6195K7095N0383K6987k4887n3714l0975K5790O2442L5714l0399
$$ 12094 -35118 -51313 -24218 26165 53152 28265 -25449 -56424 -30634 31808 67522 37123
415C7123o4994l7636J9102O0949N4525j1104p7543n8030L1403P8418L6896k7468
$$ 37123 -27871 -65507 -46405 14544 69069 57965 -19578 -77608 -46205 32213 69109 41641
427D1641n7528m8969N59O6032P0179p435p1966n0657J0145M4471M6364J6959m3168
$$ 41641 -15887 -64856 -64297 1735 71914 64479 -7487 -58144 -47999 -3528 42836 59795 16627
440A6627p5198k1784O3652P7467J2977n2337o6195k7346L9797P7450L2603n4778
$$ 16627 -58571 -80355 -16703 60764 73741 21404 -44791 -72137 -32340 45110 77713 22935
452B2935q0545j6284N6947O7042K2200l7845p2205m1535L9884Q1321L0524m5523
$$ 22935 -57610 -73894 -16947 50095 72295 34450 -37755 -79290 -39406 41915 72439 26916
464B6916o1979k4728K1700O0096N7239j5947r0633o2691L6519Q1327M0851j7012
$$ 26916 -35063 -59791 -38091 22005 79244 63297 -27336 -90027 -53508 27819 68670 51658
476E1658n6600o4441l252Q7337Q2134k9856r8865n0354K6231N8179N7925J6620
$$ 51658 -4942 -69383 -72635 14702 96836 66980 -31885 -82239 -56008 2171 60096 76716
488G6716o3801q7981j499Q3886O1291j2806n1334n5703k8276M6154R4841L3609
$$ 76716 12915 -75066 -76565 7321 68612 55806 4472 -51231 -79507 -33353 61488 95097
500I5097o9826q4557j5202M6608O5747L9357l6128r2745m2527O4125R0023K0016
$$ 95097 25271 -59286 -74488 -27880 37867 77224 41096 -51649 -94176 -30051 59972 79988
512G9988m8957o6207m0331K5337Q3662N3521m5199q6996k8759M2965O1813L9052
$$ 79988 31031 -35176 -75507 -50170 33492 87013 41814 -45182 -73941 -30976 30837 69889
524F9889j1836p1559p1210J4768R0895O2189k7974p4790m8071J2413O4301O7282
$$ 69889 58053 -13506 -84716 -69948 20947 83136 55162 -19628 -67699 -55286 9015 76297
536G6297j046q4490q2001J4367R1015O5155j6406o5398n7166p808N6774P7943
$$ 76297 75251 -9239 -91240 -76873 14142 79297 62891 -2507 -59673 -67481 -10707 67236
548F7236J1560p7860p8850M540O6369O0696J8889l7286q0144m5749N4323R5710
$$ 67236 78796 936 -77914 -73374 -7005 53691 72580 35294 -44850 -90599 -36276 59434
560E9434K2286o2885o7847k2254K9865P4921N9614l7375j03161m1798N7922O9714
$$ 59434 81720 18835 -49012 -71266 -41401 33520 93134 55759 -47402 -89200 -31278 38436
572C8436J9742k0115n1663n7000J2356Q9593N5646m5727p2326k3188J3041L5823
$$ 38436 58178 38063 -13600 -70600 -58244 31349 86995 41268 -31058 -54246 -41205 -5382
584e382N8688J7683p3735p6575K6988Q2452L1209k4114l7183m7369k3857N8577
$$ -5382 53306 70989 -2746 -79321 -52333 30119 61328 37214 31 -47338 -71195 -12618
596a2618Q7849n984q9290m7615L1160M5558L1373J4295l9783p8266j4354P9574
$$ -12618 75231 69247 -20043 -67658 -36498 9060 40433 54728 14945 -63321 -77675 1899
608A899O7581j7190n3034l6371j6749K3090P0761M0305n6746q6216j0197N8941
$$ 1899 69480 52290 -744 -37115 -53864 -30774 39987 80292 23546 -62670 -72867 -13926
620a3926N5410J9849k1583o4011n3458K9719Q6929L8175m7548o4858k0455K2918
$$ -13926 41484 61333 39750 -24261 -77719 -48000 38929 77104 29556 -35302 -55757 -32839
632c2839M6420M3945l683o2442n6234J6545O3522L5556j5388l6292l3492j2064
$$ -32839 13581 57526 53843 -8599 -64833 -48288 15234 50790 35402 -890 -34382 -46446
644d6446L4319O0241J0986o0065n2169J5361M2429J9936N263j0078m3684l0335
$$ -46446 -12127 48114 59100 -965 -53134 -37773 4656 24592 29855 19777 -23907 -54242
656e4242M4975O3620j5415o1259j2085K3246L947J3474L5306j7102o9019o534
$$ -54242 -9267 54353 38938 -22321 -34406 -11160 -7213 6261 41567 24465 -44554 -51088
668e1088O9364K6558l7931j4170M881l1028n279P2699L8446p1218o1001L3980
$$ -51088 18276 44834 6903 -7267 -2386 -33414 -38693 34006 72452 1234 -59767 -25787
680b5787L8409n495J7627J9046o0361o1812N4485Q3952j6735n2662J563l516l2552
$$ -25787 12622 7127 24754 43800 -16561 -78373 -23888 60064 43329 -9333 -7770 -11286 -43838
693d3838L1360P5669j4691q3948j2420M7891O575m592L5919k937p3880k3220O8524
$$ -43838 -12478 63191 48500 -35448 -47868 23 6598 2006 37925 34988 -38892 -62112 6412
706F412L8926l3733j7219J0909k3258j8938M6995M0548m0419m7177J9822K7996
$$ 6412 45338 11605 -5614 5295 -17963 -36901 10094 50642 10223 -36954 -17132 10864
718A0864j2588k575K3801o828l5291K797L3884J461k5120R61J7371p327j3921
$$ 10864 -1724 -4299 19502 12674 -22617 -19820 14064 15525 -9595 -8634 8737 1410 -12511
731a2511J3280J5150j6878j8097J8675K2821j5743k5398Q501J8137n864l816J7227
$$ -12511 769 15919 -959 -19056 -381 22440 6697 -18701 -10200 7937 2073 -1743 15484
744A5484l358l4303k908M0910J2778l1668j0332J7606q264j6414K7953K8116l0493
$$ 15484 12126 -22177 -25085 15825 28603 -3065 -13397 4209 -4055 -20469 7484 35600 5107
757E107l3766K0917K0006j9817Q28L2918j0288m5832O166M2328l597k5806J4981
$$ 5107 -28659 -7742 12264 -7553 -6725 26193 15905 -29927 -23761 18567 14970 -10836 4145
770D145J2461l2994j2226M0090J3814l3359l658K7479j3483l1814K1613L6869
$$ 4145 16606 -16388 -28614 11476 25290 -8069 -11727 15752 2269 -29545 -7932 28937
782B8937j6550k7975J2433P401k2422N843L9855k88m2671j0778K5506N698p337
$$ 28937 12387 -15588 -3155 4246 -18176 -12333 27522 27234 -15437 -26215 -709 4989 -2348
795b348J6015R829l0757k6750K1567L3008q55j5285m541q066j4080J0980L4969
$$ -2348 13667 23496 -7261 -34011 -12444 20564 19709 4424 -117 -8183 -22263 -11283 23686
808B3686R263l3577k7896J1770K2276M058J373M627j8021k7508J2501M0229K554
$$ 23686 32949 -628 -28524 -16754 5522 9580 10953 15580 -2441 -29949 -17448 22781 25335
821B5335l2394o556J5489p991p704K8087J3967l8183k2700L3579K1153k3975o687
$$ 25335 -7059 -13615 1874 -6117 -13821 14266 28233 -9950 -32650 929 22082 -1893 -8580
834h580J9218j4081k3494L1026L4225l4833l9665K6170K8891j7706k868K2984
$$ -8580 10638 -3443 -26937 4089 38314 3481 -36184 -10014 18877 1171 -1697 21287
846B1287k2266m1971K9054N6511j6095m5118O208J1602k0804J4887N2364j2009
$$ 21287 -979 -42950 -13896 42615 26520 -18598 -12390 -788 -21592 -6705 45659 33650
858C3650o8185q506M8639J3225j0444J5671q347n6024r612O6520L6285l5925l1389
$$ 33650 -34535 -43041 5598 18823 8379 24050 15703 -40321 -49933 16587 52872 16947 -14442
871a4442j289r052N817M7118K2064m7346m5634J3132L1664J4905J0100o505l7259
$$ -14442 -15731 -24783 -18966 28152 50216 2870 -42764 -29632 2032 16937 27037 20532 -16727
884a6727k4890K5022L9145Q196j7712k6014j9019J1093L6192J7584j8528k6479
$$ -16727 -41617 -16595 22550 30746 13034 -12980 -31999 -20906 15286 32870 14342 -12137
896a2137j3965L879K8507K9063j4345m1525r816K3463J6591R085O184k4775l9498
$$ -12137 -26102 -22223 6284 35347 21002 -20523 -30339 -6876 9715 18800 24984 209 -39289
909c9289J1210N1005J2254k9314j5096m599j2646J9149M9327j733n9548k4335
$$ -39289 -28079 22926 35180 5866 -9230 -13829 -26475 -7326 42001 40268 -19280 -43615
921d3615L1261K1058O759J8189j4975n9032j1372O3495L6802k9723k5566n905
$$ -43615 -12354 8704 15463 33652 18677 -40355 -51727 11768 48570 18847 -6719 -12624
933a2624k1424N013O1437K7603n7874m8469K0917K6026N016K3492Q067n5568m3078
$$ -12624 -34048 -29035 32402 60005 2131 -46338 -25421 605 5621 29113 37180 -18388 -61466
946f1466M3563N6734p288k6898r236k1814j2663M5812M7848k8345n5876n356K3406
$$ -61466 -17903 38831 31543 4645 -4591 -26405 -39068 6744 54592 26247 -29629 -34985 -11579
959a1579J6435K2778R670m1267m4074J9147M7253J2732j1143j6394l0980j3438
$$ -11579 4856 27634 37304 -3963 -48037 -28890 18363 31095 19952 3558 -27422 -40860
971d0860M2093M5798j6157m2938j4656K384J1554L8284K4696m0636n4672Q322
$$ -40860 1233 47031 30874 -12064 -26720 -24336 -12782 25502 50198 9562 -45110 -36788
983c6788M3109J8809J375q596l8224l0771L3962N6639O94l8173k1865p950L342
$$ -36788 6321 25130 26505 17909 -20315 -51086 -17124 39515 40209 2036 -19829 -27779 -24437
996b4437L6870L5641k6002n3545p000K9474K1042J5132L449l7973m2125K0858
$$ -24437 12433 48074 22072 -31473 -38473 -8999 12043 27175 30624 -7349 -49474 -28616
1008b8616N4080J1258k5345j9006j7446r248L5500M7662j4687n6062j7008K3608
$$ -28616 25464 36722 11377 -7629 -25075 -34323 1177 48839 34152 -21910 -38918 -15310
1020a5310J9861J7904J3235k8654m9040L550N1025K5478j5323k1711k2986j5744
$$ -15310 4551 22455 35690 7036 -42004 -38454 12571 38049 22726 1015 -21971 -37715
1032c7715K5512M8855N408m1955l0869J964J8585L0829K2074k5452n0438q915
$$ -37715 -12203 36652 42060 105 -30764 -28800 -10215 20614 42688 17236 -33202 -42117
1044d2117L6153K9945O217j0508l3185l0750K0011N0642J2635l0189k5128r457
$$ -42117 -5964 23981 30198 19690 -13495 -44245 -24234 26408 39043 8854 -16274 -25731
1056b5731M43K8671L8388j0720n1801j9414K6904K4706R875L709k2092l9632J343
$$ -25731 -25288 3383 41771 31051 -20750 -40164 -13260 11446 21321 25030 2938 -36694 -35351
1069c5351M8471K6734k1750k8086j2713k652K0205L7063L375m0859k9315J2805
$$ -35351 13120 39854 18104 -9982 -22695 -25347 -5142 31921 35296 -5563 -34878 -22073
1081b2073K6252J8315O413k0337l7145o573L4932K9033l810j9272k2164j4744
$$ -22073 4179 22494 28907 8570 -28575 -35148 -216 28817 25007 5735 -16429 -31173
1093c1173J7158L9624J0707l1868k8974l54J4834K1951J9914j1674l9942j6675
$$ -31173 -14015 25609 36316 4448 -24526 -24880 -10046 11905 31819 20145 -19797 -36472
1105c6472K6372K9404M230j1498j9914k0629O260L4564J9885j7451k7270j1209
$$ -36472 -10100 19304 23534 12036 -7878 -28507 -22247 12317 32202 14751 -12519 -23728
1117b3728N870K1110K3165m446l1408j8655J2246K1739J4098J840k0264k8666
$$ -23728 -17858 3252 26417 21971 -9437 -28092 -15846 5893 19991 21831 1567 -27099
1129b7099J626L2722J8816j1988j7205j0758o477J3298L0420N482l1568k2999
$$ -27099 -25473 7249 26065 14077 -3128 -13886 -20363 -7065 23355 28837 -2731 -25730
1141b5730J0607J7550Q432P165n479k6619j3960K3359K7263l587j8796j1077m880
$$ -25730 -15123 2427 10859 18024 12545 -14074 -28034 -4675 22588 19001 205 -10872 -15752
1154a5752M430K0648J4776j4290k4961m483J4166J4640O504n886j7804j1534R704
$$ -15752 -11322 9326 24102 9812 -15149 -19632 -5466 9174 15678 9792 -8012 -19546 -9842
1167i842J8501O879p050j3404j0609L429J7165J1210p825j4521o552K871J0437
$$ -9842 8659 15538 8488 -4916 -15525 -12096 5069 16279 8454 -6067 -12619 -9748 689
1180F89J2616M11j6181j3100N506J3919O755j825p810j0801k095J2248J2331k442
$$ 689 13305 13716 -2465 -15565 -10059 3860 10615 8790 980 -9821 -11916 332 12663 10221
1194A0221j1411p108N17O102Q980L327q157j0299l79P880O228J176l775p328m604
$$ 10221 -1190 -8298 -7781 -1679 7301 10628 2471 -7828 -8207 -327 5901 7077 3302 -4026 -8630
1209h630N161R391J880o620n626l93K393L952L896j351p406l730N273N897j454
$$ -8630 -3469 5922 7802 1182 -4444 -4837 -2444 1508 5404 4053 -3353 -7083 -1810 4087 2633
1224B633l221k09p96k077K888N004k241n709J416M280j898k216L701R96n481j14
$$ 2633 -588 -797 -1593 -3670 -782 4222 1981 -3728 -2312 1968 70 -2146 1555 2551 -2930 -3044
1240c044O219n81o098J728N580k584l953L394J903m978M63O699j289p832P56O714
$$ -3044 3175 2594 -3504 -1776 3804 1220 -2733 661 2564 -2414 -1951 4748 3459 -4373 -3617 3097
1256C097m84k738K166r41n930J611Q414M26o740k720J382R80L571M104l661p477
$$ 3097 2613 -125 2041 1100 -4830 -3219 5195 5621 -1119 -3839 -2457 -1477 2094 6198 2537 -4940
1272d940q76M244L972L593j128r723n952Q302R144j225k964k127q869l686J5590
$$ -4940 -5816 -1572 2400 5993 4865 -4858 -10810 -2508 6636 5411 2447 320 -8549 -12235 3355
1287C355J3232j1785j5163L208N126j450R648J0893j5432k1771R089K1300j228
$$ 3355 16587 4802 -10361 -7153 -2027 -3477 6171 17064 1632 -20139 -11050 10250 9022
1300I022p482L616p121j6429J0299K7585k583k4128l411Q641l162M573J8937n195
$$ 9022 1540 5156 -1965 -18394 -8095 19490 16907 -7221 -10632 -1991 -5153 -580 18357 13162
1314A3162k9127l435K4181P410q892J531k614j8289J339K8287P769k3327j1222
$$ 13162 -15965 -19400 4781 12191 3299 4830 2216 -16073 -14734 13553 21322 -2005 -13227
1327a3227Q304J214J734J6307J498k6554j2564K0265J6958m404n670n435j3569
$$ -13227 -4923 -3709 -1975 14332 15830 -10724 -23288 -3023 13935 9531 3861 -1574 -15143
1340a5143j029K2911J5985j3102k0530n834O785J4145J3586l210j9814j3868M478
$$ -15143 -16172 6739 22724 9622 -10908 -16742 -9957 4188 17774 14564 -5250 -19118 -14640
1353a4640J6275J7177J336k2357k0857P572K1026Q651m6n670k1343j5613K2586
$$ -14640 1635 18812 20148 -2209 -23066 -15494 5532 14183 14137 8467 -12876 -28489 -5903
1366e903L2862n620k6621o739J963k828J7296K6472j4751m0433j500L0025Q150
$$ -5903 26959 21339 -5282 -12021 -10058 -12886 4410 30882 16131 -24302 -25802 4223 12373
1379A2373n270O193j0484l0499N529M1821Q623k9790j1228P032o727N093L0904
$$ 12373 7103 13296 2812 -27687 -22158 19663 28286 -1504 -12732 -5700 -12427 -7334 23570
1392B3570J661m1126j4538K8922J5033p590M626k221l0006p107L9409K1406k6218
$$ 23570 25231 -15895 -30433 -1511 13522 5932 10558 8337 -21669 -28776 10633 32039 5821
1405E821k0415N757p11J580K6239J1180l3894k7555J7843K5482L166j506o307
$$ 5821 -14594 -8837 -9548 -7968 18271 29451 -4443 -31998 -14155 11327 14493 12987 6680
1418F680k2846j0596K5473K7177n102k1523j5948n105J4485K7144O656k2984k0827
$$ 6680 -16166 -26762 -1289 25888 20786 -737 -16685 -21790 -7305 19839 26495 3511 -17316
1431a7316k092R251K0687J8852j4465l6280o892K5139J5889J722J836j6306l0634
$$ -17316 -19408 -10157 10530 29382 14917 -21363 -28255 -3116 12773 14495 16331 25 -30609
1444c0609O015M2141J2631k6619j4131J703q434P677L5877M434m3612j9376K6752
$$ -30609 -24594 17547 30178 3559 -10572 -8869 -17303 -9626 26251 30685 -12927 -32303 -5551
1457e551J5221n345J0037O43l5571j2998M1166K4903k6364j7711Q761p742o549
$$ -5551 9670 4325 14362 15005 -20566 -33564 7602 32505 6141 -11570 -2809 -10551 -17100
1470a7100L2641K0351l8067l1324K4250K2919r119K538J0096k6943k5976L1106
$$ -17100 15541 35892 -2175 -33499 -9249 13670 4551 7089 17185 -9758 -35734 -4628
1482d628L8357j5752k8735J555J126p015K1345K6878k1148l8836L258K6445Q815
$$ -4628 33729 17977 -10758 -9203 -8077 -15092 6253 33131 11983 -26853 -23595 2850 11665
1495A1665K050J306k0755k4012J3822L2877O299j6012j4330j1482j70K3121K1649
$$ 11665 13715 15021 -5734 -29746 -15924 16953 23252 7240 -7090 -18572 -18742 4379 26028
1508B6028j0171k4593j0037L381J3092K1490M128k6332k0839J0691J6948O089
$$ 26028 15857 -8736 -18773 -15392 -2300 19190 23318 -3014 -23853 -13162 3786 9875
1520I875N750n084k6811j1066K8176K2909j2811j4748J01p918l327K6037J7699
$$ 9875 15625 10541 -16270 -27336 840 23749 10938 -3810 -3709 -11627 -14954 11083 28782
1533B8782k6598k5570J3857J5462l859O951Q571k4587k2871K4712K9690j3055
$$ 28782 2184 -23386 -9529 5933 2074 9025 17596 -6991 -29862 -5150 24540 11485
1545A1485j8160N663m735j3116K1444K8532k0716l4906Q774K1966l904J134J4825
$$ 11485 -6675 -1012 -5747 -18863 2581 31113 10397 -24509 -15735 6231 2327 3461 18286
1558A8286j5273l1858J1525L6458K16k1615j736l60j3113R939L0582k194l1840
$$ 18286 3013 -28845 -17320 19138 19354 -2261 -3997 -4357 -17470 -7531 23051 20857 -10983
1571a0983q646J5306O140L269J0572p437k5188l143K3268J2242o128o710q427
$$ -10983 -19629 -4323 1817 5086 15658 8221 -16967 -20110 3158 15400 9272 2562 -5865
1584e865r578Q262K0122K883j4831r399j265K925J2214J1225r638j8229o89J0337
$$ -5865 -15443 -7181 12941 15824 993 -8406 -9671 -6746 5468 16693 7055 -11174 -11863 -1526
1598a526N602M764J678j4093j3477J0492J7466j507q351j346o351o397J4164J6776
$$ -1526 4076 8840 10518 -3575 -17052 -6560 10906 9399 1048 -298 -6649 -13046 1118 17894
1612A7894j0988j8713L646Q801k803N052J1009j1591k0569Q173K0911k289j0403
$$ 17894 6906 -11807 -8161 640 -2163 2889 13898 2307 -18262 -10089 10822 8533 -1870
1625a870L803k703j2921P845K1794m015k0913l54J0252k745Q16J3398m077k1243
$$ -1870 1933 -770 -13691 -5846 15948 11933 -8980 -9334 918 -1827 -1011 12387 8310 -12933
1639a2933m2J9093L124r160J930L40j2241P41J8612L651j5315n054O318j350K10
$$ -12933 -12975 6118 9242 82 2012 2352 -9889 -9148 9464 13115 -2200 -7254 -936 -2286 -2076
1654b076J0513N38j4814m903J0822M808k735J337j369r248k27J1389L290p109
$$ -2076 8437 8975 -5839 -10742 80 4888 2153 3490 2121 -7127 -7354 4035 7325 216
1668B16k271N77l512K490R108j155r700n67N299j272l00O343k071j0010J388J0025
$$ 216 -2055 -1478 -4990 -2500 6608 5453 -4247 -4814 485 -787 -1087 5256 3185 -6825 -5437 4588
1684D588j101o081L531J756p830N15J0820p13j0402J731P350m384l772P894J511
$$ 4588 3487 -2594 937 2693 -5137 -4622 6198 5485 -4917 -3186 4164 -220 -3992 3902 5413
1699E413j0442j65J0640j614q497M500N891p880l724R973J673j0320O49R386l682
$$ 5413 -5029 -5194 5446 3832 -4665 -165 5726 -2154 -5878 4095 5768 -4552 -3903 5483 1801
1714A801p683O285N788q472l151R335L56r641K034Q645l766o518N541L549p747
$$ 1801 -5882 403 6191 -2281 -5432 3903 4259 -5382 -3348 5297 1531 -4987 554 4103 -3644
1729c644r36R170l76q714J109O117k900k534N885M98q319n22P874R91m623R27
$$ -3644 -4580 4590 4214 -4500 -3391 2726 -174 -2708 3177 3675 -4644 -5166 2708 3699 -924 3
1745CJ117m763L0P681J477o681k488K570Q4J282M702j049p464j930N382L132l03
$$ 3 1120 -3643 -3613 4068 5545 -1136 -3624 -1054 -970 312 5014 3965 -3499 -5429 -47 3085 2782
1762B782J58l150n438J751P839K002m600l146j436j090M182P112j758q690k699
$$ 2782 2940 -210 -5648 -3897 3942 5944 1344 -1802 -3238 -4328 -146 6966 5208 -3482 -6181
1777f181M149L027K213K233m494q509O89R347M081l429l757l176l158M514R555
$$ -6181 -2032 995 3208 5441 947 -7562 -6873 2474 6555 3126 -631 -3807 -6965 -2451 7104
1792G104N38r424n282K570L665M279M042m066j0628j960R429O499j500l494m578
$$ 7104 7642 -1782 -7064 -4494 -829 3450 7492 3426 -7202 -9162 267 6766 5266 1772 -2806
$$ [...]
8191a35
##END NTUPLES=NMR FID
##END=
