##TITLE=1H_1PBP507
 CDCl3, 8 sc, 
 5.7.2019
##JCAMPDX= 6.0         $$ Bruker NMR JCAMP-DX V2.0
##DATA TYPE= NMR FID
##DATA CLASS= NTUPLES
##ORIGIN= UXNMR, Bruker Analytische Messtechnik GmbH
##OWNER= root
$$ XWIN-NMR		Version 3.5
$$ Fri Jul  5 16:30:46 2019 Russian Standard Time (UT+4h)  she@DPX200
##.OBSERVE FREQUENCY= 200.13155
##.OBSERVE NUCLEUS= ^1H
##.DELAY= (6, 6)
##.ACQUISITION MODE= SIMULTANEOUS
##.ACQUISITION SCHEME= undefined
##.AVERAGES= 8
##.DIGITISER RES= 18
##SPECTROMETER/DATA SYSTEM= spect
##.PULSE SEQUENCE= zg30
##.SOLVENT NAME= CDCl3
##.SHIFT REFERENCE= (INTERNAL, CDCl3, 0, 15.7039)
##AUDIT TRAIL= $$ (NUMBER, WHEN, WHO, WHERE, WHAT)
$$ ##TITLE= Audit trail, XWIN-NMR		Version 3.5
$$ ##JCAMPDX= 5.01
$$ ##ORIGIN= Bruker BioSpin GmbH
$$ ##OWNER= she
$$ F:/spectra/data/she/nmr/H-F/1/audita.txt
$$ ##AUDIT TRAIL=  $$ (NUMBER, WHEN, WHO, WHERE, WHAT)
(   1,<2019-07-05 16:29:58.75 +0400>,<she>,<DPX200>,
      <created by zg, POWCHK disabled, PULCHK disabled
       configuration hash MD5:
       00 E9 B6 7A A2 85 ED C7 34 08 36 98 17 FE 4E 26
       data hash MD5: 16K
       29 9D 5A B3 0B FF FA EF E3 38 43 2D 3D 91 A1 E9>)
$$ ##END=
$$ 
$$ hash MD5
$$ B2 68 E9 01 53 AF BE 21 C4 37 8C 57 96 1E F7 5C
##$RELAX= 
##$RELAX= 
##$RELAX= 
##$RELAX= 
##$RELAX= 
##$RELAX= 
$$ Bruker specific parameters
$$ --------------------------
##$DU= <F:/spectra>
##$EXPNO= 1
##$NAME= <H-F>
##$PROCNO= 1
##$TYPE= <nmr>
##$USER= <she>
##$AMP= (0..31)
100 100 100 100 100 100 100 100 100 100 100 100 100 100 100 100 100 100 
100 100 100 100 100 100 100 100 100 100 100 100 100 100 
##$AQSEQ= 0
##$AQ_mod= 1
##$AUNM= <au_zg>
##$AUTOPOS= <>
##$BF1= 200.13
##$BF2= 200.13
##$BF3= 200.13
##$BF4= 200.13
##$BF5= 200.13
##$BF6= 200.13
##$BF7= 200.13
##$BF8= 200.13
##$BYTORDA= 1
##$CFDGTYP= 0
##$CFRGTYP= 5
##$CHEMSTR= <none>
##$CNST= (0..31)
1 1 145 1 1 1 1 1 1 1 1 1 1 1 1 1 1 1 1 1 1 1 1 1 1 1 1 1 1 1 1 1 
##$CPDPRG= <>
##$CPDPRG1= <>
##$CPDPRG2= <>
##$CPDPRG3= <>
##$CPDPRG4= <mlev>
##$CPDPRG5= <mlev>
##$CPDPRG6= <mlev>
##$CPDPRG7= <mlev>
##$CPDPRG8= <mlev>
##$CPDPRGB= <>
##$CPDPRGT= <>
##$D= (0..31)
0 1.2 0 0 0 0 0 0 0 0 0 0.03 0 0 0 0 0 0 0 0 0 0 0 0 0 0 0 0 0 0 0 0 
##$DATE= 1562329798
##$DBL= (0..7)
120 120 120 120 120 120 120 120 
##$DBP= (0..7)
150 150 150 150 150 150 150 150 
##$DBP07= 0
##$DBPNAM0= <>
##$DBPNAM1= <>
##$DBPNAM2= <>
##$DBPNAM3= <>
##$DBPNAM4= <>
##$DBPNAM5= <>
##$DBPNAM6= <>
##$DBPNAM7= <>
##$DBPOAL= (0..7)
0.5 0.5 0.5 0.5 0.5 0.5 0.5 0.5 
##$DBPOFFS= (0..7)
0 0 0 0 0 0 0 0 
##$DE= 6
##$DECBNUC= <off>
##$DECIM= 24
##$DECNUC= <off>
##$DECSTAT= 4
##$DIGMOD= 1
##$DIGTYP= 9
##$DL= (0..7)
0 120 120 120 120 120 120 120 
##$DP= (0..7)
150 150 150 150 150 150 150 150 
##$DP07= 0
##$DPNAME0= <>
##$DPNAME1= <>
##$DPNAME2= <>
##$DPNAME3= <>
##$DPNAME4= <>
##$DPNAME5= <>
##$DPNAME6= <>
##$DPNAME7= <>
##$DPOAL= (0..7)
0.5 0.5 0.5 0.5 0.5 0.5 0.5 0.5 
##$DPOFFS= (0..7)
0 0 0 0 0 0 0 0 
##$DQDMODE= 0
##$DR= 18
##$DS= 0
##$DSLIST= <SSSSSSSSSSSSSSS>
##$DSPFIRM= 0
$$ [...]
##$SUBNAM2= <"">
##$SUBNAM3= <"">
##$SUBNAM4= <"">
##$SUBNAM5= <"">
##$SUBNAM6= <"">
##$SUBNAM7= <"">
##$SUBNAM8= <"">
##$SUBNAM9= <"">
##$SW= 24.9336996594482
##$SWIBOX= (0..15)
0 0 2 0 0 0 0 0 0 0 0 0 0 0 0 0 
##$SW_h= 4990.01996007984
##$TD= 16384
##$TD0= 1
##$TE= 0
##$TE2= 300
##$TE3= 300
##$TEG= 300
##$TL= (0..7)
0 120 120 120 120 120 120 120 
##$TP= (0..7)
150 150 150 150 150 150 150 150 
##$TP07= 0
##$TPNAME0= <>
##$TPNAME1= <>
##$TPNAME2= <>
##$TPNAME3= <>
##$TPNAME4= <>
##$TPNAME5= <>
##$TPNAME6= <>
##$TPNAME7= <>
##$TPOAL= (0..7)
0.5 0.5 0.5 0.5 0.5 0.5 0.5 0.5 
##$TPOFFS= (0..7)
0 0 0 0 0 0 0 0 
##$TUNHIN= 0
##$TUNHOUT= 0
##$TUNXOUT= 0
##$USERA1= <user>
##$USERA2= <user>
##$USERA3= <user>
##$USERA4= <user>
##$USERA5= <user>
##$V9= 5
##$VALIST= <valist>
##$VCLIST= <CCCCCCCCCCCCCCC>
##$VD= 0
##$VDLIST= <DDDDDDDDDDDDDDD>
##$VPLIST= <PPPPPPPPPPPPPPP>
##$VTLIST= <TTTTTTTTTTTTTTT>
##$WBST= 1024
##$WBSW= 4
##$XGAIN= (0..3)
0 0 0 0 
##$XL= 0
##$YL= 0
##$YMAX_a= 431959
##$YMIN_a= -304305
##$ZGOPTNS= <>
##$ZL1= 120
##$ZL2= 120
##$ZL3= 120
##$ZL4= 120
##$ABSF1= 10
##$ABSF2= 0
##$ABSG= 5
##$ABSL= 3
##$ALPHA= 0
##$AQORDER= 0
##$ASSFAC= 0
##$ASSFACI= 0
##$ASSFACX= 0
##$ASSWID= 0
##$AUNMP= <proc_1d>
##$AZFE= 0.1
##$AZFW= 0.1
##$BCFW= 1
##$BC_mod= 2
##$BYTORDP= 1
##$COROFFS= 0
##$CY= 11.3945322036743
##$DATMOD= 1
##$DC= 2
##$DFILT= <>
##$DTYPP= 0
##$F1P= 18.9103706918063
##$F2P= -1.10871071338519
##$FCOR= 0.5
##$FTSIZE= 0
##$FT_mod= 4
##$GAMMA= 1
##$GB= 0.15
##$INTBC= 1
##$INTSCL= 1
##$ISEN= 128
##$LB= 0.24
##$LEV0= 0
##$LPBIN= 0
##$MAXI= 10000
##$MC2= 0
##$MEAN= 0
##$ME_mod= 0
##$MI= 1.114404
##$NCOEF= 0
##$NC_proc= 0
##$NLEV= 6
##$NOISF1= 3.799351
##$NOISF2= 2.8
##$NSP= 1
##$NTH_PI= 0
##$NZP= 0
##$OFFSET= 15.70392
##$PC= 1
##$PHC0= -9015.694
##$PHC1= 13.00096
##$PH_mod= 1
##$PKNL= yes
##$PPARMOD= 0
##$PSCAL= 0
##$PSIGN= 0
##$REVERSE= no
##$SF= 200.130013532006
##$SI= 16384
##$SIGF1= 3
##$SIGF2= 2
##$SINO= 400
##$SIOLD= 16384
##$SREGLST= <1H.CDCl3>
##$SSB= 0
##$STSI= 0
##$STSR= 0
##$SW_p= 3612.71676300578
##$SYMM= 0
##$S_DEV= 0
##$TDeff= 0
##$TDoff= 0
##$TI= <>
##$TILT= no
##$TM1= 0
##$TM2= 0
##$TOPLEV= 0
##$USERP1= <user>
##$USERP2= <user>
##$USERP3= <user>
##$USERP4= <user>
##$USERP5= <user>
##$WDW= 1
##$XDIM= 8192
##$YMAX_p= 0
##$YMIN_p= 0
$$ End of Bruker specific parameters
$$ ---------------------------------
##NTUPLES= NMR FID
##VAR_NAME=  TIME,          FID/REAL,        FID/IMAG
##SYMBOL=    X,             R,               I
##VAR_TYPE=  INDEPENDENT,   DEPENDENT,       DEPENDENT
##VAR_FORM=  AFFN,          ASDF,            ASDF
##VAR_DIM=   8192,          8192,            8192
##UNITS=     SECONDS,       ARBITRARY UNITS, ARBITRARY UNITS
##FACTOR=    0.0002004,     1,               1
##FIRST=     0,             0,               0
##LAST=      1.6414764,     0,               0
##MIN=       0,             -304305,         0
##MAX=       1.6414764,     431959,          0
$$ Real data points
##PAGE= N=1
##DATA TABLE= (X++(R..R)), XYDATA
0@%%%%qJ6j6J6k4M0m8N6p2Q8j04J26j52J82k19K55k96L50m07M67n39O21p10Q08
$$ 0 0 0 0 0 -8 8 -8 8 -16 24 -24 32 -40 48 -56 70 -82 100 -119 136 -160 190 -217 250 -289 332 -378 430
28D30r17J038j171J316j479J658j851K064k299K555k835L143l481L856m268M723
$$ 430 -487 551 -620 696 -783 875 -976 1088 -1211 1344 -1491 1652 -1829 2027 -2241 2482
44B482n234N804o443P167p996Q955j0076J1405j3021J5036j7619K1072k5955L3438
$$ 2482 -2752 3052 -3391 3776 -4220 4735 -5341 6064 -6957 8079 -9540 11532 -14423 19015
58A9015m6462P5402k44402J02631M89254m04288k39164L52248J58130m78331q3783
$$ 19015 -27447 47955 -196447 -93816 395438 -8850 -248014 104234 262364 -215967 -299750
69b99750M74408J25888m13842o3133K87563k9932k65274J21868K68681j01099
$$ -299750 174658 300546 -113296 -176429 111134 81202 -184072 -62204 206477 105378
79A05378k64938M6794J74178j3290q1623O9733P1968r5375j48485L1937J71356
$$ 105378 -159560 -112766 61412 48122 -33501 36232 108200 12825 -135660 -103723 67633
90F7633N8548j24441n6226R2204j6480j60183N0548K48950j4013k62943K400K18677
$$ 67633 126181 1740 -54486 37718 21238 -138945 -88397 160553 146540 -116403 -114003 104674
102A04674o2762j94423J56275K15654k12204k42228K07235K07157j93955j11956
$$ 104674 41912 -152511 3764 219418 7214 -235014 -27779 179378 -14577 -126533
112a26533K30598K9675k93740j3228K99871J5743k24410M5343J55015j45571j54468
$$ -126533 104065 133740 -160000 -173228 126643 142386 -82024 -36681 118334 -27237 -181705
123a81705J83854J59787j49402j02471J19032J2975j32626L7109J50162l0576
$$ -181705 2149 161936 12534 -89937 29095 42070 -90556 -53447 96715 66139
133F6139j18987J5326M8925k7092J1979N5381k8527n4287J8390M78l3646O4487
$$ 66139 -52848 -37522 11403 -15689 -3710 51671 23144 -31143 -12753 -12275 -45921 18566
145A8566Q3909p9665j06003O3582O4707q0584j1311J32325L06j57196j1376J25730
$$ 18566 102475 22810 -83193 -19611 45096 -35488 -46799 85526 85832 -71364 -82740 42990
157D2990j1211q4387O1488O9916r5126o9521R0824N1446o6963p693N2773l9502
$$ 42990 31779 -52608 8880 78796 -16330 -85851 4973 56419 -10544 -18237 34536 -4966
169d966n8443N5783N7128l9769k1169K8882l0991m3840N3962N2776m1211j8422
$$ -4966 -63409 -7626 49502 9733 -11436 17446 -13545 -57385 -3423 49353 8142 -10280
181a0280L8444l4281o0168O1938P1124o6437m5509Q0759L285j11554K7281J36790
$$ -10280 28164 -6117 -66285 -4347 66777 340 -45169 35590 38875 -72679 -45398 91392
193I1392m4181j37300O3472J17142r4979r2866J32617P9275j54522o8535J48679
$$ 91392 47211 -90089 -26617 90525 -4454 -97320 35297 114572 -39950 -108485 40194
204D0194L8251j35515R138J36496m3855j39681N2819J19170n9739q2638P9589
$$ 40194 78445 -57070 -47932 88564 44709 -94972 -42153 77017 17278 -65360 14229
215A4229N7571r6529m9134R2941M0898p6714k6780O1618J3999n4092j2499M9463
$$ 14229 71800 -24729 -73863 19078 59976 -16738 -43518 18100 32099 -21993 -34492 14971
227A4971K3797m1652m1379K8818N3298k1046n6520L0675O5392m9582q3175O1604
$$ 14971 38768 -2884 -44263 -15445 37853 16807 -39713 -9038 56354 6772 -76403 -14799
239a4799R4315o8448q7484Q4757P3517j09771o3410J29294N3234j36511l2694
$$ -14799 79516 11068 -76416 8341 81858 -27913 -91323 37971 91205 -45306 -78000
250g8000J39185N314j40857K2034J39776m5396j33143O2776J18231p8140r7159
$$ -78000 61185 66499 -74358 -52324 87452 42056 -91087 -28311 89920 11780 -85379
261h5379R3633P7428j05762o3270J07450M9653r9962l1917R2635J6841q8130j2345
$$ -85379 8254 85682 -20080 -83350 24100 73753 -26209 -58126 34509 51350 -36780 -49125
273d9125P8675J3185o4955j4166N2376J5352m5462j9750M2496K7106m1641l4000
$$ -49125 29550 42735 -22220 -36386 15990 31342 -14120 -33870 8626 35732 -5909 -39909
285c9909M2762L8106m6510l8201N3768L4281o4712k9179P5628K2630q2552j1161
$$ -39909 2853 40959 -5551 -43752 10016 44297 -20415 -49594 26034 48664 -33888 -45049
297d5049Q8302l905r2837J9528R5509l2604r2910M4972Q6109n6368p6726O5890
$$ -45049 43253 39348 -53489 -33961 61548 28944 -63966 -18994 67115 10747 -65979 -89
309h9O6399p1440n5231P2670M3041p0996l0896O7362K0821o2117j4115N4395R157
$$ -89 66310 -5130 -60361 12309 55350 -15646 -46542 20820 41641 -20476 -34591 19804 28961
322B8961m6503o770L9215O900l3235r019K8282J1692k6488j5774K6293J9801k7566
$$ 28961 -17542 -24312 14903 21803 -11432 -20451 7831 19523 -6965 -22739 3554 23355 -4211
335d211k1440L1434K1371l7842k0980M4368J8690m9637j2397N5939M620o2545
$$ -4211 -25651 5783 27154 -10688 -31668 12700 31390 -18247 -30644 25295 29915 -32630
347c2630K010O6001j0023o6806J9779O7800k7348o6291L2989O1517l8437n5715
$$ -32630 -30620 35381 25358 -41448 -21669 46131 18783 -47508 -14519 46998 8561 -47154
359d7154M3163N0890m3880m4222M2871L5688m3035k9538M2170K5748l8142k0347
$$ -47154 -3991 46899 3019 -41203 1668 37356 -5679 -35217 6953 32701 -5441 -25788
371b5788L5707J6324l5527j5918L3820J5715l2100j4164L3560J3806l7315j6392
$$ -25788 9919 26243 -9284 -25202 8618 24333 -7767 -21931 11629 25435 -11880 -28272
383b8272L8258J6341l9945j3363M5080J2153m9550j1258N0601O319n3621q31N7513
$$ -28272 9986 26327 -13618 -26981 18099 30252 -19298 -30556 20045 26364 -27257 -28088 29425
396B9425k435n7827O887N6124j4360n6599J9591N7243k0903n2741K4709M8276
$$ 29425 26990 -30837 -23950 32174 17814 -38785 -19194 38049 17146 -35595 -10886 37390
408C7390k9837m6967L0759M3802l0031l7373L2528L3565l4382l1709L3183K7523
$$ 37390 7553 -39414 -8655 35147 5116 -32257 271 33836 -546 -32255 928 28451
420B8451l2995k1875L6531K0206l8315j9367L7766J5291m0611j2314M5019J2566
$$ 28451 -4544 -26419 10112 30318 -7997 -27364 10402 25693 -14918 -27232 17787 30353
432C0353m5890j1087M6241O983m9876n725N2171N871n0534l045M9525j684n1479
$$ 30353 -15537 -26624 19617 26600 -23276 -29001 23170 29041 -21493 -24538 24987 23303 -28176
445b8176K633N0189l971m6728R008M5995j2679m6538J3150M3358j6112m0166K1960
$$ -28176 -25543 24646 20675 -26053 -17045 28950 16271 -30267 -17117 26241 10129 -30037 -8077
458h077M1318k4340m1602K4624L8253k8296l5882L3532L7098l4966l5313L6419
$$ -8077 33241 8901 -32701 -8077 30176 1880 -34002 -470 36628 1662 -33651 2768
470B768L1342m1016k9387M4368K8120m4549k3179M6798J8102n1044j6376N1358
$$ 2768 34110 -6906 -36293 8075 36195 -8354 -31533 15265 33367 -17677 -34053 17305
482A7305J3378m9852p171N1192L162n2668k319M9849r01m6792N958M7027p601
$$ 17305 30683 -19169 -26340 24852 28014 -24654 -26973 22876 21975 -24817 -18859 28168 20567
495B0567m6154P293M2004j0649l9912J4010M0653j4694l9375J6008L7304k0000
$$ 20567 -25587 -18294 23710 13061 -26851 -12841 27812 13118 -26257 -10249 27055 7055
507G055l8023K2528L9107k3763l7348K7610L6140l3356l8495L5031L7787l5754
$$ 7055 -30968 -8440 30667 6904 -30444 -2834 33306 -50 -38545 -3514 34273 -1481
519a481l2538M0781K9777m5545k8690M6142K4795m5616j7315M8048J1857m9231
$$ -1481 -34019 6762 36539 -9006 -37696 8446 33241 -12375 -29690 18358 30215 -19016
531a9016p880M7611K058m6138L474M5368o228m1347J0429L8095j4915l7889J4666
$$ -19016 -26896 20715 22773 -23365 -19891 25477 19249 -22098 -11669 26426 11511 -26378 -11712
544a1712L5357j3060k9684J4530K6197j7829k8200J5467K8231j1439k3933J2608
$$ -11712 23645 10585 -19099 -4569 21628 3799 -24401 -8934 19297 7858 -16075 -3467
556c467K2009j5778k4604J5889K5950j5534k5633J6663K4895j8367k3700K1141
$$ -3467 18542 2764 -21840 -5951 19999 4465 -21168 -4505 20390 2023 -21677 -536
568e36K2617k4944k2814K7006K3429k4435j8232K4294J0804k9741r637L1498J0920
$$ -536 22081 -2863 -25677 1329 24758 323 -17909 6385 17189 -12552 -22189 9309 20229
581B0229k6344o463K2409j227k3859M389K6133k316k3509J462J9197k574j7373
$$ 20229 -6115 -12578 9831 8604 -15255 -10866 15267 12951 -10558 -9096 10101 7527 -9846
594i846L539J7358l624k0079K10K2435O663j9380q674J6387M566k0963l153K9046
$$ -9846 -6307 11051 7427 -12652 -12442 9993 16656 -2724 -11398 4989 9555 -11408 -14561 14485
608A4485Q716l0610j2747K5438O404k6063J759L3206l744l7664K630L5716m970
$$ 14485 23201 -7409 -20156 5282 11686 -14377 -12618 20588 16844 -20820 -18190 17526 12556
621A2556l1742J1944L0111k0051l3065K3838L6070k1882l3053K0268K4949k5928
$$ 12556 -19186 -7242 22869 2818 -30247 -6409 29661 7779 -25274 -5006 19943 -5985
633e985k0606L4759K6218l4143k9332K7188K2749k6753j4705L4962J5646m1000
$$ -5985 -26591 8168 34386 243 -29089 -1901 20848 -5905 -20610 14352 29998 -11002
645a1002k1903L8569K3195l4335j7116L6546J1004m4309j0811N0776J4772n0033
$$ -11002 -32905 5664 28859 -5476 -22592 13954 24958 -19351 -30162 20614 35386 -14647
657a4647j5245M4406N574m5143N765N4265q055n9445M903N2854r821m4300K4451
$$ -14647 -29892 14514 20088 -25055 -19290 34975 26920 -32525 -27622 25232 15411 -28889 -4438
670d438M5625l5444n2521L5316N1403l3198m1607L8601L2930m9402l2567N5557
$$ -4438 41187 5743 -46778 -11462 39941 6743 -34864 3737 36667 -12735 -45302 10255
682A0255L6258n2091l3657M6079K2630m7790j2789N6239J3004n9078j7465N1390
$$ 10255 46513 -5578 -39235 6844 29474 -18316 -31105 25134 38138 -20940 -38405 12985
694A2985J3360m3605l59M7103p301n5029M687N4831j305m5617P731L9753j9780
$$ 12985 26345 -17260 -17619 29484 22183 -32846 -28159 26672 25367 -20250 -12519 27234 7454
707G454m3301K5523M8628k2416m5796J9994L5208k6673k7928L7657K9872m1821
$$ 7454 -35847 -10324 38304 15888 -29908 -9914 25294 -1379 -29307 8350 38222 -3599
719c599l3600L6123K7654l2132j5073L7798Q358m6220j1844M4947J4497l5224
$$ -3599 -37199 -1076 26578 -5554 -20627 17171 25529 -20691 -32535 12412 26909 -8315
731h315p462K9717l907l3601P611L7777k655l2871M49K2105p346j7152J6989K1350
$$ -8315 -15777 13940 10033 -23568 -15957 21820 19165 -13706 -13257 8848 1502 -15650 1339 22689
745B2689j8649k4947J3048J9966j1167j0650J8322Q435k6248j4149K5607J7704
$$ 22689 4040 -20907 -7859 12107 940 -9710 8612 17047 -9201 -23350 2257 19961
757A9961j8512j1949J6617L622k2739k581K7624Q062k3243r341J4757K180j2628
$$ 19961 1449 -10500 6117 9739 -13000 -15581 12043 20105 -3138 -12479 2278 4458 -8170
770h170N398J7088m997j9066m97J2738J171m825M659L382r562q071O102R584R29
$$ -8170 -2772 14316 9319 -9747 -10244 2494 3665 -1160 3499 6881 -2681 -10752 -4650 4934 5863
785E863m015k948k145j699P38M409N933M40q325p132M036P157o54j322N117j260
$$ 5863 1848 -1100 -3245 -4944 -4206 203 6136 6576 -1749 -8881 -4845 2312 1658 336 5453 4193
801D193j2328k677J4323O869j0286m559Q363j385j2545L455J8211N13j8141m109
$$ 4193 -8135 -10812 3511 10380 94 -4465 3898 2513 -10032 -6577 11634 12147 -5994 -10103
815a0103J3277J848j0838L333J4243l942j8411p51J7040L328j1963L06J0945n931
$$ -10103 3174 5022 -5816 -2483 11760 7818 -10593 -11344 5696 9024 -2939 -2633 8312 2381
829B381j5597O845J9405m409j7930N285J4355j1763j5127J8475J9270k0856k1580
$$ 2381 -13216 -6371 13034 8625 -9305 -4020 10335 -1428 -16555 1920 21190 334 -21246
842b1246K0556J8795k3208j4287K9428J2717l5177j3981L5937J3079l3999p194
$$ -21246 -690 18105 -5103 -19390 10038 22755 -12422 -26403 9534 22613 -11386 -18580
854a8580L4412O48l8110K117M0095j599l6756M050L2438r821l1341J4382L2559
$$ -18580 15832 16480 -21630 -19513 20582 18983 -17773 -13723 18715 8894 -22447 -8065 24494
867B4494j4540l1526J3681K7348j4768k3536J8213K2660k0764k3481K0716K3250
$$ 24494 9954 -21572 -7891 19457 4689 -18847 -634 22026 1262 -22219 -1503 21747
879B1747k0063k0536K1567J7550k6304j7617K9994J9191l0710j8376L1163J4357
$$ 21747 1684 -18852 2715 20265 -6039 -23656 6338 25529 -5181 -23557 7606 21963
891B1963l4594j1283L8912J0644m0715r313L9769N246l9319k95L9384l875l8941
$$ 21963 -12631 -23914 14998 25642 -15073 -24386 15383 20629 -18690 -18985 20399 16524 -22417
904b2417P221L7133j0162l3542J3642K9185j7944k6020K1403K4201k2227k1113
$$ -22417 -15196 21937 11775 -21767 -8125 21060 3116 -22904 -1501 22700 473 -20640
916b0640K2064J6480k3280j3185K5043J2693k4088j1866K2266J0140k1663q960
$$ -20640 1424 17904 -5376 -18561 6482 19175 -4913 -16779 5487 15627 -6036 -14996
928a4996K1927R281k1821r555K1742R559k2269r653K2838R139k3931p840K5854
$$ -14996 6931 16212 -5609 -15164 6578 16137 -6132 -15785 7053 16192 -7739 -15579 10275
941A0275P086k7339o347K6935L506k7164l38K8026k117k7275M036K4719p629k2402
$$ 10275 17361 -9978 -16325 10610 14116 -13048 -13386 14640 12523 -14752 -10716 14003 6374 -16028
955a6028J1100K0602j2659j7849J4166J3995j6051j1421J6948R552j6354p314
$$ -16028 -4928 15674 3015 -14834 -668 13327 -2724 -14145 2803 12355 -3999 -11313
967a1313J5903O056j5146o005J3524O249j1734o640J1023Q389r784j0627Q083
$$ -11313 4590 10646 -4500 -10505 3019 9268 -2466 -9106 1917 10306 522 -10105 -2022
980b022J1677p810j2478R175J4511r895j5538J0217J4680j2139j3352J5059J2594
$$ -2022 9655 1845 -10633 -1458 13053 3158 -12380 -2163 12517 378 -12974 2085 14679
993A4679j6925j0918J7989Q064j9723n024K0645K297k0925O91K0766l298k0173
$$ 14679 -2246 -13164 4825 12889 -6834 -11858 8787 11084 -9841 -9150 11616 8318 -11855
1006a1855M589J8200o504j6217Q263J5104q610j3965P280J1893o762j0482O710
$$ -11855 -7266 10934 4430 -11787 -3524 11580 2970 -10995 -3715 8178 1416 -9066 -2356
1019b356J0809n503j1534L845J2048l040j2967L009J4958k541j6335L129J7608
$$ -2356 8453 2950 -8584 -4739 7309 4269 -8698 -5689 9269 6728 -9607 -6478 11130
1032A1130m522j9018O131J9662p608j8820J0336J7702j3600j6613J5851J4572
$$ 11130 6608 -12410 -6279 13383 5775 -13045 -2709 14993 1393 -15220 631 15203
1044A5203j7576j1180J9704P792k1698n181K2204K276k2095O42K1592k886k0528
$$ 15203 -2373 -13553 6151 13943 -7755 -12936 9268 11544 -10551 -9909 11683 8797 -11731
1057a1731M485J8983n771j7347O044J5659n606j3717N309J1915n167j1712M173
$$ -11731 -7246 11737 5966 -11381 -5337 10322 4716 -9001 -3692 8223 3056 -8656 -4483
1070d483J1407k600j0961K212J1036k558j2375K817J3733l086j4525M227J5143
$$ -4483 6924 4324 -6637 -4425 6611 4053 -8322 -5505 8228 5142 -9383 -5156 9987
1083I987o064j5602P914J5653r985j4803J2565J3937j4360j2071J6175R480j7864
$$ 9987 3923 -11679 -3765 11888 1903 -12900 -335 13602 -758 -12829 3346 12826 -5038
1096e038o739J9263M458j9598k078J9250n44j9057K667J8379l733j6885M368J5233
$$ -5038 -11777 7486 11944 -7654 -9732 9518 8974 -10083 -7416 10963 7230 -9655 -5287 9946
1110I946m991j3944M577J2185l951j0718L292R546k572r173J737Q491j328q217
$$ 9946 4955 -8989 -4412 7773 3822 -6896 -3604 5942 3370 -5803 -4066 4425 3097 -5120
1124e120J805Q689k200r565K685R986m135j0405O069J1280p751j1546R371J1579
$$ -5120 -3315 5374 3174 -6391 -3706 6280 2145 -8260 -2191 9089 1338 -10208 -837 10742
1138A0742j1299j1147J2949J0647j4030r026J4885P379j5887n956J6052M200j5355
$$ 10742 -557 -11704 1245 11892 -2138 -11164 3721 11100 -4787 -10743 5309 9509 -5846
1151e846j939J5061J35j4513J132J3521k301j2197L451J1294l911j0553L978R255
$$ -5846 -7785 7276 7411 -7102 -5970 7551 5250 -6947 -3496 7798 3887 -6666 -2688 6567
1165F567m080q598L996Q299l808p625L466P212l915p365M043P335m375p132M968
$$ 6567 2487 -6111 -2115 6184 2376 -5249 -1783 5429 1514 -5851 -1808 5527 1152 -5980 -1012
1180a012P034o148p445O884P553p514p088Q532O950r477o758R833O328j0036n415
$$ -1012 6022 -126 -7571 -687 6866 -648 -7736 796 7746 -1731 -8489 1344 7672 -2364 -7779
1195g779J0292M756j0134l892J0046K807r719j633R471P46q932L99Q665j486q673
$$ -7779 2513 7269 -2865 -6757 3289 6096 -3623 -5256 4215 4961 -3971 -3572 5093 3607 -5066
1210e066K108Q535k781q148L679Q125m336q330M479Q224m719p657M924P132n267
$$ -5066 -2958 5577 2796 -5352 -1673 6452 2116 -6214 -1735 6489 1770 -5887 -963 6169 902
1225I02p001N507O658n545o372N460N700n619n181O025N040o499n358O400N395
$$ 902 -6099 -592 6066 521 -5851 -391 5309 -310 -5491 534 5574 -925 -6283 117 5512
1240E512o346n189O704N248p565n707P986O122q083n936Q786N355r667m733J0790
$$ 5512 -834 -6023 681 5929 -1636 -7343 643 6765 -1318 -7254 1532 6887 -2780 -7513 3277
1255C277M350j1567l387J2310J884j2940P1J4080j561j4902K951J4862m484j4351
$$ 3277 7627 -3940 -7327 4983 6867 -6073 -6002 8078 6517 -8385 -5434 9428 4944 -9407
1269i407O392J4052p952j3742Q721J2647r082j1274R536R437r919q289J0066P373
$$ -9407 -3015 11037 3085 -10657 -1936 10711 1629 -9645 -109 9328 -591 -8880 1186 8559
1283H559r906o616R245N462q981m686R457M616r912n317R906N619j0121n445J1219
$$ 8559 -1347 -7963 1282 6744 -2237 -6923 2534 7150 -2762 -8079 1827 7446 -2675 -8120 3099
1298C099N548j2862n827J4142N731j5300m581J6375L034j7651q63J8795j322j9360
$$ 3099 8647 -4215 -10042 4100 9831 -5469 -10050 6325 9359 -8292 -9155 9640 8318 -11042
1312a1042L728J9069o468j8200R852J7485j2574j6304J4335J4284j5727j1187
$$ -11042 -7314 11755 5287 -12913 -3061 14424 1850 -14454 -119 14165 -1562 -12749
1324a2749J6965Q677j7611o386J7101L959j5866j478J4389o03j2913J906J1210
$$ -12749 4216 12893 -4718 -11104 5997 9956 -5910 -7388 7001 6398 -6515 -4609 6601
1337F601k515r755K353Q042k128p106J825O848r68p503m82P850J548q456j616
$$ 6601 4086 -5669 -3316 4726 2598 -4508 -2683 4165 3197 -4306 -4788 3062 4610 -3846 -5462
1352e462R707J199j1336p56J2637j36j3117J868J3450m350j3087P007J2451r437
$$ -5462 4245 5444 -5892 -6648 5989 5853 -7264 -5396 8054 3704 -9383 -2376 10075 638
1366F38j1192J1677R189j3332o464J4824L723j5713j283J5439r37j3944L516J1890
$$ 638 -10554 1123 10312 -3020 -9484 5340 9063 -6650 -7933 7506 6569 -7375 -3859 8031
1380H031n425r867O544P160o517m136N959J239n131R60L625k457j461L139j122
$$ 8031 2606 -7261 -717 6443 -74 -4210 1749 2988 -2143 -1183 2442 -15 -1476 1663 541
1395E41l103L417K421n367p17O473j932p514M605P824o911p222R003N283j1030
$$ 541 -2562 855 3276 -2091 -2808 3665 1733 -5781 -1176 6648 -263 -7485 1518 6801 -4229
1410d229l171J2893R02j3445J439J2832m117j1678O822J0390q685q500R449O389
$$ -4229 -7400 5493 6395 -7050 -5611 7221 3104 -8574 -1752 8638 -47 -8547 902 7291
1424G291r280l837Q801J990p795o53O038M28l605n21Q19J047J193k226k474M555
$$ 7291 -1989 -5826 2975 4965 -2830 -3483 2555 2983 -622 -1143 -324 723 1916 -310 -2784 1771
1440A771L176p157l615R441K636j1271m15J3058k656j4545N821J4810r503j4092
$$ 1771 4947 -2210 -5825 3616 6252 -5019 -5434 7624 4968 -9577 -3756 11054 1551 -12541
1454a2541J3510J2489j7201j0349K0178P495k2126m214K3040K59k3142L630K2351
$$ -12541 969 13458 -3743 -14092 6086 13581 -8545 -12759 10281 10540 -12602 -8972 13379
1467A3379o651k0685Q964J7562j0916j4052J2654J1141j2987q576J1919N997j0315
$$ 13379 6728 -13957 -4993 12569 1653 -12399 255 11396 -1591 -10167 1752 7749 -2566
1480b566l753Q983K731p118k872N110L820l229n047K168O706j976q491K957J0487
$$ -2566 -6319 2664 5395 -1723 -4595 515 4335 1106 -3941 -1773 4933 2957 -5534 -2577 7910
1495G910m428j2296O304J3011r292j2325J2785J1584j6570j0363J9043P727k1128
$$ 7910 3482 -8814 -2510 10501 1209 -11116 1669 13253 -3317 -13680 5363 13090 -8038
1508h038l963K3015R6k4202L070K3509o438k1383R605J8791j2443j5607J4111
$$ -8038 -12001 11014 11110 -13092 -10022 13487 7049 -14334 -4729 14062 1619 -13988 123
1521A23J2016j4433q105J3878L897j2784k23J1474j881r299K940O334l644l616
$$ 123 12139 -2294 -10399 3479 7376 -5408 -5631 5843 3962 -5337 -2397 3937 293 -3323
1535c323L911J969k493p93m3l46K726P46m685k3O645j811q415M252R722o677r990
$$ -3323 588 2557 64 -729 -772 -1118 1608 2354 -2331 -2354 4291 2480 -5935 -1683 8039 1362 -8628
1552h628Q985Q885j1344o742J3891M400j5832k052J6120r86j5190M533J3992p817
$$ -8628 357 9242 -2102 -8844 5047 9447 -6385 -8437 7683 6697 -8493 -3960 10032 2215
1566B215j2441R571R637j0568n991J1065K202j1096O99J0070l154p928N058N245
$$ 2215 -10226 -655 8982 -1586 -7577 3488 5690 -5406 -4707 5363 2209 -5719 -661 4584
1580D584o442k702O988N95n887J407L662l325j170M750j093m733L939L617o906
$$ 4584 -1858 -4560 2428 3023 -2864 -1457 2205 -1120 -2290 2460 1367 -3366 573 4190 -2716
1595b716k065R536N87j0992J677J1246m498j0607P132R738r511p944J0831N213
$$ -2716 -4781 4755 5342 -5650 -3973 7273 2775 -7832 -700 9038 -473 -8417 2414 7627
1609G627j1559j817J1908j401j1690L867J0373o111q112P935N611r196l270R164
$$ 7627 -3932 -5749 6159 4758 -6932 -3065 7308 1197 -6915 1020 6631 -2565 -5835 3329
1623C329J139q235J053O554k951m879M045K762l965n90L128j689j857L366O6m048
$$ 3329 4468 -3767 -2714 3840 889 -3990 55 2817 -1148 -1738 1390 -299 -2156 1210 1276 -2772
1639b772K210M107m948l532P412K543r226q27J0565j566j1004M106J0962o292
$$ -2772 -562 3545 -1403 -4935 2477 5020 -4206 -5033 5532 3966 -7038 -2932 8030 1738
1653A738r989Q378Q091r919n306J1179K513j1760K66J1460l150j0338N799Q870
$$ 1738 -8251 127 8218 -1701 -7007 4172 6685 -5075 -4809 6651 3501 -6837 -1038 7832
1667G832p781p349Q817N374r108l373Q632J517p700j59O050p37m106R20J982r25
$$ 7832 51 -7298 1519 6893 -2215 -5588 3044 4561 -3139 -3298 2752 2015 -2091 -1171 811 -114
1683a14K4K71j525R12K388k340l025M006K813n462j623O630O5p463J860P789l943
$$ -114 -90 181 -1344 -432 1956 -384 -3409 597 3410 -2052 -3675 2955 3020 -4443 -2583 5206 1263
1700A263p557O157O634p916n273R695L351j0684j366J1302q88j1016L231J0373
$$ 1263 -6294 -137 6497 -1419 -6692 3003 6354 -4330 -5696 5606 4718 -6298 -3067 7306
1714G306n273r287O928P759p959n806Q315M106q194k491P435Q93o129j4M761o60
$$ 7306 2033 -7254 -326 7433 -526 -6332 1983 6089 -2105 -4596 2839 3732 -2397 -2411 2350 1690
1730A690l117P86J406n97r3j92q84R83J361j942j287K875M63l807O31M361k078
$$ 1690 -1427 -641 765 168 75 -117 -1001 -18 1343 -599 -1886 989 1452 -2355 -1724 2637 559
1747E59m572L965M279n652l781P393K868q695j727R820L98j0209J235J0142k732
$$ 559 -4013 -48 4231 -1421 -5202 2191 5059 -3636 -5363 4457 4855 -5354 -4119 6023 3291
1762C291r657M174Q622n121p200N995N650o391m196O568K517o057j336N490L67
$$ 3291 -6366 -2192 6430 1309 -5891 104 5754 -637 -4833 1735 4252 -1805 -3141 2349 2716
1777B716m587K34L575n79k668M49J870k2j253o36R64J296j119k086J593K680k439
$$ 2716 -1871 -1637 1938 1359 -1309 -860 1010 988 -265 -901 63 1359 240 -1846 -253 2427 -12
1794a2l078L383L325m767l309O014K840p156k346Q172J602r062m72R425o19r387
$$ -12 -3090 293 3618 -1149 -4458 1556 4396 -2760 -5106 3066 4668 -4394 -4866 4559 3940 -5447
1810e447J646Q993k512q041L489O901m032n901M682M655m776l256M804K194m649
$$ -5447 -3801 5192 2680 -5361 -1872 5029 997 -4904 -222 4433 -343 -3599 1205 3399 -1250
1825a250j313M372R04m152o56L748Q20l385j129L178J562l189k356L294L032l584
$$ -1250 -2563 1809 2713 -1439 -2095 1653 2473 -912 -2041 1137 2699 -490 -2846 448 3480 -104
1841a04l502L977L701m660l899N241L766n871l402O621K706p146k187P562J263
$$ -104 -3606 371 4072 -588 -4487 754 4520 -1351 -4753 1868 4574 -2572 -4759 2803 4066
1856D066p757l04P747n29p522J281P144k125o415K569N795k896m848L116M052
$$ 4066 -3691 -3995 3752 3223 -4299 -3018 4126 2001 -4414 -1845 3950 1054 -3794 -678 3374
1871C374l297l509L398L109l370k490L203K524l178k619L210K877l215l137L405
$$ 3374 77 -3432 -34 3075 -295 -2785 418 2942 -236 -2855 355 3232 17 -3120 285
1886B85L655l503m137L653M523m053m755M375M724m612m647M977M145n294l795
$$ 285 3940 437 -3700 -47 4476 423 -4332 43 4767 155 -4492 485 4630 -664 -4459
1901d459N421L113n548k201N653J248n914n22N737j43n579P09N471j303n250J674
$$ -4459 962 4075 -1473 -3674 1979 3227 -2687 -3209 2528 2385 -3194 -2485 2986 1683 -3567 -1893
1917a893N270k069m892J981M804k033m537K169M467k271m489K217M558k117m304
$$ -1893 3377 1308 -3584 -1603 3201 1168 -3369 -1200 3267 996 -3493 -1276 3282 1165 -3139
1932c139K275M372k630m469K906M605l135m416L387M186l685l882M021L657m249
$$ -3139 -864 3508 878 -3591 -685 3920 785 -3631 -244 3942 257 -3625 396 4053 -196
1947a96l373M419K795m576k037M681J398m994q79M909M44m816J91M574p07m853
$$ -196 -3569 850 3645 -931 -2968 1713 3111 -1883 -2762 2147 2591 -2225 -2034 2540 1833 -3020
1963c020J104M932j307m847J195M726j518m457J616M490j598m630J480M441j460
$$ -3020 -1916 3016 1709 -3138 -1943 2783 1265 -3192 -1576 2914 1316 -3314 -1834 2607 1147
1978A147l997J834L584k113l476K348L457k428k906K729K361l077j965L655J720
$$ 1147 -2850 -1016 2568 455 -3021 -673 2784 356 -2550 179 2540 -537 -2502 1153 2873
1993B873l731j505L583J187l549o17L696L07l837l36L533L19l124J6K864m79l016
$$ 2873 -858 -2363 1220 2407 -1142 -1759 1937 2244 -1593 -1929 1604 1923 -1201 -1185 1679 1200 -1816
2010a816N54L103l94k976L15K661n82k630P57K959q08l203L73L258m32k898Q23
$$ -1816 -1262 1841 1447 -1529 -1214 1447 865 -1765 -1008 1951 1143 -2060 -1687 1571 1139 -1759 -936
2027i36K780j305k948J239K972j059k435J254J706j831j390K351J505k308j374
$$ -936 1844 539 -2409 -1170 1802 743 -1692 -438 1268 -563 -1953 398 1903 -405 -1779
2042a779K246Q53k274l36K709M55l051q53K775J330k283j009K250P97k703j170
$$ -1779 467 1320 -954 -1290 1419 1874 -1177 -2030 745 2075 -208 -1217 1033 1830 -873 -2043
2058b043K742J997k386k087J922J471k166j166K842J293l249j497K872J126k821
$$ -2043 699 2696 310 -1777 145 1616 -550 -1716 1126 2419 -830 -2327 545 1671 -1150
2073a150j33L283p12m047O56M237n27l704J167L194k268l498K823L945k497l529
$$ -1150 -1283 2000 1288 -2759 -2103 2134 1607 -2097 -930 2264 -4 -3502 -679 3266 769 -2760
2089b760K267K578k914j838L616K190l699k620L172K287k788j322L235J068l992
$$ -2760 -493 2085 -829 -2667 949 3139 -560 -3180 -8 2279 -509 -1831 1404 2472 -1520
2104a520j662L990K176l055j708K811P13l471m66M271R02m039j048L544j36l394
$$ -1520 -3182 808 2984 -71 -1779 1032 1745 -1726 -2192 2079 2981 -1058 -2106 1438 1302 -2092
2120b092J409M196j974m837J753M445k102l651L254L360m373m084M396M194l751
$$ -2092 -683 3513 1539 -3298 -1545 2900 798 -2853 401 3761 -612 -4696 -300 3894 143
2135A43l234L711J902m579j548N079J884m500j604L608L28l407P87M151q67m414
$$ 143 -3091 620 2522 -2057 -3605 1474 3358 -1142 -2746 862 1190 -2217 -1430 2721 1854 -2560
2151b560L68L827m07k967J450L039k207l789J969M145j283l277J514K489k659
$$ -2560 -2192 1635 1228 -1739 -289 2750 543 -3246 -1277 2868 1585 -1692 -178 2311 -348
2166c48k678L317L391l106l205K648K232l267j425M340J660m959k076M357J692
$$ -348 -3026 291 3682 576 -2629 19 2251 -1016 -2441 1899 3559 -1400 -3476 881 2573
2181B573l768o01M106k14m816p5M648L65l570K39K807j506k995J887L497j566
$$ 2573 -1195 -1796 2310 2096 -2720 -2795 1853 2218 -1352 -1113 1694 188 -2807 -920 2577 1011
2197A011l157J352K176k033j674K922K335l121k902K486K667k031j982K676J747
$$ 1011 -2146 -794 1382 -651 -2325 597 2932 -189 -3091 -605 2062 31 -1951 725 2472
2212B472l216k387L184K775k346k214K058J372k629j070L226J262k804j358K225
$$ 2472 -744 -3131 53 2828 482 -1732 326 1698 -931 -2001 1225 2487 -317 -1675 550
2227E50O09k113L09K541m38k991m8K556J96j889M11J756r87k407P05K517J5k187
$$ 550 1159 -954 -645 1896 1458 -1533 -1581 975 1171 -718 -307 1449 462 -1945 -1240 1277 1292 -895
2245h95k4J657n12j838Q06K500n28k790J27K511k98k237Q95K577j295l084R41
$$ -895 -919 738 226 -1612 -806 1694 1166 -1624 -1497 1014 716 -1521 -626 1951 656 -2428 -1487
2262a487L296o90k715J034K326j599k446J766K600j274k103J026J311j214r46
$$ -1487 1809 1119 -1596 -562 1764 165 -2281 -515 2085 811 -1292 -266 1045 -169 -1115
2277a115J631J076j586j189J316J008j176o82J515P22j991j254K087J705k095
$$ -1115 516 1592 6 -1183 133 1141 -35 -717 798 1520 -471 -1725 362 2067 -28
2292b8j733K171J742k941j830L257K210l333k320L289J853l621j389M020J043
$$ -28 -1761 410 2152 -789 -2619 638 2848 -485 -2805 484 2337 -1284 -2673 1347 2390
2307B390m185q01M013M04l747K35L728r17l612J141L513j274k885J525K397j683
$$ 2390 -1795 -2596 1417 1821 -1926 -1691 2037 1120 -2492 -1351 2162 888 -1997 -472 1925 242
2323B42k327J864K148j656j850J594J653j584j591J595J866j649k103J675K313
$$ 242 -2085 -221 1927 271 -1579 15 1668 84 -1507 88 1954 305 -1798 -123 2190
2338B190j758k599K164K721k516l024K692L411l121l225L382K973l833k789M076
$$ 2190 432 -2167 -3 2718 202 -2822 -130 3281 160 -3065 317 3290 -543 -3332 744
2353G44K367m222j727M147J111m280k58M012m87l819J100L648j749l276K088L070
$$ 744 3111 -1111 -2838 1309 2420 -1860 -2118 1894 1407 -2412 -1312 2336 587 -2689 -601 2469
2369B469k558k626K525K379k403k064K201K080k075j813J622J978j315j977J178
$$ 2469 -89 -2715 -190 2189 -214 -2278 -77 2003 -72 -1885 -263 1715 400 -1577 -399
2384c99K236j059k458J133K587j150k784J473K962j929l087K426K930k792k745
$$ -399 1837 778 -1680 -547 2040 890 -1894 -421 2541 612 -2475 -49 2881 89 -2656
2399b656L228K402l878j757L946J305m151p55M108L3m009P47L681j275l393J647
$$ -2656 572 2974 -904 -2661 1285 2590 -1561 -2316 1792 1825 -2184 -1437 2244 969 -2424 -777
2415g77L032k195k568K497K252k624j958K408J757k123j563J783J513j425j550
$$ -777 2255 60 -2508 -11 2241 -383 -2341 67 1824 -299 -1862 -79 1434 9 -1541
2430a541R75J781n23j994K74K166n1k407L02K569m36k737Q60K717j397k419J887
$$ -1541 -566 1215 692 -1302 -1028 1138 1087 -1320 -1018 1551 1115 -1622 -762 1955 558 -1861 26
2447B6K249k506j848L028J480l513r24L776L32l983L01L909p63l800J097L442
$$ 26 2275 -231 -2079 949 2429 -1084 -2008 1768 2100 -1883 -1582 2327 1564 -2236 -1139 2303
2463B303j571l007J800K528j868k083J754J563j645j232J444R80j053r29O62R00
$$ 2303 732 -2275 -475 2053 185 -1898 -144 1419 -226 -1458 -14 966 -87 -1016 -354 546
2479E46k98r85m4J282K84j529j90J687J13j885J03K082n35k035J142J978j677
$$ 546 248 -737 -781 501 785 -744 -934 753 866 -1019 -916 1166 631 -1404 -262 1716 39
2496C9j861K368J426k786j144L349O89l553l00L771k46l683N72L642j029l141
$$ 39 -1822 546 1972 -814 -1958 1391 2080 -1473 -1773 1998 1752 -1931 -1359 2283 1254 -1887
2512a887J186K656j340k178J408J559j418r17J172M94j067j79P74n7o04N4L56
$$ -1887 -701 1955 615 -1563 -155 1404 -14 -931 241 735 -332 -511 263 206 -398 -344 12
2529A2K08k67m00Q0O99k28j036L65J390n06j737R85J763j289j820J839J723k252
$$ 12 220 -47 -447 -367 332 104 -932 -567 823 317 -1420 -435 1328 39 -1781 58 1781 -471
2547d71j434K630J160k828p96L245J40l257K37L330n67l140J028K657j315k275
$$ -471 -1905 725 1885 -943 -1739 1506 1646 -1611 -1374 1956 1389 -1751 -723 1934 619 -1656
2563a656J557J803j535j327J395Q08j379k67J178m6j075J95Q66j89p34J00O58
$$ -1656 -99 1704 169 -1158 237 1045 -334 -601 577 531 -544 -349 517 328 -406 -306 352
2580C52Q7p90m25Q86P92j034j140J176J506j580j679J842J766k153j671K312J514
$$ 352 439 -351 -776 110 902 -132 -1272 -96 1410 -170 -1849 -7 1759 -394 -2065 247 1761
2597A761k529j240K771Q63k829l35K766o4k649O96K472j220k220J596J974j754
$$ 1761 -768 -2008 763 1626 -1203 -1538 1228 1164 -1485 -789 1683 463 -1757 -161 1813 59
2613E9j509J838J262k056q86K070O38j838n25J729K66j457k71J224M02j314n04
$$ 59 -1450 388 1650 -406 -1292 778 1416 -422 -947 782 1048 -409 -680 544 946 -368 -872
2630h72J176P77j215r94J223J139j405j452J681J533j793j620J970J494k199j300
$$ -872 304 1081 -134 -1128 95 1234 -171 -1623 58 1591 -202 -1822 148 1642 -557 -1857
2646a857K309J104k444p52K529K46k449J89K496o33k464J065K364j400k068J714
$$ -1857 452 1556 -888 -1640 889 1135 -1314 -1125 1371 738 -1726 -661 1703 303 -1765 -51
2662e1J932j994j812K072J835k028j643J920J481j822j365J757J339j490j502
$$ -51 1881 -113 -1925 147 1982 -46 -1689 231 1712 -110 -1475 282 1621 131 -1371
2677a371J438J370j166j368J204J340j401j514J552J541j610j464J686J251j957
$$ -1371 67 1437 271 -1097 107 1447 46 -1468 84 1625 15 -1449 237 1488 -469
2692d69j269K318J196k557j085K531P26k625l61K755O9k836J97K873n24k646Q64
$$ -469 -1738 580 1776 -781 -1866 665 1391 -1234 -1595 1160 1229 -1607 -1410 1463 939 -1707 -843
2709h43K537j245k499J439K578j450k404J541K184j614k121J664K223j512k189
$$ -843 1694 449 -2050 -611 1967 517 -1887 -346 1838 224 -1897 -233 1990 478 -1711
2724a711J317K054j219j885J313J773j397j716J368J618j322j369J382J147j726
$$ -1711 -394 1660 441 -1444 -131 1642 245 -1471 -103 1515 193 -1176 206 1353 -373
2739c73r74K000R60k050j063K195P17k337n61K511N52k667o41K725N50k616m10
$$ -373 -1347 653 1613 -437 -1500 695 1412 -925 -1486 1025 1577 -1090 -1731 994 1544 -1072 -1482
2756a482K536J27k648p6K727J46k589R4K245k84k375N99K493o28k532P01K486
$$ -1482 1054 1181 -1467 -1543 1184 1330 -1259 -1165 1080 796 -1579 -980 1513 885 -1647 -946 1540
2773A540q64k256J121K184j219k233J268K244j281k020J386J797j511j687J702
$$ 1540 676 -1580 -459 1725 506 -1727 -459 1785 504 -1516 -130 1667 156 -1531 171
2788A71J603j713j604J734J409j810j258K004J262k207j468K370J427k401j360
$$ 171 1774 61 -1543 191 1600 -210 -1468 536 1798 -409 -1877 493 1920 -481 -1841
2803a841K430J303k760j236K873J391l056j238K861R68k960n32L194K30l321k3
$$ -1841 589 1892 -868 -2104 769 2160 -896 -2134 727 1695 -1265 -1797 1397 1627 -1694 -1717
2819a717L232k96l042Q33L036j374l170J690L086j652k828J896K475k179k280
$$ -1717 1515 1219 -1823 -990 2046 672 -2498 -808 2278 626 -2202 -306 2169 -10 -2290
2834b290K510K219k434k194K294J822k174j400K381J307k481j506K496J398k235
$$ -2290 220 2439 5 -2189 105 1927 -247 -1647 734 2041 -440 -1946 550 1948 -287
2849b87j239K320J007k718r78K977R86k921j055K828O57k992j81L302l8l631K18
$$ -287 -1526 794 1801 -917 -1895 1082 2068 -853 -1908 920 1577 -1415 -1596 1706 1668 -1963 -1745
2866a745L366n29l142J269K995j859l136K115L076k228k556K555K039l002j719
$$ -1745 1621 1092 -2050 -781 2214 355 -2781 -666 2410 182 -2374 181 2220 -782 -2501
2881b501L272J637l066j319K642R00k539l79K620J59k399j96J942L4j382K44J423
$$ -2501 771 2408 -658 -1977 665 1565 -974 -1353 1267 1426 -973 -1169 773 807 -575 -331 1092
2898A092n25j525L25J523q3j375J03J395m35j535M28J976l91k137K84J986m85
$$ 1092 567 -958 -633 890 807 -568 -465 930 495 -1040 -612 1364 973 -1164 -880 1106 621
2915F21j888R18J947j255k076J220J852j305j395J648R54k020p19K053N42j912
$$ 621 -1267 -349 1598 343 -1733 -513 1339 34 -1361 287 1241 -779 -1498 555 1097 -815
2931h15j38J742l28j642P26J577q32j227O73P95p35k18Q66j8p27Q9L99j06j01
$$ -815 -953 789 461 -1181 -455 1122 290 -937 -264 531 -204 -422 444 426 -301 -212 187 81 -20
2950b0M20o5m93J35J87l01L13M16m82o92P09O11q22m93J130L11j479l42J596J81
$$ -20 400 335 -158 -23 164 -137 176 592 110 -582 127 738 -84 -577 553 864 -615 -957 639 820
2970H20j333j9J149m25j040O15Q93o14o20O58J31p41J79Q19l17p23L36K95k32
$$ 820 -513 -532 617 192 -848 -233 660 46 -574 84 215 -526 -347 472 155 -568 -232 63 -169
2989a69LK73k3k12nr7q8N79K68p45l97R30J69r92J10J441n29j568O85J620j010
$$ -169 -166 107 84 -128 -133 -230 -318 261 529 -216 -613 317 486 -506 -396 1045 516 -1052 -367 1253 243
3010B43j333J560R21j858q54K022O54j943l36K016k96k039O32J918p08j694R50
$$ 243 -1090 470 1391 -467 -1321 701 1355 -588 -924 1092 796 -1243 -611 1307 599 -1095 -145
3027a45J175j267q56J468O87j556n33J279L42j194L3J079O9j179k82R85N04o88
$$ -145 1030 -237 -1093 375 1062 -494 -1027 252 594 -600 -567 512 581 -598 -880 105 609 -79
3045g9n83N50Q08p53r52R22J255r68j351R98J329j275j041J643Q00k043n28K268
$$ -79 -662 -112 696 -57 -1009 -87 1168 200 -1151 -153 1176 -99 -1140 503 1303 -740 -1268 1000
3063A000K24k279J94K500q46k583J181K655j526k229J676J973k054j689K217J407
$$ 1000 1224 -1055 -861 1639 793 -1790 -609 2046 520 -1709 -33 1940 -114 -1803 414 1821
3079A821k197j027K006O03j895k74J795K0j635q1J397Nj029j10R26J77r32m38
$$ 1821 -376 -1403 603 1206 -689 -963 832 852 -783 -864 533 538 -491 -601 325 502 -430 -868
3097h68R96O37r29q09R72Q66j184q28J380Q94j659p51K011M66k196J4K243l14
$$ -868 128 765 -164 -973 -1 865 -319 -1147 233 1127 -532 -1283 728 1194 -1002 -988 1255 941
3115I41k432P75K531j123k402J458K267j847k093K112J790k124j561K137J149
$$ 941 -1491 -716 1815 692 -1710 -252 2015 168 -1925 187 1977 -147 -1708 429 1578
3130A578j963q25J808M63j506l51J286K04j120q7Q31O9p59j12O72L06o83m94P51
$$ 1578 -385 -1210 598 1061 -445 -796 490 694 -426 -513 318 387 -372 -484 188 494 -189 -683 68
3149F8O31j061n77J138P82j462q93J800P88j958p63K331L69k436q2K728k90k682
$$ 68 699 -362 -939 199 981 -481 -1374 426 1214 -744 -1507 824 1193 -1243 -1325 1403 1113 -1569
3167a569O31K595r07k529J313K282j409j990J581J688j612j464J676J071j486
$$ -1569 -938 1657 750 -1779 -466 1816 407 -1583 -2 1686 74 -1390 286 1357 -129
3182a29q89J349O49j192l49Q67L35q44k79O74L39o93l99P41M87q93p09J036R22
$$ -129 -1018 331 980 -212 -561 306 641 -203 -482 192 531 -162 -561 180 667 -226 -935 101 1023
3201A023j322j010J546J079j931r82K164Q82k333p95K446O40k570l60K637L1k488
$$ 1023 -299 -1309 237 1316 -615 -1597 567 1449 -884 -1679 767 1407 -1163 -1523 1114 1145 -1343
3218a343K72K343n03k207R51J860j095j626J241J404j278j156J321J022j401o91
$$ -1343 -1071 1272 769 -1438 -487 1373 278 -1348 -107 1297 19 -1137 184 1206 -195 -886
3234h86J159O88j052o66R57O96q65p72Q50Q54r05r89R35J102j078j218J335J138
$$ -886 273 961 -91 -757 200 896 31 -741 109 963 58 -931 4 1106 28 -1190 145 1283
3252A283j484j272J671J312j981j134K029J046k208q98K338O21k337k86K277q
$$ 1283 -201 -1473 198 1510 -471 -1605 424 1470 -738 -1636 702 1323 -1014 -1300 977 969
3268I69k159L02J895m97j695O59J591r63j264J125J103j121j013J221Q95j160
$$ 969 -1190 -888 1007 510 -1185 -526 1065 102 -1162 -37 1066 -55 -1068 153 1048 -112
3284a12q23J064Q87r76r90R22J086p99j122P22J271p70j429P90J510r23j438J087
$$ -112 -935 129 1016 40 -950 -28 1058 259 -863 -141 1130 360 -1069 -279 1231 308 -1130 -43
3302d3J239j132j191J263J146j514r78J590P20j761l66J765J71j819o2J790j80
$$ -43 1196 64 -1127 136 1282 -232 -1210 380 1100 -661 -1027 738 909 -910 -972 818 638
3319F38j610K89J607n78j404N43J306n92j133O89R71o72r75P29R65o15r36M31
$$ 638 -972 -683 924 346 -1058 -515 791 199 -934 -245 726 54 -921 -192 773 158 -778 -347
3337c47J104m95j051N64J163n08j347N32J344m20j259M75J269q12j135Q17J179
$$ -347 757 262 -789 -225 938 430 -917 -385 959 539 -720 -245 1024 212 -923 -106 1073
3354A073q70r39Q97O06j039m82J362K14j406j50J313k0j257J57J348l26j456M10
$$ 1073 203 -736 161 767 -272 -754 608 822 -584 -734 579 559 -698 -541 807 481 -975 -565
3372e65J194l07j026L96Q55l96q87K95R45j89q08M5P15q9o84J30Q64j19r61M0
$$ -565 629 322 -704 -308 547 151 -736 -441 504 315 -493 -448 267 178 -506 -376 488 369 -592 -552
3392e52R00J08q26J76P99l85q74M26R64m77o80M79N07p04m57R35N41r65m53Q13
$$ -552 348 456 -370 -194 605 220 -654 -228 736 259 -421 58 565 -139 -596 339 880 -85 -538 275
3412B75K38r04m7J118J6j198k71J140J83q42j43Q71M5j050k55R84N13q13m60N46
$$ 275 513 -391 -438 680 696 -502 -773 367 550 -292 -435 436 481 -569 -824 160 673 -140 -600 -54
3432e4L66p25j24Q84J99r04k75P45N9n91K63Q91n29j042L80J139m53r38P40Q73
$$ -54 312 -413 -537 347 546 -358 -633 112 171 -420 -157 734 205 -837 -457 682 229 -709 31 904
3452I04j008r62J060J139r61r15Q92O38j092n11J246O84j319o25J116L50r46k35
$$ 904 -104 -1066 -6 1133 172 -743 149 787 -305 -816 430 1114 -205 -830 286 636 -310 -545
3470e45J218J57j303l90J258L52j072q5J004j41j306J67J378l6j221O8J102n43
$$ -545 673 830 -473 -863 395 747 -325 -410 594 453 -853 -686 692 656 -565 -497 605 62
3488F2j045P12J308q29j246P77J066j008q23J384R28j630j121J565J058j398p76
$$ 62 -983 -271 1037 208 -1038 -261 805 -203 -1026 358 1286 -344 -1465 100 1158 -240 -1016
3505a016J639M45j806m47J780N94j565m35J444O5j487J64J581k26j451K11J243
$$ -1016 623 1068 -738 -1185 595 1189 -376 -811 633 698 -789 -625 956 730 -721 -510 733
3522G33m74j031P27J201q94j419Q57J306q58j115J154J081j490j162J411J226
$$ 733 259 -772 -45 1156 262 -1157 -300 1006 148 -967 187 1268 -222 -1384 27 1253
3538A253j350r82J311P39j585p19J823O99j697o21J516K83j480o9J696J7j670
$$ 1253 -97 -1079 232 971 -614 -1333 490 1189 -508 -1129 387 670 -810 -879 817 834 -836
3555h36q2J495m2j254L54J275n77j366O25J225n05r69O80Q44q92q53J075R13j041
$$ -836 -918 577 535 -719 -365 910 333 -1033 -408 817 312 -657 23 867 -25 -878 197 1110 69
3574F9r44R53Q73j151o92J233Q73j349q89J166Q25j171n92J114N87j267n24J087
$$ 69 -875 78 951 -200 -892 341 1214 -135 -1024 142 967 -204 -796 318 905 -362 -886 201
3592B01M44q53l54Q51M4r22M2R15K9r03J01P86k69p22L70P71k98q41J48Q23j31
$$ 201 645 -208 -562 289 333 -589 -547 368 397 -506 -405 381 112 -610 -240 531 233 -608 -460 363 232
3613B32p19K72P36k53q60K35Q61r9q17J44P68k56p96L34R01k51r20K22Q78l13
$$ 232 -487 -215 521 268 -592 -357 504 405 -412 -268 500 244 -552 -218 683 432 -488 -266 612 299
3633B99q05L49R72m50r48K81Q96l79p07M17O38n08o49M45O60m17n29L88M29o08
$$ 299 -506 -157 815 365 -583 -302 594 215 -492 -75 563 55 -594 -149 511 94 -435 -47 382 -226
3653b26l96P26M72p45n23P40N48q33n45J051N68j260n93J259O49j165o70J405
$$ -226 -622 104 576 -169 -692 48 596 -237 -782 269 837 -423 -1016 243 892 -273 -943 462
3671D62M82j452m93J505M43j402k70J264J00j146k4J297j34j306J90J195k56j144
$$ 462 944 -508 -1001 504 947 -455 -725 539 639 -507 -531 766 632 -674 -484 711 455 -689
3689f89N26J102o17j160O18J042n23j061P52Q53p69j026R02J000r06j006R40Q58
$$ -689 -163 939 322 -838 -220 822 299 -762 -10 843 74 -952 -50 950 44 -962 -22 836
3707H36j006q72J222Q14j299q48J279Q38j244p69J409N19j461m81J417M92j298
$$ 836 -170 -1042 180 994 -305 -1153 126 964 -280 -1049 360 879 -582 -1063 354 846 -452
3724d52l36J294J08j285K3J301j0j203J27J085l58j001O51R65o27r83N53R49o53
$$ -452 -788 506 614 -671 -648 653 643 -560 -433 652 294 -707 -56 909 282 -701 -148 801 148
3743A48q74P28R85q05j070P33J058p19r62O54R58p33j003Q21R41p88r55P69Q02
$$ 148 -726 2 987 182 -888 -155 903 184 -778 -124 834 101 -902 -81 860 72 -883 -114 688
3762F88q81n98R83N14j039m82R92L87r59k21J040P5j041k0R79j6q59J60P07j94
$$ 688 -193 -791 192 706 -333 -815 177 564 -395 -616 424 499 -542 -562 417 401 -458 -298 409 215
3782B15p52K59P44j72p99K73P16k35p64M08P52k83r20K16R20j51q67K42R16k22
$$ 215 -537 -278 466 294 -505 -232 484 249 -515 -107 645 362 -558 -342 578 427 -440 -198 718 496
3802D96j038K09J050k80r69K43R40m00q51M44O99m96o35O37L95p03k27Q21L8q56
$$ 496 -542 -333 717 437 -532 -289 651 251 -600 -156 543 47 -588 49 444 -259 -486 335 373 -483
3822d83o8Q88k9q89J92Q51j81p66K9Q34L2p84m3O27R9n74j61O55K51o46k69O61
$$ -483 -551 337 308 -581 -389 462 281 -485 -456 378 410 -374 -417 210 309 -265 -426 229 480 -166 -435 226
3844B26J36o16j07P47O7q51Q3Q04q3q33K31P58l05p71M19P48n48n11N04M80o59
$$ 226 362 -254 -361 386 453 -398 -315 489 406 -427 -196 562 257 -514 -95 653 105 -406 98 578 -81
3865h1m27Q17K27q48j60Q45L1q75Q7P85j27p26N1P11l6o45l0O11jn29j50N60J82
$$ -81 -508 309 536 -312 -472 373 404 -471 -384 401 274 -452 -401 310 274 -371 -401 210 209 -320 -470 90 272
3888B72m88k21M19L12m49k47M69K60n39j12O22j26n18J67O55l30o21N15O52o77
$$ 272 -216 -437 -18 294 -155 -402 67 327 -212 -324 298 172 -346 -179 476 146 -475 40 692 15
3908A5o25P98N27q54m13Q88L08q29l39R18J26q11j11Q18J8p98P2N59jn74J36L51
$$ 15 -610 188 715 -139 -552 336 644 -185 -524 394 520 -291 -402 416 434 -364 -292 267 266 -308 -172 179
3930A79rl60QK17R7l04p7K55Q6k50q4K60J02l16k9M01j16m01K24N04l78n40M65
$$ 179 170 -190 -182 35 132 -172 -249 6 92 -158 -242 18 120 -196 -225 176 60 -341 -117 387 9 -531 -66
3953f6O39o64n04P34N96q74n05R52M33r54m01R24L64q14k52P46P9n83LM90j47
$$ -66 573 -91 -595 139 735 -139 -644 308 741 -213 -614 310 674 -140 -392 354 433 -150 -147 343 196
3974A96m22K55K26k58j89K19K11k43k88L43J88k53k18J76L14k52m33K53M44j70
$$ 196 -226 29 255 -3 -192 27 238 -5 -293 50 238 -15 -233 -57 257 5 -428 -175 269 99
3994I9n68K42N91k68p29M44P58n91o51N97O75p02n33O57N69p99m19Q71L00p73
$$ 99 -469 -227 364 96 -633 -189 569 -22 -673 -76 599 -103 -636 21 590 -209 -628 243 543 -230
4014b30k22P39J97q28R9O02n0n75J50M60k72l24K66L87l44l27L40L01l34l59L73
$$ -230 -452 287 484 -344 -245 357 307 -268 -118 342 70 -254 12 399 55 -272 68 369 35 -324 49
4035D9L21k05o20L39N78k28p32J76P53k01q80K94Q31j76r53K28R25l32p93L67
$$ 49 370 165 -455 -116 462 234 -498 -322 431 230 -650 -356 475 299 -654 -426 499 167 -626 -259
4055b59P39m23o61N33N75n94l88O63J71p19l2O92L6o36K4O78j75o65K22O28q3
$$ -259 480 57 -604 -71 504 -90 -478 185 356 -363 -395 297 333 -303 -279 399 224 -441 -219 409 326
4076C26p05J80N59j03o18J81N76l0p27JP58P2q19n2Q44P0r93QJ019J6r94k6Q67
$$ 326 -379 -199 360 257 -361 -180 396 366 -361 -360 398 470 -349 -401 443 513 -480 -472 547 563 -431 -457 410
4099D10n3r31K20R08k97q72M74O10n35m87P04M18q76l20Q53K47q58j49Q89J74
$$ 410 357 -574 -354 554 257 -615 -141 469 -66 -553 151 569 -307 -627 226 473 -385 -534 355 529
4119E29j040j18J040J33q61k92R32J64q30j82Q91L08r03l16P63L39p95j70P86
$$ 529 -511 -629 411 544 -317 -609 323 487 -343 -525 366 674 -229 -545 218 557 -238 -408 378
4138C78J87q84j43Q29Q2p03n1Q52k17q88K33R73l99q39M30P27n98o35O49P11q65
$$ 378 565 -319 -462 367 449 -254 -305 547 330 -558 -325 648 249 -590 -160 567 -31 -666 -17 694 -171
4159a71n19P43M24q12l20R41L16r68k93Q53L53q07l68R33J56q12k52P82M35p03
$$ -171 -690 53 477 -335 -655 286 602 -366 -659 194 547 -260 -628 305 461 -351 -603 179 614 -89
4179h9m26O25L60o25k62O09K92n77l23O62R3n77M4N98j20o39J21P46l20o04L10
$$ -89 -515 110 470 -155 -417 192 484 -93 -416 246 339 -238 -194 404 284 -355 -234 512 192 -412 -102
4200a02O27m10p95N80P67m91q40N74O32n69o34O27O38n82o40N27M93l91m90M18
$$ -102 525 115 -680 -100 667 176 -664 -90 542 -27 -661 -34 604 22 -618 -91 402 11 -479 -61
4220f1L96l21m94M03M38m08l60L91K81l01l33M50L25n10k36L52K82m37j49N38
$$ -61 335 14 -480 -77 361 -47 -407 -16 265 -36 -369 81 406 -104 -340 12 294 -143 -292 246
4240B46J03n81p8O00K4n61RP08k00p68K72P04j34p15J67O80k07o93K55O88j93
$$ 246 349 -232 -310 290 314 -247 -238 470 270 -498 -226 478 344 -371 -204 476 269 -424 -169 519 326
4261C26p07J07N95r1n38J62M86j85m94J38L57n8l73K60K03k58k40K78K39k43k83
$$ 326 -381 -274 321 230 -308 -146 340 155 -339 -201 156 98 -275 -15 188 -70 -310 -32 207 -36 -319
4282c19L60K08m76j05N42J44m26l21N25J97n04j39O12J59o76j60O44Q8o03L4M91
$$ -319 41 249 -227 -332 210 354 -72 -393 132 329 -175 -314 298 457 -219 -379 265 353 -250 -216 275
4303B75K4n45K5M85J12n15K6L20Nm29M2M47l1m23L2K91q0k65J76K74k96k53K12
$$ 275 299 -246 -221 264 376 -139 -113 207 212 -217 -175 272 241 -182 -150 141 61 -204 -28 246 -50 -303 -91
4326i1J88j70j15L75K2m50j30L80K76l70j88M03J05n03j62N28K79l78l26K37K71
$$ -91 97 -73 -188 187 209 -241 -371 9 285 -85 -273 130 235 -268 -430 98 377 -1 -327 -90 181
4347A81k26j86L59J95l41k53K36J59p7J5J06m6k32j8L11j8k09R7K33l71j83L63
$$ 181 -45 -231 128 323 -18 -271 -35 124 47 62 168 122 -110 -128 183 165 -44 53 286 -85 -268 95
4369I5K75k44k90J42K10l04k08M26K96m52k68K72J55j76j25L18J9k73k48L26K23
$$ 95 370 126 -164 -22 188 -116 -324 102 398 -54 -322 -50 105 -71 -196 122 141 -132 -380 -54 169
4390A69j64o7Q2N5k73k2K31J65q9k55Q7N6p6O9K29n5j93n9J19m0o4K18K07l44
$$ 169 5 -62 20 75 -198 -220 11 176 87 -168 -81 -25 -101 -32 197 142 -51 -110 9 -31 -95 123 330 -14
4414a4l04K63M25k70k73K86K44m18k37L09M68l61l10J87J48k23n7K70J79k76k03
$$ -14 -318 -55 370 100 -173 113 357 -61 -298 11 479 118 -192 -5 143 -80 -137 133 312 36 -167
4435a67Q9J00o0mJ66l9k53%J90m5njO6k40o6R6L29l9l52J49J99j45k71L40K84
$$ -167 -78 22 -38 -42 124 85 -168 -168 22 -23 -28 -29 37 -203 -269 -173 156 117 -235 -86 113 -32 -303 37 321
4460C21k22l92J80L80j78l27K63L67l74l59L04M15k62k86K36J78l70k9L10J29
$$ 321 99 -293 -113 267 89 -238 25 392 18 -341 -37 378 116 -170 66 244 -126 -155 155 284
4480B84k27o6J06n1j88J57K12j16k98R8K41j16k58K27K28k02m07K11M14j51l72
$$ 284 57 -9 97 46 -142 15 227 111 -187 -89 152 36 -222 5 233 31 -376 -165 249 98 -274
4501b74R5M28j45n46J54N22Ln49Q4L90l9l43Q9L96j91m02K33L55k75j24L06J47
$$ -274 -179 249 104 -442 -288 234 237 -312 -228 162 123 -220 -131 265 74 -328 -95 260 -15 -139 167 314
4523C14m31j10M58Q5l92m7M25q0l77j4M37K7m36J1L84j51k86P4M03j25l88M3L64
$$ 314 -117 -227 231 316 -76 -123 302 222 -155 -169 268 295 -141 -130 254 103 -183 -109 294 169 -219 -176 188
4546A88K7m55j1M25km70K8M44M0m79m0N64j12n09J79M07k17k78Q1M04k32l09L19
$$ 188 215 -240 -251 174 172 -298 -270 174 214 -265 -305 259 147 -362 -183 224 7 -271 -190 214 -18 -327 -8
4569hK42l81j60M24J70m26j52N39N2m82j33N40P6m83n2M37J32m65j55N49P1m07
$$ -8 234 -147 -307 117 287 -139 -291 248 300 -182 -315 225 301 -182 -234 203 335 -130 -285 264 335 -72
4591g2j21L61J50l98j22K89J73l55j49L91K9k51j58L62M4m42J10L83j23l90J38
$$ -72 -193 168 318 -80 -202 87 260 -95 -244 147 176 -75 -233 129 173 -269 -159 224 101 -289 -151
4612a51L57k13l87L75K88l32m27M55L38l91k33L51L27m47k89M38K63l97k27L89
$$ -151 206 -7 -394 -19 269 -63 -490 -35 303 -88 -321 30 357 -90 -379 59 322 -75 -302 87
4632H7K50l91k61L86K79l00k37K62K58k58l48K39L61k59k92K72J84k29j31K83
$$ 87 337 -54 -315 71 350 50 -187 75 333 75 -273 -34 327 68 -224 48 232 3 -128 155
4652A55R3l99l4M50n1m42O6M06j55l68J18N04j77n28L02L38j60m37K19L20j51
$$ 155 248 -151 -185 265 214 -228 -162 244 89 -279 -161 343 166 -362 -60 278 118 -319 -100 220 69
4673F9l75J86L53j91l82K10K59n2l06J73K49q1j87J3K77j66k28J38K53j38k98
$$ 69 -306 -120 233 42 -340 -130 129 77 -229 -56 193 112 -75 -62 215 49 -179 -41 212 74 -224
4694b24J94K81j66k61K19J49k26j71L40J66m47p9M47M7m71L7N06n0n10L0M66m7
$$ -224 -30 251 85 -176 43 192 -34 -205 135 301 -146 -225 222 269 -202 -165 341 291 -219 -189 277 230
4716B30m47k4M65r1l58j4M02l3l47O7K91ok68O0J07Q3k04p7K14K4k10k4K20J0
$$ 230 -217 -241 224 133 -225 -239 163 130 -217 -150 141 135 -133 -73 34 117 -87 -164 50 74 -136 -160 60 70
4740G0k43J50K07j45l18K37L18k16l50L85K53l54k70L32L04l76k18L35J34k80
$$ 70 -173 -23 184 39 -279 -42 276 60 -290 95 348 -6 -276 56 360 -16 -234 101 235 -45
4760d5j73L71J00l04j05K71P6k67K2J85n4j87JJ42N9j45qJ15k5j22k5J60qr4m2
$$ -45 -218 153 253 -51 -156 115 191 -76 -54 131 77 -110 -109 33 92 -53 -61 54 29 -93 -118 42 34 -60 -102
4785a02J99p8j76Q8K01p5k74J84K00j84j72J45K66k60k18K08K70k56j03K19K08
$$ -102 97 19 -157 -69 132 57 -217 -33 167 -17 -189 -44 222 -38 -256 -48 222 -34 -137 82 290
4806B90k91j51J61J27j26j48J66j0l5m6J35no7l1N6r2Q3J1k0l7l4l1J85j00ol3
$$ 290 -1 -152 9 136 10 -138 28 18 -17 -63 72 67 0 -31 25 -67 16 27 7 -30 -64 -95 90 -10 -16 -49
4832d9J01o4o8M1Q4j3j56N1J10l7j72P8J57%k61P7J20Q0j64N7R8j01j00J22P7
$$ -49 52 -12 -80 -39 45 32 -124 -73 37 0 -172 -94 63 63 -198 -121 -1 79 -85 -28 70 -31 -131 -9 68
4857F8k4qjq5M3N9jn8M6N4o2n4J2J19J1q7n7L2K3Pr7Q1M9o7j13kJ50J07j48r8
$$ 68 44 36 35 -50 -7 52 51 -7 39 93 31 -23 -11 108 119 32 -25 7 30 37 -60 21 70 3 -110 -112 38 145 -3 -101
4887a01J29M8j26j12K09P7j15j25M9N8j0nJ8l8J2N9p8k1k8J88n8j92J64O2Jj01
$$ -101 28 76 -50 -162 47 124 9 -116 -67 -9 -19 -24 -6 -44 -32 27 -51 -72 -100 88 30 -162 2 64 65 -36
4913c6O9J00j44p1R3J12l9r2oJ08p5m3K3J10o7j10P4J12n3q3J2j6K4r3K0J20o0
$$ -36 33 133 -11 -82 11 123 84 -8 -14 94 19 -24 -1 109 42 -68 6 118 65 -18 -6 -22 2 -91 -71 49 -11
4940a1n4rR4j01k2J69J0j76l6J93j10j13J58J44p7l19J37K35j01k08J45J79r5
$$ -11 -65 -74 20 -81 -103 66 76 -100 -136 57 -53 -166 -8 136 59 -260 -123 112 11 -197 -52 127 32
4963C2k13J53J79p6j94J66M4j16l5J24M6j16l9P0Q1j31p2K06m6q8RJ01j7j00L7
$$ 32 -181 -28 151 75 -119 47 91 -25 -60 64 110 -6 -45 25 106 -25 -97 109 63 -25 -16 85 68 -32 5
4988EP7N3j82p4K58k5k06mK14o0k33J23J44j2k42J26K00j61k52P9K94r3j98O6
$$ 5 82 135 -47 -121 137 112 -94 -98 116 56 -177 -54 90 78 -164 -38 162 1 -251 -172 122 29 -169 -103
5012a03J59j01q8P5J34r8j07O9P7m8k9J40n4p3k7J72j3p1j1J14m0j03p7K54J3
$$ -103 56 -45 -133 -58 76 -22 -129 -60 17 -31 -60 80 26 -47 -74 98 85 14 3 117 77 -26 -103 151 164
5037A64k19j17K53R7k14o6J61J48k99K7J38J4q6j12O4Q7o3l4Q5J30j32j16Q7j
$$ 164 -55 -172 81 178 -36 -102 59 207 -92 -65 73 87 1 -111 -47 40 -23 -57 28 158 26 -90 -3 -4
5061dq8N1R5o1j22L6J24l8r7J03K3M1j96J6J24rk6k0P5j4j59N3L46j72j99P3J80
$$ -4 -92 -41 54 -7 -129 -93 31 -7 -104 -1 22 63 -133 -117 7 -2 -28 -48 27 13 -146 -93 253 81 -118 -45 135
5088A35j43j42J21K57j91k05J23K19o7k21N4J46l8j93J22J78l2k37R7R2j03j33
$$ 135 -8 -150 -29 228 37 -168 -45 174 107 -114 -60 86 48 -145 -23 155 123 -114 -17 75 -28 -161
5110a61K06R5j67j81J39J48j71m4K31m2k33r0L41N2k36m1K56lk75K0K63L9l32
$$ -161 45 140 -27 -208 -69 79 -92 -136 95 53 -180 -270 71 123 -113 -154 102 99 -176 -156 107 146 -186
5133a86L9K26n5k05L3L16p5j69k5J34N6k08J47J34q4k05Q0K28l3k47Q2J99j50
$$ -186 -147 79 24 -181 -148 168 93 -76 -101 33 89 -119 28 162 78 -127 -47 181 148 -99 -17 182 32
5156C2j66J38K02j98j34J50O2j21j28K37R6k71nJ11J17k47j7K59Kk27j21K35J01
$$ 32 -134 4 206 8 -126 24 86 -35 -163 74 170 -101 -106 5 122 -125 -142 117 119 -108 -229 6 107
5179A07k16l8K27m6k07KK37k9p4K0L7Q6j55j1O7K0m2J6K1j2j5jJ10o1r8LJ74n4
$$ 107 -109 -147 80 34 -173 -171 66 37 -37 -17 20 106 -49 -60 7 27 -15 1 22 10 -5 -6 104 43 -55 -52 122 68
5207F8j67J18J11p2j86J68P1l8j27O3P9j41q2J15J45j67o5J22M2j79O8P0M1o2
$$ 68 -99 19 130 58 -128 40 111 73 -54 9 88 -53 -135 -20 125 -42 -107 15 57 -122 -54 16 57 -5
5231er8P2P4j04l8J3R3M3j21MJ14p1rOj5j0L8P0Lj01qN9O1j64M7J52j7j76J1K10
$$ -5 -103 -31 43 -61 -99 -86 7 50 -71 -67 47 -24 -33 -27 -42 -52 -14 56 59 -42 -50 9 70 -94 -47 105 88 -88 -77 133
5261A33mk11N5J55k6j48N0J40q2r2QQ5j4J8p4L0l2m9Q9q2O3p7kM3N3q1J9K4lk6
$$ 133 129 -82 -27 128 102 -46 4 144 62 -30 -22 63 49 67 -7 23 -9 -58 31 -51 12 -65 -67 -24 29 -52 -33 -9 -12 -38
5291c8j7J14K6j53l5J11K3j27P0R8k6j24Q6J01j08q0Q8R1j13j7J11k8o6m5M6J01
$$ -38 -55 59 85 -68 -103 8 31 -96 -26 72 46 -78 8 109 1 -79 9 100 -13 -30 81 53 -13 -58 -12 89
5317H9j37L8ON2l6J6MK6m7mq7N3Q2n9m2P9kn2j1P8l1m5N7j7m0n8J65q7q2M5J14
$$ 89 -48 -10 -4 48 12 28 32 58 11 7 -80 -27 55 -4 -46 33 31 -21 -32 46 15 -30 27 10 -30 -88 77 -10 -92 -47 67
5348F7p4n0K2K5p1P6m5J02j05J6omJ04r1Q7o9N5J4r%q1Q2n6L5pQo9N4M9%j43J11
$$ 67 -7 -57 -35 -10 -81 -5 -50 52 -53 -37 -43 -47 57 -34 53 -16 39 53 44 44 -37 45 -11 24 17 25 -44 10 59 59 -84 27
5380B7P5j04J2l9N7o6N9M4l9m2N9J3j14l8L7J26j01n0J17n8j9k9Q9o6L7j9JN2
$$ 27 102 -2 10 -29 28 -38 21 65 26 -16 43 56 -58 -96 -59 67 -34 -84 33 -25 -44 -73 16 -50 -13 -32 -31 21
5408B1K6j01n8J03P3q5p1J00O7r5o4L7J42j05pK8K2l8M5mJ6j6nL8j15J9P5No0
$$ 21 47 -54 -112 -9 64 -21 -92 8 75 -20 -84 -47 95 -10 -17 11 33 -5 40 36 52 36 31 69 -46 -27 48 53 -7
5437gq9J24K0k1m3PJ11q1l2K3pK6j4j01J05o5J3n3R4J9m0q0J10L2j27J3J01J3
$$ -7 -96 28 48 27 -16 -9 102 21 -11 12 5 31 17 -84 21 -44 -31 -84 10 29 -11 -91 19 51 -76 -63 38 51
5465E1j68O4P8r6k4J03JK7r3RQ0q2M1O1l6l9K3M8j03Q2N6j6J3q1n9J59p1j9l3
$$ 51 -117 -53 25 -71 -95 8 9 36 -57 -48 32 -50 -9 52 16 -23 0 48 -55 27 83 67 80 -1 -60 99 28 9 -24
5494b4N2R6q6o1O5N2j00o5J27m0Kj25J14Q5j21r1J98l7n7n7J24j6j62P8R6p8J
$$ -24 28 124 38 -23 42 94 -6 -71 56 16 18 -107 7 92 -29 -120 78 41 -16 -73 51 35 -127 -49 47 -31 -30
5521c0L9l1kj20J60j6m5N7M4m2k4n7J08N8j04Q4p1n9O4n1Q3m4Q4j82J16j2J1k1
$$ -30 9 -22 -24 -144 16 0 -45 12 56 14 -10 -67 41 99 -5 79 8 -51 13 -38 45 1 85 -97 19 7 18 -3
5549cjQ2l4j34L5J71n0j54J04k2No0Q7j8K1p4M8pn6R7K6r0l4L5J0k7j9J53n6o6
$$ -3 -4 78 44 -90 -55 116 66 -88 16 -6 -1 -61 26 8 29 -45 3 -4 -60 37 63 -27 -61 -26 -16 -43 -62 91 35 -31
5579c1n4L6J8J01r3KL8k4J0o3J79j7j19j32J64K3ro7J05J3j45m7J95k8Oo6M8n1
$$ -31 -85 -49 -31 70 -23 -21 17 -7 3 -60 119 102 -17 -149 15 38 29 -38 67 80 -65 -112 83 55 61 -5 43 -8
5607hj9k5J59p6k5l0j1k7L0N0P2j30RO3m9J5K7J1n7p6K2Q6m3R0j19P6N8r0j24
$$ -8 -27 -52 107 31 6 -24 -35 -62 -32 18 90 -40 -31 32 -17 -2 25 36 -21 -97 -75 11 -32 58 -61 15 73 -17 -141
5636a41Q3J85o0p8p2J32l6n3J08K5k7q1O5j5JK6Nj29O8k3L1M4r1P8o5J3j5O7M7
$$ -141 -58 127 67 -11 -83 49 13 -40 68 93 66 -15 50 35 36 62 67 -62 6 -17 14 58 -33 45 -20 -7 -22 45 92
5665I2j7q2l0L5m3J16p8K1L2o1o2Q9J6n6M8N9m8j42J7J51K8j68K0J19q8n3L7J40
$$ 92 75 -7 -37 -2 -45 71 -7 14 46 -15 -77 12 28 -28 20 79 31 -111 -94 57 85 -83 -63 56 -32 -85 -48 92
5693I2k0p9p7J12LL7o1L0M1l2j6J8r2J26m3m5O4r7Q1Mj06mO8l3Q4j12K5Q7j2j34
$$ 92 72 -7 -84 28 31 68 7 37 78 46 30 48 -44 82 39 -6 58 -39 42 46 -60 -64 4 -29 55 -57 -32 55 43 -91
5723i1J13N0m5q3n1J92o8j69Q0J40o8q6O6O4m6o2%J54j29pk9P9m7jK7KPr3J36
$$ -91 22 72 27 -56 -107 85 17 -152 -72 68 0 -86 -20 44 -2 -64 -64 90 -39 -46 -75 4 -43 -44 -17 -15 -8 -101 35
5752C5o6K4l6N4L1m4j8J03Nq7m7J09j7j38K1J36Pj37K9J33j8j30o2K46r1m1k8
$$ 35 -31 -7 -43 11 42 -2 -20 83 88 1 -46 63 46 -92 -71 65 72 -65 -36 97 79 -51 -113 133 42 1 -27
5779b7J68m7j81K8R8j4j04J3Q5q0K2K3qJ0M8p1Q1j16K2J15p9km7J8R5r0L3Q1j5
$$ -27 141 94 -87 -59 39 25 -79 -66 19 -61 -39 -16 -24 -14 34 -37 44 -72 -50 65 -14 -16 -63 -45 50 -40 -7 74 59
5808E9j32j4J10P5j23k6Q0J21j56k0P4J3l2q9J07K3o9n8Q5J03p1r2P3Nk2JN1J
$$ 59 -73 -87 23 98 -25 -51 29 150 -6 -26 48 61 29 -60 47 70 1 -57 28 131 60 -32 41 46 24 25 76 77
5836G7j38K1N8O8p5J0k0Mo0M7p8J95j36l9J18q4M3o8R6J2j21J5P1m4jj5J10n4
$$ 77 -61 -40 18 86 11 21 1 5 -55 -8 -86 109 -27 -66 52 -32 11 -57 39 51 -70 -55 16 -28 -29 -44 66 12
5864A2q7MR9J02j52L1M0n4m2QK5Q9j00j6P8J6m7J5Q3j2j03N1Qj09P4J4N1o4m7
$$ 12 -75 -71 28 130 -22 9 49 -5 -47 -39 -14 75 -25 -41 37 53 6 21 104 92 -11 40 48 -61 13 27 78 14 -33
5893c3P8N6j00l3J8P9n9o6L9N9l4j10P8M1o5k9P6j7r2M6M6J11j18o0R1J4j05N6
$$ -33 45 101 1 -32 -14 65 6 -60 -21 38 4 -106 -28 13 -52 -81 -5 -22 -114 -68 -22 89 -29 -89 2 16 -89 -33
5921c3J3K5j05Q2L1K8j06J02k2k9k4J36k0j20J09k9J2r2Q5l9QJm0O7P1o7p8L4
$$ -33 -20 5 -100 -18 13 41 -65 37 15 -14 -38 98 78 -42 67 38 50 -42 43 4 12 13 -27 40 111 44 -34 0
5949@O9m5j16P2N1m5q3M0J00n9m6J12j4o6%JL3n5N8l0MK1j01J28j09M0M0K8l0
$$ 0 69 24 -92 -20 31 -14 -97 -57 43 -16 -62 50 36 -30 -30 -29 4 -51 7 -23 -19 2 -99 29 -80 -40 0 28 -2
5978bj09J26jl3J8J0L6p1J4J5P4k8n4J8M5n6L6n3pK7o3J1P5N1j06K6R4p7n0jP
$$ -2 -111 15 14 -19 -1 9 45 -26 -12 3 77 49 -5 13 58 2 38 -15 -22 5 -58 -47 28 79 -27 -1 93 16 -34 -35 -28
6009b8M9k2J2m2O1n4JQ9o6k9M3j0m0JJ5NlL7l5m8%N1K1qq6Q6k9J28j59%J30L2
$$ -28 21 -1 11 -31 30 -24 -23 66 0 -29 14 4 -36 -35 -20 -15 -18 19 -16 -64 -64 -13 8 0 -86 0 -29 99 -60 -60 70 102
6041A02r0p3L0K7J03o5l9K3L5p6L8j5K7l2lN4L1p5J8kl1K4j1M0%n5K9q7O4M2j3
$$ 102 12 -61 -31 -4 99 34 -5 18 53 -23 15 0 27 -5 -8 46 77 2 20 18 -13 11 0 40 40 -15 14 -73 -9 33 20
6072B0%m7K1L9q2k8P0K3p2L3L0n4Q7n1j4K5L4m0n9R1M9r4k3O2L4k3n7J2N0pl6
$$ 20 20 -27 -6 33 -49 -77 -7 16 -56 -23 7 -47 40 -11 -25 0 34 -6 -65 26 75 -19 -42 20 54 31 -26 -14 36 29 -7
6103glO6Pp4km4J00k7N4q3J3L1n9Q1o4M6r4J6K8k7J4J7J8n1P3lp0j2LQ4r7N0l6
$$ -7 -10 56 63 -11 -13 -57 43 16 70 -13 0 31 -28 53 -11 35 -59 -43 -15 -42 -28 -11 7 -44 29 26 -44 -56 -53 31 -66 -16 -52
6136e2N7m6pO7k3K6j18J03M3p1n1O4nL5k5Nj1J4q0R6On2m5J7R2K5k3j08O1L3l0
$$ -52 5 -41 -48 19 -4 22 -96 7 50 -21 -72 -8 -13 22 -3 2 -9 5 -75 21 27 -25 -70 -53 39 64 41 -67 -6 27 -3
6167cM5pp1M4O6q7oM2K6l8p5N6oM1j11L8J42j02p6J8J52o2j56R9N9Kp8M0M4k4
$$ -3 42 35 -36 8 74 -13 -19 23 49 11 -64 -8 -14 27 -84 -46 96 -6 -82 -64 88 26 -130 -31 28 30 -48 -8 36 12
6197A2l7l8J02k4p2P3o4K8m2j3J20Ml4o3K6J9p2P7K4r1m4J25k0rO1k5j9jr9J34
$$ 12 -25 -63 39 15 -57 16 -48 -20 -62 -75 45 49 15 -48 -22 -3 -75 2 26 -65 -109 16 -4 -13 48 23 4 3 -96 38
6227C8M5j10j3M9K1j10K5N8R5r1q2Q1Qj7n7M8P7k8j41P2J18o9l6p0J31j15N2O8
$$ 38 83 -27 -40 9 30 -80 -55 3 98 7 -75 6 14 -3 -60 -12 65 37 -104 -32 86 17 -19 -89 42 -73 -21 47
6255D7n1o7P9Ljo7L4P4k5n2J6R0p0p5M4J39l3j57N0J67j05j68Q9Q9q2k8Q5O0l9
$$ 47 -4 -71 8 11 10 -57 -23 51 26 -26 -10 80 10 -65 -21 118 85 -72 -22 145 40 -128 -39 50 -32 -60 25 85 46
6284D6j07J2P3N1j06R2m2mr3J33J7r6j6M9k7l6k3N5Q8q1j04J47l6o2JJ39K8j88
$$ 46 -61 -49 24 75 -31 61 19 15 -78 55 72 -24 -40 9 -18 -54 -77 -22 66 -15 -119 28 -8 -70 -69 70 98 -90
6312i0RJ64m1m7p5K01p4k22J32J00j2q6l5J61m4j04R5M1P2j78j9O5j4k2R4kn8
$$ -90 -81 83 42 -5 -80 121 47 -175 -43 57 45 -41 -76 85 41 -63 32 73 145 -33 -52 13 -1 -23 71 69 11
6339A1o6M3P4k9o4M9J4o9j8K2J28j94N7R6k8o2r5J33M9j54L6R9K2l2q4P5Jr0M4
$$ 11 -55 -12 62 33 -31 18 32 -37 -55 -33 95 -99 -42 54 26 -36 -131 2 51 -103 -67 32 54 22 -62 13 14 -76 -32
6368c2J02k5k0q3Q8k1n2l4K21r4p3L8J0K0j08Q2JK5q0R8l4p4L1L0J7p0j4R9j2
$$ -32 70 45 25 -58 30 9 -43 -77 144 50 -23 15 25 45 -63 19 20 45 -35 63 29 -45 -14 16 33 -37 -51 48 36
6397C6j9p5O2N5j38M6N3M6p6kk7J23q4l7L3L6j9m9J9O8l2q0k7O3RN4ok6n9M9j5
$$ 36 17 -58 4 59 -79 -33 20 66 -10 -12 -39 84 0 -37 -4 32 13 -36 -17 51 19 -61 -88 -25 -16 38 32 6 -53 -4 -19
6428a9k0pR1j4Oj3o6J35qk4l1k1j2J4j3L3M5r3N4l4N5o7k9L2L2j1o7KJ19p5q2
$$ -19 -39 -46 45 31 37 24 -42 93 85 61 30 9 -3 11 -2 31 76 -17 37 3 58 -9 -38 -6 26 15 -52 -50 69 -6 -88
6459h8K1J57j63N9MJ3m6m4N8L6o2Q8l2J9n3m3N3Ll5K3K7m3K6M1M4r9k2N5P2j13
$$ -88 -67 90 -73 -14 -10 3 -43 -87 -29 7 -55 33 1 20 -33 -76 -23 -20 -55 -32 -5 -48 -22 19 63 -36 -58 -3 69 -44
6489d4JM2M9q7kM0J7L1m0K5J06r6n0k4O9N0o1JJ6m6nP0k9n9mJ19j11m2N3P0m3
$$ -44 -43 -1 48 -39 -41 -1 16 47 7 32 138 42 -8 -32 37 87 26 27 43 -3 -8 62 33 -26 -30 89 -22 -64 -11 59 16
6520A6k8K9N5p9M6n8O5o6n1J1J25m8q6J61q5J2l2mJ6m9oL4P9q0l0O4J5j4om5Q4
$$ 16 -12 17 72 -7 39 -19 46 -20 -71 -60 65 17 -69 92 7 19 -13 -17 -1 -50 -56 -22 57 -23 -53 11 26 12 6 -39 45
6551D5k3K4L6j40N9M1m9N1j17J67n2Lp6N4M5j43K6O8m7qK7ON0j00l5M8Q5l9q6
$$ 45 22 46 82 -58 1 42 -7 44 -73 94 42 45 -31 23 68 -75 -49 19 -28 -36 -9 -3 47 -53 -88 -40 45 6 -80
6580h0N7n0lP8j1rm0Q3m9L4J2o4N5k8m6L7K0p6Q3N2k0j05L4O0J2op1J17j8j27
$$ -80 -23 -73 -76 2 -9 -18 -58 25 -24 10 22 -42 13 -15 -61 -24 -4 -80 3 55 35 -70 -36 24 36 30 -41 76 58 -69
6610f9J5L6N2l9KoN8q7N8NL3n7K3J9n0kM6j6j01M0L5L7j01N2K4Jk8l4O2K6o6J3
$$ -69 -54 -18 34 -5 -3 -9 49 -38 20 25 58 1 24 43 -7 -9 37 21 -80 -40 -5 32 -69 -17 7 8 -20 -54 8 34 -32 -19
6642a9k6N0o7PO7L2r5j2P6P5j39LM9oko8N2K6n2J15m7K6l8L0m6l4N3n2N6m1lL5
$$ -19 -45 5 -62 -55 12 44 -51 -63 13 88 -51 -48 1 -5 -7 -75 -23 3 -49 66 19 45 7 37 -9 -43 10 -42 14 -27 -30 5
6674EL9r5Pj9J03k9r4P7O1%j08R6Nl6o3j8O2M8p6J3N1m6o1Q1Kk3m4QQ0o8j8N4
$$ 5 44 -51 -44 -63 40 11 -83 -6 55 55 -53 43 48 12 -51 -69 -7 41 -35 -22 29 -17 -78 3 5 -18 -62 -54 26 -42 -60 -6
6706fJ9%l1M3o1N7n9L8qp2K3O0K6o3O4N2j06l0N3L8p1NPN2K1p4k7N7K9k0KN1m8
$$ -6 13 13 -18 25 -36 21 -38 0 -8 -80 -57 3 29 -34 30 82 -24 -54 -1 37 -34 -29 -22 30 51 -23 -50 7 36 16 18 69 21
6739B1p1N6Q2m2r0K2N9l6m5K1O2n2k9M5rJ4p5J14m8mPM7o0OJ1K9j11K0K2R2j8
$$ 21 -50 6 88 46 -44 -22 37 1 -44 -23 39 -13 -42 3 -6 8 -67 47 -1 -5 2 49 -11 -5 6 35 -76 -56 -34 58 40
6770D0q6m5J73l9j26M5L7kn4O3M1M0j33l1J03Q7j94L8J46r6r3R5j1j4m6P3M5j02
$$ 40 -46 -91 82 43 -83 -38 -1 -3 -57 6 47 87 -46 -77 26 113 -81 -43 103 7 -86 9 -2 -16 -62 11 56 -46
6798d6k7J19n0k2l6P2rj0%K0N5j35KK4J02r1k7R0P0j28KK6M3p1o7J27m3N1m5j0
$$ -46 -73 46 -4 -26 -62 10 1 -9 -9 11 66 -69 -67 -43 59 -32 -59 31 101 -27 -25 1 44 -27 -94 33 -10 41 -4 -14
6828a4N6m2q8J07k1M0k4K4L8j17NN0k0L1m6L7j3k2ON1r0L4K2M1k8j13O3Q1m1J6
$$ -14 42 0 -88 19 -2 38 14 38 76 -41 -36 14 -6 25 -21 16 3 -19 -13 38 -52 -18 4 45 17 -96 -33 48 7 23
6858B3o4M7m5k1rJ24Rp4j3J4L1j44M5J32l1j0n1Q6p7mJ28p6l0k3O3J6m7m4N0L3
$$ 23 -41 6 -39 -60 -69 55 64 -10 -23 -9 22 -122 -77 55 24 14 -37 49 -28 -32 96 20 -10 -33 30 46 -1 -45 5 38
6888C8q5N9L0K3j33N7lon%L8J33j63K7pM1l3n9J00j7q3L0Q8k2k8j03J60l7p8m1
$$ 38 -47 12 42 65 -68 -11 -14 -20 -25 -25 13 146 -17 10 3 44 11 -48 52 35 -48 -18 70 48 20 -83 77 40 -38 -79
6918g9J15j5l1KJ1j8q6R2O9m1q0P0k0Oq0J13L4n6k0K7l9J8m3L4J3M0j46J98n2
$$ -79 36 21 -10 -8 3 -15 -101 -9 60 19 -61 9 -11 -5 -85 28 62 6 -14 13 -26 -8 -51 -17 -4 36 -110 88 36
6947C6r3l1J33Qp1kpJ01m1Km4L5j1p0J08k4r3R2Oj6p3O6K1o0lN6l5N5q2K7k4j3
$$ 36 -57 -88 45 53 -18 -20 -27 74 33 35 -9 26 15 -55 53 29 -64 28 34 18 -55 11 32 -28 -31 25 -10 45 -37 -10 -34 -47
6979d7L7K4Plk2J1K3j2m9OO8o5N0Lj9j9oP6Jo5k2K3Oj6K2k2pN1Mj4L8m8k6MNl7
$$ -47 -10 14 21 18 -4 7 30 18 -31 -25 43 -22 28 31 12 -7 -13 63 64 -1 -23 0 6 -10 12 -10 -17 34 38 24 62 14 -12 -8 -3 -40
7015d0L3k0k7L4kM4n0MK2k9L8j7J8Lk7j1L5J0j0k0J9J2k2O0j39Q3lO9r2nj8N7
$$ -40 -7 -27 -54 -20 -22 22 -28 -24 -2 -31 7 -10 8 11 -16 -27 8 18 8 -12 7 19 -3 57 -82 1 -2 67 -25 -30 -48 9
7047Io9K7K4pM6k6o6P8Mk7j5P7k7q7N5M1L1r1M4j7L6o0K3N5o9mRK5o8M8M6l8l8
$$ 9 -60 -33 -9 -16 30 4 -62 16 20 -7 -22 55 28 -59 -4 37 68 -23 21 4 40 -20 3 58 -11 -15 -6 19 -49 -1 45 7 -31
7080c1N1m1QM5p1K0Q8p3k8L3LO2j26N0L2m8k5P8j5rk1L3lj9M3pRl0p7Q2PnJ1n6
$$ -31 20 -21 -13 32 -39 -19 69 -4 -32 1 4 66 -60 -10 22 -26 -51 27 12 3 -18 15 12 -7 36 29 38 8 -69 13 20 15 26 -30
7114c0j9R4n2L9k7k2J1L5l1K9Om5L1q0J1Q7l3J9qL2J5q8J2JK4l4N3J2Kr2Q3l4
$$ -30 -49 45 -7 32 5 -17 -6 29 -2 27 33 -12 19 -61 -50 37 4 23 15 47 62 -26 -14 -13 11 -23 30 42 44 -48 35 1
7146AnJl3L3J2k6j1K1k0q2Q2J8L3n9k6M8K9J3q0P5J4j04P1L1l2J4j0Qnl9J9R4
$$ 1 -4 -3 -36 -3 9 -17 -28 -7 -27 -109 -27 -9 24 -35 -61 -13 16 29 -51 24 38 -66 5 36 4 18 8 16 11 -28 -9 85
7178H5r5N3m3J2lj9P6k0p9mQ1k6l8j1Ljo0J4J28m8m%KLJ4l8K0Ll8j1J01l5o4J5
$$ 85 -10 43 0 12 9 -10 66 46 -33 -37 44 18 -20 -31 -28 -29 -89 -75 53 5 1 1 3 6 20 -18 2 5 -33 -44 57 22 -42 -27
7212b7K0J3o4K3R5m7o2L6K2jm2O8k0K0p6%QR5n7O8j6j06L8M1o6M6m7N2N3r2J5
$$ -27 -7 6 -58 -35 60 13 -49 -13 9 8 -34 34 14 34 -42 -42 -34 61 4 72 56 -50 -12 29 -37 9 -38 14 67 -25 -10
7243a0k4O2K7Kr4L0oJ9LJj8l6Q7p7l8O3L6L6r4M3n8Q3p4q0J79o5L9m6N9r9m3O8
$$ -10 -34 28 55 57 -37 -7 -13 6 9 10 -8 -44 43 -34 -72 -9 27 63 -31 12 -46 37 -37 -117 62 -3 36 -10 49 -50 -93 -25
7275b5P4rp3L5j5j5J4l5N1J4q7P1L0l5m5J21p8ql5N3L8o2O2j6J4k2j1L3l6o7L9
$$ -25 49 40 -33 2 -13 -28 -14 -49 2 16 -71 0 30 -5 -50 71 -7 -15 -50 3 41 -21 41 25 39 17 6 39 3 -64 -25
7306b5k3L1m3N1MO1o3N6n0j4j0K2Kl7JK4L3J2r0L9L1Qn4K8kjr3O3L9k8j1J5J4
$$ -25 -48 -17 -60 -9 -5 56 -7 49 -1 -15 -25 -3 -1 -38 -37 -13 20 32 -58 -19 12 20 -34 -6 -8 -9 -102 -39 0 -28 -39 -24 -10
7339a0n8RQ5J9l4j6m3P0p3M8oN0o0Rj2M7Lm2R0k7o9k7Q4n0k8P6L9q8K4jK4ll0
$$ -10 -68 -59 26 45 11 -5 -48 22 -51 -3 -9 41 -19 -10 -22 25 28 -14 76 49 -20 -47 37 -13 -41 35 74 -14 10 9 33 30 0
7372@m0L3oK2j12Q5M7p7J0j9K0Jo6P4k6O5l0K8K8j14N4R6n3p9J08l5j4OO8p8J8
$$ 0 -40 -7 -13 9 -103 -18 29 -48 -38 -57 -37 -36 -102 -28 -54 11 -19 9 37 -77 -23 73 20 -59 49 14 0 6 74 -4 14
7403A4m0R7l4M2j3m7L1n1Mm9P6qj1L3k4j6p3N5P2j9r9PJ08j39R9L1m9m6Q5l2k4
$$ 14 -26 71 37 79 66 19 50 -1 3 -46 30 22 11 44 20 4 -69 -14 58 39 -60 -53 55 -84 15 46 -3 -49 36 4 -20
7434b0k3j1K2Pl2jO2l2M1m9jN9n2joJ41j43M0NoO1o9M4k6jj3K0N0o0j8L1pj2J3
$$ -20 -43 -54 -32 -25 -57 -58 4 -28 13 -36 -37 22 -30 -31 -37 104 -39 1 6 0 61 -8 36 10 9 -4 16 66 6 -12 19 12 0 13
7468A3L2K9m6%m6M1j02L1M7Pm2M6N6n0loM0k7m8K8m8Q0j9k9o5N1rL9Om2O0k3k0
$$ 13 45 74 28 28 -18 23 -79 -48 -1 6 -36 10 66 16 13 7 47 20 -28 0 -48 32 13 -16 -81 -30 -39 0 6 -36 24 1 -19
7501a9J4K6m3k2L7J4k2K9m8K7N0J0r9P7K3m3j5J0k7J3jj8N1j3L7n3KKONn3L8L9
$$ -19 -5 21 -22 -44 -7 7 -15 14 -34 -7 43 53 -46 31 54 11 -4 6 -21 -8 -9 -27 24 11 48 -5 -3 -1 5 10 -43 -5 34
7534C4o9OO8m4J6Nj8ql2Q2m5Oj9K6j2klk7J5K7k7O0n6K3K3p9M6Rj7J8jNqnM4j07
$$ 34 -35 -29 39 -5 11 16 -2 -10 -42 40 -5 1 -18 8 -4 -6 -9 -36 -21 6 -21 39 -17 6 29 -50 -4 5 -12 6 5 10 2 -3 41 -66
7570f6Q6M1n5J5j2M4p8lm5K4J1N7m4N5p7L1j1j5OJ3N7j15L6Q5n8L0N5n9nm8J04
$$ -66 20 61 6 21 9 53 -25 -28 -73 -49 -38 19 -25 30 -47 -16 -27 -42 -36 -23 34 -81 -45 40 -18 12 67 8 3 -45 59
7601E9k8o6j0P9j3M1l4J9l6l4L0J9j0n7L4N6p3MJ0R3l3n3Q1p9J6p6K9M4j9n6J1
$$ 59 31 -35 -45 34 21 62 28 47 11 -23 7 26 16 -41 -7 49 -24 -20 -10 83 50 -3 78 -1 15 -61 -32 12 -7 -63 -52
7632e2N1K6o3M5kK8k5KM2j28Q5rk2oM4j1m7KMJ3l7j1j6Q2k3l1L7RP7o8n2Q4P3
$$ -52 -1 25 -38 7 5 33 8 10 52 -76 9 0 -22 -28 16 5 -42 -40 -36 -23 -60 -71 -87 -5 -28 -59 -22 -13 64 -4 -56 28 101
7665A01j57M6j4M0K4l1K6l8%l8P5j9KJ1l5M0n5L1j0K1K4n3o2Q1o4J19o2j2m4N1
$$ 101 -56 -10 -24 16 40 9 35 -3 -3 -41 34 15 17 28 -7 33 -22 9 -1 20 44 -9 -71 10 -54 65 3 -9 -53 -2
7695bL1j01R6p0O4j0m8L4P1r6K5J4o1O5j6M4n1k3nJ31j10M0l3J3Ol2N9K3j7m3
$$ -2 29 -72 24 -46 18 8 -40 -6 65 -31 -6 8 -53 12 -4 40 -11 -34 -39 92 -18 22 -11 2 8 -24 35 58 41 -2
7725bK4o3N4q1O2j7j0M2qJ3Ll1m7J25j5j59J00j1Q5p5L5J2q6J9P6K1j20j8Q4K2
$$ -2 22 -41 13 -68 -6 -23 -33 9 1 14 17 -14 -61 64 49 -110 -10 -21 64 -11 24 36 -50 -31 45 66 -54 -72 12 34
7755C4J4p0oL2k7M7q2N6mJ1j7j5j09P9L6Ql1o8R7pk9PL0L0k1lJ06j40m6R6R2o8
$$ 34 48 -22 -28 4 -23 24 -58 -2 -6 5 -12 -27 -136 -57 -21 -13 -44 -112 -15 -22 -51 -44 -14 16 -5 -8 98 -42 -88 8 100 32
7787C2p0M3n6J00n6KK5l2K7m0N0J9Pp8PJ0J9l7kKL1oPj2j1M5q7NkO9J6n0Ql1J0
$$ 32 -38 5 -51 49 -7 -5 20 -12 15 -25 25 44 51 -27 -20 -10 9 -28 -30 -28 3 -3 4 -8 -19 26 -61 -56 -58 11 27 -23 -15 -46 -36
7822c6L3qJ3K5p1J3k2Q1L2r4J2L1j2L2j2N3j05O4m3J6QMm2J04m7K4q2J5K8J5q3
$$ -36 -3 -11 2 27 -44 -31 -53 28 60 -34 -22 9 -3 29 17 70 -35 29 -14 2 10 14 -28 76 29 53 -29 -14 14 29 -54
7853e4M7lk1mL0K1l0Q0j02K1O4n0K9q1lJ30n4q2j8O7j2Jj4N8L0l4r5Q3J1j7j3
$$ -54 -7 -10 -31 -35 -5 16 -14 66 -36 -15 49 -1 28 -53 -56 74 20 -62 -80 -13 -25 -24 -38 20 50 16 -79 4 15 -2 -15
7884a5j5O9j15P2J5j1K4j7m8j1l5O6M5Nl7L9l5lJj3L9n5M7o0N3K4j23J73j19N
$$ -15 -30 39 -76 -4 11 0 24 7 -41 -52 -87 -21 24 29 -8 31 -4 -7 -6 -19 20 -35 12 -48 5 29 -94 79 -40 -35
7914c5L3m0N3nm1K8L9p8N1nN5k7q1M4J8qkn0N1j6j5J6LJ9L3nm0km7O1om9J00o2
$$ -35 -2 -42 11 6 -35 -7 32 -46 5 0 55 28 -53 -9 9 1 -1 -51 0 -16 -31 -15 -12 7 40 35 -5 -7 -54 7 1 -48 52 -10
7948a0%K8j9k3L2M1l2kl4m3K4L4K3k8K6k2j3JqJ1KJ0P7m5l8j4J9j3Ml4P0m3m0
$$ -10 -10 18 -1 -24 8 49 17 15 -19 -62 -38 -4 19 -9 17 -5 -18 -17 -25 -14 -12 -2 75 30 -8 -22 -3 -16 -12 -46 24 -19 -59
7981e9J06n3PkO1l5n2K4Lo4M4j5L2K0o3kM9N3j1p1lK2N7j24O5m9N1N0p9j2L5l0
$$ -59 47 -6 1 -1 60 25 -27 -3 0 -64 -20 -35 -3 17 -46 -48 1 54 43 -28 -31 -9 48 -76 -11 -60 -9 41 -38 -50 -15 -45
8013d5N8q0N9M6m7JlK5q0N8O5r7K7o4Q4K2Q2j31jO0n4j5O9m3L0k7l7l5Q8J5q9
$$ -45 13 -67 -8 38 -9 -8 -11 14 -66 -8 57 -40 -13 -77 7 29 111 -20 -21 39 -15 -30 39 -4 26 -1 -38 -73 15 30 -59
8044e9L1K6K8m8j3P4Po3mM5o3N8k3j5K3l3K1K8qm9O3k2j0Ln0Q5k3p3Q2l5kl7O9
$$ -59 -28 -2 26 -22 -35 39 46 -17 -21 24 -39 19 -4 -19 4 -29 -8 20 12 -37 26 4 -6 -3 -53 32 9 -64 18 -17 -19 -56 13
8077A3n8O2k0nJ8MRm6M3k2J6r4J15j08M8M1j7m2M2K0p0O8k9oO9m3j8L7n8K3NL3
$$ 13 -45 17 -3 -8 10 14 23 -23 20 -2 14 -80 35 -73 -25 16 -1 -43 -1 19 -51 17 -12 -18 51 8 -10 27 -31 -8 -3 30
8109C0n6mL4qk2m0O7km0P8k8l6k1L3m3Q8j0J2j0r5O8j5Q2o4M5ql9N6m7J3rj6r
$$ 30 -26 -30 4 -4 -26 -66 1 -1 -41 37 9 -27 -48 -15 -58 30 20 32 22 -73 -5 -20 62 -2 43 35 -4 52 5 18 9 -7 -16
8142a6M2p3j8O5J4K3k6r6Q5L3m9Rj4K3p1K6M2Ql5ML5l2L2ml9M4j2r9J59o9m0M2
$$ -16 26 -47 -65 0 14 37 11 -85 0 33 -16 -7 -21 2 -69 -43 -1 7 -28 -24 11 -21 11 7 -32 12 0 -99 60 -9 -49 -7
8174gL7%p0L5k3J9JN3k6LJ3ql3J1kNq5
$$ -7 30 30 -40 -5 -28 -9 -8 45 19 22 35 27 -6 5 3 8 -77
8191g7
$$ Imaginary data points
##PAGE= N=2
##DATA TABLE= (X++(I..I)), XYDATA
0@%%%%%%%%%%%qJ6j1J0j5J6j6J6k1K9l2L3l8M3m9N6o2P0p8Q5r4J05j17J28j40
$$ 0 0 0 0 0 0 0 0 0 0 0 0 -8 8 -3 7 -8 8 -8 8 -13 16 -16 17 -21 22 -27 29 -33 37 -41 44 -50 55 -62 66 -74
36g4J56j70J85k06K30k53K77l09L47l87M31m87N57o36P34q67J042j276J613k124
$$ -74 82 -88 97 -109 121 -132 145 -164 183 -204 227 -260 297 -339 395 -472 570 -706 907 -1217
56a217K962m491P781j7399R0728L53595l76577l59687L56664J93377m17995j06405
$$ -1217 1745 -2746 5035 -12364 78364 431959 55382 -304305 52359 245736 -172259 -278664
68b78664M87670J06433m56877j05150L44700K0621k66252Q6330K65154j21715
$$ -278664 209006 315439 -141438 -246588 98112 118733 -147519 -61189 203965 82250
78H2250k74891P6078K27520j9409j22358L5466O1293r3266j08551P4359J71212
$$ 82250 -192641 -116563 110957 91548 -30810 4656 65949 -27317 -135868 -61509 109703
89A09703J9148j53387p1476R7804K2053j15396M4556K10142l5855k67154m90K42496
$$ 109703 128851 -24536 -96012 1792 23845 -91551 -46995 163147 127292 -139862 -140352 102144
101A02144k4577k01093J10049K00604j91878k32845K15596K34530j96787j63326
$$ 102144 77567 -123526 -13477 187127 -4751 -237596 -22000 212530 15743 -147583
111a47583K05236O4092k63530j3608L08435J8334k68754M810J82145r7296j47734
$$ -147583 57653 121745 -141785 -155393 153042 171376 -97378 -92568 89577 -7719 -155453
122a55453J76215J62477j71575j39374J29114N7022j21223K0161J45179l8816
$$ -155453 20762 183239 11664 -127710 1404 58426 -62797 -42636 102543 63727
132F3727j41687K0609Q6064j7161j4036M1967k5844o1355K3585L2940k0238L5542
$$ 63727 -77960 -57351 28713 11552 -2484 39483 13639 -47716 -24131 8809 -11429 24113
144B4113N7706p9286j02627P1086R1432o5914l4997J05358l05j51914p209J46573
$$ 24113 81819 2533 -100094 -29008 62424 -3490 -38487 66871 66566 -85348 -92557 54016
156E4016N448j02794L5362P3451q2748p0307R7156O3801p9529l2031N7238j7681
$$ 54016 59464 -43330 -7968 65483 -17265 -87572 9584 73385 -6144 -38175 19063 1382
168A382n3983N2904O1249m9911m3493L1355n734l3683M8482N2609m9490m0857
$$ 1382 -52601 303 61552 11641 -31852 -497 -6231 -39914 8568 61177 11687 -29170
180b9170L5970q959m7807N2627O9705o4772o2420P0863K4126r5269J4012J26505
$$ -29170 6800 -2159 -49966 2661 72366 7594 -54826 16037 40163 -55106 -41094 85411
192H5411l6564j40340N2519J28793p7650j04387J14059Q4422j47006p5069J54417
$$ 85411 48847 -91493 -38974 89819 12169 -92218 21841 106263 -40743 -115812 38605
203C8605N6526j41058j5013J34067k9817j39656N0764J32809n4857j01152O8406
$$ 38605 95131 -45927 -60940 73127 43310 -96346 -45582 87227 32370 -68782 -376
214c76O7537q9891n2037R7338M5794q5608l4458O8134J9519n7154j1366N1898
$$ -376 67161 -22730 -74767 22571 68365 -17243 -51701 16433 35952 -21202 -32568 19330
226A9330J6759m6379l2585L5446M8587k3178n5221K3697N9639m0117p3820N7025
$$ 19330 36089 -10290 -42875 -7429 41158 17980 -37241 -13544 46095 5978 -67842 -10817
238a0817R0797o4535r2746P5089Q0579r6895o7777J21134N9368j33962m4263J37928
$$ -10817 79980 15445 -77301 -2212 78367 -18528 -86305 34829 94197 -39765 -84028 53900
250E3900J9298j40371Q422J40631l4445j37477N4690J26753p0496j08220Q5650
$$ 53900 73198 -67173 -58751 81880 47435 -90042 -35352 91401 20905 -87315 -1665
261a665Q6444j00758o9834J08108N6800j04239m1217R5636K3181r0599j3284Q4368
$$ -1665 84779 -15979 -85813 22295 79095 -25144 -66361 29275 52456 -38143 -51427 32941
273C2941J2573p1905j3690N8180J4666m8110j6960M3739K3321m1846l0697M1923
$$ 32941 45514 -26391 -40081 18099 32765 -15345 -32305 11434 34755 -7091 -37788 4135
285D135L6637m4236l8625M9623L6573n8874l1850P0405K6420p9583j7338Q5610
$$ 4135 40772 -3464 -42089 7534 44107 -14767 -46617 23788 50208 -29375 -46713 38897
297C8897L784r0644J1872R4603k6401r4974L8835R0146n0765q1569O1426P1626
$$ 38897 42681 -47963 -36091 58512 32111 -62863 -24028 66118 15353 -66216 -4790 66836
309F6836o9204o1035P2575M9231p2031l6899O9194K5467o5215j7182N8388J1366
$$ 66836 -2368 -63403 9172 58403 -13628 -50527 18667 44134 -21081 -38263 20125 31491
321C1491n0499p747M2565O435l6134p925L0335J0271k6933j3796K6274J7961k6627
$$ 31491 -19008 -26755 15810 22245 -13889 -21814 8521 18792 -8141 -21937 4337 22298 -4329
334d329k0914K9147K1732l4378k1098M1399K0277m6910j5841N2699Q551n9324
$$ -4329 -25243 3904 25636 -8742 -29840 11559 31836 -15074 -30915 21784 30335 -28989
346b8989j081O4857n730o6459J5104O7304k4049o7400L0227O4071l5596n8591
$$ -28989 -30070 34787 29057 -37402 -22298 45006 20957 -46443 -16216 47855 12259 -46332
358d6332M1046N3171m4053m8003M3172L9888m2889l2134M3010K7690m0289k3326
$$ -46332 -5286 47885 3832 -44171 -999 38889 -4000 -36134 6876 34566 -5723 -29049
370b9049L6414J7890l5701j5811L4935J6106l2662j5058L2309J3506l5585j5053
$$ -29049 7365 25255 -10446 -26257 8678 24784 -7878 -22936 9373 22879 -12706 -27759
382b7759L8148J6939l8659j4895M2206J2344m7853j2131N0060R300n1769l238
$$ -27759 10389 27328 -11331 -26226 15980 28324 -19529 -31660 18400 27700 -24069 -27307
394b7307N5710q20n8227M253N6921j0344n5863J7529N7636k0370n5431K2345N0142
$$ -27307 28403 27583 -30644 -26391 30530 20186 -35677 -18148 39488 19118 -36313 -13968 36174
407C6174k7367m7316L0952M6037l0048m0645L0995L5025l3913l2650L4074K9935
$$ 36174 8807 -38509 -7557 38480 8432 -32213 -1218 33807 -106 -32756 1318 31253
419C1253l2747k4597L4466K0389l8007k0383L8046J7473l8796j3373M2896J2226
$$ 31253 -1494 -26091 8375 28764 -9243 -29626 8420 25893 -12903 -26276 16620 28846
431B8846m5990j2364M5658Q955m7813n730N1527N999n1591m977M9595M46n0347
$$ 28846 -17144 -29508 16150 25105 -22708 -28438 23089 29088 -22503 -27480 22115 22561 -27786
444b7786K630N1554k670m8276O250M5806j1257m6567J3029M5413j3985m1201J9217
$$ -27786 -25156 26398 23728 -24548 -18298 27508 16251 -30316 -17287 28126 14141 -27060 -7843
457g843M0270k3771m2002K4254M0164k5845l6525L1273L6401l4752l6765L5334
$$ -7843 32427 8656 -33346 -9092 31072 5227 -31298 -25 36376 1624 -35141 193
469A93L3274l8508k9946M3067K9148m4448k6070M5168K0116m8995j6937N1727
$$ 193 33467 -5041 -34987 8080 37228 -7220 -33290 11878 31994 -17001 -33938 17789
481A7789J5328n0413j0443N0045M565n2438k611N1488J139m8005L545M6520p405
$$ 17789 33117 -17296 -27739 22306 26871 -25567 -28178 23310 24449 -23556 -20011 26509 19104
494A9104m7222P232M4186q519m0450J2742M0228j4568m0242J4994L8241j7870
$$ 19104 -28118 -20886 23300 14781 -25669 -12927 27301 12733 -27509 -12515 25726 7856
506G856l7216K1668L8913k2986l8471K5219L6437l0695l7074L4906L8921l4911
$$ 7856 -29360 -7692 31221 8235 -30236 -5017 31420 725 -36349 -1443 37478 2567
518B567l5268L7829L0672m3680k9326M6269K7288m5756k0958M6417J4148m9140
$$ 2567 -32701 5128 35800 -7880 -37206 9063 36351 -9405 -30363 16054 30202 -18938
530a8938j0024M8692M986m6506J131M5861m991m3688P925L9224j3066l7973J5363
$$ -18938 -28962 19730 24716 -21790 -20659 25202 20211 -23477 -15552 23672 10606 -27367 -12004
543a2004L7183j3684l2687J3266K7228j6570k6872J7432K8861j3048k6225J1268
$$ -12004 25179 11495 -21192 -7926 19302 2732 -24140 -6708 22153 9105 -17120 -5852
555e852K2168j4331k3181J6159K5575j5490k5742J5937K5362j7439k4279J9706
$$ -5852 16316 1985 -21196 -5037 20538 5048 -20694 -4757 20605 3166 -21113 -1407
567a407K3082k2829k2428K6579K3452k5926k1607K3623J4097k6761r237L1698
$$ -1407 21675 -1154 -23582 2997 26449 523 -21084 2539 16636 -10125 -19362 12336
579A2336J0680k9496r528K3720K418k2514L618K5513l887k5379J340K1081j915
$$ 12336 23016 -6480 -16008 7712 10130 -12384 -8766 16747 12860 -12519 -11179 9902 7987
592G987j8203L115J7021l729j8418K519K1667L286k1557q619J7197P041j7748
$$ 7987 -10216 -7101 9920 6191 -12227 -9708 11959 15245 -6312 -14931 2266 9307 -8441
605h441k991K5281N328l0970j1825K8011J0626k4322j784K9401l598l6117L077
$$ -8441 -11432 13849 19177 -11793 -23618 4393 15019 -9303 -11087 18314 14716 -21401 -18324
618a8324L7251l216l3676Q023L0324j6093l1207K2754L4986k3244l5410K0427
$$ -18324 18927 15711 -17965 -9942 20382 4289 -26918 -4164 30822 7578 -27832 -7405
630g405K9392k1993k1612L0959K2632l5830k8904L0524K7112k5515j8072L0270
$$ -7405 21987 -6 -21618 9341 31973 -3857 -32761 -2237 24875 -640 -18712 11558
642A1558J4004l8995j8784M0651K3582l6042k0847L4371J3517m0175j0150M8082
$$ 11558 25562 -13433 -32217 8434 32016 -4026 -24873 9498 23015 -17160 -27310 20772
654B0772J2497n1562j6155M7099J1389m3499P32M9321q239n8261O261N7446n740
$$ 20772 33269 -18293 -34448 12651 24040 -19459 -18727 30594 22355 -35906 -29645 27801 22061
667B2061m7779J6649M3648l1298m9229L6467N3509l3531m6990L4772L6502m3811
$$ 22061 -25718 -9069 34579 3281 -45948 -9481 44028 10497 -36493 -1721 34781 -9030
679i030l1710N3667L4653n4788l6279M8661K8703m5595j6749N1784J1584n9012
$$ -9030 -40740 12927 47580 -7208 -43487 5174 33877 -11718 -28467 23317 34901 -24111
691b4111j5666N6231J6986m6580p105M3968m944n1438O984N6342k226n0583L154
$$ -24111 -39777 16454 33440 -13140 -20245 23723 18779 -32659 -25675 30667 28441 -22142 -18988
704a8988M1596j3874m0529K3935M6458k4644m8531K0313M0714k2141l0429L2204
$$ -18988 22608 8734 -31795 -7860 38598 13954 -34577 -14264 26450 4309 -26120 6084
716F084K7893m1170l2542L9579L2025l3048k1499L3738J0324m2538r279M7077
$$ 6084 33977 -7193 -39735 -156 31869 -1179 -22678 11060 21384 -21154 -30433 16644
728A6644J4258m0352j2221L1334J428l0602P111L6575n537l6522O00K7527k817
$$ 16644 30902 -9450 -21671 9663 11091 -19511 -12400 24175 18638 -17884 -17284 10243 7426
741G426j8324J2673J8661j9117k3952J6160K3651j1083j5109J3857Q182k3044
$$ 7426 -10898 1775 20436 1319 -22633 -6473 17178 6095 -9014 4843 13025 -10019
753a0019j0807K7146J6938k2173j5897J6241P273j9027j920K5867N226k6633r852
$$ -10019 -20826 6320 23258 1085 -14812 1429 8702 -10325 -12245 13622 18848 -7785 -17637
766a7637J8794O511j2612K305J4626o408j9093K312J6887J754q436J354L011p898
$$ -17637 1157 7668 -4944 -2639 11987 5579 -13514 -11202 5685 7439 -997 357 3368 -4530
780d530n453Q775R866k447p572k981L55J057K554L939K494k724q116m315O788
$$ -4530 -9983 -1208 8658 6211 -1361 -4342 -3987 -2930 -376 3563 6057 3333 -4783 -9098 -2310
795b310Q402j587m408K025p69q841j17J4230N385j2481o618Q656J492r772L287
$$ -2310 6092 4505 97 2122 1353 -7488 -7605 6625 12010 -471 -7089 1567 3059 -6713 -3426
810c426J5687j966j9088k903J5944L561j1302P92J1832m433j6928J897J8450K771
$$ -3426 12261 10295 -8793 -11696 4248 7809 -3493 -2701 9131 4698 -12230 -10333 8117 10888
824A0888j4569k342J0624l523j2873P149J8068n564j9408M103J6055q056j4082
$$ 10888 -3681 -6023 4601 1078 -11795 -4646 13422 7858 -11550 -7447 8608 552 -13530
837a3530J5612J7089k0194k0930K0786K0663k1269j6353K6121J2901l2731j3261
$$ -13530 2082 19171 -1023 -21953 -1167 19496 -1773 -18126 7995 20896 -11835 -25096
849b5096L6218J4187l4925j0623L3611L633l6069J398L9737j865l9037K296L4426
$$ -25096 11122 25309 -9616 -20239 13372 17005 -19064 -17666 22071 20206 -18831 -16535 17891
862A7891o891l1337J2647L1897j4900l2459J3929K9751j3804k5246J6458K2717
$$ 17891 11000 -20337 -7690 24207 9307 -23152 -9223 20528 6724 -18522 -2064 20653
874B0653j9840k3097K0977K3673k0368k2188K0302J8718k3733j7174K8362J8508
$$ 20653 813 -22284 -1307 22366 1998 -20190 112 18830 -4903 -22077 6285 24793
886B4793l0657j9301L0611J6465l2424j2633L6964J0736m0208j0188M0351P625
$$ 24793 -5864 -25165 5446 21911 -10513 -23146 13818 24554 -15654 -25842 14509 22134
898B2134l9378k686L9464j831l9241N659L8419q716l5386J1723L1310j5593k7455
$$ 22134 -17244 -19930 19534 17703 -21538 -15879 22540 13824 -21562 -9839 21471 5878 -21577
911b1577J9956K5141k2082k2977K2067J8828k2385j4444K4223J2774k4904j2556
$$ -21577 -1621 23520 1438 -21539 528 19356 -3029 -17473 6750 19524 -5380 -17936
923a7936K3056J0941k1778r393K1804Q982k1976r563K1736R574k1931r724K2626
$$ -17936 5120 16061 -5717 -15110 6694 15676 -6300 -15863 5873 15447 -6484 -16208 6418
936F418R587k3330q498K4787P277k6728o846K7160N179k6979j748K7599j042k7944
$$ 6418 16005 -7325 -15823 8964 16241 -10487 -17333 9827 15006 -11973 -13721 13878 12836 -15108
950a5108K863K6132n582k3400R485K1595j2049j9512J3350J5831j4954j2564J6756
$$ -15108 -12245 13887 8305 -15095 -5610 15985 3936 -15576 -2226 13605 -1349 -13913 2843
963B843J0642j6717q373J6156O582j5696n794J4516O112j2508o346J1378P360
$$ 2843 13485 -3232 -11605 4551 11133 -4563 -10357 4159 10271 -2237 -8583 2795 10155
976A0155j0601r560Q861J1288p809j1898Q477J3336r702j5405R978J5212j0997
$$ 10155 -446 -10006 -1145 10143 2334 -9564 -1087 12249 2547 -12858 -2880 12332 1335
989A335j4001J3535J2922j6215j1966J7399R613j8922o488K0303L834k1005p88
$$ 1335 -12666 869 13791 -2424 -14390 3009 12622 -6300 -12788 7515 11349 -9656 -10444
1002a0444K0951k158k0620M052J9425n496j7070P526J5489q607j4659Q011J3010
$$ -10444 10507 8349 -12271 -8219 11206 5710 -11360 -3834 11655 3048 -11611 -3600 9410
1015I410o871j0886O867J0489o364j1122M541J1823l310j2216K893J4019k723
$$ 9410 2539 -8347 -1480 9009 2645 -8477 -3936 7887 4577 -7639 -4746 9273 6550
1028F550j5824K765J6957l682j8283N272J9597o823j9396Q874J8209j2057j7228
$$ 6550 -9274 -6509 10448 6766 -11517 -6245 13352 6529 -12867 -3993 14216 2159 -15069
1041a5069J4893J5724j6773j2960J8506R381k0866o580K2070L699k2162p51K1890
$$ -15069 -176 15548 -1225 -14185 4321 13702 -7164 -13744 8326 12025 -10137 -10888 11002
1054A1002j931k1144L751J9739n319j8185O104J6674n961j4581N338J2676n279
$$ 11002 9071 -12073 -8322 11417 6098 -12087 -5983 10691 4730 -9851 -4513 8163 2884
1067B884j1579M907J1676l329j1172K300J0913k324j1593K761J3103k876j4233
$$ 2884 -8695 -3788 7888 4559 -6613 -4313 6600 4276 -7317 -4556 8547 5671 -8562
1080h562L531J4919n127j5456O968J5847q885j5315J1324J4404j3655j3103J5141
$$ -8562 -5031 9888 4761 -10695 -3727 12120 3235 -12080 -756 13648 -7 -13110 2031
1093B031J0920j7001q112J8648N516j9594l325J9473P11j9164J814J8772l240
$$ 2031 12951 -4050 -12162 6486 12002 -7592 -10917 8556 9267 -9897 -8083 10689 7449
1106G449j7798L984J5998m874j4543M813J3145m295j1470L610J0052l032r268
$$ 7449 -10349 -6365 9633 4759 -9784 -4971 8174 3879 -7591 -3981 6071 3039 -6229
1119f229K192Q820j351q301J549Q330k014r209K484R818l180j0072N042J0995
$$ -6229 -4037 4783 3432 -4869 -3320 5010 2996 -6213 -3729 6089 2909 -7163 -2121 8874
1133H874o903j1443Q497J1783j0407j1200J2215J0828j3581r889J4412Q207j5481
$$ 8874 1971 -9472 -975 10808 401 -10799 1416 12244 -1337 -11226 3186 11393 -4088
1146d088o621J6054N157j5676l251J5117R36j4923N63J4010j715j2921K866J1681
$$ -4088 -10709 5345 10502 -5174 -8425 6692 7628 -7295 -6732 7278 5563 -7358 -4492 7189
1160G189l756j1017M007R904m014q822M130Q406l967q008L679P405l840p163M112
$$ 7189 3433 -7584 -3577 6327 2313 -6509 -2379 6027 2060 -5948 -2269 5136 1296 -5867 -1755
1175a755P276m138p244M695O924n558p162O621P571p204p250Q007O955r108o833
$$ -1755 5521 1383 -5861 -1166 5758 200 -6962 -341 7230 26 -7224 783 7738 -1370 -8203
1190h203R759O606r913n788J0159N204j0323m280J0057L429r807k215R541J264
$$ -8203 1556 8162 -1751 -7539 2620 7824 -2499 -6779 3278 6707 -3100 -5315 4226 5490
1204E490r198k47Q764r83q796J742Q747k432q401L179Q025m210q215M428Q288
$$ 5490 -3708 -3955 4809 3826 -4970 -3228 5519 3087 -5314 -2135 5890 1680 -6535 -2107 6181
1219F181m534q007M654P360n141p140N507O918n591o595N609O097n439n405N853
$$ 6181 1647 -6360 -1706 5654 513 -6627 -1120 5798 207 -6388 -779 5318 -121 -5526 327
1234C27N094o367n172O580N503o343n228O499N146p099n439P750O055p998o108
$$ 327 5421 -946 -6118 462 5965 -378 -5606 893 6039 -1060 -6499 1251 7306 -692 -6800
1249f800Q372N667r146n066J0158M599j1229l958J1999K706j2588q83J3429q84
$$ -6800 1572 7239 -1907 -6973 3185 7784 -3445 -7403 4596 7302 -5286 -6169 7260 6376
1263F376j4653K330J5014l660j4654N371J4229p363j3926Q440J3322r079j2023
$$ 6376 -8277 -5947 9067 5407 -9247 -3876 10353 2990 -10936 -2496 10826 1747 -10276
1276a0276R229J0370r813q806J0058P705j0131o917R539N998q957n004R095M579
$$ -10276 -1047 9323 -490 -9296 762 8467 -1664 -8581 958 6956 -2001 -7005 2090 6669
1290F669r718m880R903N613r808n613J0706N489j2054n618J3528N953j4657n174
$$ 6669 -3049 -7929 1974 7587 -2221 -7834 2872 8361 -3693 -9311 4217 10170 -4487 -9661
1304i661J5729L875j6902j930J8166j46j9254K473J9440n118j8755Q110J7884
$$ -9661 6068 9943 -6959 -8889 9277 9131 -10123 -7650 11790 6672 -12083 -3973 13911
1317A3911j1337j7039J3540J5385j5138j2806J6459R870j7543p505J7493N112
$$ 13911 2574 -14465 -925 14460 -678 -13484 2975 12845 -4698 -12203 5290 10402
1329A0402j6465k685J5071L36j3584J293J2001k232j0497K513Q851k237p478K037
$$ 10402 -6063 -8748 6323 6659 -6925 -5632 6369 4137 -6360 -3847 5004 2767 -4711 -2674
1343b674O832j499p172L64P646J088q045j645Q968J313j0368j025J2115N63j3012
$$ -2674 4158 2659 -4513 -4149 3497 4585 -3460 -5105 3863 5176 -5192 -6217 5898 6461 -6551
1358f551R83J3287k995j3217N601J2941q226j2037J0711J0327j2481p908J4119
$$ -6551 -5568 7719 4724 -8493 -2892 10049 1823 -10214 497 10824 -1657 -9565 4554
1371D554N064j5435k481J5709J30j4804K256J2835m611j0939O124Q479o678n764
$$ 4554 9618 -5817 -8298 7411 7541 -7263 -5007 7828 3217 -7722 -1598 6881 203 -5561
1385e561O364K609n708k0M377j773k608K878K21l205K325K767m367j553N849m52
$$ -5561 803 3412 -2296 -2316 2061 288 -2320 558 779 -2426 -101 2666 -1701 -3254 2595 2143
1401B143o970L242P837n847p653Q011O469j0066m276J2164K045j3343J68J3251
$$ 2143 -4827 -1585 6252 405 -7248 763 7232 -2834 -7110 5054 7099 -6244 -6076 7175
1415G175k637j2335N580J1043p905r401R131P552r520n066R190K733q380j180
$$ 7175 4538 -7797 -2217 8826 921 -8480 651 8203 -1317 -6383 2807 5540 -2840 -4020
1429d020P087M17m933m72K177P33L11j581j948L311K844n964l503Q316L331j0439
$$ -4020 3067 3484 -1449 -1921 256 989 1300 -281 -2229 1082 3926 -2038 -5541 2775 6106 -4333
1445d333j719J2143j151j3865M153J4841p594j4560J1443J3409j5430j1487J8856
$$ -4333 -6052 6091 4940 -8925 -4772 10069 2475 -12085 -642 12767 -2663 -14150 4706
1458D706Q996k1284n851K2738K270k3030J684K2811n234k1561Q016J9243j0060
$$ 4706 13702 -7582 -13433 9305 11575 -11455 -9771 13040 7806 -13755 -5739 13504 3444
1471C444j5746J2048J2505j3082r856J2588P316j1136m810R689L006q005k835
$$ 3444 -12302 -254 12251 -831 -10687 1901 9217 -1919 -6729 2960 5966 -2039 -4874
1484d874O167L285m186m414K592N879k015p565K316R519l720j1543N339J2700
$$ -4874 1293 4578 392 -4022 -1430 4449 2434 -5131 -2815 6704 2984 -8559 -3220 9480
1498I480p504j2683J0847J1995j4791j1156J7983R198k0149n885K2139J922k3840
$$ 9480 1976 -10707 140 12135 -2656 -13812 4171 13369 -6780 -12665 9474 11396 -12444
1511a2444J498K4122m815k2498Q119K0096j1186j7149J3423J3840j4373j0088
$$ -12444 -10946 13176 8361 -14137 -6018 14078 2892 -14257 -834 13006 -1367 -11455
1523a1455J4341N988j3341j879J2218r55j0549K579P905l400m676L940K662l509
$$ -11455 2886 8874 -4467 -6346 5872 4917 -5632 -3053 4852 1452 -3224 716 3378 -131
1537a31j384J347K23J347O54l709n61N607q68p517K947R134n604j0048P856R631
$$ -131 -1515 -168 55 1402 2056 -1653 -2214 3393 2525 -4992 -2045 7089 1485 -8563 -707 8924
1553H924j0176p961J2652N527j5056l280J6172O86j5749K813J4576o386j3300
$$ 8924 -1252 -9213 3439 8966 -6090 -9370 6802 7488 -8261 -5448 9128 2742 -10558
1566a0558Q922J1234j0062p940J0888M026j1231n82J0829k064r085M188O572n858
$$ -10558 -1636 9598 -464 -8404 2484 6510 -4721 -5303 5526 3462 -5623 -1435 5137 -721
1580g21l809O868J576o610L64N064k389k524M134J63m854K442M184n418k771Q418
$$ -721 -4530 2338 3914 -2696 -2332 2732 343 -2181 1953 2116 -2738 -296 3888 -1530 -4301 4117
1596D117J292j0478N12J1187l008j1097N913J0285q522r006J0215O720j1219l636
$$ 4117 5409 -5069 -4557 6630 3622 -7475 -1562 8723 201 -8805 1410 8130 -3089 -6725
1610f725J1732J09j1944K727J1131n011r385P024O786q668m436R420K264q853
$$ -6725 5007 5116 -6828 -4101 7030 2019 -7366 -342 6444 -2224 -6660 2760 5024 -3829
1624c829K3P433k062n659L644L846m063j785L638m45k553K696J087l843J017M129
$$ -3829 -3806 3627 1565 -4094 -450 3396 -667 -2452 1186 741 -1812 884 1971 -1872 -855 3274
1640C274l535l818O207L133q416j665R870l72j0865K929J1099n323j0695P512
$$ 3274 -261 -4079 2128 5261 -3155 -4820 5050 4678 -6187 -3258 7841 2518 -8177 -665
1654f65R087r175o820J0622L902j1597j124J1665j622j1043M459R618o877q227
$$ -665 8422 -753 -7573 3049 6951 -4646 -5770 5895 4273 -6770 -2311 7307 430 -7797
1668g797Q509O344r105m317Q960K389q286q26O977m04n176R44K988r28q51N64
$$ -7797 712 7056 -2049 -6366 2594 4983 -3303 -4129 2848 2444 -2732 -1788 1200 272 -579 -15
1684a5q47L15K048j619k673L218L019m716k339O114R79p066Q67P681k785p688
$$ -15 -862 -547 1501 -118 -2791 427 3446 -1270 -3609 2505 3484 -3582 -2715 4966 2181 -5507
1700e507M979P218o998o079Q778M418j0268k373J1128Q9j1299K207J0718m360
$$ -5507 -528 6690 -308 -6387 2391 6809 -3459 -5832 5296 5385 -5914 -3707 7011 2651
1714B651r916O127Q512p462o840Q165N007q453l323P875J706o835m58N499l97
$$ 2651 -7265 -1138 7374 -88 -6928 1237 6244 -2209 -5532 2343 4049 -2786 -3244 2255 1858
1729A858l980P97K257o69p32K34n12O24J241j461j434K414R76l359L0M081j282
$$ 1858 -2122 -1325 932 263 -469 -235 -747 -123 1118 -343 -1777 637 1613 -1746 -1716 2365 1083
1746A083m478L113M410m848m089O625L455q115k334R431J049j0141N21J0216j995
$$ 1083 -3395 -282 4128 -720 -4809 1816 5271 -2844 -5178 4253 5302 -4839 -4318 5898 3903
1761C903r975L541R205m640q082N677O367o150m985O486L300o400j944N862Q08
$$ 3903 -6072 -2531 6674 2034 -6048 -371 5996 -154 -5139 1347 4647 -1753 -3697 2165 2973
1776B973n172j00M138n11l149O35K241l56j565k82J002R88r36j665J254K359j850
$$ 2973 -2199 -2299 1839 1328 -1821 -1186 1055 699 -866 -1148 -146 842 -94 -1759 -505 1854 4
1793Dk889K879L249m085l272N403L180o681k586P822J915q717r24R228k4r439
$$ 4 -2885 -6 3243 -842 -4114 1289 4469 -2212 -4798 3024 4939 -3778 -4702 4526 4502 -4937
1809d937J152R341k161q571K970P527l799o333M397N258m799l850M735K687m820
$$ -4937 -3785 5556 3395 -5176 -2206 5321 1522 -4811 -414 4844 45 -3805 930 3617 -1203
1824a203j606M515J015m344o84M021O52l590j070L320J285l272j772L208K601
$$ -1203 -2809 1706 2721 -1623 -2307 1714 2366 -1224 -2294 1026 2311 -961 -2733 475 3076
1839C076l465l331L829L597m336l792M862L935n622l644O256L150o966k419P391
$$ 3076 -389 -3720 109 3706 -630 -4422 440 4375 -1247 -4891 1365 4515 -2451 -4870 2521
1854B521J791p716p66P829j16p583J015P259j680o709K335O225k789n306L049
$$ 2521 4312 -3404 -4170 3659 3543 -4040 -3025 4234 2554 -4155 -1820 4405 1616 -3690 -641
1869f41M494l302l825L419L273l333k789L213K531l306k535L219K644l205k974
$$ -641 3853 551 -3274 145 3418 85 -2704 509 3040 -266 -2801 418 3062 -143 -3117
1884c117L277L354l444l968L692M233l860m610M227M668m459m754M838M416n187
$$ -3117 160 3514 70 -3898 -206 4027 167 -4443 -216 4452 -7 -4761 77 4493 -694
1899f94m037N403L492n505k595N523J728n802q77N856K37n685M72N501j089n325
$$ -694 -4731 672 4164 -1341 -3936 1587 3315 -2487 -3364 2492 2729 -2956 -2484 3017 1928 -3397
1915c397J686N180j838n096K025M892j969m575K060M464k131m558K255M584k106
$$ -3397 -1711 3469 1631 -3465 -1440 3452 1483 -3092 -1032 3432 1301 -3257 -1002 3582 1476
1930A476m421K116M341k492m387K750M531k919m579L046M398l539m120L861L807
$$ 1476 -2945 -829 3512 1020 -3367 -617 3914 995 -3584 -538 3860 321 -3799 62 3869
1945C869m263l511M377L041m481k423M535J665m772j193M943P06m834j48M736
$$ 3869 -394 -3905 472 3513 -968 -3391 1144 2809 -1963 -3156 1787 2493 -2341 -2489 2247
1960B247n14m688R50M938j185m778J092M798j288m562J507M564j642m604J677
$$ 2247 1733 -2955 -2005 2933 1748 -3030 -1938 2860 1572 -2990 -1483 3081 1439 -3165 -1488
1975a488M542j425m226J550L798j866l626K328L440k354l176K503K621k863k196
$$ -1488 3054 1629 -2597 -1047 2751 885 -2741 -413 3027 673 -2503 0 2621 -242 -2438
1990b438L457J806l680j744L734J345l584q33L653L04l800l03L737K37l336j78
$$ -2438 1019 2825 -855 -2599 1135 2480 -1104 -1937 1716 2020 -1780 -2083 1654 1891 -1445 -1623
2006a623K968k94k957M85L124m57l140L72K728l09k667N88K888p63l201P00L360
$$ -1623 1345 1051 -1906 -1421 1703 1246 -1894 -1522 1206 897 -1770 -1182 1706 943 -2258 -1558 1802
2023A802n03k994N54K858j060k786J338L032j092k740J055K044j394j602K148
$$ 1802 1299 -1695 -1141 1717 657 -2129 -791 2241 1149 -1591 -536 1508 114 -1488 660
2038F60J525k377j443K156J054k119n26K524J74k960o23K982J178k574j122K118
$$ 660 2185 -192 -1635 521 1575 -544 -1070 1454 1628 -1332 -1955 1027 2205 -369 -1491 627
2054F27P28k350r39K756J659k673k127K041J886j993j301K504J150l172j398L128
$$ 627 1355 -995 -1934 822 2481 -192 -2319 -278 1608 -385 -1686 818 1968 -1204 -2602 526
2070E26J407k786o98K918m21l572P64M265n97m011Q59L323j745l266K785L711
$$ 526 1933 -853 -1551 1367 946 -2626 -1862 2403 1806 -2205 -1346 1977 232 -3034 -249 3462
2086C462k681l824K386L061k471k134L290K029l799k450L536K590k926j849K903
$$ 3462 781 -3043 -657 2404 -67 -2201 1089 3118 -681 -3131 405 2995 69 -1780 1123
2101A123J080l572j292L992J919l516k001K771J168l086n40M014O20m263j159
$$ 1123 2203 -1369 -2661 1331 3250 -266 -2267 504 1672 -1414 -1954 2060 2680 -1583 -2742
2116b742L745N23l329P62L810j790m707J933M812j774m133K540L442l825l682
$$ -2742 1003 1526 -1803 -1041 2769 979 -3728 -1795 3017 1243 -2890 -350 3092 -733 -4415
2131d415M465M274l995l874L565K513m076j548N024J690m975j797L960J120l375
$$ -4415 50 4324 329 -3545 20 2533 -1543 -3091 1933 3623 -1352 -3149 811 1931 -1444
2146a444L39L777r96m337N47M259k50l313R89K771j979l394K244M112j626l673
$$ -1444 -1105 2672 1676 -2661 -2114 2145 1895 -1418 -429 2342 363 -3031 -787 3325 1699 -1974
2162a974J160K683k049k434L138L143l460l530K828K800k858j719L749J397m682
$$ -1974 -814 1869 -180 -2614 524 3667 207 -3323 -495 2305 -553 -2272 1477 2874 -1808
2177a808k012M746K011l995j166L776P5m517K32M859L84m241j74L071q26k860
$$ -1808 -3820 926 2937 -1058 -2224 1552 1627 -2890 -2658 2201 2585 -1656 -1830 1241 415 -2445
2193b445J973L400j949l377J387K680j502j752K399J840l112k579K899K924k188
$$ -2445 -472 2928 979 -2398 -1011 1669 167 -1585 814 2654 -458 -3037 -138 2786 598
2208E98k289K175J726k987k001L251K741k775k654K133J763k376r56K929J158
$$ 598 -1691 484 2210 -777 -2778 473 3214 439 -2215 -82 1681 -695 -1651 1278 2436
$$ [...]
8191d
##END NTUPLES=NMR FID
##END=
