##TITLE=1H_1MTBDP2212
 CDCl3
 8 sc, 
 23.12.2022
##JCAMPDX= 6.0         $$ Bruker NMR JCAMP-DX V2.0
##DATA TYPE= NMR FID
##DATA CLASS= NTUPLES
##ORIGIN= UXNMR, Bruker Analytische Messtechnik GmbH
##OWNER= root
$$ XWIN-NMR		Version 3.5
$$ Fri Dec 23 14:17:34 2022 Russian Standard Time (UT+4h)  she@DPX200
##.OBSERVE FREQUENCY= 200.13135
##.OBSERVE NUCLEUS= ^1H
##.DELAY= (6, 6)
##.ACQUISITION MODE= SIMULTANEOUS
##.ACQUISITION SCHEME= undefined
##.AVERAGES= 8
##.DIGITISER RES= 18
##SPECTROMETER/DATA SYSTEM= spect
##.PULSE SEQUENCE= zg30
##.SOLVENT NAME= CDCl3
##.SHIFT REFERENCE= (INTERNAL, CDCl3, 0, 15.7039)
##AUDIT TRAIL= $$ (NUMBER, WHEN, WHO, WHERE, WHAT)
$$ ##TITLE= Audit trail, XWIN-NMR		Version 3.5
$$ ##JCAMPDX= 5.01
$$ ##ORIGIN= Bruker BioSpin GmbH
$$ ##OWNER= she
$$ F:/spectra/data/she/nmr/H-F/1/audita.txt
$$ ##AUDIT TRAIL=  $$ (NUMBER, WHEN, WHO, WHERE, WHAT)
(   1,<2022-12-23 14:16:37.14 +0400>,<she>,<DPX200>,
      <created by zg, POWCHK disabled, PULCHK disabled
       configuration hash MD5:
       00 E9 B6 7A A2 85 ED C7 34 08 36 98 17 FE 4E 26
       data hash MD5: 16K
       CF 5A D8 E5 F1 ED A6 AE E4 36 4B 1B D4 84 01 15>)
$$ ##END=
$$ 
$$ hash MD5
$$ 9C C3 E4 A7 DB B4 E8 96 3B E6 7E 03 69 C0 D8 5D
##$RELAX= 
##$RELAX= 
##$RELAX= 
##$RELAX= 
##$RELAX= 
##$RELAX= 
$$ Bruker specific parameters
$$ --------------------------
##$DU= <F:/spectra>
##$EXPNO= 1
##$NAME= <H-F>
##$PROCNO= 1
##$TYPE= <nmr>
##$USER= <she>
##$AMP= (0..31)
100 100 100 100 100 100 100 100 100 100 100 100 100 100 100 100 100 100 
100 100 100 100 100 100 100 100 100 100 100 100 100 100 
##$AQSEQ= 0
##$AQ_mod= 1
##$AUNM= <au_zg>
##$AUTOPOS= <>
##$BF1= 200.13
##$BF2= 200.13
##$BF3= 200.13
##$BF4= 200.13
##$BF5= 200.13
##$BF6= 200.13
##$BF7= 200.13
##$BF8= 200.13
##$BYTORDA= 1
##$CFDGTYP= 0
##$CFRGTYP= 5
##$CHEMSTR= <none>
##$CNST= (0..31)
1 1 145 1 1 1 1 1 1 1 1 1 1 1 1 1 1 1 1 1 1 1 1 1 1 1 1 1 1 1 1 1 
##$CPDPRG= <>
##$CPDPRG1= <>
##$CPDPRG2= <>
##$CPDPRG3= <>
##$CPDPRG4= <mlev>
##$CPDPRG5= <mlev>
##$CPDPRG6= <mlev>
##$CPDPRG7= <mlev>
##$CPDPRG8= <mlev>
##$CPDPRGB= <>
##$CPDPRGT= <>
##$D= (0..31)
0 1.2 0 0 0 0 0 0 0 0.06 0 0.03 0 0 0 0 0.0002 0 0 0 0 0 0 0 0 0 0 0 0 
0 0 0 
##$DATE= 1671790596
##$DBL= (0..7)
120 120 120 120 120 120 120 120 
##$DBP= (0..7)
150 150 150 150 150 150 150 150 
##$DBP07= 0
##$DBPNAM0= <>
##$DBPNAM1= <>
##$DBPNAM2= <>
##$DBPNAM3= <>
##$DBPNAM4= <>
##$DBPNAM5= <>
##$DBPNAM6= <>
##$DBPNAM7= <>
##$DBPOAL= (0..7)
0.5 0.5 0.5 0.5 0.5 0.5 0.5 0.5 
##$DBPOFFS= (0..7)
0 0 0 0 0 0 0 0 
##$DE= 6
##$DECBNUC= <off>
##$DECIM= 32
##$DECNUC= <off>
##$DECSTAT= 4
##$DIGMOD= 1
##$DIGTYP= 9
##$DL= (0..7)
0 120 120 120 120 120 120 120 
##$DP= (0..7)
150 150 150 150 150 150 150 150 
##$DP07= 0
##$DPNAME0= <>
##$DPNAME1= <>
##$DPNAME2= <>
##$DPNAME3= <>
##$DPNAME4= <>
##$DPNAME5= <>
##$DPNAME6= <>
##$DPNAME7= <>
##$DPOAL= (0..7)
0.5 0.5 0.5 0.5 0.5 0.5 0.5 0.5 
##$DPOFFS= (0..7)
0 0 0 0 0 0 0 0 
##$DQDMODE= 0
##$DR= 18
##$DS= 0
##$DSLIST= <SSSSSSSSSSSSSSS>
$$ [...]
##$SUBNAM2= <"">
##$SUBNAM3= <"">
##$SUBNAM4= <"">
##$SUBNAM5= <"">
##$SUBNAM6= <"">
##$SUBNAM7= <"">
##$SUBNAM8= <"">
##$SUBNAM9= <"">
##$SW= 18.05172834244
##$SWIBOX= (0..15)
0 0 2 0 0 0 0 0 0 0 0 0 0 0 0 0 
##$SW_h= 3612.71676300578
##$TD= 16384
##$TD0= 1
##$TE= 0
##$TE2= 300
##$TE3= 300
##$TEG= 300
##$TL= (0..7)
0 120 120 120 120 120 120 120 
##$TP= (0..7)
150 150 150 150 150 150 150 150 
##$TP07= 0
##$TPNAME0= <>
##$TPNAME1= <>
##$TPNAME2= <>
##$TPNAME3= <>
##$TPNAME4= <>
##$TPNAME5= <>
##$TPNAME6= <>
##$TPNAME7= <>
##$TPOAL= (0..7)
0.5 0.5 0.5 0.5 0.5 0.5 0.5 0.5 
##$TPOFFS= (0..7)
0 0 0 0 0 0 0 0 
##$TUNHIN= 0
##$TUNHOUT= 0
##$TUNXOUT= 0
##$USERA1= <user>
##$USERA2= <user>
##$USERA3= <user>
##$USERA4= <user>
##$USERA5= <user>
##$V9= 5
##$VALIST= <valist>
##$VCLIST= <CCCCCCCCCCCCCCC>
##$VD= 0
##$VDLIST= <DDDDDDDDDDDDDDD>
##$VPLIST= <PPPPPPPPPPPPPPP>
##$VTLIST= <TTTTTTTTTTTTTTT>
##$WBST= 1024
##$WBSW= 4
##$XGAIN= (0..3)
0 0 0 0 
##$XL= 0
##$YL= 0
##$YMAX_a= 131301
##$YMIN_a= -181351
##$ZGOPTNS= <>
##$ZL1= 120
##$ZL2= 120
##$ZL3= 120
##$ZL4= 120
##$ABSF1= 10
##$ABSF2= 0
##$ABSG= 5
##$ABSL= 3
##$ALPHA= 0
##$AQORDER= 0
##$ASSFAC= 0
##$ASSFACI= 0
##$ASSFACX= 0
##$ASSWID= 0
##$AUNMP= <proc_1d>
##$AZFE= 0.1
##$AZFW= 0.1
##$BCFW= 1
##$BC_mod= 2
##$BYTORDP= 1
##$COROFFS= 0
##$CY= 11.3945322036743
##$DATMOD= 1
##$DC= 2
##$DFILT= <>
##$DTYPP= 0
##$F1P= 2.36226072786647
##$F2P= -0.459571619588291
##$FCOR= 0.5
##$FTSIZE= 0
##$FT_mod= 4
##$GAMMA= 1
##$GB= 0.15
##$INTBC= 1
##$INTSCL= 1
##$ISEN= 128
##$LB= 0.24
##$LEV0= 0
##$LPBIN= 0
##$MAXI= 10000
##$MC2= 0
##$MEAN= 0
##$ME_mod= 0
##$MI= 1.114404
##$NCOEF= 0
##$NC_proc= 0
##$NLEV= 6
##$NOISF1= 3.799351
##$NOISF2= 2.8
##$NSP= 1
##$NTH_PI= 0
##$NZP= 0
##$OFFSET= 15.70392
##$PC= 1
##$PHC0= -19265.48
##$PHC1= 8.600731
##$PH_mod= 1
##$PKNL= yes
##$PPARMOD= 0
##$PSCAL= 0
##$PSIGN= 0
##$REVERSE= no
##$SF= 200.130013532006
##$SI= 16384
##$SIGF1= 3
##$SIGF2= 2
##$SINO= 400
##$SIOLD= 16384
##$SREGLST= <1H.CDCl3>
##$SSB= 0
##$STSI= 0
##$STSR= 0
##$SW_p= 3612.71676300578
##$SYMM= 0
##$S_DEV= 0
##$TDeff= 0
##$TDoff= 0
##$TI= <>
##$TILT= no
##$TM1= 0
##$TM2= 0
##$TOPLEV= 0
##$USERP1= <user>
##$USERP2= <user>
##$USERP3= <user>
##$USERP4= <user>
##$USERP5= <user>
##$WDW= 1
##$XDIM= 8192
##$YMAX_p= 0
##$YMIN_p= 0
$$ End of Bruker specific parameters
$$ ---------------------------------
##NTUPLES= NMR FID
##VAR_NAME=  TIME,          FID/REAL,        FID/IMAG
##SYMBOL=    X,             R,               I
##VAR_TYPE=  INDEPENDENT,   DEPENDENT,       DEPENDENT
##VAR_FORM=  AFFN,          ASDF,            ASDF
##VAR_DIM=   8192,          8192,            8192
##UNITS=     SECONDS,       ARBITRARY UNITS, ARBITRARY UNITS
##FACTOR=    0.0002768,     1,               1
##FIRST=     0,             0,               0
##LAST=      2.2672688,     0,               0
##MIN=       0,             -181351,         0
##MAX=       2.2672688,     131301,          0
$$ Real data points
##PAGE= N=1
##DATA TABLE= (X++(R..R)), XYDATA
$$ [...]
1030d830K294R171p768m815J0468j297r244O378M922q719O83P256n254k824O575
$$ -4830 -2536 6635 -1133 -5948 4520 3223 -6021 357 5279 -3440 -2757 4499 -755 -3579 2996
1045B996k255m425N831k24n937N080K740p630K504O916p380k750R569k876q190
$$ 2996 741 -3684 2147 1923 -4014 1066 3806 -3824 -1320 5596 -1784 -4534 5035 2159 -6031
1060f031P638L704r684J873Q061o491l777Q028j545o194N321J833o043K870L619
$$ -6031 1607 5311 -4373 -2500 5561 -930 -4707 3321 1776 -4418 903 2736 -3307 -437 3182
1075C182n712J065N358n220j929P336k989o021P347J852r011L514P178p699k834
$$ 3182 -2530 -1465 3893 -1327 -3256 4080 1091 -4930 2417 4269 -4742 -1228 5950 -1749 -4583
1090d583Q993k488p133O398K618p427K148N234n378q85N532l400k581N587j785
$$ -4583 4410 1922 -5211 1187 3805 -3622 -1474 3760 -1618 -2503 3029 -371 -2952 2635 850
1105H50m574N644R69o964L762N268p480r26Q404m021o226P527J808q357L072O009
$$ 850 -3724 1920 2889 -4075 -313 4955 -2525 -3451 4953 932 -5294 2233 4041 -4316 -1244 4765
1121D765o420j671O668k671m137N227m8m766L738J763n282K493L958n910j80O756
$$ 4765 -1655 -3326 3342 671 -3466 1761 1713 -3053 685 2448 -2834 -341 3617 -2293 -2473 4283
1137D283m370m589P564K98q034M416N563p652r77P881l643n201O490P83o246L269
$$ 4283 -87 -4676 2888 3186 -4848 -432 5131 -2521 -3498 4383 740 -4461 2029 2812 -3434 -165
1153a65L403n250P09M400m274j006N348l201l508O186m71o571M832L954p592L27
$$ -165 3238 -2012 -1303 3097 -1177 -2183 3165 -36 -3544 2642 2171 -4400 432 4386 -3206 -2879
1169b879P648m780m843P466M30p288L908M461o181j61N650l534k721N144j271
$$ -2879 4769 -11 -4854 2612 3042 -4246 -338 4123 -2058 -2219 3431 -103 -2824 2320 1049
1184A049l995M501N05n241L529L127o185P07O313m988l605P390o40p190N018M097
$$ 1049 -2946 1555 2060 -3181 348 3475 -2710 -2003 4310 -678 -4283 3107 2467 -4723 295 4392
1200D392p218J42O762m102l827O119l23n181L693K087m871J777L393m499M5M865
$$ 4392 -2826 -2684 4078 -24 -3851 2268 1945 -3236 457 2544 -2327 -550 2843 -1656 -1611 3254
1216C254l768k570N934j196n694N015K903p061J167O495n011l564O857o63o154
$$ 3254 -514 -3084 2850 1654 -4040 975 3878 -3183 -2016 4479 -532 -4096 2761 2098 -4056
1231d056M215L140n720Q08M569l755j501M667k062k911M572n38m489M014K206
$$ -4056 159 3299 -2421 -1613 2956 -799 -2300 2367 305 -2606 1966 1428 -3061 953 3159
1246C159n957J570N419n128k528O827j567o070N062L012o743R70N658m329k535
$$ 3159 -2798 -1228 4191 -937 -3465 3362 1795 -4275 787 3799 -2944 -1974 3684 -645 -3180
1261c180N420j135m069L768J005m231K449K394m377R05M199m072j740N795j980
$$ -3180 2240 1105 -2964 804 1809 -2422 27 2421 -1956 -1051 3148 -924 -2664 3131 1151
1276A151n039N229K067o591J741N568n033k499O146j215n059M083K107m975J348
$$ 1151 -3888 1341 3408 -3183 -1442 4126 -907 -3406 2740 1525 -3534 549 2656 -2319 -971
1291i71L508l623n08L886k566j998M334j152l887M112J388n391K028M509n004
$$ -971 2537 -1086 -1594 2292 -274 -2272 2062 910 -2977 1135 2523 -2868 -840 3669 -1335
1306a335j601O068j920m926M743J978n663J464M319l945j495M516j587k953L514
$$ -1335 -2936 3132 1212 -3714 1029 3007 -2656 -1192 3127 -818 -2313 2203 616 -2337 1177
1321A177N1l433K758J355m036J612L279m222p76N151k518l885M984J021n660K344
$$ 1177 1228 -2205 553 1908 -2128 -516 2763 -1459 -2235 2916 398 -3487 1497 2518 -3142 -798
1337g98M305m768j349N345j865l696L925Q82m061K002K241l490M40L105l030r06
$$ -798 3507 -1261 -2610 2735 870 -2826 1099 1981 -2080 -78 2163 -1327 -887 2218 -812 -1718
1353a718L924k044k896M168K95m754K801L298m892m76N290k533l732M660Q87m879
$$ -1718 2206 162 -2734 1434 1729 -3025 -224 3074 -1818 -2294 2996 463 -3269 1391 2278 -2601
1369b601K164L189l887l69L689k144j801L286q85k654L048M74l778K329K387m283
$$ -2601 -437 2752 -1135 -1504 2185 41 -1760 1526 641 -2013 1035 1509 -2269 60 2447 -1836
1385a836J69M525k961k940M851J30m963K768L247m430m79M413k184k686L699q0
$$ -1836 -1667 2858 -103 -3043 1808 1938 -3025 -257 2990 -1440 -1919 2494 310 -2376 1323 1243
1401A243l201K298J280l127J190K283l171RL540k503k164M116l20m228K994K533
$$ 1243 -1958 340 1620 -1507 -317 1966 -1205 -1196 2344 -159 -2323 1793 1473 -2755 239 2772
1417B772m595K05M456k905k631M287k2l956K373K096l497M55K832k504p51K990
$$ 2772 -1823 -1618 2838 -67 -2698 1589 1567 -2389 -16 2080 -1417 -962 1870 -634 -1385 1605
1433A605j552j958L231l06l270K710J780m128Q34L906l312k097M605o21m108K954
$$ 1605 53 -1905 1326 1020 -2250 460 2240 -1888 -1054 2852 -460 -2557 2048 1427 -2681 273
1449B73K182m115L86L541k572j648L361q04k494K600L95k865J829J627l237O41
$$ 273 2455 -1660 -1274 2267 -305 -1953 1408 604 -1890 710 1105 -1760 69 1696 -1541 -900
1465i00L170k787j541M040r61l600L364J711m463Q92L799l164j855M011o56l240
$$ -900 2270 -517 -2058 1982 1021 -2579 785 2496 -1967 -1075 2724 -440 -2295 1716 1060 -2180
1481b180K559J276l105R33K178k586j07K671k010j323L219q30k928L013J148l967
$$ -2180 379 1655 -1450 -517 1661 -925 -1032 1639 -371 -1694 1525 695 -2233 780 1928 -2039
1497b039J257L431l327j466M289j118l510L102J475l795R63K789k555r32K876
$$ -2039 -782 2649 -678 -2144 2145 1027 -2483 619 2094 -1701 -738 2051 -504 -1436 1440
1512A440j166j853K560j74k523K091J114l126J095K632k926r17L789j439l088
$$ 1440 274 -1579 981 807 -1716 375 1489 -1637 -542 2090 -836 -1753 2036 597 -2491
1527b491L384J097l960J201L119k994j109L471j145k436K562N51k649J415J491
$$ -2491 893 1990 -1970 -769 2350 -644 -1753 1718 573 -1863 699 1250 -1399 16 1507
1542A507k547N14K178k255p83L049j391k368L089M94l499J557K699l275p44L783
$$ 1507 -1040 -526 1652 -603 -1386 1663 272 -2096 993 1487 -2012 -455 2244 -1031 -1775 2008
1558B008j488k750K967Q54l219J301K088k462k92K433j500j196K426o64k083K249
$$ 2008 520 -2230 737 1591 -1628 -327 1761 -701 -993 1440 -60 -1256 1170 506 -1577 672
1574F72N25k822J381K113k930l94L405j709k447L196M73l368J472K426k840n74
$$ 672 1197 -1625 -244 1869 -1061 -1455 1950 241 -2206 990 1463 -1905 -433 1993 -847 -1421
1590a421K997j286j864K368J03k234J557R74k287P31J880k203k99K645j603j820
$$ -1421 1576 290 -1574 794 897 -1337 220 1194 -1093 -362 1518 -685 -984 1661 58 -1762
1606a762K909Q3l082J721K159l055l22L158j603k034K615L55k623J354J441k204
$$ -1762 1147 1230 -1852 -131 2028 -1027 -1349 1809 206 -1828 787 1142 -1481 -127 1314 -890
1622h90K25J897j588o83K173j050j444K298l5k493J755J597k876J10K912j896
$$ -890 -665 1232 -356 -1039 1134 84 -1360 938 903 -1590 165 1762 -1114 -1004 1908 12
1638A2j822K969K4k874J658J769k616o7K293j484j098K058l94j675J703L73k087
$$ 12 -1810 1159 1183 -1691 -33 1736 -880 -947 1346 -138 -1236 822 428 -1247 456 829 -1258
1655a258J275J296k329K96K360j815j339K827l53k721K007J503k793J47K583j719
$$ -1258 17 1313 -1016 -720 1640 -175 -1514 1313 960 -1761 246 1749 -1044 -897 1686 -33
1671c3j426K417k43k063J562Q23k034P07J431j832r0J980j399j060K297m03k195
$$ -33 -1459 958 715 -1348 214 1037 -997 -290 1141 -691 -781 1199 -200 -1260 1037 634 -1561
1688a561J934J014k631O15K366k019j228K728m46k356J820J118k310L65J843j593
$$ -1561 373 1387 -1244 -629 1737 -282 -1510 1218 772 -1584 236 1354 -956 -591 1252 -341
1704c41n74J868q59j152J687p6j756J458Q20k183O26J965j973q55K586o93k221
$$ -341 -915 953 94 -1058 629 553 -1203 255 1075 -1108 -482 1483 -490 -1345 1241 548 -1673
1721a673K140R32k590N83K104j826q60K230o16j577J653L17j781R93R29j756M15
$$ -1673 467 1399 -1191 -608 1496 -330 -1190 1040 424 -1153 500 817 -964 29 958 -798 -383
1738c83J602j650n42K152q47j806K007O11k513R46J991k078p49K484p96j835J812
$$ -383 1219 -431 -973 1179 332 -1474 533 1144 -1369 -423 1568 -510 -1259 1225 429 -1406 406
1755D06N83k024P79J415j623j65J653j108p37J745n56j519J708M14k125Q40J730
$$ 406 989 -1035 -256 1159 -464 -629 1024 -84 -821 924 368 -1151 557 971 -1154 -314 1416
1772A416k023n33K391r83j753J963O14k329P87J698j709m80J910q29j128J562
$$ 1416 -607 -1140 1251 268 -1485 478 1092 -1237 -450 1248 -461 -941 969 140 -988 574
1788E74Mj499J180O20j690N98J382j645l75K068r69j521J895L70k222J004J619
$$ 574 578 -921 259 879 -811 -213 1169 -476 -851 1217 248 -1273 622 992 -1230 -226 1393
1805A393k039l58K116r16j479J736L40j783R08R78j465J28J324j187l76J606p59
$$ 1393 -646 -1004 1112 196 -1283 453 793 -990 -82 896 -569 -441 883 -304 -680 926 167
1822A67j180J592J80j822R76J383k008j00K100j134j448J964J79k031J084J181
$$ 167 -1013 579 759 -1063 -87 1296 -712 -812 1288 154 -1294 670 849 -1182 -98 1083
1838A083j676r7J597j015p60J491l32j146J199K77j532Q68J043j696Q0J768j129
$$ 1083 -593 -690 907 -108 -868 623 291 -855 344 621 -911 -43 1000 -696 -616 1152 23
1855B3j145J891k1j936J219J156j847m7J781r93j113J588m7j396R84O05j397N19
$$ 23 -1122 769 748 -1188 31 1187 -660 -707 1074 81 -1032 556 509 -887 97 702 -695 -176
1873a76R29j169j75J418r33q05J558j02j611J209Q81j835J82J790j188r55J657
$$ -176 753 -416 -591 827 -106 -911 647 545 -1066 143 1024 -811 -629 1161 -27 -982 675
1890F75q1j542J026Q35j477J64J208r60m25J265n58q66J209k6j364J016O95j526
$$ 675 594 -948 78 913 -564 -400 808 -152 -577 688 130 -736 473 447 -917 99 794 -732
1908g32K98J494j270p39J715k75j621J247Q46j630K63J346j004o76J367l46r73
$$ -732 -434 1060 -210 -949 766 491 -1130 117 963 -667 -404 942 -62 -738 629 283 -690
1925f90J001J68j176P07O84j236K23J101r97n26J481m55j324J326N54j631L92
$$ -690 311 479 -697 10 694 -542 -319 782 -215 -741 740 285 -1039 287 841 -790 -398
1942c98J422j263o15J582l57j260J108M56j277N01Q22r81o3R89p84n15J235l05
$$ -398 1024 -239 -854 728 371 -889 219 675 -602 -101 721 -260 -323 666 -118 -633 602 297
1960B97j053J059L78j444N16J204j317m03J640n62j293J207M81j421M45J036j076
$$ 297 -756 303 681 -763 -247 957 -360 -763 877 315 -978 229 710 -711 -266 770 -306
1977c06k56J157n29p17J024k3r93Q29L84j108L66R95j135k27J301n74j059J273
$$ -306 -562 595 66 -651 373 350 -643 186 570 -538 -172 823 -312 -539 762 188 -871 402
1995D02K66j439N69J099j245l34J333m62r68J103J12j017N83N55j004K12Q74q14
$$ 402 668 -771 -202 897 -348 -682 651 189 -779 324 436 -581 2 557 -447 -235 639 -175
2013a75l18J112m94q50J146J10j262O90R42j281k24J401p20q59J173J34j176N55
$$ -175 -493 619 125 -725 421 531 -731 -41 901 -380 -604 797 77 -782 391 525 -651 -96
2031i6P68r82j15J010o84m20Q72k23p74Q61K68j123N94P65j120j03J280o88q08
$$ -96 672 -310 -425 585 -99 -519 353 130 -644 217 485 -638 -44 721 -399 -502 778 90 -718
2050g18J167Q7j230O52Q28j147r3J205p18o51J024o6q44O26L06q93K75P03q44
$$ -718 449 536 -694 -42 786 -361 -454 751 33 -618 406 340 -504 122 428 -465 -190 513 -331
2069c31r8J038o93o21J112L4j221P99P31j174J4J176p09q05J168J8j053O38N55
$$ -331 -429 609 -84 -705 407 441 -780 19 750 -424 -410 766 57 -748 420 438 -615 23 578
2088E78r33O7Q59p13k28Q73m36o17Q80Nr71P08N11j120J78J033p56o73J206j00
$$ 578 -355 -288 571 -142 -370 503 67 -550 330 335 -636 72 583 -537 -359 674 -82 -755 451 351
2108C51j023P47N82j031Q6R25o71m78R24k01p06O66J70p55M23N26q73J12Q08o88
$$ 351 -672 75 657 -374 -288 637 -34 -512 412 211 -495 171 341 -414 9 535 -338 -226 582 -106
2128a06m84J136k22j046Q69M63j081J31R85o95m78R74k02p98O89L10q77L01O31
$$ -106 -590 546 324 -722 147 610 -471 -340 645 -50 -528 446 244 -554 135 445 -432 -131 500
2147E00p19p0P86m91m32Q39j43p82O53L53r74K26Q77p45m51J082k97q55P16L85
$$ 500 -219 -289 497 6 -426 413 270 -512 141 494 -480 -254 623 -122 -573 509 212 -643 73 458
2167D58q94J48P56n83l11Q81l95n24P38K8o95N00L22p76K22P21q02k35R75l57
$$ 458 -436 -288 468 -115 -426 455 60 -464 274 302 -393 107 429 -347 -125 596 -206 -441 534 177
2187A77p55Q29K57r95K50Q34p67k55Q05k81o64P28O2o99M26L99o71J25O04n04
$$ 177 -578 251 508 -487 -237 597 -170 -425 380 99 -565 163 225 -474 -48 351 -320 -195 409 -95
2207i5k34P26l00o17P15K66r31L25P57q67j97R86l52o78O37K64p57K74M72o34
$$ -95 -329 397 97 -520 195 461 -470 -145 612 -255 -452 534 182 -496 141 405 -352 -78 394 -240
2227b40l8O59m28l22O94k60n20O29J02p05L86O05p89j91R42l81o86Q49N4q22L70
$$ -240 -278 381 -47 -369 325 65 -455 174 276 -429 -43 562 -227 -418 524 143 -543 306 360 -462 -92
2248i2O31o71j42O45k96n29P06l5n87M71J68o47K94M45o09r2P49m07n11Q15L2
$$ -92 539 -132 -274 371 75 -454 252 217 -370 101 269 -378 -84 361 -248 -340 409 2 -509 306 338
2269C38p54L61N40p46m8P88m47n05P18R6p10M30K79n93J39M50m33j54N40k43m66
$$ 338 -416 -55 485 -261 -309 479 32 -473 245 341 -369 61 340 -253 -114 336 -97 -251 289 46 -420
2290d20N85M5n96M30M07p76L2P17m05m81O97M7p36M69L75o02QO03m44k46N54r3
$$ -420 165 210 -386 44 451 -325 -293 424 19 -462 235 282 -454 15 390 -212 -204 399 -45 -291 263 170
2312A70m65M73J27o23L23L68n74J7N83m63l11O70q9o47M49L61p02J05O91n83k09
$$ 170 -295 178 305 -318 5 373 -201 -184 399 -64 -375 295 206 -441 8 369 -333 -228 463 -120 -329
2333c29O27j19m83L69K10n06J72L43m56k8M86k82l22O17j59n35M70K73o38J21
$$ -329 298 179 -304 65 275 -231 -59 284 -172 -200 286 4 -318 299 140 -395 75 348 -290 -169
2353a69N76m74l02O89j66n94M65L09o26J64M19m91l0M70k48k93N21o9m34L66K09
$$ -169 407 -67 -369 320 154 -440 25 334 -292 -128 291 -200 -230 240 -8 -301 220 151 -283 83 292
2374B92n67J66N47n64k12O25r7o16N25L09o81J62M46m78j71N92k33l67M63K2m33
$$ 292 -275 -109 438 -126 -338 287 190 -426 99 408 -273 -111 335 -143 -314 278 45 -322 141 163 -270
2395b70K20L28n06R4M36l55k30N77k08m75N19K07n93J73M91n64j34N82j64m58
$$ -270 -50 278 -228 -134 302 -53 -283 294 86 -389 130 337 -256 -83 408 -156 -290 292 128 -330
2415c30M25J33n01K20K87m54P7L73k93k02M83j19m71N17J26n82K51L74m39j44
$$ -330 95 228 -273 -53 234 -220 -143 230 -63 -265 218 99 -372 145 271 -311 -60 314 -125 -269
2435b69O56l11l65M94R0n59K32L99m82o7M26k27l02M02l7k80K35K04m50J59K94
$$ -269 387 76 -289 205 295 -264 -32 367 -115 -182 244 17 -285 117 80 -200 35 239 -211 -52 242
2456B42l72p5N08k88m06N29J00n76L01L64n16l6N36j73l99M34K7m13K65J73l93
$$ 242 -130 -205 303 15 -391 138 238 -338 -37 327 -189 -225 311 138 -261 173 200 -213 52 225 -168
2477a68P6L81l75j19M73k64k80M13L1m25K86K70n44P5M93k89l80N29mm31K38K78
$$ -168 -92 289 -86 -205 268 4 -276 137 168 -257 29 299 -245 -170 323 34 -346 183 179 -252 -14 264
2499B64m05kL90k67j60L70q3l43L47J14m17J91L03m52J2M45k97k54M62o9m57L29
$$ 264 -141 -143 247 -20 -180 190 107 -236 111 225 -192 -1 302 -150 -138 307 10 -244 218 149 -308 21
2521B1K38m39L7L92k31k77M11k9k84K53R6l50J22K92l90%L80k15k68M38q8l52
$$ 21 259 -180 -143 249 18 -259 152 123 -161 92 188 -162 -40 252 -138 -138 242 27 -241 197 109 -243
2543b43L04K33m86M0M25k92k81M55l4l60K85J42m25J36L42l03o8L12j97j85L47
$$ -243 61 294 -192 -152 273 -19 -300 155 121 -239 46 188 -237 -101 241 -62 -130 182 -15 -200 147
2564A47o2l25L42J82m83O6M22l60j40M57j27m08K86K02l38L6L22k93j31L97j42
$$ 147 85 -240 102 284 -199 -133 289 -71 -211 246 119 -289 -3 199 -139 -103 219 -74 -205 192 50
2585E0k20K67P0l72K16J39k48rL33k55k04M16m1m03K61K31m20R6M20m01p6M06
$$ 50 -170 97 167 -205 11 150 -98 -107 226 -29 -233 183 142 -261 0 231 -189 -93 327 -74 -150 256
2607B56j61l20K84Q4l11J67K32l29JK48j97r0K55k0l18K61J15l55J34K99k68j54
$$ 256 95 -225 59 143 -168 -1 231 -98 -97 151 -46 -136 119 99 -219 42 157 -198 -64 235 -33 -187
2629a87M12j44k80K76R6l70J73K25k40o7K70k13j54L04j2k53K05J25l18N9K93
$$ -187 225 81 -199 77 173 -197 -24 201 -39 -106 164 -49 -203 101 89 -164 41 166 -152 -93 200
2650B00k57j51L97j40k83L27J07m05K11K49l12p7L01j08k80L19J3l14K32J70l45
$$ 200 -57 -208 189 49 -234 93 200 -205 6 255 -57 -134 167 59 -221 98 111 -203 29 199 -146
2671a46P3K38j76j80L51j62k60L68P1l59J25K89l95m9M06j63k28K96O2l57J18
$$ -146 -73 165 -11 -191 160 -2 -262 106 177 -182 -57 232 -163 -212 194 31 -197 99 161 -196 -78
2692g8K69l18L7K57j44j70K42l0k21K44M7k88J29J81k79K1L30k20j97K64N3l46
$$ -78 191 -127 -90 167 23 -147 95 65 -156 88 135 -153 -24 157 -122 -101 229 9 -188 76 129 -217
2714b17J45K39k43l8L15k23j14K40m1j84J31J32k46N3K08k39rK83k00j97L30l1
$$ -217 -72 167 -76 -114 201 -22 -136 104 63 -121 10 142 -104 -51 157 -82 -91 192 -8 -205 125 94
2736I4k84K19K05m21O4L50k41k02L36J5l38K35J25k43L5J84k25l8K85j30j86K45
$$ 94 -190 29 234 -187 -123 227 -14 -216 120 135 -203 32 157 -86 -51 133 -92 -130 155 25 -161 84
2758H4j3k57J62K01k28qK48j92j39K70Ok90J37J88l24R5J95k27o2K73q0j77K41
$$ 84 71 -186 -24 177 -51 -59 189 -3 -142 128 134 -156 -19 169 -155 -60 135 -92 -154 119 39 -138 103
2781A03k4k27J90J28k83L3K73j99j98L74m0k81J60J63l13J02J89j68j73K79Nk36
$$ 103 79 -148 42 170 -113 -80 193 -6 -204 170 130 -151 9 172 -141 -39 150 -18 -191 88 93 -143
2803a43J76N3j99R4J18j83K1J61j30q8K10k9k60L05N1l29R0K47k48q1L06j01k04
$$ -143 33 86 -113 -19 99 -84 -63 98 -32 -120 90 61 -199 106 157 -172 -82 165 -83 -164 142 41 -163
2826a63K37L9k32Q1J75j91k3J85j59n5J96k3k17J69J00k98J31J71k00k1K46j22
$$ -163 74 113 -119 -38 137 -54 -77 108 -51 -106 90 67 -150 19 119 -179 -48 123 -77 -98 148 26
2848B6k09K34M4k49J05J93k45j0J94n9j08J48K7j95J25J01k57J09J50j24n1J63
$$ 26 -183 51 95 -154 -49 144 -101 -111 83 24 -84 64 91 -104 21 122 -135 -26 124 0 -51 112
2870A12p0j62J26J21k84J43K35k59r8L23j05k17K28k8k15J28J59k30L5J24m1j17
$$ 112 42 -120 6 127 -157 -14 221 -38 -136 187 82 -135 93 65 -150 -22 137 -93 -58 66 25 -92
2892i2K07l8j63J49J0j92J19J85k70K6K01j57j66K65M7k91J24J81k86L1J76q3
$$ -92 115 77 -86 63 73 -119 0 185 -85 -59 142 -15 -181 84 131 -160 -36 145 -141 -110 66 -17
2914a7k01L26l3k04P7J67j98R8J33k59K2J76n8j26J71J1k83J92J01k20P8J85j49
$$ -17 -218 108 75 -129 -52 115 -83 15 148 -111 -89 87 29 -97 74 85 -198 -6 95 -125 -47 138 -11
2937a1j47K33k9k09J98O8j81O8R6j54j1K35j70p7J79o6j70J00J72j66QJ79j15
$$ -11 -158 75 46 -163 35 103 -78 -10 86 -68 -79 156 -14 -91 88 22 -148 -48 124 -42 -34 145 30
2960C0j35J82k5j51J12J06j66J5J09j03m8K16j53r9J48K6j21O4J34k18OJ92j78
$$ 30 -105 77 52 -99 13 119 -47 -32 77 -26 -74 142 -11 -110 38 64 -57 7 141 -77 -71 121 -57
2983e7p5K50%k46J31J65j99p4K57j69p2K21q0j80J38J05k32J28P1j42K8J26j34
$$ -57 -132 118 118 -128 3 168 -31 -105 152 -17 -89 132 52 -128 10 115 -117 11 82 -60 -32 94 -40
3006d0n6J22O8k33J49J43k27m2K55j50r0K06n5j30J58K3k06J15J37k03l0J73o6
$$ -40 -96 26 94 -139 10 153 -74 -116 139 -11 -101 105 50 -80 78 101 -105 10 147 -56 -86 87 21
3029B1j23J65K5j64J25K3j07k9J77j50p6J86p2j48J87N6j34J7J80k38%J18j9r3
$$ 21 -102 63 88 -76 49 72 -35 -64 113 -37 -113 73 1 -147 40 96 -38 -21 159 -79 -79 39 20 -73
3053g3J11Qj65J62Oj38L3J86j72l2J55p6q8J49K0j84O7R9j34o8K10j9j84J73k9
$$ -73 38 46 -119 43 49 -89 -56 130 -42 -74 81 5 -83 66 86 -98 -31 68 -66 -134 76 57 -127 46 17
3078A7j41J41J39k49P7J56j14o4J59j13q0J24M8k15J46O9j30J5J16l1j73J45j3
$$ 17 -124 17 156 -93 -16 140 26 -38 121 8 -72 52 100 -115 31 100 -30 -15 101 70 -103 42 29
3101B9j60Q3J22j28m3K21j33n2J15j5j20P4R9j73L1J30j34k7K22r1j52J63J3j43
$$ 29 -131 -48 74 -54 -97 124 -9 -61 54 39 -81 -7 92 -81 -50 80 -54 -81 141 50 -102 61 74 -69
3125f9P5J46k34M1J39j38m0J75q1j00J02M1j90Q5J78j94oJ74p7n5Q0M4j55K3J49
$$ -69 6 152 -82 -41 98 -40 -80 95 14 -86 16 57 -133 -48 130 -64 -70 104 27 -28 52 96 -59 -36 113
3150A13k39P3J62j05r7J73Nj62N6R3r8j1J59j61qR5r0o2J72o2q8J27N0k10M1J78
$$ 113 -126 -53 109 4 -93 80 85 -77 -21 72 -26 -37 122 -39 -47 48 -42 -104 68 6 -82 45 95 -115 -74 104
3176A04r2j50J85M9j98R3J04j61Q6J0m2l4J38k0j38J20K2j38O6Q8j80J7J22o5
$$ 104 12 -138 47 96 -102 -9 95 -66 20 30 -12 -46 92 72 -66 54 76 -62 4 92 -88 -71 51 -14
3200a4j04K11o2j37J27R9k04P5J02r1j14J47J1r3Q6K3r6N8J38j84l9J75j71k0
$$ -14 -118 93 31 -106 21 120 -84 -9 93 2 -112 35 46 -47 39 62 -34 24 162 -22 -61 114 -57 -77
3224g7J10n2o5R2O2j52N0J13j14l7J57m5j14J00J12j95M7J06j23QJ12n2j14J31
$$ -77 33 -19 -84 8 70 -82 -32 81 -33 -70 87 42 -72 28 140 -55 -8 98 -25 -17 95 43 -71 60
3248F0j9p2R8M0j40J9P8j33k4J56k4j86K18%j69O5J19j67K7J31p6j23J26M1k00
$$ 60 41 -31 67 107 -33 -14 64 -69 -93 63 39 -147 71 71 -98 -33 86 -81 -54 77 1 -122 4 45 -155
3273a55J21M9j12J07Q5j48j2J04k7p7J05L5j20j4J82j63j7J36l3j62J58L1j41
$$ -155 -34 15 -97 10 95 -53 -65 39 12 -65 40 75 -45 -59 123 -40 -57 79 46 -116 42 73 -68
3296f8Q6N4j33L7J05r1m6J31p5q1P2Q6j54O1J19j50K0J36r4m9Q7Mj21M9R5j55
$$ -68 18 72 -61 -24 81 -10 -56 75 0 -81 -9 77 -77 -16 103 -47 -27 109 15 -34 53 57 -64 -15 80 -75
3322g5J5J55q6n1J05k4q7N3K3p0mJ27r6q0J32o1k7O2L4j10O5P6j10p3J39m6p6
$$ -75 -60 95 9 -42 63 39 -48 5 28 -42 -46 81 -15 -95 37 -24 -51 11 45 -65 0 76 -34 -107 32 -14 -90
3349i0J31O5j67O0J02j62j1J11k2r1R8j8n2M5L9j70J17K4j16Q3P6r5oJ03K4j61
$$ -90 41 106 -61 -1 101 -61 -72 39 17 -74 24 6 -46 -1 38 -132 -15 9 -107 -24 52 -43 -49 54 78 -83
3375h3J14P9o8o8J44r2j03J49n1o6M3M8j07M2L9o6NN3m9pR0k6j15Q8J25j64nJ12
$$ -83 31 110 42 -26 118 26 -77 72 21 -45 -2 46 -61 -19 20 -46 -41 12 -37 -44 46 20 -95 -7 118 -46 -51 61
3403F1p7n3J04l3o9J08L1j16M4O5j00l3J30q2j0R3p8q5J11N6j30j0J44p4o7J03
$$ 61 -16 -69 35 2 -67 41 72 -44 0 65 -35 -68 62 -20 -30 63 -15 -100 11 67 -63 -73 71 -3 -70 33
3429C3Lr6M9R5j31K0J40j77PJ35q5j7R4k1j38P2L7m9K8O8j02j3J03Pj61J36kj60
$$ 33 36 -60 -11 84 -47 -27 113 -64 -57 78 -7 -24 70 49 -89 -17 20 -29 -1 67 -35 -48 55 62 -99 37 35 -125
3457a25R1J20j23k2J04p1l0J07J5j56O8R9j14K6R8r9l0J31n0j38R5P8j31NJ31
$$ -125 -34 86 -37 -59 45 -26 -56 51 66 -90 -22 77 -37 -11 87 -12 -42 89 39 -99 -4 74 -57 -52 79
3482G9p8l4J27p3m0O3j5j00N1Q1j04JR7n1j06J50k6r2N7M6o3P5L9j22%R1qr7J35
$$ 79 1 -33 94 21 -19 44 29 -71 -20 61 -43 -42 55 4 -102 48 22 -70 -13 33 -30 45 84 -38 -38 53 45 -52 83
3511H3l2j59J04M2o9j4Q4J7o8P1p3n0R1j0n3oN0m9KR4k4m2N7K6j02J3Q6q0n7J35
$$ 83 51 -108 -4 38 -31 -45 39 56 -12 59 -14 -64 27 17 -36 -42 8 -41 -39 55 31 -11 46 72 -30 -17 69 -11 -68 67
3541F7p7l6J16j5q9P6J5j26Q7Qj3j1M1r9N0K1N8j32M5O1l6j8R8p6p0P9nk5J0K4
$$ 67 -10 -46 70 55 -34 42 57 -69 18 26 13 2 43 -56 -6 15 73 -59 -14 47 11 -7 91 15 -55 24 19 -6 4 28
3571B8m9k2J33j01l1J21r5J3N7p7k7L1K4j1p6J10k6j8K4L7p5J9N0p9k2R3k7m0
$$ 28 -21 -43 90 -11 -42 79 -16 -3 54 -23 -50 -19 5 -6 -82 28 2 -16 8 45 -30 -11 39 -40 -62 31 4 -36
3599c6R9j6r6N2Nl2nP7n2n1P8m8j5O4M6j14M4L3m8j3J1j2k9J12o8o4P7K9q4Q1
$$ -36 63 47 -49 3 8 -24 -29 48 -4 -55 23 -25 -40 24 70 -44 0 33 -15 -28 -17 -29 -58 54 -14 -78 -1 28 -56 25
3629B5kpj25J40J0p9R0K1j24N0N9j00qJ03m0q9R7Lm3LJ8o2N0N6p2m5O1P2j03J03
$$ 25 23 16 -109 31 41 -38 52 73 -51 -1 58 -42 -50 53 13 -76 21 24 -19 -16 2 -60 -10 46 -26 -71 -10 62 -41 62
3659F2k0p1M0N1o5K2M8j10J2P4l8n8J24J3j33J0J06n5n7O7M1j60J18N4j15M9J1
$$ 62 42 -29 11 62 -3 19 67 -43 -31 43 5 -53 71 84 -49 -39 67 12 -45 22 63 -97 21 75 -40 9 20
3686B0j5jP3p9l4Q4L4j52J24%r7L2K0m4K9J9K6q5O6%o8N8JJ1o7J3kl6O5O0r1P0
$$ 20 5 4 77 -2 -36 48 82 -70 54 54 -43 -11 9 -35 -6 13 39 -46 20 20 -48 10 11 22 -45 -32 -34 -70 -5 55 -36 34
3718C4j6n7L8P0r9QR2p9j7K3N1m9OL7k4k4N6n9l6P6Mj11R1m0K0J9j6Op7O5kp4
$$ 34 18 -39 -1 69 -30 -22 70 -9 -26 -3 48 -1 5 42 18 -6 50 -9 -45 31 35 -76 15 -25 -5 14 -2 4 -73 -8 -10 -84
3750h4M2R8j40J25K0p7J3N3Jp2Q7m6m5P2J1j7l2M1o2L9j9J7j03J34Mj00K4N6j0
$$ -84 -42 56 -84 41 61 -16 -3 50 51 -21 66 20 -25 47 58 41 9 50 -12 27 8 25 -78 56 60 -40 -16 40 30
3779C0r6N6j4rP5Kr9M6Q3r2m0J05Jq5N0M2q5M2N8o3j7N7q6k3J31m6m9P9j9n2R
$$ 30 -66 -10 -24 -33 42 44 -55 -9 74 -18 -58 47 48 -37 13 55 -30 12 70 7 -10 47 -39 -62 69 23 -26 53 34 -18 -9
3810iMo1L9M7m5nK2pk3L6M7l9J5N5j39L3P3pl6N0K4j21O4M8q6k0J2L4l7J22p2
$$ -9 -5 -66 -27 20 -25 -30 -8 -15 -38 -2 45 6 21 76 -63 -30 43 36 0 50 74 -47 17 65 -21 -41 -29 5 -32 90 18
3841A8m0J2PQm9J28m6k1k0L4o6Q8L4j07L3Q0j40O9M0j3j19R4l5k5J00kn5l6Q9
$$ 18 -22 -10 -3 5 -44 84 38 17 -3 31 -35 53 87 -20 13 93 -47 22 62 49 -70 24 -11 -36 64 62 7 -29 60
3870F0q0J0NK5n6R4n0o3L6N7p7J5O4q8L0N7O9j35j0O0m4l3J01l4k2On6J9M1JN6
$$ 60 -20 -10 -5 20 -36 58 8 -55 -19 38 -39 -24 40 -48 -18 39 108 -27 -37 23 -21 -54 47 13 -9 -3 -59 -40 1 2 58
3901E8n1Mm2J4L5j7k3M1o2J7O6Kn1l6Q0l1k6L8j1L9m5L5n6j8J12l3k4N8Mq9P4
$$ 58 7 11 -31 -17 18 1 -22 19 -43 -26 40 42 -9 -45 35 4 -22 16 5 44 -1 34 -22 -40 72 39 15 73 77 -12 62
3932F2p5L3p7J32q1k4Q9j9q1N8k5Qj5O5j10O9L0j22P4K6Mo2P7l0j9J9M1p1L1N5
$$ 62 -13 20 -57 75 -6 -30 59 40 -41 17 -8 0 -15 50 -60 9 39 -83 -9 17 21 -41 36 6 -13 6 47 -24 7 62
3962F2q7J3M3rp5M7K6k1jO0p2l1R9n7m8Q2L8j65R5L2j25J04K9k8m5R4m9j5M3o2
$$ 62 -25 -12 31 22 -53 -6 20 -1 -2 58 -14 -45 54 -3 -51 31 69 -96 -1 31 -94 10 39 11 -34 60 11 -4 39 -23
3992b3k5MM9j3L0l3K4k0R3n6j01J10j4p7P2%m8lL4l3J4N6J8o3J0P1p1l1M4K8j1
$$ -23 -48 -44 5 -8 22 -11 13 -7 86 30 -71 39 25 -52 20 20 -28 -31 3 -30 -16 40 58 -5 5 76 5 -26 18 46 35
4023C5Nl4mj8N6J4o2M4n9J3N0mj05Q4jm4lQ5q2l4J00Nj02J02m5m0N0Rn8O7j2j4
$$ 35 40 6 2 -16 40 54 -8 36 -23 -10 40 36 -69 15 14 -30 -33 52 -30 -64 36 41 -61 41 -4 -44 6 15 -43 24 12 -2
4055bqM7J3q2L1J8m8rO7r5M6O2l1J2mL0j5k3l0J9k4M8m8J5N4mo3M9j2k8O6No0
$$ -2 -10 37 50 -32 -1 17 -31 -40 27 -68 -22 40 9 21 17 47 32 9 -21 -2 -26 22 -26 -11 43 39 -24 25 13 -15 51 56 -4
4088dl0N4j0k0L0ook0K6n6L2K7jk6J5kj8k9Q9j09N9j3k2M6mM0j11P4J9%k0K3o
$$ -4 -34 20 10 -10 20 14 8 -12 14 -42 -10 17 16 -10 5 3 -15 -44 45 -64 -5 -18 -40 6 2 42 -69 5 24 24 4 27 21
4121B1k9M7j3n8J21n1p3L3K2k6LK0j8oN1n0m8M3L8o4M2O9j16M8M2m2n2M9M5o5
$$ 21 -8 39 26 -32 89 38 -35 -2 20 -6 -3 17 -1 -7 44 -6 -54 -11 27 -37 5 74 -42 6 48 6 -46 3 48 -17
4151a7k6Q8p9M2K3rm6J6NJ1J2qj9M6n4nj1N0k0k3N4k9m8L4N2j15O6j1N7p4O6L0
$$ -17 -43 45 -34 8 31 22 -24 -8 -3 8 20 12 -7 39 -15 -20 -31 19 -1 -24 30 1 -47 -13 39 -76 -10 -21 36 -38 28 58
4183E8j18P8m5M3l3lK7p0P2m1lj7OJ9M5nl9NM1o2k4J24m5ok8OJ0l3J3j6k8J02
$$ 58 -60 18 -27 16 -17 -20 7 -63 9 -32 -35 -52 -46 -27 18 13 -26 -21 20 -42 -66 58 13 7 -21 -15 -5 -38 -25 -41 -69 33
4215C3J7j20J44r7K9m0M8k0r6J54m5k8rN6m2KJ8Kn7K4MJ15n9m6j1j7k0K1N8j6
$$ 33 50 -70 74 -23 6 -34 14 -6 -102 52 7 -21 -30 26 -16 -14 4 6 -51 -27 -23 92 33 -13 -24 -41 -61 -40 18 2
4245BKl7N3k1n5Q1K1j03Q7n3P5m6R5j48OR4p8J2J3K9n0J8L5k4OJ0j1pOJl2P4%
$$ 2 4 -33 20 -1 -56 25 46 -57 30 -23 52 6 101 -47 -41 53 -25 -13 0 29 -21 -3 32 8 14 24 13 6 12 13 -19 55 55
4278E5p2RL2m2l1O0rp5P9J8o7K4J4J3j4M2n0j3J11q2m3N8l3k8N0j7lm8R9l7k7
$$ 55 -17 -8 24 -18 -49 11 2 -73 6 24 -43 -19 -5 8 -6 36 -14 -27 84 2 -41 17 -16 -44 6 -11 -14 -62 37 0 -27
4309b7J4O4j02O7N0r3M6N8q9k1L0K7m8j4O5No0K3l3Mk8N7J0j2L2m2K4k0J0p3P8
$$ -27 -13 51 -51 16 66 -27 19 77 -12 -33 -3 24 -24 -38 27 32 -28 -5 -38 -34 -62 -5 5 -7 25 -17 7 -13 -3 -76 2
4340BL6j9j5l5k5J21j1p8N8l5k3j0P5o5j5N4J3p9O3M3o7J0J3k4j4M1J5k4N8j0
$$ 2 38 19 4 -31 -56 65 54 -24 34 -1 -24 -34 41 -24 -39 15 28 -51 12 55 -12 -2 11 -13 -27 14 29 5 63 53
4370E3o1OMJ3m2P1l5n2O0mn4O8k8J3K9l8k0l9L6M8o1K8K3o0K4K5l3R3n3q9J2R0
$$ 53 -8 -2 2 15 -27 44 9 -43 17 13 -41 27 -1 12 41 3 -17 -56 -20 28 -33 -5 18 -42 -18 7 -26 67 14 -75 -63 27
4402B7j2Ok9O1n9j8l5N0k3L1N7m9Jm5K3m5P0K8q9R1k7o2j1J10n2M7o5J1m1O4o
$$ 27 15 21 -8 53 -6 -24 -59 -9 -32 -1 56 7 8 -37 -14 -59 11 39 -50 41 14 -48 -59 51 -1 46 -19 -8 -49 15 9
4433Ij2rJ4O2q4L3lj9N8l5r6J25p0L3l4M7k5PM9o8POqJ2K6%n2K1M2m9j7L2k1L5
$$ 9 -3 -12 2 64 -20 13 10 -9 49 14 -82 43 -27 6 -28 19 -6 1 50 -18 -11 -5 -13 -1 25 25 -27 -6 36 -13 -30 2 -19 16
4467A6JL4m0o8J16q6N5j2k4Rj4M2n5J0J6J6JL8r2m4M8j5j9R8p7j6K6O2n3M0J2
$$ 16 17 51 11 -57 59 -27 28 16 -8 1 -13 29 -26 -16 0 16 17 55 -37 -81 -33 -48 -67 31 -46 -62 -36 26 -27 13 25
4498B5j0k8M2k5j5k9P8o0nj5K8RJ6j5L0J5l9J6k3j8qM5j7n6M8J7MqK0l9j1l8J04
$$ 25 15 -13 29 4 -11 -40 38 -22 -27 -42 -14 -5 11 -4 26 41 2 18 -5 -23 -31 14 -3 -59 -11 6 10 2 22 -17 -28 -66 38
4531C8m2o3L5N1l9Q2l7m4LNON1l3N6o9rj3j3N2ll3j3J1k7Q5mk3j3K0J1k2J7m9
$$ 38 -4 -67 -32 19 -20 62 25 -19 -16 -11 -5 46 13 69 0 -9 -22 -35 17 14 -19 -32 -21 -48 37 33 10 -3 17 28 6 23 -26
4564b6L4kRk1N9k5k2n7N0l2L0k0J6K9m8M1J5rL3p6L7rJ1m3K0mj7%L1L2l9K8j4
$$ -26 8 6 15 -6 53 28 6 -51 -1 -33 -3 -23 -7 22 -26 15 30 21 54 -22 15 6 17 -26 -6 -10 -27 -27 4 36 -3 25 11
4597A1k0oK7k1l0O3m8K0k8pP8j5M9r9O2J9n6J2qj0kJ8l1Ql2J0Rj2K2M2j6PK1n3
$$ 11 -9 -15 12 -9 -39 24 -24 -4 -32 -39 39 24 73 -26 36 55 -1 11 3 -7 -9 9 -22 -14 -46 -36 -27 -39 -17 25 9 16 37 -16
4631a6j4L0m3JJ7orJ06k2p6Q3p9J2m0N2l5K5K6J8l5N1J7p1M1l0k2L4m3qk3M5j6
$$ -16 -30 0 -43 -42 -25 -31 -40 66 44 -32 51 -28 -16 -56 -4 -39 -14 12 30 -5 46 63 -8 33 3 -19 15 -28 -36 -59 -14 -30
4663c0pO6n0J5L6k4o5N6l1Q4q7L8N8p6QP6r6k2K0N5l2k3J2j0KM9j2k7K9Qj2j0
$$ -30 -37 29 -21 -6 30 6 -59 -3 -34 50 -37 1 59 -17 -9 67 -29 -51 -31 24 -8 -31 -19 -29 -27 22 10 -17 12 20 8 -2
4695bKk3M1J4l1k2QM3n3M5k2n1L4l8N4OJ3m1Pk4N3%n4L7l3k4R5q9MJ00r6qP3j6
$$ -2 0 -23 18 32 1 -21 -13 30 -23 22 0 -51 -17 -55 -1 5 18 -23 -16 -40 13 13 -41 -4 -37 -61 34 -55 -51 49 -47 -55 18 2
4729Bn8P9kq2L8L4o7M7J1m6P1J2l9k1K6ooM6n3N2k6%M4j09N9om1N6j3Kl1P1%o8
$$ 2 -56 23 21 -61 -23 11 -56 -9 2 -44 27 39 0 -21 5 -1 -7 39 -14 38 12 12 56 -53 6 0 -41 15 2 4 -27 44 44 -24
4763b4N3q6K1J5OJj9J5k1L5L3l6J9n9M6PpJ4q9N4N4ok7j9L2j6L5Ml0j9L1n5MK9
$$ -24 29 -57 -36 -21 -15 -14 -33 -18 -39 -4 29 -7 12 -47 -1 6 -1 13 -76 -22 32 26 -1 -20 12 -4 31 35 5 -14 17 -38 -34 -5
4797eK9l0Rqk1N6l7n3L3M8j1m1N9l5rL5j3jl4O9o8M2n5P2l3OJ2jkk0K9m7O2k3
$$ -5 24 -6 3 -5 -26 30 -7 -60 -27 21 10 -31 28 -7 -16 19 6 5 -29 40 -28 14 -41 31 -2 4 16 15 13 -7 22 -25 37 14
4831A4j0k0M1MK7r1k1J08p0K5KJ1M0j17L7k4K4N3j7k7j2K0J9m6J9N6j2n8J0J6
$$ 14 4 -16 25 29 56 -35 -56 52 -18 7 9 20 60 -57 -20 -44 -20 33 16 -11 -23 -3 16 -30 -11 45 33 -25 -15 1
4861Aj1Rq9Q3oO5mk1k0J1l8K0pJ1J8K0p9O5r7J00Rk0k1nM6j8m9NJ4n9O7K9k2q
$$ 1 -10 -1 -90 -7 -13 52 48 27 7 18 -20 0 -7 4 22 42 -37 28 -69 31 40 20 -1 -6 40 22 -27 -22 -8 -67 0 29 7 -1
4895ak6pk0O2M1r7O9mk9Mj3K9m3O4k7qL9m6pk7N3N6o0mPl4J5oP2Ml1m4K0K4jl5
$$ -1 -27 -34 -54 8 49 -48 21 17 -12 -8 -21 8 -35 29 2 -6 33 -13 -20 -47 6 62 2 -2 5 -29 -14 -20 52 56 25 -19 1 25 24 -11
4931a1L8j1kL0l5l4jK0k9K3J6J7l5k3M9k0J8j3o3O2N6m9J0nJ9p1N9n1QL9Rm8L7
$$ -11 27 16 14 44 9 -25 -26 -6 -35 -12 4 21 -14 -37 12 -8 10 -3 -66 -4 52 3 13 8 27 -44 15 -36 -28 11 20 -28 9
4964IM4o7K0j0L9o8M6p2J3J8M2m9K1L8o8lO0m0lm5P2K7o7Q9n3k6L7Qj4K3ooPj3
$$ 9 53 -14 6 -4 35 -33 13 -59 -46 -28 14 -35 -14 24 -44 -47 13 -27 -30 -75 -3 24 -43 46 -7 -33 4 12 -2 21 15 9 16 3
4998Cn%n3Q1m5K4Pk9nJ9K1l4o8R7pO6j11N5r8J06m8L8K1k5%L1mp5L8pM2Nj7m7
$$ 3 -2 -2 -55 26 -19 5 12 -17 -22 -3 18 -16 -84 13 6 72 -39 16 -82 24 -24 14 35 10 10 41 37 -38 0 -7 35 40 23 -24
5032b4K0J0l8L7J6o3M5K2n2j8O1J4p4L4K3l3k1L1Ml4jP2J3o3Q3m2n0M9l2K2m7
$$ -24 -4 6 -32 5 21 -42 3 25 -27 -45 16 30 -44 -10 13 -20 -41 -10 -6 -40 -41 31 44 -19 64 22 -28 21 -11 11 -36
5063c6N4nk5L4j08J17l3k7J1j2M4k6j0L2Pj05QJ15n4L0m1j7M5J5on1R3l0n8OQ
$$ -36 18 13 -12 22 -86 31 -2 -29 -18 -30 14 -12 -22 10 17 -88 -80 35 -19 11 -30 -47 -2 13 7 -44 49 19 -39 -33 -25
5094b5m4R3Om7RJ2l2L0k8O6m7K6n0OJ4J7k1L3k8L0m9N6pn8Q1q3j0P3k5L4J0l1
$$ -25 -69 24 30 -17 -8 4 -28 2 -26 40 -7 19 -31 -25 -11 6 -15 18 -10 20 -29 27 20 -38 43 -40 -50 23 -2 32 42 11
5126A1Pl7L2m0O9q7K4%j9N6m6l5M6lJ0j8O9o4L8j5m4RK6%J4N6k3J3o6Q1j08L0
$$ 11 18 -19 13 -27 42 -45 -21 -21 -40 16 -30 -65 -19 -22 -12 -30 39 -25 13 -2 -46 -37 -11 -11 3 59 36 49 -17 64 -44 -14
5158a4J6l2J5k3J9N1n2Kj5L5mK9o6J5L4p2K9L6l2L3Kk5Kj1M2o2pM4qL0l2%j1k4
$$ -14 2 -30 -15 -38 -19 32 -20 -18 -33 2 -2 27 -39 -24 10 -62 -33 3 -29 4 6 -19 -17 -28 14 -48 -55 -11 -19 11 -21 -21 -32 -56
5192e6K1L4o4O4j6J1rm3J6M8l6P2Pp1K3L8n0m1L9j7Rl0L7N0k0k0l9K9J9n0M0J3
$$ -56 -35 -1 -65 -1 -17 -6 -15 -58 -42 6 -30 42 49 -22 1 39 -11 -52 -13 -30 -21 -51 -14 36 16 -4 -43 -14 5 -45 -5 8
5224Hl6Q5k3n5pK2MJ4l0nK2J2j1J4k1K3QJ2l1k6L0j3Mj2RO1j1po9P2m0J6J9m2
$$ 8 -28 57 34 -21 -28 -6 -2 12 -18 -23 -1 11 0 14 -7 16 24 36 5 -21 9 -4 0 -12 -3 58 47 40 -29 43 3 19 38 -4
5258d%L3%m7l4R0m4KJ0kKn5K8PN9j3k9K0Np9P0o8R5l1K6l4n9K1J8J7K4On5M4l1
$$ -4 -4 29 29 -18 -52 38 -6 -4 6 4 6 -49 -21 -14 45 32 3 23 28 -51 19 -49 46 15 41 7 -52 -31 -13 4 28 34 -21 23 -8
5293hL4p0%P2l5mPN6p2L2J5l5k2K2kJ9m2O1n4j6QK1k1N3n2J8k0mK3J5Q2m7l6r
$$ -8 26 -44 -44 28 -7 -11 -4 52 -20 12 27 -8 -30 -8 -10 9 -33 28 -26 -42 -34 -13 -34 19 -33 -15 -35 -39 -16 -1 81 34 -2 -11
5327a1RNK6j2j5M4n0L6l0j5K9PQn0J6P8r0J7J1k1%M3Ln6L1j7J4k2Nj6M6K2j05
$$ -11 -2 3 29 17 2 46 -4 32 2 -13 16 23 31 -19 -3 75 -15 2 13 -8 -8 35 38 -18 13 -4 10 -12 -7 -23 23 45 -60
5360f0Q8q4O5m5%O2j2k8J2%K3rJJ9l5K5k1lk0R1p4n3R2k2m0K4j8pL5jk3J1k1K1
$$ -60 28 -56 9 -36 -36 26 14 -14 -2 -2 21 12 13 32 -3 22 1 -2 -22 69 -5 -58 34 12 -28 -4 -22 -29 6 5 -18 -7 -28 -7
5394gJ3l6Nk1J8J9k2M8l9M2m2K6qj8L1k1l3K4N4m7M3n8rO8k3k5K9k8J5%j6j9M7
$$ -7 6 -30 -25 -46 -28 -9 -31 17 -22 20 -22 4 -4 -22 9 -12 -45 -21 33 -14 29 -29 -38 30 7 -18 11 -17 -2 -2 -18 -37 10
5427A0k0j9rN5%n4K2N2j5l8J6l2O3k6L6no6O1l9l0L0NK7kl7J6pO0k8m0K2k7J2
$$ 10 -10 -29 -38 17 17 -37 -15 37 22 -16 0 -32 31 5 41 36 -30 31 -8 -38 -8 -3 24 22 -15 1 -6 54 26 -14 8 -19 -7
5460gM4k6L8n8j0j2N4j5K5k3nJ0k6L3poqpL3p2O2Lp9K0K5K5l1j7nN9o4L2k9P4
$$ -7 37 11 49 -9 -19 -31 23 8 33 10 5 15 -11 22 15 9 1 -6 27 -45 17 20 -59 -39 -14 11 -20 -37 -42 17 -47 -15 -44 30
5494C0n3K5K8k1OQ4p2j0m4M5J9l9K0k8K6j6Kn1M7Pnm2K6Pj0j5L3L2m6k0N8m6K9
$$ 30 -23 2 30 9 15 99 27 17 -27 18 37 -2 18 -10 16 0 2 -49 -2 5 0 -42 -16 -9 -19 -34 -1 31 -15 -35 23 -23 6
5527FQp5K1P8rn8J8PK6rk7Jl9K4k2M4j4J5k6O1J0m1K1J4n3K6M2l2k0K3K2n4m8
$$ 6 14 -61 -40 38 29 -29 -11 -4 22 13 -14 -13 -52 -28 -50 -6 -20 -5 -31 30 40 -1 20 34 -19 7 49 17 -3 20 42 -12 -60
5560f0P2l8KK1k5jL1qL1k7l1O6n7RRLK8k6k3M4k4k4N3o3N8qko0K4qL1k7N9m1M5
$$ -60 12 -26 -24 -3 -28 -29 2 -6 25 -2 -33 33 -24 -15 -6 -3 25 -1 -24 20 -4 -28 25 -38 20 12 10 -50 -26 -34 -3 -30 29 -12 33
5595C3j9k4L3k6L3m4RJ8k4j4L3n1J9N0k7Pk1k1P0k5j5Qj6J0k1m4J08q8K8Pk1K2
$$ 33 14 -10 23 -3 30 -14 -5 13 -11 -25 8 -43 -24 26 -1 6 -15 -36 34 9 -6 2 -14 -4 -25 -69 39 -49 -21 -14 -35 -13
5627a3qJ7Lk0K5K1j3l1OK5mMj9K3k6l9Q3k4OM0n0pl2L7nRJ0m6L1j3mJ4m7O1j7
$$ -13 -21 -4 -1 -21 4 25 12 -19 -13 12 8 12 -7 16 -10 -49 34 10 16 56 6 -1 -33 4 -1 8 18 -28 3 -10 -14 0 -47 14 -3
5662cl2M5K4K9l6n5M4m7L8J2k6j3oK1p2Q3Nl2J08j04K9J2j6J8km9l6L7PJ8l4J7
$$ -3 -35 10 34 63 27 -28 16 -31 7 19 -7 -20 -26 -5 -77 6 11 -21 87 -17 12 24 8 26 24 -25 -61 -24 -17 1 -33 -16
5694a6M8q2M5qm0K2L6k9pj9M2N1l4Lj1L1m7K5l4L9Pq6R3p0kJ2L0Ql7J5j8K7L5
$$ -16 32 -50 -5 -13 -53 -31 5 -24 -31 -50 -8 43 9 12 1 32 -15 10 -24 15 22 -64 29 -41 -43 -31 -1 7 -30 -15 -33 -6 29
5727B9k7K4j0l8L0K3n3Lk5M7L0j5ko4M4L9l5K1k4k5K2kQj8j8LM0KL1jl9K5l1j0
$$ 29 2 26 16 -22 8 31 -22 -19 -44 3 33 18 16 -48 -4 35 0 21 -3 -28 -6 -8 0 -18 -36 -33 7 9 40 39 0 25 -6 -16
5761a6J5K8Kk8KQP0j34M9j0j1j7K7J6jn1PL3l5K3M3l3j1N1k5j7K0l5j7R7q9K4
$$ -16 -1 27 29 1 3 11 81 -53 -4 -14 -25 -42 -15 1 0 -51 -44 -11 -46 -23 20 -13 -24 27 2 -15 5 -30 -47 50 -39 -15
5793a5P1n1k3k2M2m4Q1k3k7nqj5L4J9J9m2kP4n8J1l9M0q8P3k4L1K2l3l5L3O2o8
$$ -15 56 5 -18 -40 2 -42 39 16 -11 -16 -24 -39 -5 14 33 -9 -11 63 5 16 -23 17 -71 2 -22 9 31 -2 -37 -4 58 -10
5825a0N1l4k0MK1jk4L3l4M9jrk2J6k6M4l8N2l3PK6m6j4qN5l5m7K4K2J8k7k0j0
$$ -10 41 7 -13 -9 12 11 -13 20 -14 35 34 25 3 19 -7 37 -1 51 18 25 51 5 -9 -17 38 3 -44 -20 2 20 -7 -27 -37
5858c7L0L3k1J5m8k0L6N8m4J8j3j2L8o5k8N3k3M0M5m2K2k4Qk8j9K0mqP8n5pnl8
$$ -37 -7 26 5 20 -28 -48 -12 46 2 20 7 -5 33 -32 -60 -7 -30 10 55 13 35 11 19 -9 -28 -8 -12 -20 58 3 -4 -9 -47
5891d7P7q0P3r3N8QL4L2m4J9Rl5n1M6j6j9mL3L5l9PRk5O5o7qL8K4l0pM4r1L0L3
$$ -47 30 -50 23 -70 -12 -4 30 62 18 37 46 11 -40 6 -10 -29 -33 0 35 -4 3 12 -13 52 -15 -23 15 39 9 2 46 -45 -15 18
5925A8m3J6l2L7KM0m5n6P8l4M0n0J5L0l0M5q9K1O0l5k9L2L7p6qP1K4k7Nl2Lm3
$$ 18 -25 -9 -41 -4 -2 38 -7 -63 15 -19 21 -29 -14 16 -14 31 -58 -37 23 -12 -41 -9 28 -48 -56 15 39 12 17 -15 -12 -55
5957e5K5K0j4L1QJ6j00N3L3j5JL5l6k8k0N0m9J6O0m9PJ7j8pk9Q9n3J9lj6J5K7
$$ -55 -30 -10 -24 7 15 31 -69 -16 17 2 3 38 2 -26 -46 4 -45 -29 31 -18 -11 6 -12 -19 -48 41 -12 7 4 -12 3 30
5989C0j0l0K7K6m7l1N0pmnrj2OJ5j9L6N2q3k7O1J1j8k8J5J6l8K5K4lk1k6P4p9
$$ 30 20 -10 17 43 -4 -35 15 8 4 -1 -10 -22 -16 -1 -20 16 68 -15 -42 19 30 12 -16 -1 15 -23 2 26 23 2 -24 50 -29
6022b9K2M5k5PKo2K4K8l8QL3m0j2J3K4j8N3n6K2K2rl5P1o6k0J9K0KJ6jq6R9l4
$$ -29 -7 38 13 20 22 -40 -16 12 -26 -18 15 -25 -37 -24 0 -18 35 -21 1 23 14 -21 50 -16 -36 -17 3 5 21 20 -66 33 -1
6055aPJ2j3k8jP4k2l9K5K0k3j9oL0k1n2QO4k0M8Mm7mjJ9J4J4m9L2l2Pk4j8N3m3
$$ -1 6 18 5 -23 -24 50 28 -11 14 34 11 -8 -14 16 -5 -57 -49 15 -5 43 47 0 -4 -5 14 28 42 -7 25 -7 0 -24 -42 11 -32
6090c2N1p6K6L7m8L7NjnLM6k1jn9Q5o1k0M7j1l1R1k2o4M1k0o7J40j08K3J7l6J6
$$ -32 19 -57 -31 6 -42 -5 0 -1 -6 -3 43 22 21 -38 47 -14 -34 13 2 -29 62 40 -24 17 -3 -70 70 -38 -15 2 -34 -18
6122a8J2O0r5K1J3L4J4j8K3k0K7mn9j6M1l3l2M8j8M2J5o2M1J6j9k2MLk7L4LPL4
$$ -18 -6 54 -41 -20 -7 27 41 23 46 26 53 49 -10 -26 15 -18 -50 -2 -20 22 37 -25 16 32 13 -9 -5 -2 -29 5 8 15 49
6155D9m2j7l1M6nJ6m1L4M2p4j5oK1K4oRK0l3n3N3l5L3J2J4p3M0j4k2O5K9n4J3
$$ 49 7 -10 -41 5 0 16 -25 9 51 -23 -38 -44 -23 1 -5 4 24 -9 -62 -9 -44 -11 1 15 -58 -18 -32 -54 11 40 -14 -1
6187aj2L1m7J9K4j8J6j6MJJ4l3j0O0k7m7L8l2N6l6K2j7M0n5lJ9K0j2K2Rn7N1k2
$$ -1 -13 18 -29 -10 14 -4 12 -4 0 1 15 -18 -28 32 5 -42 -4 -36 20 -16 6 -11 29 -26 -29 -10 10 -2 20 29 -28 23 1
6220Alk2j8L9J4OP1j26M0O6j04N3k2K8l7Po2J08o7L1K5k3ql6P9m5j2J3lm6L9j3
$$ 1 -2 -24 -42 -3 11 17 88 -38 2 68 -36 17 -5 23 -14 -7 -69 39 -28 3 28 5 -3 -39 40 -5 -17 -4 -7 -53 -14 -27
6252b7nNnpk5P3l8J4L2j0qn6P3j4M0o6%J0LK6p5Q8n5K8k8L9l4K0J1J4m0k6P6j8
$$ -27 -32 -27 -32 -39 -64 9 -29 -15 17 7 -1 -57 16 2 42 -24 -24 -14 -11 15 -60 28 -27 1 -27 12 -22 -2 9 23 -17 -43 33 15
6286A5K7j5p4M1J1l3lJ7L6J7n3J9l2P1l0J4L0m5k1J3N4m3l4L2k8KN6j6k9J3M2
$$ 15 42 27 -47 -6 5 -28 -31 -14 22 39 -14 5 -27 44 14 28 58 13 -8 5 59 16 -18 14 -14 -12 44 28 -1 12 54
6317E4j21O3k4QjM4k0j2K9o9M5J1Oo0K7OO8j02j5N8Mj4l8J25n1Ll6L4j9Qqn3J10
$$ 54 -67 -4 -28 -20 -21 23 3 -9 20 -49 -4 7 13 -47 -20 -14 54 -48 -63 -5 -1 -15 -53 72 21 24 -12 22 3 11 3 -50 60
6350F0n6L5k4j7P7p9%l3M0k5J1J6jK7n2M7J3n6mJ7k2RJ2j2jO2m7j9rO0m4LM3o0
$$ 60 4 39 15 -2 75 -4 -4 -37 3 -22 -11 5 4 31 -21 26 39 -17 -21 -4 -26 -17 -5 -17 -18 44 -3 -22 -31 29 -15 -12 31 -29
6384b9NO5n0Qm3J06l0k3J9k3K5m0M2l2L0l2oM9r4M0OM3k9j0m1m7J03l8Q2n5om4
$$ -29 -24 41 -9 -1 -44 62 32 9 28 5 30 -10 32 0 30 -2 -8 41 -53 -13 -7 36 7 -3 -44 -91 12 -26 56 1 -5 -49
6416d9O1l8K6l7mO8J0p7L4Lk7M7k3J6P%LM9n1j9Pj6O0o9L2J8l5N6n3k4N6m4K0
$$ -49 12 -26 0 -37 -41 27 37 -40 -6 -3 -30 17 -6 10 17 17 20 69 18 -1 6 -10 50 -19 13 31 -4 52 -1 -25 31 -13 7
6449GMm8N7m3N8l2K5j2m3N5m3M3n4j6MqM8l6J6J7J7J3k6l0m2R0krL6m6qj6K3P
$$ 7 11 -37 20 -23 35 3 28 16 -27 28 -15 28 -26 -42 -38 -46 2 -34 -18 -1 16 29 3 -27 -69 21 19 10 46 0 -8 -24 -1 6
6483FM2j2p5k5R2Ol2K5l2l1M4K1j9Nl5M4o4L9k9J9NN0qj1l6L0j6k9K6K7k9mj6
$$ 6 48 36 -39 -64 28 34 2 27 -5 -36 8 29 10 15 -20 24 -40 -1 -30 -11 -6 44 36 25 -11 19 3 -26 0 27 -2 -6 -22
6516b2k4Q7j8m8Q2j2j09N6J2j4M3o8N4nk6J6K4o6M1J1o0O7j4l7L5j6K2j6PPll2
$$ -22 -46 41 23 -25 57 45 -64 -8 4 -10 33 -35 19 14 -12 4 28 -38 3 14 -46 21 7 -30 5 -11 11 -5 2 9 6 -26
6548b6L5n6P1l0J1PK6l8l0M8m9P9n3ojKK3j5lJ0nJ6j2j3M7o9j1%O1k9%PlJ4k0
$$ -26 9 -47 24 -6 5 12 38 0 -30 18 -31 48 -5 -11 -12 -10 13 -2 -5 5 0 16 4 -9 38 -31 -42 -42 19 -10 -10 -3 -6 8 -12
6583a2j5N2r8O3N3n2rj7O1m9nJ2KkJ7o2J29o7K5nk0K9pj9J9Rn7J3QM2j6k9K1l1
$$ -12 -27 25 -73 -10 43 -9 -18 -35 26 -23 -28 -16 -14 -16 1 -61 68 1 26 21 1 30 23 4 23 32 -25 -12 -4 38 22 -7 14 -17
6617a7j9oL3k8j5M9m8M7k5P0kl9j2L9K2o3L9o0N5lQj8m7M8l0olN9m1M4n6N7j2
$$ -17 -36 -42 -9 -37 -52 -3 -51 -4 -29 41 39 0 -12 27 49 -14 25 -35 20 17 25 7 -40 8 -22 -28 -31 28 -13 31 -25 32 20
6650B0n1M6Nk2O1J1j02J8J7J4j7k3N2n0qM8Pqm3OJ8oN8n4k9oL6OK6Om6M9p5J6
$$ 20 -31 15 20 -2 59 70 -32 -14 3 17 0 -23 29 -21 -29 19 26 18 -25 -19 -1 -7 51 -3 -32 -38 -2 4 30 36 -10 39 -36 -20
6684b0O1jj14R1J1o3M8m0M2O4n3j9m8L4n0N4M8Oj2jp9O5Kl1l8JL3mM9o9L8Nn4
$$ -20 41 40 -74 17 28 -35 13 -27 15 79 26 7 -41 -7 -57 -3 45 51 39 38 -41 24 26 -5 -43 -42 -9 -13 36 -33 5 10 -44
6717d4R6n3K4m5j0K4N0Po5j9jM9K9o3LM1l0k8M2j2L8pj6jK3n2L9j8NnK8o8L6m8
$$ -44 52 -1 23 -22 -32 -8 42 49 -16 -35 -36 13 42 -21 -18 23 -7 -35 7 -5 33 26 10 9 32 -20 19 1 6 1 29 -39 -3 -51
6751e1L2O9j31J09n3K1k2O9n1j5P%k8N1J2J8l2rm1L3j3N3j00M7M6M4m2j6l7J6
$$ -51 -19 50 -81 28 -25 -4 -26 43 -8 -23 -16 -16 -44 7 19 37 5 -4 -45 -12 -25 28 -72 -25 21 65 23 7 -30 -14
6781a4jj4ljJ6NN7j09N5J7qj6k2L4k0J6j3L6l7K1K4o9K6M7k4J1k9RL3j0mm4L7
$$ -14 -15 -29 -32 -33 -17 -12 45 -64 -9 8 0 -16 -38 -4 -24 -8 -21 15 -22 -1 23 -46 -20 27 3 14 -15 -6 27 17 13 -31 6
6814F%m2J50j04j0J0kPk7J7JJ6j6N7r2RM2n6J7L5j7J1k8KL3j2Om7J9k4M9l1Q5
$$ 6 6 -36 114 10 0 10 8 15 -12 5 6 22 6 63 -29 -20 22 -34 -17 18 1 12 -16 -14 19 7 13 -34 -15 -39 10 -21 64
6847F4p4M2n8P1p3J6m5M3K7qL9m6K1Lj9K8M6j06N0Rl5M0l8K8J0n9%OK9o8O2Ok8
$$ 64 -10 32 -26 45 -28 -12 -57 -14 13 5 44 -2 19 22 3 31 77 -29 21 30 -5 35 -3 25 35 -24 -24 -18 11 -57 5 11 -17
6880a7N1n8O1jj2l6M0l1L9l9KJ5k2K6Mm8M0n2ML5l7O0J6J0m1L0m1M4n9J6J5lj9
$$ -17 34 -24 37 36 24 -12 28 -3 36 -3 -1 14 -8 18 22 -26 14 -38 -34 1 -36 24 40 50 9 39 -2 42 -17 -1 14 11 -8
6913hl9k6K6P5oJ4k4m3L1rK8J5nQr4N9n5O8k2l1K7j6K9k9O2o9J4l6P0RNl4K5l4
$$ -8 -47 -73 -47 28 22 36 12 -31 0 -9 19 34 29 37 -57 2 -53 15 -7 -38 -11 -27 2 -27 35 -34 -20 -56 14 23 28 -6 19 -15
6947a5MO1l4l4Q8q5M7Qp3K1K0M1n0R1m7k3j9l6K5JK0k1O0l7k4L3K0k7n6M2k1R
$$ -15 -11 50 16 -18 70 -15 32 40 -33 -12 8 49 -1 90 43 20 1 -35 -10 -9 11 -10 50 13 -11 22 42 15 -41 1 -20 -11
6979a1%K2n5J9N2l6J1j2O2J7j2o5Q3n3k7K2Rn0M2L1l1m5K4M2m4J7On6M9Mo2L7
$$ -11 -11 11 -44 -25 27 -9 2 -10 52 69 57 -8 75 22 -5 17 26 -24 18 49 18 -27 -3 39 -5 12 18 -38 11 15 -47 -10
7011a0l6N7j4K4k9Pj9k2M9j6PJ6m5O9l6Lk0K8n4Q8n3J0L2m5K6npmJ6rj1K5J4j9
$$ -10 -46 11 -3 21 -8 -1 -20 -42 7 -9 -2 14 -31 38 2 5 -15 13 -41 47 -6 4 36 -9 17 12 5 1 17 8 -3 22 36 17
7045A7kJ5l6OK4llo0J8O3m2L5m2n5K1J6J5N6l7j2J8Nm9J15j06oL8Nl0k7M6Pk7
$$ 17 15 30 -6 0 24 21 18 -42 -24 39 -3 32 -10 -65 -44 -28 -13 43 6 -6 12 17 -32 83 -23 -29 9 14 -16 -43 3 10 -17
7078a7K3R4j08Q8o0p6O4ok5qO7j3o4R1Oq7M8p7N6K7Kol1Rm0O3j9l9O1p2M4jJ0
$$ -17 6 100 -8 80 20 -56 8 2 -23 -31 36 23 -41 50 56 -31 17 -60 -4 23 25 19 -12 -3 -43 20 1 -38 23 -49 -5 -6 4
7111DK0k5L0k6JJ7K8r1N9j6J8m7K5M3k6k7O4m5l6O3l9J1L2L7r7M0m9M1oJ1l1K6
$$ 4 24 -1 29 3 4 21 49 -42 17 1 19 -28 -3 40 14 -13 51 6 -30 33 -6 5 37 74 -23 17 -32 9 3 14 -17 9
7143In8L3nL2j7k0M9n6K0L9q8M6m2P7j3pmk4N0Kk3N9o9Q1j15M9K8k6j6kJ5Kk9
$$ 9 -49 -16 -21 11 -6 -26 23 -33 -13 26 -62 -16 -58 19 6 -1 -5 -29 21 23 0 59 -10 71 -44 5 33 7 -9 -11 4 6 -23
7176b3JK0m9N6lmqL2nKk9K7n3NK2K2%K6J6m7k2J7m7O1l7lL0L9o7M7j9%l4L0O0
$$ -23 -22 -2 -51 5 2 -2 -10 22 17 19 -10 17 -36 -31 -9 13 13 39 55 8 -14 3 -44 17 -20 -23 7 46 -21 26 7 7 -27 3 63
7211F3qp0Q8r2NK1l9K6k8M8j0j9J6Lj9O6n8K7r0R0l7K6k7l3J6K8L2l9JPKP3p1
$$ 63 55 -15 73 -19 -14 7 -32 -6 -34 14 4 -15 1 4 -15 51 -7 20 -70 20 -17 9 -18 -51 -35 -7 25 -14 -13 -6 -4 69 -2
7244bj0O3o6M8k2m8M4j1m3L4M4l4j6L7k2J8oj2m2N6OJk4j3L1k6l1M4L8m9Nj8L9
$$ -2 -12 51 -15 33 11 -37 7 -4 -47 -13 31 -3 -19 18 -4 14 8 -4 -46 10 16 17 -7 -20 11 -15 -46 -2 36 -13 -8 -26 13
7277A3oJ7k6L9n6P2l8j0Ql2M4J7n4PJ0J8m0K0j9PK5o9K6K5J8m2P1k4K9m2k2nP
$$ 13 7 24 -2 37 -19 53 15 5 13 -19 25 42 -12 -5 5 23 -17 3 -16 -9 16 -53 -27 -2 16 -26 45 21 50 8 -14 -19 -12
7310a2l1R7m3m5R5n9Ql3P8r1JK7j5P9l2l4m6M7O2k1J5n4K8k6J7j1M7k3K3p1M5
$$ -12 -43 54 11 -34 61 2 10 -23 55 -36 -35 -8 -23 56 24 -10 -56 -9 53 32 47 -7 21 -5 12 1 48 25 48 -23 22
7341B2Ll8L2l1kK0r8P0M0j5KK5j9l8L4K1qk2m3Q9l8jN3q6j7K8J4l9N6OJ0m5K3
$$ 22 25 -13 19 -12 -14 6 -92 -22 18 3 5 30 11 -27 7 28 20 -2 -45 44 6 5 58 -28 -45 -17 -3 -42 14 20 30 -15 8
7374Hj1k7O9l1m1O1j2l7K1j8R6r4J2ln7N6m0K4L8k8j0J7JL8n9N2l2l2K2J6M7n1
$$ 8 -3 -30 39 8 -33 28 16 -21 0 -18 78 -16 -4 -7 -64 -8 -48 -24 14 -14 -24 -7 -6 32 -27 25 -7 -39 -17 -1 46 -5
7406emn9P2J3Mk1m8K3j2N9j4kOK0m0M3k8PRl4J9K1j5K6j3m8K8M5k4m3K8J1k3j1
$$ -5 -9 -68 4 17 21 0 -48 -25 -37 22 8 6 12 32 -8 35 7 14 23 -11 8 29 14 40 27 -21 7 52 28 -15 13 24 1 -10
7440a0k2M8qK4o1K7L8m7J2l1O1nl0Rl4N8q0P6p7L5K4K4K1nl2J7Lp7L0j1M0l4k
$$ -10 -32 16 8 32 -29 -2 36 -11 1 -30 31 26 -4 5 -29 29 -51 25 -52 -17 7 31 52 47 15 32 35 -42 -12 -23 17 -17 -19
7473a9L8r2J9P5n0R0p2K6Om3N7k5k2J7J1m1m5Q4j1MlpM8r1Q7m3oL5l5L1ro5J11
$$ -19 19 -73 -54 21 -29 61 -11 15 21 -22 35 10 -12 5 16 -25 -70 14 3 7 4 -3 45 -46 41 -2 -8 27 -8 23 14 -51 60
7506F0j4k5j3J%KJ4J0l4K3j6j6J3K5n6N1k3Rk5OJ0ol8J3J1J9Op7J01n5J6k5M0
$$ 60 46 21 8 9 9 11 25 35 1 24 8 -8 5 30 -26 25 2 11 -14 -8 2 -4 -42 -29 -18 1 7 -70 31 -24 -8 -33 7
7539GM2n6rJ1n0N7M6r6L2L0l6Qj8J34j01j6L3j9l4M3J2L2Rl6n3K7n8P7k6K3j2
$$ 7 49 -7 -16 -5 -55 2 48 -48 -16 14 -22 -14 -32 102 1 -15 18 -1 -35 8 20 52 61 25 -28 -1 -59 18 -8 15 3
7570Cmk5j1M8o2L9k4N2k1J1MKJ3l7K7l1M0l0J5K4J4o1K6j2j4K9J0l1L9j0k2qJ
$$ 3 -1 -26 -37 11 -51 -12 -36 16 -5 6 10 12 25 -12 15 -16 24 -6 9 33 47 -14 12 0 -14 15 25 -6 33 23 1 -7 -6
7603fJk0P4m9ojo8Q0kl6L7k6O2J0l9m6j1O3n3j3L6lj7N9km6M4n2K8pqL8ql2P2
$$ -6 -5 -25 49 0 -6 -7 -75 5 3 -33 4 -22 40 50 11 -35 -46 17 -36 -49 -13 -16 -33 26 24 -22 22 -30 -2 -9 -17 21 13 -19 53
7638E3q4K1rj4M4K9l2m7L3L8o3j0k8O3PN1l3M2q2O6J4r3N7K0p3L4K2K6m4n1N0
$$ 53 -31 -10 -19 -33 11 40 8 -39 -6 32 -31 -41 -69 -6 1 52 19 61 -21 45 59 -34 23 43 -30 4 26 52 8 -43 7
7669GL0p7O2J4l7j9j1K2qP7q1MJ3j6K3Nn6K3M7L1n6PK9l7l4K8L1ql2L0k3k5J2
$$ 7 37 -40 22 36 -1 -20 -31 -9 -17 60 -21 -17 -4 -20 3 8 -48 -25 22 53 -3 4 33 -4 -38 -10 21 13 -19 11 -12 -37 -25
7702b5j6QML0K6o9L5pN5k4kp2O4Oj1k2K9J0J8n2oL5o0J3L6Pq8P2J7jm1J7PNK0
$$ -25 -41 -33 -29 1 27 -42 -7 -14 41 17 15 -57 7 13 2 -20 9 19 37 -15 -21 14 -46 -33 3 10 -78 -6 11 10 -31 -14 -7 -2 18
7737A8m6K5L8r8L6P0l5l2M4m0J7k0J3j8J6K4qK3j0j2L4j19M6Q2n9k7pO1j1m6P3
$$ 18 -28 -3 35 -63 -27 43 8 -24 20 -20 -3 -23 -10 -28 -12 12 4 27 17 5 39 -80 -34 48 -11 -38 -45 16 5 -41 32
7768C2k9%J1l5k9K8L9n3j0QoL2J9kmm6L6o8P6j4K9l0QM6m6j9P5k6p3K5N5m6K0
$$ 32 3 3 14 -21 -50 -22 17 -36 -46 -38 -44 -12 7 5 1 -45 -9 -77 -1 -15 14 -16 -8 38 -8 -27 48 22 -51 -26 29 -17 3
7801Cl1O6n4O1p0N3k1Qj4K5J4l1n4J7LO3l2qnj0K7o2L7j3L8k0J2k4O8o6nO1o8
$$ 3 -28 38 -16 45 -25 28 7 15 1 26 40 9 -45 -28 -25 38 6 -2 -7 -17 10 -52 -15 -28 10 -10 2 -22 46 -20 -25 36 -32
7834c2M2k3K1l7P4k1j8j6n4P5oj5Kj0M0Kp9J16n6l9L9L2o3M7j2l4pOk2K7M9o2
$$ -32 10 -13 8 -29 45 24 6 -10 -64 11 5 -10 -8 -18 22 24 -55 61 5 -34 5 37 -26 21 9 -25 -32 -26 -48 -21 28 -34
7866c4pJ8nk4N8l4L5o4Q4q2L0K8O8r2JLpKpMk3N3Jj3j1M0j7kRK5o1JP9k6l3n2
$$ -34 -41 -23 -28 -52 6 -28 7 -57 27 -55 -25 3 71 -21 -20 -17 -24 -22 -29 -25 -48 5 6 -7 -18 22 5 3 12 37 -24 -23 56 30 -3 -55
7902e5O6k5K1j4J9Oj0qL2K0l4pK1l9kk2j2Q0m3Rj7M6l5K9Qq5P1qk1j8nR0m0r8
$$ -55 11 -14 7 -7 12 18 8 0 32 52 18 11 32 -7 -9 -31 -43 37 -6 3 -14 32 -3 26 34 -51 20 12 -9 -27 -32 58 18 -80
7936h0P4J6j5l5J9K5K2Mn6K1L2k7jJ9j6lml6J0M1O6j67J7N1L8k4l6L7J8J9n0K3
$$ -80 -6 10 -5 -40 -21 4 26 30 -26 -5 27 0 -1 18 2 -1 -5 -41 -31 10 76 -91 -74 -23 15 -9 -45 -8 10 29 -21 2
7968BJ9j5k1klKJ7lM7n1O4q0j7lO1l4Q4n9LK5p7K7j4O3ll9L4j5k8L7J0m0M2k7
$$ 2 21 6 -15 -17 -20 -18 -1 -4 43 -8 56 -24 -41 -44 17 -17 67 8 11 36 -41 -14 -28 35 32 -7 27 12 -16 21 31 -9 33 6
8002FQ%J3n1j7P8l9M2m8j3k7J6K5M2l5rL3J8k6K2j9n3K7M4j9M2q6k8P2l0M1j1
$$ 6 14 14 27 -24 -41 37 -2 40 -8 -21 -48 -32 -7 35 0 -9 24 42 16 38 19 -34 -7 37 18 60 -26 -54 18 -12 29 18
8034A8j9%l0J9L8n7Nk4O4l8K5qPQQl1KO2k1l4lP8o3j2Qj0K4rj7KK8p1L5J2k0K5
$$ 18 -1 -1 -31 -12 26 -31 -26 -50 14 -24 1 -7 0 8 16 -15 -13 49 28 -6 -9 69 6 -6 2 -8 16 7 -10 -8 20 -51 -16 -4 -24 1
8070AK6Mk8J4Mm4K2J7n0J6K3j8k2j6J01k7k3k1L3j1lQj6l4Q1n7lK2m4K6k6N7p1
$$ 1 27 31 3 17 21 -23 -1 16 -34 -18 5 -13 -35 -51 50 23 0 -21 12 1 -2 6 -10 -44 37 -20 -23 -1 -45 -19 -45 12 -59
8103e9O2%J9pj9j7qjK6%MK4Jk8jn2J19o3J4Oj1lrn0L4OJP2o6j1N5m7M1q1O8k8
$$ -59 3 3 22 15 -4 -21 -29 -30 -4 -4 0 24 25 -3 -4 -56 63 0 14 20 9 6 -3 -53 -19 -13 -12 60 -6 -17 38 -9 32 -49 19 -9
8139iJ6pqK4j5J7k1K1nk9M9k3k5J9m0L0J6k9K7L9rj0k4J6lJ7k2l5J4J2K4j6np
$$ -9 7 0 -8 16 1 18 -3 18 13 -16 33 10 -15 4 -36 -6 10 -19 8 47 38 28 4 20 17 34 12 -23 -9 3 27 11 6 -1
8173aL7n4jK7j4m2O9pn1N7J9n8O3k1m0J1N1j8
$$ -1 36 -18 -19 8 -6 -48 21 14 -37 20 39 -19 44 23 -17 -6 45 27
8191B7
$$ Imaginary data points
##PAGE= N=2
##DATA TABLE= (X++(I..I)), XYDATA
0@%%%%%%%%%%%%%%%%%%%%%%%%%%%%%kMnPqRj3J8k0K1k3K6k8L1l9M4m7N2o0O7p2
$$ 0 0 0 0 0 0 0 0 0 0 0 0 0 0 0 0 0 0 0 0 0 0 0 0 0 0 0 0 0 0 -2 2 -3 4 -4 5 -8 10 -10 11 -12 14 -14 17 -22 22 -25 27 -33 34 -38
50c8Q2r1R6j05J15j23J34j43J53j61J63j59J43j07L1J29m88J390m312K6161J08431
$$ -38 44 -47 49 -56 59 -64 70 -73 80 -81 82 -77 66 -41 -10 119 -369 1021 -3291 22870 131301
71A31301k17998r4654K02765m8626j49321J17398P0273r2851O9406Q6008p7802
$$ 131301 -86697 -181351 21414 -27212 -176533 -59135 11138 -81713 -12307 73701 -4101
82d101K1284Q7272q1204l6003Q1020n7618n6739J07449k3448j11982J15312P1061
$$ -4101 17183 104455 23251 -12752 68268 10650 -46089 61360 37912 -74070 41242 112303
94A12303j75749O904J76252j02247j39102J46565L9612j67518K9847J02147j00194
$$ 112303 -63446 -56542 119710 17463 -121639 24926 64538 -102980 -73133 29014 -71180
105g1180k9542J09263l0274l8741J07544J2425n8462P5045K2969q9377L7462L8578
$$ -71180 -100722 8541 -21733 -60474 47070 59495 1033 76078 99047 9670 47132 85710
117H5710j15417p35R5410r7418p5359J30336n237j34522Q1087R7468j12920q679
$$ 85710 -29707 -30442 64968 -32450 -107809 22527 17290 -117232 -36145 61323 -51597 -60276
129f0276J29097m6220p5780R1084J0782r3100L9009M4760o9665J3024O0864n0545
$$ -60276 68821 22601 -53179 37905 48687 -44413 -5404 39356 -30309 -17285 43579 -6966
141f966l731P4372m6553m7748Q3034j3804r9167N8710N0999j08658j650J01169
$$ -6966 -10697 63675 17122 -30626 52408 38604 -60563 -1853 49146 -59512 -61162 40007
153D0007o3202o3473J04428J2634r0758N8592P0571p3272n218P2926l9881l9778
$$ 40007 -23195 -86668 17760 30394 -60364 -1772 68799 -4473 -9691 63235 23354 -16424
165a6424M8765k1896m5183M7358n398n9725N0857L4733p7452J7537Q0058o1592
$$ -16424 32341 10445 -34738 12620 7222 -52503 -1646 33087 -44365 -26828 53230 -8362
177h362m1749R2553r100q6925N8768N0088q8603k421Q0679m4107m7329O6665N311
$$ -8362 -50111 42442 33342 -53583 5185 55273 -33330 -35751 44928 821 -46508 20157 25468
190B5468n2565L4877K1450m4991J8637K4649n0292P932M6555n0651k2047P1363
$$ 25468 -27097 7780 29230 -15761 2876 27525 -22767 -14835 31720 -18931 -40978 30385
202C0385k0277o2213O3724L2818p9164J7764P3392n5764l8443P3445p686o7182
$$ 30385 10108 -52105 11619 44437 -34727 -16963 56429 665 -37778 35667 27981 -39201
214c9201L8606L0614n5658M265M0006l1757o999L7815k3738j3847M6508j7884
$$ -39201 -595 30019 -25639 -21374 18632 -13125 -20124 17691 -6047 -19894 26614 8730
226H730l9056N1820J1474o6025K7614N3113o2666k0663P4182k3552o2056N6481
$$ 8730 -30326 21494 32968 -33057 -5443 47670 -14996 -35659 38523 14971 -47085 9396
238I396K6926o9165J2731N4278m2604k2279M8625j2753l0416L4977l89l1542L2966
$$ 9396 36322 -32843 -20112 34166 -8438 -30717 17908 5155 -25261 9716 9327 -22215 10751
251A0751J0043m4671K6129L6033n3690n213O2014l3806m7885O0449J0852p0740
$$ 10751 20794 -23877 2252 38285 -15405 -20618 41396 7590 -40295 20154 31006 -39734
263c9734K6288N1761n6503j8951O2766j7239m4812M2642J5162m2247J8514K4700
$$ -39734 -13446 38315 -18188 -37139 25627 8388 -36424 6218 21380 -20867 -2353 22347
275B2347l3618P825K9548l4424m446M4296k9196l2576N3254o22o1175L5166M1418
$$ 22347 -11271 -3446 26102 -8322 -12768 31528 2332 -30244 23010 22388 -38787 -3621 37797
288C7797o3097p608O7045l0416m7608N6514J4454n7965K2355M0634m1115o493
$$ 37797 -25300 -32908 34137 3721 -43887 12627 27081 -30884 -8529 32105 -9010 -15503
300a5503M1448k1855j9058L5479j2577k8473L5803M4m4889L0194K8125n4691K287
$$ -15503 25945 4090 -14968 20511 7934 -20539 15264 15308 -29581 613 28738 -25953 -23666
313b3666N6990l7499l7623O0781M463o1228L2401M3511n2081q560N4277k2132
$$ -23666 33324 -4175 -41798 18983 23446 -37782 -5381 38130 -13951 -22511 31766 9634
325I634l3738L9709L299l6750K2677J3951l4839J3378K3051l8111O91M0901l2489
$$ 9634 -24104 15605 18904 -17846 4831 18782 -16057 -2679 20372 -17739 -17048 23853 -8636
338h636k5516N3317m208n3132L8584L5186n7425l27N9043l1074l7091N1937O209
$$ -8636 -34152 19165 14957 -38175 409 35595 -21830 -22157 36886 5812 -31279 20658 26867
351B6867n0076K3484K8868m0182j563L2458k5632j2286L2671j6944k2467L7193
$$ 26867 -23209 275 29143 -11039 -12602 19856 -5776 -18062 14609 -2335 -24802 12391
363A2391l311l9862L2444K4150m9538P411N1255l5343k9402N5059q86n3496L0059
$$ 12391 9080 -30782 1662 25812 -23726 -16315 34940 -403 -29805 25254 24368 -29128 931
376I31L2634m7861m344M4072k2967k5454L4571k288k9896K2717Q509l0248J6616
$$ 931 33565 -14296 -18640 25432 2465 -22989 11582 9294 -20602 2115 10624 -19624 -3008
389c008J9530l3282N595L6006k9948j8583M6797p727m4207L5725K6030n0548K836
$$ -3008 16522 -16760 -11165 24841 -5107 -23690 23107 15380 -28827 6898 32928 -17620 -14784
402a4784M7104l0349k9682M2028K00l9870K1729K0032l1911M866K5525k2635m792
$$ -14784 32320 1971 -27711 14317 14517 -25353 -3624 16408 -15503 -10637 14888 -7747 -12539
415a2539K8015j6710j5010L2570o386l0743L0185J4823m3246R937L9175l4573
$$ -12539 15476 -1234 -16244 16326 9940 -20803 9382 24205 -19041 -9104 30071 -4502
427d502k1948M5900m422m2130K6910K3623l8033L9L2472k0474j5519K7703n670
$$ -4502 -26450 19450 15028 -27102 -192 23431 -14602 -14563 17909 -2565 -18084 9619 3949
440C949j9606K1663K486k2864J8009J1739k8963R483K7296k8880j1228L9106j2283
$$ 3949 -15657 6006 8492 -14372 3637 15376 -13587 -4104 23192 -5688 -16916 22190 9907
453I907l5268L1716J6367m2391O122L6194k6044j8550L4341k890k7340K0129J0819
$$ 9907 -25361 6355 22722 -19669 -13547 22647 -3397 -21947 12394 9504 -17836 2293 13112
466A3112k4462Q368J5834k0771J524K0432j9106p752K7898j1989k3423K9639P805
$$ 13112 -11350 -2982 12852 -7919 -6395 14037 -5069 -12821 15077 3088 -20335 9304 17109
479A7109l6317J4190L0594l1412j2973L7763q911l1429K4701J3648l0343N319
$$ 17109 -19208 -5018 25576 -5836 -18809 18954 10043 -21386 3315 16963 -13380 -8061
491h061K2617j9059o708K1155r935j1555J9356m539j7044J9603M082k5577J4086
$$ -8061 14556 -4503 -11211 9944 9 -11546 7810 3271 -13773 5830 9912 -15665 -1579
504a579J9962k8626l531L4001j5269k5792L0933R233l4687J0255K6222k4776j0372
$$ -1579 18383 -10243 -13774 20227 4958 -20834 10099 19332 -15355 -5100 21122 -3654 -14026
517a4026K6533q461j9025J8541K476j9079J2086Q223j8940Q182J5235k0418l74
$$ -14026 12507 4046 -14979 3562 6038 -13041 -955 7268 -11672 -3490 11745 -8673 -9047
530i047K5561j6000j7047K9824J076l2101J7686K2849l0747o018L2219j2665k3482
$$ -9047 16514 514 -16533 13291 14367 -17734 -48 22801 -7946 -13964 18255 5590 -17892
543a7892K3556O092k4988R193J4247j8497M78J6186j3747m461J9108r847j2327
$$ -17892 5664 11756 -13232 -4039 10208 -8289 -7811 8375 -5372 -9833 9275 -572 -12899
556a2899K2299p46k3254J8273J5307k8782J637K9597j9093k0044K9221K077l0608
$$ -12899 9400 8654 -14600 3673 18980 -9802 -8165 21432 2339 -17705 11516 13593 -17015
569a7015J3513J9041k4279l737K2450j1426j1745J8475k943j4142J5969K698j8323
$$ -17015 -3502 15539 -8740 -12477 9973 -1453 -13198 5277 2334 -11808 4161 6859 -11464
582a1464J3165J2202k2578L337K3727j8807j3557K8692l558k8695J9379J6727
$$ -11464 1701 13903 -8675 -5338 18389 -418 -13975 14717 11159 -17536 1843 18570
594A8570k9918j024K7711j5548j7452K2965J322k0514J2306R731j6985N446J3368
$$ 18570 -11348 -12372 15339 -209 -17661 5304 6626 -13888 -1582 8149 -8836 -3390 9978
607I978j5184o7J8338j3073r906K2545m195k2171J8634J1524k7958L604K5583
$$ 9978 -5206 -5273 13065 -8 -9914 12631 8436 -13735 4899 16423 -11535 -7931 17652
620A7652j9851j5606K7254j166k5957J5334J4760k2154O57J9532j2326p435J7592
$$ 17652 -2199 -17805 9449 8283 -17674 -2340 12420 -9734 -9077 10455 -1871 -9306 8286
633H286n648j1372J6221m48j6931J4227Q571k2601N490K0760k0125j0824K6882
$$ 8286 2638 -8734 7487 7039 -9892 4335 12906 -9695 -4205 16555 -3570 -14394 12488
646A2488n564k5132J9137J3417k6377K033K3509j4932j2142K1067j456j6753J2994
$$ 12488 6924 -18208 929 14346 -12031 -9998 13511 -1421 -13563 7504 6048 -10705 2289
659B289O334j5589O703J0055j5093J719J5299j4290p412K0830o389j9579J8557
$$ 2289 8623 -6966 -263 9792 -5301 -3582 11717 -2573 -9985 10845 4456 -15123 3434
672C434R175k5394N201K2632j7946j1779K4361k215k0889J4638J0768j8997K663
$$ 3434 12609 -12785 -7584 15048 -2898 -14677 9684 7469 -13420 1218 11986 -7011 -4348
685d348J5054j2377m651J4461p369q644J4326l090j4273J4128N554k0264P139
$$ -4348 10706 -1671 -6322 8139 770 -7874 6452 3362 -10911 3217 8771 -11493 -4354
698d354J7672j8445p543K3872n706k0041J7386J0088k1824L370J8458j3520q459
$$ -4354 13318 -5127 -12670 11202 5496 -14545 2841 12929 -8895 -5525 12933 -587 -9046
711i046J6973l394j2750J1189K611j2849P330O387j3804L744J2487j3823m215
$$ -9046 7927 4533 -8217 2972 5583 -7266 64 6451 -7353 -3609 8878 -4945 -9160
724i160J8608p112j5305J7552O093k1202O666J7829j6219p812J9837m038j5974
$$ -9160 9448 2336 -12969 4583 10676 -10526 -3860 13969 -2250 -10062 9775 5737 -10237
737a0237J2725O222j5404L883J0264j1084j319J0942q132m609J2750n110j0411
$$ -10237 2488 8710 -6694 -2811 7453 -3631 -4950 5992 -2140 -6749 6001 891 -9520
750i520J3905K678j7090Q502J3734j6927l960J9831p208j5533J5704N844j8288
$$ -9520 4385 7063 -10027 -1525 12209 -4718 -8678 11153 3945 -11588 4116 9960 -8328
763h328M671J3431j2401m704J3323m933q254J0268n36r356Q807K973j1998O528
$$ -8328 -3657 9774 -2627 -7331 5992 1059 -7195 3073 2537 -6819 1988 4961 -7037 -509
777e09R267j3658p24J5942r022j1644J6429K281j8127P736J3048j5145m093J5972
$$ -509 8758 -4900 -5624 10318 1296 -10348 6081 8362 -9765 -2029 11019 -4126 -8219 7753
791G753n709j1306J1594K627j1620N599O299r525K224Q096q978r53J1510p430
$$ 7753 2044 -9262 2332 4959 -6661 -1062 5237 -4288 -2064 6032 -2946 -3899 7611 181
805A81p589J3893o22j4972R742R847j6310j076J6686q752j1548J4480K301j4654
$$ 181 -7408 6485 5863 -9109 633 10480 -5830 -6906 9780 1028 -10520 3960 6261 -8393
819h393O489R111j1239o31J0366o391m217R641l542o672R751k64j0865Q406O566
$$ -8393 -1904 7207 -4032 -4663 5703 -688 -4905 4736 1194 -5478 4273 4009 -6856 1550 8116
834H116j3995J580J3987j0392q693J5500m57j5309R005R461j4013p31J3358p120
$$ 8116 -5879 -4299 9688 -704 -9397 6103 5646 -9663 -658 8803 -5210 -5941 7417 297
848B97p411J1015m43r249P235L031r234M725N830j0082J340J0467r278n582J3951
$$ 297 -7114 3901 3458 -5791 1444 4475 -4759 -34 5796 -4286 -2946 7521 -1757 -7339 6612
863F612k773j3444J0993P466j5587J555J4506r703q105J3774m19j2307P799O156
$$ 6612 3839 -9605 1388 8854 -6733 -5178 9328 -375 -8480 5294 4875 -7432 367 6523
877F523j0689J645Q241p616j821Q817n587n082J0243k196j0133R465M911j3578
$$ 6523 -4166 -2521 5720 -1896 -3717 5100 -487 -5569 4674 2478 -7655 1810 6721 -6857
891f857L271J2508j0739o376J4821k046j3278R715P176j3082R53J1236p569n284
$$ -6857 -3586 8922 -1817 -8193 6628 4582 -8696 1019 8195 -4887 -3934 7302 -267 -5551
905e551R905k272p340P513P67q419N963M355j0220K786R580r714m059J3347l916
$$ -5551 4354 2082 -5258 2255 3022 -5397 566 4921 -5299 -2513 7067 -2647 -6706 6641 2725
920B725j1520J1063N484j4208K903J2260r735o019J2426j768j0103P699L853r395
$$ 2725 -8795 2268 7752 -6456 -3553 8707 -1028 -7047 5379 3611 -6492 1207 5060 -4335
934d335L101O146p851J31Q005o576l693J0123l196q899R528L470j2458M205J0603
$$ -4335 -1234 4912 -2939 -2808 5197 -1379 -5072 5051 1855 -7044 2484 5954 -6504 -2299 8304
949H304j0733m526J3370l137j1214R306N129j1486K102Q921p414l068Q734l481
$$ 8304 -2429 -6955 6415 3278 -7936 1370 6499 -4987 -2885 6036 -1378 -4446 4288 807
963H07n449P639o84p328O582L028r595L661Q037r505k667J1851m532r723J0491
$$ 807 -4642 2997 2313 -5015 1567 4595 -5000 -1339 6698 -2807 -5474 6377 1845 -7878 2613
978B613L641j2585L562J0000q944m178J0646k524p846P155K230p823L802M496
$$ 2613 6254 -6331 -2769 7231 -1713 -5891 4755 2231 -5615 1540 3770 -4053 -251 4245
992D245p197J258O515o553k172Q926m037p104R105J807j0985M778Q546r891k972
$$ 4245 -2952 -1694 4821 -1732 -3904 5022 985 -6119 2986 4793 -6192 -1414 7132 -2759 -5731
1007e731J1423l674q674Q460L125r489K882O645o740j287O852l943l319O575j963
$$ -5731 5692 2018 -6656 1804 4929 -4560 -1678 4967 -1773 -3060 3792 -151 -3470 3105 1142
1022A142n543O602J120q272M630N955q957p34J0101n241p320R608J811j0374M097
$$ 1142 -4401 2201 3321 -4951 -321 5634 -3323 -4057 6044 803 -6517 3091 4902 -5472 -1375
1037a375P491q136k102Q405l320n273O325J54n898M337K251o257K737M617o758
$$ -1375 6116 -2020 -4122 4283 963 -4310 2015 2169 -3729 608 2859 -3398 -661 3956 -2802
1052b802r2P734n125n091Q931Q3r311N538O304r148q79R301m434o204P695J008
$$ -2802 -2894 4840 -285 -5376 3555 3638 -5673 -135 6169 -2979 -3858 5443 1009 -5195 2500 3508
1068C508p504L622M141o126N85N122m685j365N932l342l966O757n13p084N503
$$ 3508 -3996 -374 3767 -2359 -1774 3348 -1337 -2702 3230 -112 -4078 2679 2166 -4918 585
1083E85M277q582Q60Q560n826n227Q850K4q459M839N027p403j28O629m194l159
$$ 585 4862 -3720 -2860 5700 -126 -5353 3497 3521 -4938 -99 4928 -2475 -2603 4026 -168 -3327
1099c327N761j360m383M783M05n429L966L046o699J388O609n864l354Q334j462
$$ -3327 2434 1074 -3309 1474 1879 -3550 416 3462 -3237 -1849 4760 -1104 -4458 3876 2414
1114B414p699O015M221q354P55P489n057l973O923o82n689M209K224n388K002
$$ 2414 -5285 730 4951 -3403 -2648 4841 -216 -4189 2734 2052 -3637 572 2796 -2592 -590
1129e90L568m863K78M988m357k314O668k098n993O187K633q206K171P115o338
$$ -590 2978 -1885 -1607 3381 -976 -3290 3378 1280 -4713 1474 4107 -4099 -1928 5187 -1151
1144a151l390Q148j434o892N423L118o744J353N148m587j320N153k706k867N108
$$ -1151 -4541 3607 2173 -4719 704 3822 -2922 -1569 3579 -1008 -2328 2825 119 -2748 2360
1159B360j119m762M934J735o836K723N630o507j977P959k685o543O439K733p814
$$ 2360 1241 -3521 1413 3148 -3688 -965 4665 -1842 -3819 4140 1455 -5088 1351 4084 -3730
1174c730J902O131n342k401O317j804m464M700P43m934L134K495n181J519M538
$$ -3730 -1828 4303 -1039 -3440 2877 1073 -3391 1309 2052 -2882 252 2747 -2434 -915 3623
1189C623n143j360O659k944n276O453J551p654K971N908o459k023P401k392n518
$$ 3623 -1520 -2880 3779 835 -4441 2012 3563 -4091 -1120 4788 -1671 -3694 3707 1315 -4203
1204d203N395J797o012K212L826m594j91M434l310j857N045j964l951N101Q35
$$ -4203 1192 2989 -3023 -811 3015 -1579 -1770 2664 -646 -2503 2542 578 -3373 1728 2563
1219B563o231L309M618o379q85P183l274n278O218J506o880K581M807n309j171
$$ 2563 -3668 -359 4259 -2120 -3005 4178 904 -4374 1844 3350 -3530 -949 3858 -1451 -2622
1234b622N456k440l368M600m09m020L574J280m864K337L750n279k96N934l485
$$ -2622 2834 394 -2974 1626 1217 -2803 771 2051 -2813 -476 3274 -2005 -2301 3633 148
1249A48m084O325N18o758L475M649o139j027O497k850m335N122O69n056K650K668
$$ 148 -3936 2389 2907 -3851 -376 4273 -1866 -2893 3604 754 -3581 1541 2210 -2846 -196 2472
1265B472m345O97L662l636q84M659k587l227N267l3n709L746L831o203k01O397
$$ 2472 -1873 -1176 2486 -1150 -2034 2625 38 -3189 2078 2045 -3664 82 3913 -2290 -2491 3906
1281C906l448m294N876O36n943K901L658m833m03M542k710k159M034j055l235
$$ 3906 458 -3836 2040 2676 -3267 -366 3292 -1541 -1944 2598 -112 -2271 1763 708 -2527
1296b527L671M98m370K767K814n015L53N231l704l196N782j17n824L497L673n470
$$ -2527 1144 1642 -2728 39 2853 -2162 -1809 3422 -282 -3478 2304 2187 -3637 -140 3533 -1937
1312a937k35N271k951l025M529j41l939K840J555l796J450K643l583K3L962l092
$$ -1937 -2172 3099 148 -2877 1652 1511 -2428 412 1967 -1829 -379 2264 -1319 -1296 2666 -426
1328d26k200M894q08m798L850K617n603O70N180l744k897N249l30m664L167K323
$$ -426 -2626 2268 1460 -3338 512 3129 -2474 -1804 3376 -368 -3265 1984 1654 -3010 157 2480
1344B480m243P30L330k931r34L514j822k106L627n25l637L259J683m729J246M303
$$ 2480 -1763 -1033 2297 -634 -1568 1946 124 -1982 1645 1120 -2517 742 2425 -2304 -1058 3245
1360C245m014k131N388j183m670L798K355m999P65M158l119j819L957r34k895
$$ 3245 -769 -2900 2488 1305 -3365 433 2788 -2211 -1446 2712 -407 -2226 1731 797 -2098
1375b098K987M38l203K138J689l643R98L313l502j286M623j598l991M121J596
$$ -2098 889 1327 -1876 262 1951 -1692 -694 2619 -883 -2169 2454 856 -3135 986 2582
1390B582n166J349M341l855j840M671r87l712L179J329l627J291K360k936L3K945
$$ 2582 -2584 -1235 3106 -749 -2589 2082 1095 -2617 562 1891 -1736 -445 1915 -1021 -988 1957
1406A957k355j326L485j167l051L533R64m434J824L520m044j154M758j645l751
$$ 1957 -398 -1724 1761 594 -2457 1076 2040 -2394 -570 2950 -1094 -2248 2510 865 -2886
1421b886L818J338m302J269L180l174q51L385j635j934K917l34k719K536Q97l482
$$ -2886 932 2270 -2032 -763 2417 -757 -1608 1777 142 -1792 1125 791 -1928 608 1505 -1977
1437a977J566K769l624n42M279k156l117M077Q38m566J973L310l809q53M035j630
$$ -1977 -411 2358 -1266 -1808 2471 315 -2802 1275 2113 -2453 -480 2830 -979 -1832 2203 573
1453E73k750L174L94l134J821J518k984P56K449k738o24L412j751k510L613L45
$$ 573 -2177 997 1391 -1743 78 1596 -1388 -632 1817 -921 -1545 1867 116 -2394 1219 1564
1469A564m093K331K820m023m03M268k005l007L766O16l890J820K349l140rK825
$$ 1564 -2529 -198 2622 -1401 -1804 2464 459 -2548 1218 1834 -2056 -236 2113 -1027 -1036 1789
1485A789j963j306K912r81k267K727K88l280K056K155l700R9L853k416k522M006
$$ 1789 -174 -1480 1432 451 -1816 911 1199 -2081 -25 2130 -1570 -1471 2382 -34 -2556 1450
1501A450J41l987K149K636l548l16L465j808j981K911j81k585K056Q84k683J182
$$ 1450 1591 -2396 -247 2389 -1159 -1475 1990 182 -1799 1112 931 -1654 402 1286 -1397 -215
1517b15J919k732n7L074k132j889L517l08l518K453K215l865Q0L652k202k218
$$ -215 1704 -1028 -1085 1989 -143 -2032 1485 1177 -2341 112 2327 -1538 -1458 2194 -8 -2226
1533b226L489ml146J976J563k757M44K257k117n41K608j447j634K760l67k735
$$ -2226 1263 1259 -1887 89 1652 -1105 -661 1596 -521 -1062 1546 99 -1535 1225 858 -1877
1549a877K178J631l490N12L270k561j788L645l60l406K320J787l222K93K802j973
$$ -1877 301 1932 -1558 -1046 2224 -337 -2125 1520 1160 -2246 74 1861 -1361 -1068 1734 -239
1565b39j283K654o76j974K214L32k442J532J404k689M97K566k277j320L294o65
$$ -239 -1522 1132 456 -1518 696 1028 -1414 118 1522 -1167 -670 1896 -381 -1701 1593 928
1581I28l042K535J537l464N06L032k261j546L025m57k476J921R99k450Q27J705
$$ 928 -2114 421 1958 -1506 -1000 2032 -229 -1775 1250 793 -1683 238 1237 -1213 -386 1319
1597A319k055m5K093j529j146K602o06k454K401J017l179Q65K781k555j258L301
$$ 1319 -736 -781 1312 -217 -1363 1239 633 -1821 580 1597 -1582 -717 2064 -491 -1749 1552
1613A552o47k842K259J214k771O20K121j962o53K219r78j363K005k32j919J747
$$ 1552 905 -1937 322 1536 -1235 -615 1506 -456 -1109 1110 132 -1231 774 542 -1377 370
1629C70P43k508R57K117k388p11K986j042k415K537Q51k990Q69K433k263q87K584
$$ 370 1113 -1395 -438 1679 -709 -1420 1566 524 -1891 646 1497 -1493 -624 1809 -454 -1341 1243
1646A243q02j769J853L36k026J212R85j999M54J812j924n67K480j050j930K452
$$ 1243 441 -1328 525 861 -1165 47 1032 -967 -513 1299 -625 -1192 1288 238 -1692 760
1662G60M91k866J242K203k528o29K865j010k104K220N56k353R74J475j902m7J846
$$ 760 1251 -1615 -373 1830 -698 -1327 1538 528 -1576 644 1200 -1153 -179 1296 -606 -653 1193
1679A193j349q43J936o84j585J920L35k305J168J769k448k62K652j303j954K540
$$ 1193 -156 -999 937 253 -1332 588 923 -1382 -214 1555 -893 -1155 1497 194 -1760 780
1695G80M46k684J206J827k204l34K204j093j297J903j68j635J362N54j829Q60
$$ 780 1226 -1458 -252 1575 -629 -963 1241 148 -1149 754 586 -1049 313 867 -962 -102
1711a02J346j962p2K151j385j462K426Lk538J451J659k369k14K458j323j552K249
$$ -102 1244 -718 -790 1361 -24 -1486 940 943 -1595 -144 1515 -854 -1068 1390 67 -1485 764
1728G64K0j996J257R47j779L95J436j452k98J787j047j162J983j50k031J472J305
$$ 764 784 -1212 45 992 -787 -392 1044 -408 -706 1081 34 -1128 855 705 -1326 146 1451
1745A451k436J79K383j607j415K301P7k323J376J312k175J77J835j312q11J809
$$ 1451 -985 -806 1577 -30 -1445 856 933 -1390 -14 1298 -877 -700 1135 -177 -988 821
1761H21n48j357J600J77j748J161J029j988J86K008j520j135K353k58k222J601
$$ 821 273 -1084 516 693 -1055 106 1135 -853 -667 1341 -179 -1314 1039 781 -1441 160
1777A60J199k288J34K064j418j068J982k26j655J292O09j677O73J138j468n0J722
$$ 160 1359 -929 -795 1269 -149 -1217 765 539 -1116 176 785 -892 -219 919 -549 -599 1123
1794A123j209r47J941l67j794J526R31k160L88J967j579j036K088j92j920J414
$$ 1123 -86 -1033 908 541 -1253 273 1204 -956 -568 1399 -180 -1216 872 680 -1240 174
1810A74Q62j859L67J470j328m21J474p40r76J562j39j512J252P15j809M69J704
$$ 174 1036 -823 -456 1014 -314 -735 739 -1 -977 585 446 -1066 186 901 -908 -439 1265
1827A265j597p58K154n61j723J549P88k011M22J647j385o45J663m93j244J321
$$ 1265 -332 -1090 1064 503 -1220 329 1117 -894 -472 1175 -210 -855 808 315 -929 392
1843C92J86j359Q11P75j456K54J354j348n18J823n97j572J609N75j973O34J602
$$ 392 578 -781 30 805 -651 -397 957 -391 -909 914 317 -1255 354 929 -1044 -410 1192
1860A192j582o57J942m76j541J435N02j521N36J065j285p0J336r28o23J412m50
$$ 1192 -390 -1047 895 419 -1122 313 815 -706 -170 895 -390 -460 876 -52 -675 737 287
1877B87j225J275N21j780O76J362j581m55J847o35j484J555N21j809O59J267j352
$$ 287 -938 337 858 -922 -246 1116 -465 -920 927 292 -1192 363 884 -925 -266 1001 -351
1894c51l51J483o65q82J240j01j106J008L56j326N09J107j376k41J554o67j268
$$ -351 -702 781 116 -766 474 373 -733 275 631 -695 -186 921 -455 -696 858 191 -1077
1911a077J545L23j758P31J231j450l44J579o19j046J307J28j293Q15N68j152K33
$$ -1077 468 791 -967 -236 995 -455 -799 780 161 -885 422 550 -743 72 640 -512 -279
1928b79R90j002k44J259o51r33J355J12j498Q97R11j469n5J491q55j054J518N3
$$ -279 711 -291 -535 724 73 -860 495 607 -891 6 917 -552 -607 884 29 -1025 493 546
1946E46j412Q40P83j260J11J072p74n05J068k97p92R82J42j225P93P20j323J03
$$ 546 -866 -26 757 -503 -392 680 -94 -599 469 172 -620 362 504 -721 72 792 -531 -428
1964d28J336r65q08J543o0j468Q42Q74j390j5J350q22p46J219j87r63Q14L23j026
$$ -428 908 -57 -865 678 618 -850 -8 866 -524 -539 811 -11 -757 462 275 -688 126 449 -577
1983e77M35P68j044J8J109p96o50J263p3j330J037P08j489K11J385j012p57J390
$$ -577 -142 626 -418 -400 709 -87 -737 526 453 -877 160 868 -621 -410 975 -37 -794 596
2001E96j53j177Q54N71j127J93Q69q10k11R87o54n21J004j62r68Q35N32j328K86
$$ 596 443 -734 120 691 -436 -243 626 -184 -395 592 -62 -583 421 259 -709 126 658 -670 -384
2020c84J216j043n46J334j86j206R13N96j244K10J005p84m29J069l26p63Q94L2
$$ -384 832 -211 -757 577 391 -815 98 694 -550 -340 665 -119 -548 521 195 -568 326 358
2038C58r41N92N51j044K15R11q43m39J238l35j079J062M26j319L46J122r73m74
$$ 358 -583 9 560 -484 -269 642 -201 -640 598 263 -816 246 672 -647 -301 821 -152 -626
2056f26J229l23r32Q69K92j014M50O22q64LQ43p00l44R61k91q58R09K53j153M31
$$ -626 603 280 -652 217 509 -505 -55 567 -297 -294 549 -151 -495 466 175 -683 226 479 -674 -243
2076b43J029j065l96J273l75r83R49L58j146L73R00q85j57R36n04n51Q74j45p56
$$ -243 786 -279 -675 598 223 -760 189 547 -599 -226 674 -211 -368 568 64 -487 387 242 -514
2095e14O62L76j027L89P32r28k12J167n13r08J040K83j171L77R27r53l25J082
$$ -514 148 524 -503 -114 618 -310 -522 645 132 -776 264 547 -624 -247 680 -273 -598 484
2113D84m04o96Q19J57q24M69M61q03J96O44o87k14R61m32p11Q88J81j041M18Q39
$$ 484 80 -616 203 360 -464 5 466 -337 -141 503 -184 -398 563 131 -580 308 489 -552 -134 705
2133G05j067j65J170m65q15R48J23r89N12N82q53N6P15n54l29P83k57o25P62J80
$$ 705 -362 -527 643 178 -637 311 434 -555 -43 539 -314 -258 457 -97 -426 357 100 -525 237 417
2153D17r69N31O24r36QR09n30p15R96J18j006N26O27r49l4Q71m68n24Q18q2o82
$$ 417 -552 -21 603 -333 -325 584 54 -661 335 453 -553 -27 600 -349 -383 488 20 -504 314 232 -450
2174d50N29K92p71K92N56p18l8Q45n25n65R45Pj025O36N99r19k7R31n86n44Q41
$$ -450 79 371 -400 -108 448 -270 -308 537 12 -553 392 399 -626 10 609 -310 -337 594 8 -536 305
2195C05K3q29N49L66p68J52N78n30j90P30l64m69P10m5p49N75M19q70P2Q94o06
$$ 305 328 -501 48 414 -354 -202 376 -154 -344 386 22 -447 263 218 -531 44 463 -407 -335 559 -47
2216d7m68R04r8q05N96M67q42O4P25n85k90P33k19n28N43P5o16M28L06p06J06
$$ -47 -515 389 291 -514 82 549 -293 -229 496 -89 -379 354 135 -393 150 225 -391 37 343 -363 -257
2237b57P05o09l14Q04j23p62O19L73q60J41P65n73l52Q11j59o37N43J99o46K68
$$ -257 448 -161 -475 329 206 -556 63 436 -424 -283 482 -91 -443 368 209 -428 115 314 -332 -64
2257f4M52n71M2N78m72l24P56k31o82O32L06q41J76P78p28k02P57k43o35N98L34
$$ -64 388 -183 -141 437 -35 -359 397 166 -516 116 422 -419 -243 535 -193 -395 362 119 -516 82 416
2278D16p40J82N66n99m5N22k83l59N24L3o37M94K42o06J74O21o00k74P77k60o05
$$ 416 -324 -142 424 -175 -220 302 19 -340 184 217 -420 74 316 -290 -116 505 -95 -369 408 148 -457
2299d57N91K38p08K07N33n51j46N45j41m93N18O6n04L28L10n68R0N22n38j20O77
$$ -457 134 372 -336 -129 404 -147 -293 252 111 -382 136 202 -302 26 336 -232 -142 380 -158 -278 399
2320C99l38m31M98K49p55K64N96o91j03O79k90n11N92J07o03K63M48n55J7M66
$$ 399 61 -370 128 377 -378 -114 482 -209 -312 367 77 -434 158 265 -338 -75 373 -182 -165 301
2340C01m06j12N39k82l43M26R9n55L22M24o03m8O34k72n39O31Q8o98L38M02n00
$$ 301 -105 -217 322 40 -303 123 222 -333 -11 413 -190 -238 396 124 -415 216 304 -394 -56 346 -154
2361a54j36N61k63l09N28j53m48M34R3m94L30L13n09j6N55l28l47N68Q7p54M80
$$ -154 -290 271 8 -301 227 74 -374 60 153 -341 -11 302 -207 -223 332 4 -343 225 312 -442 38
2382C8L44n73oN87l82k84N00k4m31K43L31n26R4L76l58j21M57k92l19N57l2m77
$$ 38 382 -191 -197 390 8 -276 224 200 -231 12 343 -183 -89 287 -71 -192 265 -27 -346 211 179 -298
2404b98L28K71n85N6N98l66l67N31N0n54L73K84n48M4M83l39j60M37j74l81M99
$$ -298 30 301 -284 -228 370 4 -363 168 218 -336 37 321 -227 -183 300 -39 -199 238 64 -317 182
2425A82j1l95K34K60m68j5N33l31k65M86n3n22L67K81n58J97M15m44j78N17j42
$$ 182 171 -224 10 270 -198 -213 320 -11 -276 210 157 -365 2 283 -275 -78 337 -107 -285 232 90
2446I0l64L68J13m21K04K45l81L8L56k92j93M47q7m75M25K47n49R3M31l77j98
$$ 90 -274 94 207 -214 -10 235 -146 -108 248 -44 -237 210 123 -352 73 320 -229 -136 295 -82 -280
2467b80N18p4m75L81J52m29J08L97l83o1M27k63k34L97k2m40L71J73n15J54L95
$$ -280 238 164 -311 70 222 -207 -99 298 -85 -146 281 18 -216 181 159 -281 90 263 -252 -98 297
2488B97m16j70M70r5m07L86J69n14J86L76l58j44L68p6l12K91N1l58K70J83l17
$$ 297 -119 -289 181 86 -321 65 234 -280 -94 282 -76 -220 148 72 -240 51 102 -256 14 197 -120
2509a20K6L93l82r4M31j48l95L95J84n46J64L94m14j09M58k08l00L81K2l84K35
$$ -120 -94 299 -83 -177 254 106 -289 106 290 -256 -92 302 -112 -221 237 29 -271 110 132 -252 -17
2530a7K13l56m0L77k36j76L83q6k74K79J86n04K29K96m01n8M87k28l51M15O7m19
$$ -17 196 -160 -200 177 -59 -235 148 62 -212 67 253 -251 -22 274 -127 -185 302 74 -277 138 205 -214
2552b14J61K82l73J7L18k40j26L08p9l25L17J08l33J26K48l09m9L98k42l17M76
$$ -214 -53 229 -144 -127 191 -49 -175 133 54 -271 46 154 -179 -53 195 -114 -163 235 -7 -324 152
2573A52l6l89K96L02m94k9M75k66k53L54Ql23J63K54l78O3K71k46j22M27k31k57
$$ 152 116 -273 23 325 -169 -198 277 11 -242 112 120 -203 -40 214 -164 -101 170 -76 -198 229 -2 -259
2595b59L56R8m72K54K38l71J3L89k49k55M07K6l49J71K29l43M5K93k81k9K05o1
$$ -259 97 195 -277 -23 215 -156 -143 246 -3 -258 149 175 -174 -3 226 -117 -72 221 -60 -89 116 55
2617E5k49K65J01m42K59K35l92LL88k05k44L42J1l74K31K02l27L1L62k45j91L56
$$ 55 -194 71 172 -270 -11 224 -168 -165 223 18 -226 116 127 -247 -16 186 -141 -110 252 7 -184 172
2639A72p2k64K55P6l30J72J68k60p4L73k12k43L89n0l43K19K37m11O3K60j41j61
$$ 172 100 -164 91 167 -163 9 177 -83 -157 216 4 -239 150 100 -243 -24 213 -198 -135 125 -16 -177
2661a77L46q7k79J93J47k83O0L02l27n2L93k12j88L77q7l03J91K18l91PL88l07
$$ -177 169 82 -197 -4 143 -140 -80 222 -105 -157 236 24 -164 213 126 -177 14 232 -159 -152 236 -71
2683g1j37L79o6k95K39J29k96L0L35k70j23K87j60j40K58J9k81J50J77k48jK31
$$ -71 -208 171 105 -190 49 178 -118 -88 247 -23 -146 141 -19 -159 99 118 -163 -13 164 -84 -85 146
2705A46j80k24M04o6l44L46J31m10R2K97k26j31L46j30j77J72R9l26J44K11k57
$$ 146 -34 -258 146 80 -264 82 213 -197 -105 192 -34 -165 181 51 -126 46 145 -181 -37 174 -83
2726h3OK36j77j21K95j43j82K38Q2k95P2K43k01j10L00q8k84L08M0k91J20K11
$$ -83 -77 159 -18 -139 156 13 -169 69 151 -144 -72 171 -30 -140 160 72 -212 96 136 -155 -35 176
2748A76k62m1K28j18j47K33m3k64L42Jk70J51J38k34N6K28k08j54K90K5k82J29
$$ 176 -86 -127 101 -17 -164 69 26 -238 104 105 -165 -14 124 -110 -54 174 -34 -188 102 127 -155 -26
2770b6K88l61M5K26q0k35K43%k86K93Mk01K7J86j89p1K71j15k11K25J4k31J63
$$ -26 262 -99 -54 172 92 -143 100 100 -186 107 111 -90 -63 123 -66 -137 134 19 -192 33 47 -184 -21
2793b1J82k75k8L14j89k02L14m1k51K03R7j71kK34j71l3J55p4j80J81R9k92K00
$$ -21 161 -114 -142 172 -17 -219 95 54 -197 6 103 -68 -70 164 -7 -40 115 41 -139 42 141 -151 49
2816D9J21l00O8J95q6k48K76J3k89J37J97k28rL03k40m7J82j4k17J74Q2k03P0
$$ 49 170 -130 -62 133 47 -201 75 88 -201 -64 133 -95 -104 199 -41 -88 94 80 -137 37 119 -84 -14
2839a4J44j80p4K83k27m4K27n8k36K17J51k46m4K59j24k00K84p4j73J23J34j92
$$ -14 130 -50 -124 159 -68 -112 115 57 -179 38 189 -57 -101 158 34 -166 118 44 -129 -6 128 -64
2861f4N3J46j69j8J78j28j53K33M7k76J77J16k69N1K22j48j13K08j0k91K05J20
$$ -64 -11 135 -34 -52 126 -2 -155 78 125 -151 26 142 -127 -76 146 -2 -115 93 83 -208 -3 117
2883A17k32N4K16k27l0K16r6j23J47K3j71J48R8k33M3K33j77j09K18m5j73J68
$$ 117 -115 -61 155 -72 -102 114 18 -105 42 65 -106 42 140 -93 -50 183 6 -103 115 70 -103 65
2905F5P5j89j5K03j62o0J74o3j76J56J01k03M6J36j60K1J36j87m4K73q1j51J37
$$ 65 140 -49 -64 139 -23 -83 91 28 -148 8 109 -94 -48 88 -72 -51 85 -102 -146 127 46 -105 32
2928C2J16k41R3J71k40m7K39n5j83J95N1k33L7K16j67q9J81l6r2R1rj21J49J9
$$ 32 148 -93 0 171 -69 -116 123 68 -115 80 131 -102 -65 151 -16 -105 76 40 -52 39 30 -91 58 77
2952G7j83J11J28j82r1K50p7j76J90Q3k67J17J02j37j9J88j56q6K40m2k61K22
$$ 77 -106 5 133 -49 -140 110 33 -143 47 130 -137 -20 82 -55 -74 114 -42 -128 112 70 -191 31
2974C1P6j25l5K23j86p2J95o8j85J74O7k42R6K20k30%K26j19j43J35N7k45J47
$$ 31 107 -18 -53 170 -16 -88 107 39 -146 28 95 -147 -51 169 -61 -61 165 46 -97 38 95 -150 -3
2997cJ67k48k9J97r4m5J34o7j62J42O5j55K7J98k14n0K82j47j54K64m4j39N7Q5
$$ -3 164 -84 -113 84 -10 -55 79 12 -150 -8 57 -98 -71 127 -87 -137 145 -2 -156 108 64 -75 -18 67
3021F7j64M8J25r2n7J36L0j94J30L9j33J18R8j76o7K05p4j91K33m2j42N7J51j91
$$ 67 -97 -49 76 -16 -73 63 93 -101 29 68 -65 53 151 -25 -92 113 39 -152 81 39 -103 -46 105 -86
3045h6m5K69j53r2J12L9j36O3J11j65K7J34j07l6J80j05k8J22r3p0Q5P8j68j4
$$ -86 -131 138 -15 -107 5 44 -92 -29 82 -83 -56 78 -29 -65 115 10 -18 104 11 -59 26 104 -64 -78
3069g8K47j89m3J43rj46O2J28j69l0J69j44p0K24q9p6J41qj83J09M4q3l6J93j04
$$ -78 169 -20 -63 80 71 -75 -13 115 -54 -84 85 -59 -129 95 6 -70 71 63 -120 -11 33 -50 -86 107 3
3094Cj25J75o7q8J31J03j74L6J68k10k2J37n1r3R2O1k22J54Q9j59MJ29l9j10J69
$$ 3 -122 53 -14 -102 29 132 -42 -6 162 -48 -70 67 16 -77 15 76 -146 8 97 -62 -58 71 32 -78 91
3119I1m6j34J23O1k00Q2J81j97o9J70r1o5J37l2r4N6J58j72n8J55l4n4R3r1k7
$$ 91 45 -89 34 95 -105 -23 158 -39 -108 62 -29 -94 43 11 -83 -27 131 -41 -99 56 22 -32 61 -30 -57
3144e7J25J2j58O6O2j21K5J68q7j19J26O5j73L6J78j20o5J20m4q9J11L2j81J19
$$ -57 68 80 -78 -12 50 -71 -46 122 35 -84 42 107 -66 -30 148 28 -37 83 39 -50 61 93 -88 31
3168C1Q0j94qJ50j01m0J50m1j68J97Pj77Q4Q7j73Q2J37j28o5J89o8p6M2J12j08
$$ 31 111 -83 -91 59 -42 -82 68 27 -141 56 63 -114 -30 57 -116 -34 103 -25 -90 99 31 -45 -3 109 1
3193Ak3J06p0r1J35jj05R7L0j85Q7J30j69J4J53j61l3J45m5j05Q8P2j79N4J29
$$ 1 -22 84 14 -77 58 57 -48 49 79 -106 -19 111 -58 -44 109 -52 -85 60 15 -90 -2 70 -109 -55 74
3218G4k9j86K17m2r5J07J7j37M4O2q0m4J55o7o1J69j4j84P3J34j51m8J42n8r3
$$ 74 45 -141 76 34 -61 46 63 -74 -30 32 -48 -92 63 -4 -65 104 90 -94 -21 113 -38 -86 56 -2 -95
3243i5J96n0j38J07mq7J25k1o2l5J35j35rJ12M8j88R8O0j13N1J11j23j36J61N8
$$ -95 101 51 -87 20 16 -71 54 33 -29 -64 71 -64 -73 39 87 -101 -3 57 -56 -5 106 -17 -153 8 66
3268F6j67O5J08j46qJ58q5m5J80o7j26J25l7j14J31M7j39K5J38q0p7J04P5j98
$$ 66 -101 -36 72 -74 -82 76 -9 -54 126 59 -67 58 21 -93 38 85 -54 -29 109 29 -48 56 131 -67
3292f7O1J76k14QJ36j05p6Q2L3j02Q0P6j36pJ24j58k2J43j06J6N5Q1j46R2R3j62
$$ -67 -6 170 -44 -36 100 -5 -81 1 34 -68 12 88 -48 -55 69 -89 -111 32 -74 -58 -3 78 -68 24 117 -45
3318d5J4J02j28k6J59j1j09J13j0j17P3K7q3jJ28j54LJ09Qj32P2J03j42L2P5j42
$$ -45 -31 71 -57 -83 76 65 -44 69 59 -58 15 42 -41 -42 86 -68 -65 44 52 -80 -8 95 -47 -15 60 -82
3344h2j9J49p5q0J59k1j08J09K1n8PO0qj23J11n6jJ8P6j45K1J09q6o0J51l3j14
$$ -82 -101 48 -27 -107 52 31 -77 32 53 -5 2 62 54 -69 42 -14 -15 3 79 -66 -45 64 -22 -82 69 36 -78
3371g8Q2L8p7lJ16j26pJ42o0l9O3o6n3P4M7j04Q5O3q7n3Q1j0j21J18L4j96J41
$$ -78 4 42 -35 -38 78 -48 -55 87 27 -12 51 -15 -68 6 53 -51 34 97 10 -43 38 28 -93 25 59 -137 4
3398DO8j17K3J18j00j07J90l8o7R3l6o8k0J59o6q2J14l5l9N9k6n5K8J24j61K0
$$ 4 72 -45 -22 96 -4 -111 79 41 -26 67 31 -37 -57 102 36 -46 68 33 -6 53 27 -28 0 124 -37 -17
3424a7M7r0n4J54m6q9M1R0r1N5L1j02rJ42Kj39Q9o3j1L2J13j14k5J42p1j06J48
$$ -17 30 -60 -114 40 -6 -95 -54 36 -55 0 31 -71 -80 62 64 -75 14 -49 -60 -28 85 -29 -54 88 17 -89 59
3451E9J9j32P9O1j14n5J33o3lJ4J3r5Q3Q0p8k9R0j24k8J58p8p9J08k0o7Q1P2j38
$$ 59 78 -54 25 86 -28 -83 50 -13 -16 -2 11 -84 -1 79 1 -28 62 -62 -90 68 -10 -89 19 -1 -68 13 85 -53
3479e3K7R4p7q4J07L5q5L5N7m0r4J37j5m3M7Mo0QM2p8K5J12j36k5J24l8q2R8m0
$$ -53 -26 68 -9 -93 14 49 -36 -1 56 16 -78 59 44 1 48 52 -8 0 42 -36 -11 101 -35 -60 64 26 -56 42 2
3508Bo6Q6%r8K2J34p0p5J09m4o9L9P8j41Q8L4l3j6R1j00K3J31j08q6J27J9j29
$$ 2 -64 22 22 -76 -54 80 10 -65 44 0 -69 -30 48 -93 -5 29 -4 -20 71 -29 -6 125 17 -69 58 77 -52
3535e2%J18o9n2J40k8j16M7O4j02L3Q1q5L3K7K7o7M2j5k7j5Rpl3R0o5m9J19J2
$$ -52 -52 66 -3 -55 85 57 -59 -12 52 -50 -17 64 -21 12 39 66 -1 41 26 -1 -16 -7 -14 -47 43 -22 -71 48 60
3564F0j55R1N5j32Q5J2q2K4P8p7K2J8O5j01J5P9o7jJ06j40M3J3P0j61J13L1j18
$$ 60 -95 -4 51 -81 4 16 -66 -42 36 -41 -19 -1 64 -37 -22 57 -10 -11 95 -45 -2 11 81 -80 33 64 -54
3591e4M7M6n1m1J12l7j18R8N3q2QO4o7m3J46j24j0J24p5m5P5k2p4L2P1l9j0M1
$$ -54 -7 39 -12 -53 59 22 -96 2 55 -27 -19 45 -22 -65 81 -43 -53 71 -4 -49 26 4 -70 -38 33 -6 -16 25
3619B5l6n8R2J8o2L5j4l7J0J08q3p3Q6M2p0lM8k5l4R8r8k9J09l8o0O9k2q2L2O7
$$ 25 -11 -69 23 41 -21 14 0 -37 -27 81 -2 -75 11 53 -17 -20 28 3 -31 67 -31 -60 49 11 -49 20 -2 -84 -52 15
3649A5p7mJ53r1k3K5K6o3P2Pq7Q7j3n0K0P3j7j21R8K2q9K0N3m4%k7lnJ06L1j34
$$ 15 -62 -66 87 -4 -27 -2 24 -39 33 40 -47 40 27 -23 -3 70 53 -68 30 52 -37 -17 36 -8 -8 -35 -38 -43 63 94 -40
3680d0P9M3j33k1R8q6k1J15m3p1O6K9o9K8J7m4N0N0j12J7J09m1n2N4N9j43K1J19
$$ -40 39 82 -51 -72 26 -60 -81 34 -9 -80 -14 15 -54 -26 -9 -53 -3 47 -65 -48 61 20 -32 22 81 -62 -41 78
3708G8m6o6K8N1r1N9Om5R2m0j1n1O6m5J2Rk5k9R5j8r4KR7p4l1J20o6o8Q1J8l1
$$ 78 32 -34 -6 45 -46 13 19 -26 66 26 15 -36 30 -15 -3 6 -19 -48 47 29 -65 -63 34 -40 -71 49 -17 -85 -4 14 -17
3739a7j2N2j10L8J15o0J5lK8q4J7P2j01Q0Rj2Pmk7q5P1RJ0mR6j22K2J7L2q4K9
$$ -17 -29 23 -87 -49 66 6 21 18 46 -38 -21 51 -50 30 39 27 34 30 3 -82 -11 -2 8 4 100 -22 0 17 49 -35 -6
3770fM9r9N3J7m4K4J6k2j6Oj1j7Q6J6j09j0J13k7o7Q5o5j5M0K1r1NJ31o6o5J38
$$ -6 43 -56 -3 14 -30 -6 10 -12 -28 -22 -33 -50 36 52 -57 -67 46 19 -48 37 -28 -43 -3 18 -73 -68 63 -3 -68 70
3800G0m3l4P2o4l5M2O2j37N1K2l3m2P5J0o5N1J1n2j9P9m9j2P3p0k5M7K6p9M3O7
$$ 70 27 -7 65 1 -34 8 70 -67 -16 6 -27 -69 6 16 -49 2 13 -39 -58 21 -28 -40 33 -37 -62 -15 11 -68 -25 42
3830D2lJ3L0k9o5N5m9l6Q6k8J7j5O3n9jJ3j5m2O1J6j34M2J7l9MQ3r7NQ2L2j19
$$ 42 39 52 82 53 -12 43 -6 -42 44 16 33 18 81 22 21 34 19 -23 38 54 -80 -38 -21 -60 -56 27 -70 -65 17 49 -70
3861g0R1Kn1N1Qj01kJ01Jr6J14m9l1k9R1l8l4N7k4l2O4m4M7l7K4j5oL2p6OJ01
$$ -70 21 23 -28 23 31 -70 -72 29 30 -66 48 -1 -32 -61 30 -8 -42 15 -9 -41 23 -21 26 -11 13 -2 -8 24 -52 -46 55
3892E5j02J2P2o3m8P8K6r9N0K2m1o2J34l9J8k8M7n7L7Rk7kK8J0l9M5l2k0j9P5
$$ 55 -47 -35 37 -26 -74 4 30 -69 -19 3 -38 -100 34 -5 13 -15 32 -25 12 21 -6 -8 20 30 -9 36 4 -16 -35 40
3922D0o0n4J38n8l3L5Ql5L0m4l5K6P1j0p0J6M0j25J08Q3j68J07N1j31Q7l0k9k1
$$ 40 -20 -74 64 6 -27 8 16 -19 11 -33 -68 -42 29 19 -51 -35 5 -120 -12 71 -97 10 61 -70 17 -13 -42 -63
3950f3Q0l0m2M9N9o4NO1j04L4L8%j13R2P0q8L6Q8j62O0L6n9o6J41k2j02O6K8p9
$$ -63 17 -13 -55 -6 53 -11 -6 55 -49 -15 23 23 -90 2 72 -16 20 108 -54 6 42 -17 -83 58 36 -66 0 28 -51
3979e1L1J9j7j8O8l6o9R7J7j04J5L7j8K1N9n3m2Q5m7qNL5m8N4K4m4k4P6n8j4K7
$$ -51 -20 -1 -18 -36 32 -4 -73 24 41 -63 -48 -11 -29 -8 51 -2 -44 41 -6 -14 -9 26 -22 32 56 12 -12 64 6 -8 19
4010A9L2p4M9L2l5l7J0k8L1K0o0PJ7M5p7N0M6j07M1L5l7m8P8Ln7M5L1n7k1Q3q
$$ 19 51 -23 26 58 23 -14 -4 -32 -1 19 -41 -34 -17 28 -49 1 47 -60 -19 16 -21 -69 9 12 -45 0 31 -26 -47 36 28
4041B8p5N4j5m3M6N5j07R6oJ6n5O8n3q3J15k1m4K4K5o5JQ6Nq6M1ko2Q0j2l8L7
$$ 28 -47 7 -8 -51 -5 50 -57 39 33 49 -6 62 9 -74 41 20 -24 0 25 -40 -39 47 52 -34 7 5 -57 23 11 -27 10
4072A0%p0M3L3n0n1O2N0l6k8N3j9k7P3J9q4Q0j9%l8L0o4P5K3k0q1N5P2p0j0ml5
$$ 10 10 -60 -17 16 -34 -85 -23 27 -9 -37 16 -3 -30 43 62 -22 58 39 39 1 31 -33 42 65 45 -36 19 91 21 11 7 -28
4104b8RN9p2kJ9o7L6O3K0j21P6Jk8L6M7p4j6L9M0j5k8K1j5n5O8J2j8L8n7JQ2p0
$$ -28 -19 40 -32 -34 -15 -82 -46 17 37 -84 -8 -7 -35 1 48 -26 -42 -3 37 22 -6 15 0 -55 13 25 7 45 -12 -11 71 1
4136AjM4j8n5J8O3l7rJ5l7m5N2J9Pq6J02p2L3L3k2m1O1M2l6J9k0Jm5L6k3rqL7
$$ 1 0 44 26 -29 -11 52 15 6 21 -16 -61 -9 10 17 -69 33 -39 -6 27 5 -36 25 67 31 50 30 31 -14 22 -1 -10 -18 19
4169A9j2j1K0j9J3L1j06Q8oJ8q6O6mJ3K5m0j3m6R1m2l5LL8l3J0P2j27P3j3J1n2
$$ 19 7 -4 16 -3 10 41 -65 23 17 35 -51 15 11 24 49 9 -4 -50 41 -1 -36 -33 5 -28 -18 54 -73 0 -13 -2 -54
4200e4P9k3m2O9l4p2N9L6j7Rm6M5Qj2j4J5J1K7j3QO7r1j3L8Jj24J02%l7M6j9j4
$$ -54 25 2 -40 29 -5 -77 -18 18 1 10 -36 9 17 5 -9 6 17 44 31 39 106 15 2 40 41 -83 19 19 -18 28 9 -5
4232ej9%m1K0L7L9r2Q7j2o4O9j0J2j00M7L5n6Q2p3N8j7N1m1M1jj5m0%Q4oo0Qj7
$$ -5 -24 -24 -65 -45 -8 31 -61 26 14 -50 19 9 21 -79 -32 3 -53 29 -44 14 -3 48 7 48 47 32 -8 -8 76 70 10 18 1
4265Ak1N4q6K9O4k8l3kRl7J7L0Jnk4J1r8J10nl8K1L6m1M6JPm0J7Jl6N1k7l9M0
$$ 1 -20 34 -52 -23 41 13 -20 -22 -13 -50 -33 -3 -2 -7 -31 -20 -118 -8 -13 -51 -30 6 -35 11 12 19 -21 -4 -3 -39 12 -15 -54 -14
4299a4M0m7JK7M6r4O7J7p1L3J5Rm6Q4j6q1N1L4p4QN8n7l9O1q2K6P4j3l8k0M1k1
$$ -14 26 -21 -20 7 53 -41 26 43 -28 5 20 29 -17 67 51 -30 21 55 -19 -11 47 -10 -49 12 -70 -44 30 17 -21 -41 0 -21
4331b1L9k8K0qJ4k3k1Q1j6q0J2qL8RL3K3m2J0k4M9n2P6n3kJ3J5o5N2q1J2M1K3
$$ -21 18 -10 10 2 16 -7 -28 53 37 -43 -31 -39 -1 8 41 64 22 32 8 57 5 81 28 26 39 54 -11 41 -40 -28 13 36
4363C6m9k7L5j1J7j7j4KL8o7J9P8qn9N3k6mJ1J0lm5P1j9p4N0O2Lj4kp7K1L3j9
$$ 36 -13 -40 -5 -16 1 -16 -30 -28 10 -57 -38 40 32 -27 26 0 -4 7 17 14 -31 40 21 -53 -3 59 62 48 46 -31 -10 23 4
4396DJ8Mm3qoN1qj5KNn4L3O0q9O0j2mM7p1L7l1L8Lo4M8k2l8J2P3m7j4QJ8j7Q4
$$ 4 22 26 -17 -25 -31 20 12 -3 -1 4 -50 -17 43 -46 14 2 -2 45 -26 11 -20 18 21 -43 5 -17 -55 -43 30 -17 -31 -23 -5 -22 62
4431F2j6m0J5L1p9N5J9k2n8JK6jK4k0LM9K3j13J5L5k8K6j8L4p2O2J2m7lJ9Qo3
$$ 62 46 6 21 52 -27 28 47 25 -33 -32 -6 -7 17 -3 0 49 72 -41 -26 9 -19 7 -11 23 -49 13 25 -22 -25 -6 2 -61
4463f1N6J3nlJ9%j4kK3j2M2J1j08P9j0jQnqK4j8J0l6OK3o9N2Op4M3L6q0QP7m6
$$ -61 -5 8 3 0 19 19 5 3 26 14 56 67 -41 38 28 27 35 30 22 46 28 38 2 8 31 -38 14 20 -54 -11 25 -55 -47 30 -16
4498a6o6N9L8l9l6N4p0J01qk8J0jJ7j1k1L9L9n6J1K1l1L3k7j2J4J9q5R7mp3M1
$$ -16 -82 -23 15 -24 -60 -6 -76 25 17 -11 -1 -2 15 4 -17 22 61 5 16 37 6 39 12 0 14 33 -52 45 41 -32 9
4529IQj2M5Mp6l9Q4nl2k2L6Qm4J1kK0J9l7M6j8k2L4m5O4o9K4J6L4l4L1L6p4OL0
$$ 9 17 5 50 54 -22 -61 23 18 -14 -36 0 8 -36 -25 -27 -7 12 -25 21 3 -19 15 -30 34 -35 -11 5 39 5 36 72 -2 4 34
4563C4m0M2l8N8j18Q4ol1K9K3n2p3J06k9j8qN2mn6K3L8o4M8j8L0m3PMmL3J0j1
$$ 34 -6 36 -2 56 -62 22 16 -15 14 37 -15 -88 18 -11 -29 -37 15 11 -45 -22 16 -48 0 -18 12 -31 -24 -20 -24 9 19 8
4595HJK0j9%j7j1k0Q0m7pJ5k3Q6m1r7M9L8J4n5L8j5l3J5Rk0PM1L7o7K2rol3L4
$$ 8 9 29 10 10 -7 -18 -38 42 -5 -12 3 -20 66 25 -72 -23 15 29 -26 12 -3 -36 -21 -12 -32 -25 16 53 -14 8 -1 -7 -40 -6
4629foKLNn7Q0j6L2k9M8o4K5nn9N1Nl6PL2L0q1M9K8J7p9K7o0M8rl0M9L1m9k2J4
$$ -6 -12 -10 -7 -2 -59 21 5 37 8 56 -8 17 12 -47 4 9 -27 -20 12 42 -39 10 38 55 -24 3 -57 -9 -18 -48 1 32 -17 -39 -25
4664b5O4m2j8K9k7opK4k1OK0KK4mp1O7K5o3j9M0l1L7K7N0j35N9Pm3K3J0K8j12
$$ -25 39 -3 -21 8 -19 -25 -32 -8 -29 -23 -3 -1 23 19 -52 15 40 -23 -42 -2 -33 4 31 81 -54 5 12 -31 -8 2 30 -82
4696h2J09mo3J8J7Jl6J8K4r9Q4kn2L3M6q4J7M1M2K8o2j3k2kM2J5l7K0jl4N8%n1
$$ -82 27 23 -40 -22 -5 -4 -40 -22 2 -97 -13 -15 -67 -34 12 -72 -55 -14 28 56 -6 -19 -41 -43 -1 14 -23 -3 -4 -38 20 20 -31
4729c1J05Qr6M8Pl1pL0k2Nk0Qk7K9L1p2n7J23k6k5j5L2k6n6L7K8QM5k5p1J13l7
$$ -31 74 82 -14 34 41 10 3 33 11 16 -4 4 -23 6 37 -35 -92 31 5 -20 -35 -3 -29 -85 -48 -20 -12 33 8 -63 50 13
4761A3J5oMk8J2J4l1K8j3J7m2Q0o5o7O8L5n4J8L3K8m1j2J6j8l7M2J2om1M1k7j0
$$ 13 28 22 26 -2 10 24 -7 21 8 25 -17 63 -2 -69 -1 34 -20 -2 31 59 18 6 22 4 -33 9 21 15 -26 15 -12 -22
4793b2J4j1M3m0nOj7l7K4K2j7j9JP6j7J4oj4j6L8m9K5K0K6n5K5j2L1KJ3n6J2R
$$ -22 -8 -19 24 -16 -21 -15 -32 -69 -45 -23 -40 -59 -58 18 1 15 9 -5 -21 17 -32 -7 13 39 -16 9 -3 28 30 43 -13 -1 8
4826Hl3OL8j2j4J6n0M0k8M7jm0O0o4plL9j0J9l8J9rj2mJ9J01j42J12p8K6K8j6
$$ 8 -25 -19 19 7 -7 9 -41 -1 -29 18 17 -23 37 -27 -34 -37 2 -8 11 -27 -8 -17 -29 -33 -14 87 -55 57 -21 5 33 17
4858A7k7MJL4m2j1J3M9n6j7Q0l2J4l3J0l4J2kkmM4n1J9j5k0%J3M9j7Mj6Qj1QM6
$$ 17 -10 -6 -5 29 -13 -24 -11 38 -18 -35 45 13 27 -6 4 -30 -18 -20 -22 -26 18 -33 -14 -29 -49 -49 -36 13 -4 0 -16 -8 -19 -11 35
4893C5l3%K8K9o3N5m9j8NK7qlOo2J05o6jl0L2k1L5l0N1p9K8M1j6k7L9j4k1NMk1
$$ 35 2 2 30 59 -4 51 2 -16 -11 16 8 5 11 -51 54 -12 -13 -43 -11 -32 3 -27 24 -55 -27 14 -2 -29 10 -4 -25 -20 -16 -37
4927c7J07p7J9Jqj6J7L7o0L1l6L8o4P5j5kj5M1k8oPMk7M9j9jlnQj9J4l6O3m7n0
$$ -37 70 -7 12 13 5 -11 6 43 -17 14 -22 16 -48 27 12 10 -5 36 8 2 9 13 -14 35 16 15 12 7 15 -4 10 -26 37 -10 -60
4962f0O7l2K6jj8M0o5K6Nj9j0oO1m4O6l5l3P2m6J8K7p9R6r0L7Kj0oJ6L0o5PM1
$$ -60 7 -25 1 0 -18 22 -43 -17 -12 -31 -41 -47 14 -30 36 1 -32 40 -6 12 39 -40 56 -34 3 5 -5 -11 5 35 -30 -23 18
4995A8%j8K3o2M8l0J1k7N3j7L4l1m1oL8Mn6M4K4lK1l1K7pj2K3k8K5k9l5K0K5K5
$$ 18 18 0 23 -39 9 -21 -10 -37 16 -1 33 2 -39 -45 -7 -3 -59 -15 9 6 27 -4 23 16 4 27 -1 24 -5 -40 -20 5 30
5028C0K0n3J1KL8k9K6lK4o5m1J03k9n2Kk1l2R9l2k4j0P1l8n1Q0m7L4K0j0l1Mj8
$$ 30 50 -3 8 10 48 19 45 42 66 1 -40 63 34 -18 -16 -37 -69 30 -2 -26 -36 35 -3 -54 26 -21 13 33 23 -8 -4 -22
5060b2J5RK6n5qJ5L6K3j6nK2J4q1M8j4K2qMll7n4R0q7N0l8R0m1mKP4j13L0L2k6
$$ -22 -7 2 28 -27 -35 -20 16 39 23 18 40 54 -27 21 7 29 21 25 22 -15 -69 21 -66 -16 -54 36 -5 -9 -7 67 -46 -16 16 -10
5094a0j1L1l6L1K9r2N6l8M6l6L7mj5l9PK0J2K8k2M4j7n3M0K2L0q1N0l6L4j1k9
$$ -10 -21 10 -26 5 34 -58 -2 -40 6 -30 7 3 -12 -51 -44 -24 -12 16 -6 38 21 -32 8 30 60 -21 29 -7 27 16 -13
5125a3K0oMK9m5j2L0l9K6%k5M1J5l6K0j7m6K6N0Jl1j6Q6n6j8oM3p9Q9J7m6k6M6
$$ -13 7 1 5 34 -11 -23 7 -32 -6 -6 -31 10 25 -11 9 -8 -54 -28 22 23 -8 -24 62 6 -12 -18 25 -54 35 52 6 -20 26
5158B6J0Qm2k2J5NK3o9L4M7o7N3pj9j7L5Op4M9m0K1K1%No8N6J6M1q2J4K9j7K3
$$ 26 36 44 2 -20 -5 0 23 -46 -12 35 -32 21 14 -5 -22 13 19 -55 -6 -46 -25 -4 -4 1 -67 -11 5 46 -36 -22 7 -10 13
5191A3Qk7l1N3k1J18n2j20P4k9N1j7n0K2l0O4l0K5rm1mJ4J8k8L1Kk8L4L2r8J5
$$ 13 21 -6 -37 16 -5 113 61 -59 15 -14 37 20 -30 -8 -38 26 -4 21 12 -29 -33 -19 -1 -29 2 4 -24 10 42 -56 -41
5222d1N9k6qK2rqJ5j5mqK6pj4O1k1NK6K1k0J8p9OM1r7O0N5m8J2Kk0ok6J5K9k6
$$ -41 18 -8 -16 6 -3 -11 4 -11 -15 -23 3 -4 -18 43 22 27 53 74 54 72 -7 -1 40 -57 3 58 10 22 24 4 -2 -28 -13 16 -10
5257a0j4O7Jj25N2j0K7k4L4N7j30Q3Nk6k3P4j1n6kK4o5J22m1n7M9J9m4K1K6Jk5
$$ -10 -24 43 44 -81 -29 -39 -12 -36 -2 55 -75 8 13 -13 -36 38 27 -29 -31 -7 -72 50 9 -48 1 20 -24 -3 23 24 -1
5288aK5Pk7N0j5j17O5J1j1L6jm7j4mO4q2M8%L0qKj3J8l3K2k2l9N7MJ0k0qk8P2
$$ -1 24 31 4 54 39 -78 -13 -2 -13 23 22 -25 -39 -43 21 -61 -13 -13 17 9 11 -2 16 -17 5 -17 -56 1 5 15 -5 -13 -41 31
5322C1J4m0L0Pl6QQk4N3l0m6L6k2J6oM6k0Lm3L7o5K7K4K1n4k4J7K6J3jK1%m3J9
$$ 31 45 5 35 42 6 14 22 -2 51 21 -25 11 -11 5 -1 45 25 28 -15 22 -43 -16 8 29 -25 -49 -32 -6 7 6 27 27 -16 3
5356Cqk6LJ6M6j9j5M8k1Nn0L5k7O2o6K0j6m0J07o2l9K3MO1o8k0J7k8Q1p1K8J7
$$ 3 -5 -31 -28 -12 34 15 0 48 27 32 -18 17 -10 52 -14 6 -10 -50 57 -5 -44 -21 -17 44 -24 -44 -27 -55 26 -45 -17 0
5388@L7l1m9O5o3jM9jp6P4j9j4j0kL1QL9k2K9p8L8j4QK4l1J7K8n5K6nJ4n1K1n
$$ 0 37 6 -43 22 -41 -42 7 6 -70 4 -15 -29 -39 -41 -10 -2 37 15 44 -34 4 -10 -2 22 -9 8 36 -19 7 2 16 -35 -14 -19
5422a9Nj2K5n9M2LRj6M2nk6mLn7L4k9N6oL7q1Q3l4qk6j4Q8j4l8J1k4N9M1r1R2
$$ -19 -14 -26 -1 -60 -18 -15 -6 -22 20 15 -11 -15 -12 -69 -35 -64 -8 -14 23 -58 25 -9 -17 -43 -57 31 17 -21 -10 -34 25 66 -25 67
5456F7q5%K1k2M8n5P3j1n9l6N8j4k5K4K5no6J0M1o2J12J9p7OpM5m2j6QM9J0m1
$$ 67 -18 -18 3 -19 29 -26 47 36 -23 -59 -1 -15 -40 -16 9 4 -62 -52 -11 -73 39 58 -19 -13 -20 25 -17 -33 -25 24 34 -7
5488gK9M8n7j7K8J9j9l1J5J0l3J0K2k0L1k7mjN3l8oqqJoM2m8K4j7J5l3J3J0O6
$$ -7 22 70 13 -4 24 43 24 -7 8 18 -15 -5 17 -3 28 1 -3 -4 49 11 5 -3 -11 -10 -16 26 -22 2 -15 0 -33 -20 -10 56
5522E6l6n3pK9l5O1K8l2l2N0j2k7Q3n7j8j1J8k9j3L7N1m1l4j8rML6L0j3k6N6o4
$$ 56 20 -33 -40 -11 -46 15 43 11 -21 29 17 -10 73 16 -2 -13 5 -24 -37 0 51 10 -24 -42 -51 -47 -11 19 6 -20 36 -28
5554b8Rj9N6n1k3L3l1Q0n5K7o8P0m1M9Jrl0M6q%j0j8M2kJ5o7R9m1k5kj8M6J2n3
$$ -28 -19 -38 18 -33 -56 -23 -54 26 -29 -2 -70 0 -41 8 9 0 -30 16 8 8 -2 -20 22 20 35 -32 67 26 1 -1 -19 27 39 -14
5588a4P9q7K5L3l4l3K5Ql8M9o4L2j02P7L4m5O0L5q4P0l4M0m4K2l2m5M9kk4K3K4
$$ -14 65 -22 3 36 2 -31 -6 2 -36 13 -51 -19 -121 -44 -10 -55 5 40 -44 26 -8 32 -12 10 -22 -67 -18 -20 -44 -21 3
5619CJ%n9M5LOK5j4k7k0M3O1j06L6K4j0j5MrkRj0L0lj8L2r8O0Pl4PMj0MM2J4l0
$$ 3 4 4 -55 -10 -7 -1 24 10 -17 -37 6 67 -39 -3 21 11 -4 0 -9 -11 -2 -12 18 15 -3 29 -69 -9 -2 -36 -29 -25 -35 -31 11 25 -5
5656em9O8j6O1j42O5J1K7Jl6L1M7o4K3j2RMj4k5L6Kn3L6o1J22o6rN1p9M2L3m4
$$ -5 -54 14 -2 59 -83 -18 -7 20 21 -15 16 63 -1 22 10 19 23 9 -16 20 22 -31 5 -56 66 0 -9 42 -37 5 38 -6
5688fk8K8N4k2k8n8P5l2L0J2l3K6k1n0jQ8k1L9l1l0M3Ll9J9k0l3O5m3%NK6nl1
$$ -6 -34 -6 48 26 -2 -60 15 -17 13 25 -8 18 -3 -53 -54 34 13 52 21 -9 34 37 -2 17 -3 -36 29 -14 -14 -9 17 12 -19
5721a9k5M1j2M5k3r3O8%k4N5l7K4prm4L2N0k5J5l2L4l5j0J4J8O8n0n3N9K3k3J5
$$ -19 -44 -3 -15 30 7 -86 -18 -18 -42 13 -24 0 -7 -16 -60 -28 22 -3 12 -20 14 -21 -31 -17 1 69 19 -34 25 48 25 40
5753D0j7qJ8j6K7J6n1m0M7k3rO0l9j2jL5j1rk1jM7n4P5o1Q3p7k5N4k2J0J0j0l5
$$ 40 23 15 33 17 44 60 9 -31 16 -7 -16 44 5 -7 -8 27 16 7 -14 -15 32 -22 53 -8 75 -2 -27 27 5 15 25 15 -20
5786b0K1k3N7p7L4J8J2oPm2M3n9K9k6M5NMl6o1J22l8J6n0K6l0N0j7J6n6JK0J6
$$ -20 1 -22 35 -42 -8 10 22 16 23 -19 24 -35 -6 -32 13 18 22 -14 -75 47 9 25 -25 1 -29 21 4 20 -36 -35 -15 1
5818Ak8Qj7K6k2J4L3k7l6N3J7k9N9l0J7m0Q4r9L1j8OJ7J0rl5J8jkj1J9L6n3J7
$$ 1 -27 -19 -36 -10 -32 -18 15 -12 -48 5 22 -7 52 22 39 -1 83 -16 15 -3 3 20 30 21 -14 4 3 1 -10 9 45 -8 9
5851Ilo2L2K0l2K8pN9r0K1pM1J3Pn3Q0lk1n7L2k6K3lk4L6m2P3qJ5q1O5j6j7N9
$$ 9 6 -56 -24 -4 -36 -8 -15 44 -46 -25 -32 9 22 29 -24 56 53 32 -25 7 -19 4 1 -23 13 -29 44 36 51 -30 35 19 2 61
5885F1o2K9o8N7oj4jL0m0O5p4j0K6K6K0n5O1l3p9M1MJ2j1N5Kn7L9k0K3nl8K0l7
$$ 61 -1 28 -40 17 11 -3 -4 26 -14 51 -23 -33 -7 19 39 -16 45 12 -67 -26 -22 -10 -21 34 36 -21 18 -2 21 16 -22 -2 -39
5918c9m0J14pOj7%jQk1J9p0J6M1m5O7j5m2L9j7nj4K8p2N1k3L2%J4J1n6N5k9l4
$$ -39 -79 35 28 34 17 17 16 24 3 22 -48 -32 9 -36 31 16 -26 13 -4 -9 -23 5 -67 -16 -39 -7 -7 7 18 -38 17 -12 -46
5951d6K1NK1l0l3N4QJ8n7P8Ok3l2k8L1O9l4l4J6PrNLO7q8j6K4o6J00n8Lj3K0j2
$$ -46 -25 -20 1 -29 -62 -8 0 18 -39 39 45 22 -10 -38 -7 62 28 -6 10 17 8 13 16 83 -5 -21 3 -63 37 -21 -18 -31 -11 -23
5985b3QK0Rr2N0L2l9M7Ql8mL1pol5P9J6j15O7Q%lJ3on3N8k5L7m3oL7o7N1L2p0
$$ -23 -15 5 14 -78 -28 4 -35 12 20 -18 -22 9 2 -4 -39 40 56 -59 8 16 16 13 26 20 -33 25 0 37 -6 -12 25 -42 9 41 -29
6020b9L0K7m5O%qJ0j9Qk6l0NN5Q6q8K2No4Q0j7PoK5o2N0l2KL0m5K0L9o7N2k5O
$$ -29 1 28 -17 -11 -11 -19 -9 -28 -20 -46 -76 -71 -16 70 -18 4 9 -55 25 8 15 9 34 -28 22 -10 -8 22 -23 -3 36 -31 21 -4 2
$$ [...]
8191@
##END NTUPLES=NMR FID
##END=
