##TITLE=1H_1FN2907
 CDCl3, 8 sc, 
 30.7.2019
##JCAMPDX= 6.0         $$ Bruker NMR JCAMP-DX V2.0
##DATA TYPE= NMR FID
##DATA CLASS= NTUPLES
##ORIGIN= UXNMR, Bruker Analytische Messtechnik GmbH
##OWNER= root
$$ XWIN-NMR		Version 3.5
$$ Tue Jul 30 14:25:18 2019 Russian Standard Time (UT+4h)  she@DPX200
##.OBSERVE FREQUENCY= 200.13155
##.OBSERVE NUCLEUS= ^1H
##.DELAY= (6, 6)
##.ACQUISITION MODE= SIMULTANEOUS
##.ACQUISITION SCHEME= undefined
##.AVERAGES= 8
##.DIGITISER RES= 18
##SPECTROMETER/DATA SYSTEM= spect
##.PULSE SEQUENCE= zg30
##.SOLVENT NAME= CDCl3
##.SHIFT REFERENCE= (INTERNAL, CDCl3, 0, 15.7039)
##AUDIT TRAIL= $$ (NUMBER, WHEN, WHO, WHERE, WHAT)
$$ ##TITLE= Audit trail, XWIN-NMR		Version 3.5
$$ ##JCAMPDX= 5.01
$$ ##ORIGIN= Bruker BioSpin GmbH
$$ ##OWNER= she
$$ F:/spectra/data/she/nmr/H-F/1/audita.txt
$$ ##AUDIT TRAIL=  $$ (NUMBER, WHEN, WHO, WHERE, WHAT)
(   1,<2019-07-30 14:24:30.60 +0400>,<she>,<DPX200>,
      <created by zg, POWCHK disabled, PULCHK disabled
       configuration hash MD5:
       00 E9 B6 7A A2 85 ED C7 34 08 36 98 17 FE 4E 26
       data hash MD5: 16K
       55 AC 57 8F 49 4B F6 94 1D 39 CD 4B 09 28 94 CA>)
$$ ##END=
$$ 
$$ hash MD5
$$ 82 31 D0 E5 EF DC 7F 8C 16 B6 EE FE D2 7A 21 DA
##$RELAX= 
##$RELAX= 
##$RELAX= 
##$RELAX= 
##$RELAX= 
##$RELAX= 
$$ Bruker specific parameters
$$ --------------------------
##$DU= <F:/spectra>
##$EXPNO= 1
##$NAME= <H-F>
##$PROCNO= 1
##$TYPE= <nmr>
##$USER= <she>
##$AMP= (0..31)
100 100 100 100 100 100 100 100 100 100 100 100 100 100 100 100 100 100 
100 100 100 100 100 100 100 100 100 100 100 100 100 100 
##$AQSEQ= 0
##$AQ_mod= 1
##$AUNM= <au_zg>
##$AUTOPOS= <>
##$BF1= 200.13
##$BF2= 200.13
##$BF3= 200.13
##$BF4= 200.13
##$BF5= 200.13
##$BF6= 200.13
##$BF7= 200.13
##$BF8= 200.13
##$BYTORDA= 1
##$CFDGTYP= 0
##$CFRGTYP= 5
##$CHEMSTR= <none>
##$CNST= (0..31)
1 1 145 1 1 1 1 1 1 1 1 1 1 1 1 1 1 1 1 1 1 1 1 1 1 1 1 1 1 1 1 1 
##$CPDPRG= <>
##$CPDPRG1= <>
##$CPDPRG2= <>
##$CPDPRG3= <>
##$CPDPRG4= <mlev>
##$CPDPRG5= <mlev>
##$CPDPRG6= <mlev>
##$CPDPRG7= <mlev>
##$CPDPRG8= <mlev>
##$CPDPRGB= <>
##$CPDPRGT= <>
##$D= (0..31)
0 1.2 0 0 0 0 0 0 0 0 0 0.03 0 0 0 0 0 0 0 0 0 0 0 0 0 0 0 0 0 0 0 0 
##$DATE= 1564482269
##$DBL= (0..7)
120 120 120 120 120 120 120 120 
##$DBP= (0..7)
150 150 150 150 150 150 150 150 
##$DBP07= 0
##$DBPNAM0= <>
##$DBPNAM1= <>
##$DBPNAM2= <>
##$DBPNAM3= <>
##$DBPNAM4= <>
##$DBPNAM5= <>
##$DBPNAM6= <>
##$DBPNAM7= <>
##$DBPOAL= (0..7)
0.5 0.5 0.5 0.5 0.5 0.5 0.5 0.5 
##$DBPOFFS= (0..7)
0 0 0 0 0 0 0 0 
##$DE= 6
##$DECBNUC= <off>
##$DECIM= 24
##$DECNUC= <off>
##$DECSTAT= 4
##$DIGMOD= 1
##$DIGTYP= 9
##$DL= (0..7)
0 120 120 120 120 120 120 120 
##$DP= (0..7)
150 150 150 150 150 150 150 150 
##$DP07= 0
##$DPNAME0= <>
##$DPNAME1= <>
##$DPNAME2= <>
##$DPNAME3= <>
##$DPNAME4= <>
##$DPNAME5= <>
##$DPNAME6= <>
##$DPNAME7= <>
##$DPOAL= (0..7)
0.5 0.5 0.5 0.5 0.5 0.5 0.5 0.5 
##$DPOFFS= (0..7)
0 0 0 0 0 0 0 0 
##$DQDMODE= 0
##$DR= 18
##$DS= 0
##$DSLIST= <SSSSSSSSSSSSSSS>
##$DSPFIRM= 0
$$ [...]
##$SUBNAM2= <"">
##$SUBNAM3= <"">
##$SUBNAM4= <"">
##$SUBNAM5= <"">
##$SUBNAM6= <"">
##$SUBNAM7= <"">
##$SUBNAM8= <"">
##$SUBNAM9= <"">
##$SW= 24.9336996594482
##$SWIBOX= (0..15)
0 0 2 0 0 0 0 0 0 0 0 0 0 0 0 0 
##$SW_h= 4990.01996007984
##$TD= 16384
##$TD0= 1
##$TE= 0
##$TE2= 300
##$TE3= 300
##$TEG= 300
##$TL= (0..7)
0 120 120 120 120 120 120 120 
##$TP= (0..7)
150 150 150 150 150 150 150 150 
##$TP07= 0
##$TPNAME0= <>
##$TPNAME1= <>
##$TPNAME2= <>
##$TPNAME3= <>
##$TPNAME4= <>
##$TPNAME5= <>
##$TPNAME6= <>
##$TPNAME7= <>
##$TPOAL= (0..7)
0.5 0.5 0.5 0.5 0.5 0.5 0.5 0.5 
##$TPOFFS= (0..7)
0 0 0 0 0 0 0 0 
##$TUNHIN= 0
##$TUNHOUT= 0
##$TUNXOUT= 0
##$USERA1= <user>
##$USERA2= <user>
##$USERA3= <user>
##$USERA4= <user>
##$USERA5= <user>
##$V9= 5
##$VALIST= <valist>
##$VCLIST= <CCCCCCCCCCCCCCC>
##$VD= 0
##$VDLIST= <DDDDDDDDDDDDDDD>
##$VPLIST= <PPPPPPPPPPPPPPP>
##$VTLIST= <TTTTTTTTTTTTTTT>
##$WBST= 1024
##$WBSW= 4
##$XGAIN= (0..3)
0 0 0 0 
##$XL= 0
##$YL= 0
##$YMAX_a= 320308
##$YMIN_a= -298440
##$ZGOPTNS= <>
##$ZL1= 120
##$ZL2= 120
##$ZL3= 120
##$ZL4= 120
##$ABSF1= 10
##$ABSF2= 0
##$ABSG= 5
##$ABSL= 3
##$ALPHA= 0
##$AQORDER= 0
##$ASSFAC= 0
##$ASSFACI= 0
##$ASSFACX= 0
##$ASSWID= 0
##$AUNMP= <proc_1d>
##$AZFE= 0.1
##$AZFW= 0.1
##$BCFW= 1
##$BC_mod= 2
##$BYTORDP= 1
##$COROFFS= 0
##$CY= 11.3945322036743
##$DATMOD= 1
##$DC= 2
##$DFILT= <>
##$DTYPP= 0
##$F1P= 20.1537800932815
##$F2P= 0.134698688090026
##$FCOR= 0.5
##$FTSIZE= 0
##$FT_mod= 4
##$GAMMA= 1
##$GB= 0.15
##$INTBC= 1
##$INTSCL= 1
##$ISEN= 128
##$LB= 0.24
##$LEV0= 0
##$LPBIN= 0
##$MAXI= 10000
##$MC2= 0
##$MEAN= 0
##$ME_mod= 0
##$MI= 1.114404
##$NCOEF= 0
##$NC_proc= 0
##$NLEV= 6
##$NOISF1= 3.799351
##$NOISF2= 2.8
##$NSP= 1
##$NTH_PI= 0
##$NZP= 0
##$OFFSET= 15.70392
##$PC= 1
##$PHC0= -9377.524
##$PHC1= 13.20097
##$PH_mod= 1
##$PKNL= yes
##$PPARMOD= 0
##$PSCAL= 0
##$PSIGN= 0
##$REVERSE= no
##$SF= 200.130013532006
##$SI= 16384
##$SIGF1= 3
##$SIGF2= 2
##$SINO= 400
##$SIOLD= 16384
##$SREGLST= <1H.CDCl3>
##$SSB= 0
##$STSI= 0
##$STSR= 0
##$SW_p= 3612.71676300578
##$SYMM= 0
##$S_DEV= 0
##$TDeff= 0
##$TDoff= 0
##$TI= <>
##$TILT= no
##$TM1= 0
##$TM2= 0
##$TOPLEV= 0
##$USERP1= <user>
##$USERP2= <user>
##$USERP3= <user>
##$USERP4= <user>
##$USERP5= <user>
##$WDW= 1
##$XDIM= 8192
##$YMAX_p= 0
##$YMIN_p= 0
$$ End of Bruker specific parameters
$$ ---------------------------------
##NTUPLES= NMR FID
##VAR_NAME=  TIME,          FID/REAL,        FID/IMAG
##SYMBOL=    X,             R,               I
##VAR_TYPE=  INDEPENDENT,   DEPENDENT,       DEPENDENT
##VAR_FORM=  AFFN,          ASDF,            ASDF
##VAR_DIM=   8192,          8192,            8192
##UNITS=     SECONDS,       ARBITRARY UNITS, ARBITRARY UNITS
##FACTOR=    0.0002004,     1,               1
##FIRST=     0,             0,               0
##LAST=      1.6414764,     0,               0
##MIN=       0,             -298440,         0
##MAX=       1.6414764,     320308,          0
$$ Real data points
##PAGE= N=1
##DATA TABLE= (X++(R..R)), XYDATA
$$ plain form
0 0 0 0 0 0 -8 8 -8 8 -16 16 -16 24 -32 40 -48 56 -64 80 -89 105 -128 147 -169 196 -225 258 -295 337
28 337 -381 431 -485 544 -610 683 -763 851 -946 1052 -1165 1293 -1432 1584 -1752 1943
44 1943 -2153 2386 -2649 2953 -3298 3700 -4173 4743 -5441 6315 -7457 9015 -11276 14868
58 14868 -21470 37592 -155712 -91677 262867 -70089 -298440 -54563 154044 -85482 -171810
69 -171810 32718 59823 -154791 -90729 126432 48120 -178164 -82827 132212 83873 -95825
80 -95825 -78040 46039 86021 35238 -24889 -39710 45104 112179 32995 -53251 30332 106392
92 106392 21954 -16926 88904 76387 -59728 2626 178126 74177 -136494 -10250 218243
103 218243 79207 -147842 -9564 186920 43893 -108309 37320 128892 -31070 -68979
$$ packed form
0@%%%%qJ6j6J6k4L2l2M0n6P2q8J04j20J44j69J94k33K75l16L65m21M83n53O32
28C37p18Q12r16J029j154J293j446J614j797J998k217K458k725L016l336L695
44A943m096M539n035N602o251O998p873Q916j0184J1756j3772J6472k0291K6144
58A4868l6338N9062j93304O4035L54544l32956k28351K43877K08607k39526q6328
69a71810K04528K7105k14614O4062K17161p8312k26284R5337K15039m8339j79698
80i5825J7785J24079L9982n0783o0127j4821Q4814O7075p9184q6246Q3583P6060
92A06392q4438l8880J05830j2517j36115O2354J75500j03949k10671J26244K28493
103B18243j39036k27049J38278J96484j43027j52202J45629R1572j59962l7909
$$ plain form
113 -68979 100677 87904 -93411 -50312 124632 58795 -101441 -29964 93217 15394 -66194
124 -66194 9079 38041 -39499 -24094 48224 -7588 -74783 5568 56238 -40584 -70656 28225
136 28225 27178 -70582 -39450 48162 -14999 -91326 -4821 53770 -49410 -87193 22356 34903
148 34903 -72173 -56764 42446 772 -83511 -17347 51041 -29320 -74802 14606 37773 -47072
160 -47072 -39751 38536 4562 -56477 9354 56962 -29687 -56778 49474 61867 -47240 -37900
172 -37900 69682 42609 -48901 2905 77331 4630 -46700 48150 80276 -28717 -42809 73072
184 73072 72568 -39547 -26862 70256 44191 -31816 5749 53783 1513 -22382 39102 38610 -31698
197 -31698 -17064 50131 22530 -37793 -6775 32986 -4135 -22259 15114 4328 -38033 -4619
$$ packed form
113f8979J69656j2773j81315M3099J74944o5837j60236P1477J23181p7823q1588
124f6194P5273K8962p7540J5405P2318n5812o7195Q0351N0670r6822l0072R8881
136B8225j047r7760L1132Q7612o3161p6327Q6505N8591j03180l7783J09549J2547
148C4903j07076J5409R9210m1674q4283O6164O8388q0361m5482Q9408K3167q4845
160d7072P321P8287l3974o1039O5831M7608q6649k7091J06252J2393j09107R340
172c7900J07582k7073r1510N1806P4426p2701n1330R4850L2126j08993j4092J15881
184G3072n04j12115J2685R7118k6065p6007L7565M8034n2270k3895O1484m92p0308
197c1698J4634O7195k7601o0323L1018L9761l7121j8124L7373j0786m2361L3414
$$ plain form
209 -4619 37698 -16912 -60108 4643 41235 -28705 -55624 11038 20447 -40343 -29458 22896
221 22896 -9811 -54224 -1766 35570 -30436 -59477 14065 35363 -35811 -44749 20378 17326
233 17326 -34218 -13908 25951 -7788 -32849 15943 31594 -23572 -27693 31798 29590 -23912
245 -23912 -11798 34456 15872 -15998 12452 32241 -2407 -8448 33157 29633 -13468 -1674
257 -1674 39926 22837 -12521 8185 33594 9563 -4892 20446 22305 -5380 1683 27922 11622
270 11622 -14047 5295 24472 918 -13322 8281 12032 -10672 -7683 10862 -2562 -20533
282 -20533 -2762 9545 -14515 -24118 -338 2015 -23175 -20883 813 -9174 -28656 -14051 527
295 527 -19302 -29883 -7689 -2156 -25465 -26170 -3380 -7339 -27428 -18770 -1183 -12850 -25582
$$ packed form
209d619M2317n4610m3196O4751L6592o9940k6919O6662R409o0790J0885N2354
221B2896l2707m4413N2458L7336o6006k9041P3542K1298p1174q938O5127l052
233A7326n1544K0310L9859l3739k5061M8792J5651n5166m121N9491k208n3502
245b3912J2114M6254j8584l1870K8450J9789l4648o041M1605l524m3101J1794
257a674M1600j7089l5358K0706K5409k4031j4455K5338J859k7685P063K6239j6300
270A1622k5669J9342J9177k3554j4240K1603L751k2704K989J8545j3424j7971
282b0533J7771J2307k4060r603K3780K353k5190K292K1696r987j9482J4605J4578
295E27j9829j0581K2194N533k3309p05K2790l959k0089Q658J7587j1667j2732
$$ plain form
308 -25582 -10229 -488 -15977 -20002 -2713 -1032 -15642 -11719 2628 -2424 -12126 -2712 5734 -3220
322 -3220 -6343 5293 7216 -2237 879 11449 7972 1035 8521 15434 8599 5677 14944 17248 9579
337 9579 10823 19481 17405 10634 15342 21684 16658 12013 17980 21446 15456 13383 18775 18961 13657
352 13657 13934 17437 15027 11175 12846 14400 10700 7834 9625 9818 6280 4233 4886 4159 1893 593
368 593 -244 -1711 -2683 -3281 -4939 -6647 -7053 -7520 -8778 -9730 -10442 -11798 -12268 -11542 -12394 -14763 -14993 -12804
386 -12804 -13039 -15508 -15768 -13568 -13161 -14477 -14195 -12914 -12804 -12731 -11295 -10361 -11058 -10902 -8481 -6710 -7634 -8218
404 -8218 -5972 -3495 -3410 -4128 -3201 -841 485 256 673 2150 3193 3550 4559 5694 5324 5326 7456 9057
422 9057 7579 6419 8775 10927 9253 7624 9424 10895 9536 8850 10144 9865 8139 8956 10643 8679
$$ packed form
308b5582J5353R741j5489m025J7289J681j4610L923J4347n052r702R414Q446q954
322c220l123J1636J923r453L116J0570l477o937P486O913o835k922R267K304p669
337I579J244Q658k076o771M708O342n026m645N967L466n990k073N392J86n304
352A3657K77L503k410l852J671J554l700k866J791J93l538k047O53p27k266j300
368E93q37j467r72n98j658j708m06m67j258r52p12j356m70P26q52k369k30K189
386a2804k35k469k60K200M07j316K82J281J10P3J436R34o97J56K421J771r24n84
404h218K246K477Q5p18R27K360J326k29M17J477J043L57J009J135l70KK130J601
422I057j478j160K356K152j674j629J800J471j359o86J294k79j726Q17J687j964
$$ plain form
438 8679 5876 7627 9829 7034 3875 5776 7541 4455 2473 4301 4110 881 1002 3239 887 -2783
454 -2783 -630 2018 -1934 -5519 -2358 -112 -4485 -6825 -3283 -3014 -7242 -6869 -3366 -5863 -9620 -6148
470 -6148 -2976 -7972 -11033 -5318 -2993 -8913 -10280 -4432 -3843 -8866 -7467 -2866 -5477 -8715 -3747
485 -3747 -674 -6491 -8053 -438 1129 -5878 -5821 1652 1352 -3879 -1210 3204 -368 -1858 4234 4844
501 4844 -1971 -482 7949 6010 -1762 1500 8585 4943 282 5202 7266 1221 2208 9449 5635
516 5635 -2749 2771 11254 4065 -4164 3074 8852 832 -2678 4595 3616 -4400 -508 6775 -1348
531 -1348 -9259 445 6768 -4761 -10288 625 2877 -7644 -6928 1706 -3346 -10898 -2004 3698 -8696
546 -8696 -12667 1823 4055 -11011 -10549 3956 1117 -11044 -4247 5749 -3990 -10357 3316 7306
$$ packed form
438H679k803J751K202k795l159J901J765l086j982J828j91l229J21K237k352l670
454b783K153K648l952l585L161K246m373k340L542K69m228L73L503k497l757L472
470f148L172m996l061N715K325n920j367N848N89n023J399M601k611l238M968
485c747L073n817j562P615J567p007N7P473l00n231K669M414l572j490O092O10
501D844o815J489Q431j939p772L262P085l642m661M920K064o045R87P241l814
516E635q384N520Q483p189q229P238N778q020l510P273r79q016L892P283q123
531a348p911R704O323j1529n527J0913K252j0521P16Q634n052p552Q894N702j2394
546h696l971J4490K232j5066M62J4505k839j2161O797R996r739o367J3673L990
$$ plain form
560 7306 -7953 -8421 8581 7219 -8587 -3904 10459 4088 -6515 3023 10242 -867 -3349 9765
574 9765 8762 -4329 544 13184 5705 -4217 5913 12328 537 -1334 12049 9044 -4931 2661
588 2661 16297 4630 -7566 7095 16393 -663 -6082 12342 12612 -6766 -2303 16951 7452
601 7452 -11297 1549 17888 2060 -11500 4953 13345 -3932 -7468 8520 5676 -9997 -2661
614 -2661 10383 -1372 -12693 164 6952 -6831 -9699 1662 -2116 -11863 -2615 3444 -12388
627 -12388 -16081 3645 3677 -18791 -16005 5888 -1014 -20391 -8923 5992 -10688 -20029 2323
640 2323 6852 -19666 -18897 11070 7383 -21967 -14365 13325 3820 -17517 -3906 11212 -4716
653 -4716 -10919 9671 9648 -12735 -5740 19003 9140 -13535 -346 19276 5708 -6603 8432
$$ packed form
560G306j5259m68J7002j362j5806M683J4363o371j0603R538P219j1109k482J3114
574I765j003j3091M873J2640p479r922J0130O415j1791j871J3383l005j3975P592
588B661J3636j1667j2196J4661R298j7056n419J8424K70j9378M463J9254r499
601G452j8749J2846J6339j5828j3560J6453Q392j7277l536J5988k844j5673P336
614b661J3044j1755j1321J2857O788j3783k868J1361l778r747R248O059j5832
627a2388l693J9726L2k2468K786K1893o902j9377J1468J4915j6680r341K2352
640B323M529k6518P69K9967l687k9350P602K7690r505k1337J3611J5118j5928
653d716o203K0590k3k2383O995K4743r863k2675J3189J9622j3568j2311J5035
$$ plain form
666 8432 13031 -2402 2106 19039 6888 -10739 7016 24572 3972 -11703 8979 20299 1034
679 1034 -4000 12232 8998 -5025 5812 16955 -1068 -10965 10597 17830 -5340 -10094 9910
692 9910 9519 -6209 -572 8560 -4608 -8409 10733 8735 -16181 -10670 15977 6445 -19856 -7644
706 -7644 14006 -2362 -17973 1960 9619 -15078 -15839 12368 6520 -24493 -14212 16607 2992
719 2992 -25364 -9766 13334 -3654 -19681 -1220 7346 -11741 -12743 7048 2460 -15995 -6914
732 -6914 9696 -1359 -13161 -1006 5893 -5347 -5125 5635 -507 -8677 3820 10179 -5908
745 -5908 -8469 10599 9726 -9605 -3408 15129 4233 -11818 4507 17294 -3127 -11810 11772
758 11772 16069 -9000 -8399 16399 10764 -12456 -2034 17899 2986 -13216 4758 15921 -4195
$$ packed form
666H432M599j5433M508J6933j2151j7627J7755J7556k0600j5675K0682J1320j9265
679A034n034J6232l234j4023J0837J1143j8023r897K1562P233k3170m754K0004
692I910l91j5728N637R132j3168l801J9142j998k4916N511K6647r532k6301J2212
706g644K1650j6368j5611J9933P659k4697p61K8207n848l1013J0281L0819j3615
719B992k8356J5598K3100j6988j6027J8461Q566j9087j002J9791m588j8455R081
732f914J6610j1055j1802J2155O899j1240K22J0760o142q170J2497O359j6087
745e908k561J9068q73j9331O197J8537j0896j6051J6325J2787k0421q683K3582
758A1772M297k5069O01K4798n635k3220J0422J9933j4913j6202J7974J1163k0116
$$ plain form
771 -4195 -10377 9945 10462 -9009 -4369 12443 2705 -10988 2684 12179 -4531 -9839 7931 8657
785 8657 -8674 -5151 9992 1951 -9805 2049 9597 -5629 -8908 8595 7430 -10786 -6236
798 -6236 10855 3100 -11414 -1062 8990 -3672 -8631 5764 5210 -10509 -4967 10997 1392
811 1392 -13603 -1334 11387 -2742 -11349 3510 7133 -7860 -5697 9322 1856 -12371 -289
824 -289 13131 -1874 -12949 3645 11938 -4494 -8510 7215 6512 -7358 -1605 10671 670
837 670 -9504 3920 11921 -3044 -8439 6510 8714 -4899 -3545 7448 2185 -6186 2570 7706
851 7706 -4021 -6687 6488 6239 -7277 -4903 7055 2005 -7691 -409 5785 -3817 -6842 4305
865 4305 3915 -8309 -5194 6796 1310 -9433 -2147 6289 -2386 -7727 2027 3998 -6111 -4733
$$ packed form
771d195o182K0322N17j9471M640J6812r738j3693J3672R495j6710n308J7770P26
785H657j7331L523J5143q041j1756J1854P548j5226l279J7503j165j8216M550
798f236J7091p755j4514J0352J0052j2662m959J4395n54j5719N542J5964r605
811A392j4995J2269J2721j4129q607J4859L623j4993K163J5019p466j4227J2082
824b89J3420j5005j1075J6594Q293j6432m016J5725p03j3870N753J2276j0001
837F70j0174J3424Q001j4965n395J4949K204j3613J354J0993n263q371Q756N136
851G706j1727k666J3175k49j3516K374J1958n050r696P282O194r602l025J1147
865D305l90j2224L115J1990n486j0743P286Q436q675n341R754J971j0109J378
$$ plain form
879 -4733 5566 1359 -8086 -1452 6574 -1453 -7342 1833 5250 -4346 -4686 4899 2442 -6421 -1305
894 -1305 6512 -423 -6650 1711 5868 -3154 -4944 4111 3462 -5193 -2125 5534 462 -5755 875
909 875 5342 -2147 -4608 3341 3696 -3884 -1956 4982 1278 -4494 925 5360 -989 -3591 3379 4335
925 4335 -2506 -1314 5212 2375 -3075 1419 5768 323 -2624 3570 4967 -1289 -1195 4573 2887 -2161
941 -2161 862 4847 469 -2363 2613 3940 -1527 -1835 3223 1926 -2771 -496 2868 -791 -3402
956 -3402 808 1979 -3050 -3195 1521 362 -4190 -2257 1275 -1621 -4359 -799 677 -3669 -4137 495
972 495 23 -4564 -3225 1015 -958 -4242 -1688 782 -2266 -3264 408 428 -3189 -2261 1775 429 -3032
989 -3032 -1114 1928 2 -1765 569 1408 -706 -283 2286 1171 -1396 383 3107 1244 -1017 820
$$ packed form
879d733J0299m207r445O634Q026q027n889R175L417r596l40R585k457q863N116
894a305P817o935o227Q361M157r022j790R055o49q655L068P659n072o217O630
909H75M467p489k461P949L55p580J928O938l704n772N419M435o349k602O970R56
925D335o841J192O526k837n450M494M349n445k947O194J397o256R4N768j686n048
941b161L023L985m378k832M976J327n467l08N058j297m697K275L364l659k611
956c402M210J171n029j45M716j159m552J933L532k896k738L560J476m346m68M632
972D95m72m587J339M240j973l284K554K470l048r98L672K0l617R28M036j346l461
989c032J918L042j926j767K334Q39k114M23K569j115k567J779K724j863k261J837
$$ plain form
1005 820 2427 1165 563 1722 1167 287 1789 2789 639 -513 1920 2932 833 -147 1384 1760
1021 1760 850 1232 1457 25 -15 2122 2254 -488 -922 1715 2316 -25 -691 699 948 403 617 381
1039 381 -672 -242 1366 955 -1134 -1177 731 1091 -389 -1112 -742 -108 254 -41 -1244 -1606 -137 677
1057 677 -759 -2131 -1164 26 -428 -1349 -1388 -1311 -1116 -531 -513 -1819 -2266 -592 388 -1160 -2393 -1226
1075 -1226 189 -287 -1301 -1318 -683 -174 -74 -400 -909 -597 327 704 -92 -572 -4 930 937 409 40 425
1095 425 1319 1411 572 189 982 1693 1182 492 757 1117 1260 1020 898 599 647 1168 1121 341 108 774 927
1116 927 347 -35 125 290 185 117 -182 -445 -223 162 -234 -913 -586 -47 -349 -996 -704 -265 -527 -741
1136 -741 -416 -448 -864 -585 -49 -391 -815 -386 5 -364 -722 -269 88 -357 -373 43 -21 -400 -43 280 -237
$$ packed form
1005H20J607j262o02J159n55q80J502J000k150j152K433J012k099r80J531L76
1021A760r10L82K25j432m0K137J32k742m34K637O01k341o66J390K49n45K14k36
1039C81j053M30J608m11k089m3J908L60j480p23L70O34L62k95j203l62J469Q14
1057F77j436j372R67J190m54r21l9P7J95N85J8j306m47J674R80j548j233J167
1075a226J415m76j014j7O35N09J00l26n09L12R24L77p96m80N68R34Pn28l69L85
1095D25Q94R2q39l83P93P11n11o90K65L60J43k40j22k99M8N21m7p80k33O66J53
1116I27n80l82J60J65j05o8k99k63K22L85l96o79L27N39l02o47K92M39k62k14
1136g41L25l2m16K79N36l42m24M29L91l69l58M53L57m45j6M16o4l79L57L23n17
$$ plain form
1157 -237 -450 396 493 -307 -376 466 384 -348 -105 512 180 -390 153 523 -94 -365 357 458 -276 -221 475
1178 475 417 -284 5 593 300 -121 301 467 117 198 426 236 16 605 634 -76 -104 856 634 -265 37
1199 37 914 315 -344 351 772 -180 -417 725 646 -733 -558 839 483 -1036 -678 710 170 -1013 -362
1218 -362 289 -474 -749 135 -2 -1108 -595 445 -162 -1299 -635 260 -311 -853 -295 -275 -782 -245 407
1237 407 -669 -1299 144 819 -615 -1263 172 685 -551 -619 450 18 -748 301 997 -430 -989 809
1255 809 1339 -468 -821 820 1105 -158 15 889 377 -46 1021 1126 -279 -172 1446 1268 -323 -35
1273 -35 1312 821 -107 741 1090 -113 130 1425 808 -824 -51 1585 565 -1067 13 1044 -49
1290 -49 -804 365 410 -946 -630 663 -110 -1545 -541 636 -522 -1506 -332 8 -1035 -1007 71 -561
$$ packed form
1157b37k13Q46R7q00o9Q42q2p32K43O17l32n70N43L70o17k71P22J01p34N5O96
1178D75n8p01K89N88k93m21M22J66l50Q1K28j90k20N89K9p10k8R60k22q99L02
1199C7Q77n99o59O95M21r52k37J142p9j379J75J397l56j519L58J388n40j183O51
1218c62O51p63k75Q84j37j106N13J040o07j137O64Q95n71n42N58K0n07N37O52
1237D07j076o30J443O75j434o48J435N13j236o8J069m32p66J049O96j427n59J798
1255H09N30j807l53J641K85j263J73Q74n12m23J067J05j405J07J618j78j591K88
1273c5J347m91r28Q48L49j203K43J295o17j632P73J636j020j632J080J031j093
1290d9p55J169M5j356L16J293p73j435J004J177j158r84J174L40j043K8J078o32
$$ plain form
1308 -561 -1501 -391 475 -928 -1530 51 500 -1125 -1078 523 89 -1232 -243 986 -389 -1285 468
1325 468 1266 -630 -1065 867 1114 -631 -383 1043 538 -722 352 1263 -41 -646 785 1074 -280
1342 -280 -353 754 583 -223 217 590 -155 -186 834 385 -730 -105 990 123 -711 274 751 -403 -456
1361 -456 874 413 -1026 -116 1420 120 -1345 144 1370 -76 -1044 354 917 -449 -581 892
1377 892 423 -949 -99 1119 -24 -1052 61 1025 -199 -785 179 230 -571 -155 425 -449 -822 300
1395 300 514 -832 -789 418 251 -838 -339 360 -344 -806 384 417 -918 -740 819 435 -1090 -440
1413 -440 812 101 -836 77 679 -349 -565 686 554 -724 -215 1020 340 -789 97 907 -75 -517
1431 -517 561 566 -547 -199 905 277 -774 77 918 -64 -734 345 699 -354 -335 671 241 -593 -42
$$ packed form
1308e61r40J110Q66j403o02J581M49j625M7J601m34j321R89J229j375q96J753
1325D68P98j896m35J932K47j745K48J426n05j260J074R11j304o05J431K89j354
1342b80p3J107j71q06M40L73p45l1J020m49j115O25J095q67q34R85M77j154n3
1361d56J330m61j439R10J536j300j465J489J226j446r68J398N63j366j32J473
1377H92m69j372Q50J218j143j028J113R64j224n86R64N1q01M16N80q74l73J122
1395C00K14j346M3J207j67j089M99O99p04m62J190L3j335J78J559l84j525O50
1413d40J252p11r37R13O02j028k16J251j32j278N09J235o80j129Q86Q10r82m42
1431e17J078Nj113L48J104o28j051Q51Q41r82o70J079L54j053J9J006m30q34N51
$$ plain form
1450 -42 777 -110 -679 264 700 -244 -512 505 345 -437 -91 554 -19 -495 287 487 -365 -407 439 321
1470 321 -491 -135 445 -81 -596 165 430 -495 -496 408 227 -730 -294 497 -34 -702 -23 446 -385 -537 305
1491 305 300 -663 -313 467 52 -608 -47 448 -155 -493 277 324 -362 -218 427 149 -443 -31 497 -26 -302
1512 -302 224 413 -209 -167 427 216 -314 87 500 24 -239 246 334 -151 -109 322 203 -236 63 411 -24
1533 -24 -274 179 279 -130 -132 327 163 -240 3 337 -68 -268 219 321 -213 -126 293 153 -334 -39 281
1554 281 -47 -272 140 226 -249 -261 213 117 -353 -175 210 -78 -371 -24 175 -235 -307 118 -4 -371 -146
1575 -146 208 -23 -380 -48 208 -86 -260 78 128 -216 -166 215 66 -188 -9 248 23 -108 111 187 -58
1596 -58 -13 256 89 -92 112 150 -4 -55 206 150 -87 7 196 157 -102 80 218 11 -25 130 88 -58 -37
$$ packed form
1450d2Q19q87n69R43M36r44k68J017j60p82L46O45n73m76P82K00q52m2Q46j18
1470C21q12L56N80n26n15P61K65r25jR04j81r57M36P91n31o68O79M69q31j52Q42
1491C05nr63L50P80m15o60N61M95o03l38P70M7o86J44O45k78n92M12N28n23k76
1512c02N26J89o22M2N94k11n30M01M13m76k63M85Q8m85M2M31j19m39K99L48m35
1533b4k50M53J00m09kM59j64m03K43L34m05k00M87J02n34Q7M19j40m87K95L20
1554B81l28k25M12Q6m75j2M74r6m70J78L85k88k93L47J99m10p2M25j22l67K25
1575a46L54k31l57L32K56k94j74L38N0l44N0L81j49k54J79K57k25j31K19P6k45
1596e8M5K69j67j81K04L8j54n1K61n6k37R4J89l9k59J82J38k07l6J55m2j46K1
$$ plain form
1619 -37 206 0 -216 42 188 -45 -179 45 123 -94 -79 77 31 -161 -34 107 -103 -193 -16 59 -187 -103
1641 -103 12 12 -215 -34 71 -131 -154 42 57 -26 -31 69 116 -123 -90 108 42 -63 -4 123 18 -80 51 37
1665 37 -40 73 103 57 -19 49 64 41 78 74 23 18 100 97 1 -77 107 61 -72 -111 120 55 -62 0 61 37 -41 68 62
1694 62 -46 -73 100 35 -65 -47 107 72 -57 -26 0 82 -17 40 -27 -26 -38 44 -11 14 12 -15 19 -6 17 22 -2 92 -13
1723 -13 36 -42 74 87 -129 -55 41 71 -112 -60 50 44 -66 57 52 -23 -21 22 50 -100 -48 49 42 -89 -68 38 5 -27
1751 -27 -20 -5 22 27 33 38 -5 76 93 -40 -82 96 56 -37 10 73 95 95 122 68 7 -8 140 19 15 14 93 78 -69 3 -16
1782 -16 8 13 -5 -70 11 77 -42 -63 -55 2 31 -25 -20 -20 -42 -32 -6 -103 -64 -27 24 -18 -116 -92 43 42 -58 -58 6 -10 -26 4
1814 4 -59 26 -68 71 15 -61 -4 34 -30 -120 -72 81 0 -11 11 -75 -24 32 57 -34 27 128 81 5 -32 92 104 21 27
$$ packed form
1619c7K43k06k16K58J46k33j34K24P8k17J5J56m6j92J27J41k10r0J77P5k46Q4
1641a03J15%k27J81J05k02k3J96J5q3nJ00M7k39L3J98o6j05N9J27j05r8J31j4
1665C7p7J13L0m6p6O8J5k3L7mn1nQ2lr6p8J84m6j33l9K31o5j17O2O1k4p8J09o
1694F2j08k7J73o5j00J8J54l5j29L1K6Q2r9N7o7Jj2Q2n5K5kk7L4k5K3Nk4R4j05
1723a3M9p8J16J3k16P4R6L0j83N2J10oj10J23np5KM3K8j50N2R7pj31K1J06l3l2
1751b7PJ5K7NONm3Q1J7j33m2J78m0r3M7O3K2%K7n4o1j5J48j21mjP9j5j47P2j9
1782a6K4Nj8o5Q1O6j19k1QN7K9n6N%k2J0K6r7L9L7N1m2r8K4J35jj00%O4j6j6L0
1814Do3Q5r4J39n6p6N7L8o4r0M8J53q1j1K2q6N1N6K5r1O1J01m7p6l7J24J2q3O
$$ plain form
1843 27 84 58 -37 47 91 -12 16 73 69 -2 82 85 53 51 -32 78 47 13 18 4 -38 63 24 -29 -64 -41 115 -53 -53 -70
1873 -70 -87 -93 -97 -61 -123 -122 -31 51 -120 -160 33 15 -124 -117 26 53 -44 -102 11 5 -9 -38 77 -123 -57 128 2 -94
1901 -94 -53 54 23 -21 38 48 -97 24 180 15 -132 -13 106 48 -108 12 90 10 -82 -8 -1 -56 -27 153 19
1926 19 -122 3 153 -26 -130 56 109 29 -23 83 23 -21 59 168 -14 -16 188 198 22 2 156 38 36 105 89
1951 89 15 -32 109 135 -104 -111 82 38 -89 -13 17 -80 -90 100 58 -158 -200 58 7 -150 -97 -30 -101 -134 -33 -41 -74
1978 -74 -143 123 11 -223 -52 79 49 -124 31 133 -50 -18 218 44 -86 36 263 73 -87 84 247
1999 247 29 -36 115 125 -36 -9 182 49 -156 62 226 -21 -142 26 152 16 -98 35 -58 -126 41 75
2021 75 -102 -231 96 151 -195 -112 74 30 -141 -33 119 -59 -139 91 125 -169 -120 186 196 -174 -134 183 -12
$$ packed form
1843B7N7k6r5Q4M4j03K8N7mp1Q4Ll2kq3J10l1l4Nj4m2J01l9n3l5K3J56j68%j7
1873g0j7omL6o2JR1Q2j71m0J93j8j39PJ43K7r7n8J13oj4k9J15k00O6J85j26r6
1901i4M1J07l1m4N9J0j45J21J56j65j47J19J19n8j56J20P8q0r2P4Pn5K9J80j34
1926A9j41J25J50j79j04J86N3q0n2J06o0m4Q0J09j82kK04J0j76k0J54j18kO9j6
1951H9p4m7J41K6k39pJ93m4j27P6L0r7j0J90m2k16m2K58n1j57N3O7p1l3J01ql3
1978g4o9K66j12k34J71J31l0j73J55J02j83L2K36j74j30J22K27j90j60J71J63
1999B47k18o5J51J0j61K7J91j33k05K18J64k47j21J68J26j36j14J33r3o8J67L4
2021G5j77j29L27N5l46Q3J86m4j71J08J52j78q0K30L4k94M9L06J0l70M0L17j95
$$ plain form
2044 -12 -158 24 25 -126 -141 154 108 -277 -68 132 -43 -229 -9 105 -134 -154 127 76 -272 -44 150 10
2066 10 -200 -69 213 -98 -208 38 144 -144 -91 128 83 -185 -13 227 3 -197 79 181 -58 -153 136
2087 136 135 -98 66 310 10 -192 126 352 -24 -132 244 248 -34 -14 262 104 -125 82 258 -39 -146 173
2109 173 262 -73 -108 184 116 -127 12 111 -70 -127 160 65 -183 -107 118 97 -204 -71 61 -95 -183 2 13
2132 13 -228 -171 70 -50 -262 -155 7 -94 -300 1 7 -267 -153 94 -86 -363 -83 88 -133 -236 37
2153 37 160 -118 -193 208 164 -235 71 293 153 -147 98 377 117 -86 261 276 41 -23 303 203 -63 129
2175 129 298 149 -12 207 219 24 53 240 132 17 76 177 -23 4 134 93 -187 -23 179 -2 -259 40
2197 40 167 -160 -232 69 60 -240 -184 68 24 -320 -176 164 -88 -390 -33 105 -158 -280 -18 78 -180 -141 101
$$ packed form
2044a2j46J82Jj51j5K95m6l85K09K00j75j86K20J14k39k0K81n1l48K28J94j40
2066A0k10J31K82l11j10K46J06k88N3K19m5k68J72K40k24k00K76J02k39r5K89
2087A36jk33J64K44l00k02L18K26l76j08L76Mk82K0K76j58k29K07J76k97j07L19
2109A73Q9l35l5K92o8k43J39R9j81n7K87r5k48P6K25k1l01J33J32j56q8J85J1
2132A3k41N7K41j20k12J07J62j01k06L01Ok74J14K47j80k77K80J71k21j03K73
2153C7J23k78p5M01m4l99L06K22j40l00K45K79k60k03L47J5k35o4L26j00k66J92
2175A29J69j49j61K19J2j95K9J87j08j15N9J01k00K7J30m1k80J64K02j81k57K99
2197D0J27l27p2L01rl00N6K52m4l44J44L40k52l02L57J38k63j22K62R6k58L9K42
$$ plain form
2220 101 -46 -183 -73 135 -106 -159 -35 4 -156 -78 107 -92 -159 23 82 -164 -140 155 82 -156 -111 178 19
2243 19 -227 -23 170 -22 -152 158 204 -126 -129 244 189 -63 -32 221 119 14 14 171 85 84 188 66 -60 33
2267 33 208 55 -47 93 86 33 99 156 -17 -112 77 213 -85 -161 171 177 -159 -192 92 117 -176 -93 86 -136
2291 -136 -233 -74 8 -203 -289 -43 83 -209 -322 -102 -20 -135 -180 -106 -128 -107 -25 -135 -261 -104 23 1 -124
2314 -124 -81 29 -49 42 52 -2 -74 52 244 19 -101 137 291 136 21 152 207 70 135 244 169 43 183
2337 183 288 115 35 156 283 132 51 172 170 79 92 130 79 -11 103 94 -82 -118 73 32 -129 -89 -7 -43 -119 -4
2363 -4 -45 -128 -158 -16 -21 -199 -210 -16 -107 -213 -139 -97 -108 -72 -74 15 -136 -3 -1 -63 -124 3 51 -65 -56 -16 -26 -70 -56
2392 -56 16 -3 -68 80 63 -9 -1 50 -2 -15 14 68 3 -131 11 95 26 -3 30 132 41 30 154 89 46 156 180 76
$$ packed form
2220A01j47j37J10K08k41n3J24L9j60P8J85j99o7J82N9k46K4K95p3k38M5K89j59
2243A9k46K04J93j92j30L10M6l30lL73n5k52L1K53j02j05%J57q6jJ04j22j26R3
2267C3J75j53j02J40pn3O6N7j73r5J89J36k98p6L32Ol36l3K84K5k93Q3J79k22
2291a36r7J59Q2k11q6K46J26k92j13K20Q2j15m5P4k2K1Q2j10j26J57J27k2j25
2314a24M3J10p8R1J0n4p2J26J92k25j20K38J54j55j15J31N5j37O5J09p5j26J40
2337A83J05j73q0J21J27j51q1J21kr1J3L8n1r0J14rj76l6J91m1j61M0Q2l6p6J15
2363dm1q3l0J42nj78j1J94r1j06P4M2j1L6kQ9j51J33Ko2o1J27M8j16RM0j0m4J4
2392e6P2j9o5J48j7p2QN1n2j3K9N4o5j34J42Q4o9k9L3J02r1j1J24o5m3J10K4j04
$$ plain form
2420 76 82 109 170 63 40 105 144 98 152 179 112 66 157 152 22 43 92 131 32 -12 63 114 -31 7 44 -6 -51 -41 -59 -61
2450 -61 -62 -81 -93 -126 -108 -122 -168 -149 -148 -143 -155 -223 -77 -201 -252 -145 -133 -229 -212 -84 -140 -194 -168 -85 -110 -195 -100 -125 -117 -109 15
2481 15 -13 -123 11 47 20 -74 -7 44 0 16 136 110 72 60 156 159 78 157 225 29 24 203 143 32 73 135 156 34
2509 34 176 213 77 120 173 167 16 45 84 122 32 54 108 -3 -24 6 60 -72 -70 19 -37 -123 -77 56 -77 -138 -88 -88
2537 -88 -141 -38 -72 -113 -174 -120 -9 -100 -218 -85 -81 -135 -75 -34 -44 -96 -70 42 -36 -132 44 50 -39 -34 98 -11 -16 85
2565 85 134 73 -72 71 156 44 3 142 106 44 104 217 123 28 130 217 113 28 149 149 41 67 55 63 -41 119
2591 119 64 -42 -2 164 42 -15 32 84 23 -56 83 18 5 -61 116 53 -118 -49 102 25 -37 -60 43 0 -49 -42
2617 -42 7 -90 -32 84 6 -133 -92 56 -51 -102 -115 -10 -109 -42 40 -120 -173 -36 32 -167 -155 -20 29 -104 -163
$$ packed form
2420G6OK7O1j07k3O5L9m6N4K7o7m6R1nj30K1M9L9r9m4P5N1j45L8L7n0m5J0j8k
2450f1jj9j2l3J8j4m6J9JNj2o8J46j24n1J07J2r6J7J28n6n4K6Q3k5q5R5k5QQJ24
2481A5k8j10J34L6k7r4O7N1m4J6J20k6l8j2R6Lq1P9O8j96nJ79o0j11M1O2K1j22
2509C4J42L7j36M3N3oj51K9L9L8r0K2N4j11k1L0N4j32KQ9n6q6M6J33j33o1N0%
2537h8n3J03l4m1o1N4J11r1j18J33Mn4O0M1j0n2K6J12p8r6J76Oq9NJ32j09nJ01
2565H5M9o1j45J43Q5j12m1J39l6o2O0J13r4r5J02Q7j04q5J21%j08K6j2Qj04J60
2591A19n5j06M0J66j22n7M7N2o1p9J39o5j3o6J77o3j71O9J51p7o2k3J03m3m9P
2617d2M9r7N8J16p8j39M1J48j07n1j3J05r9O7Q2j60n3J37O8j99J2J35M9j33n9
$$ plain form
2642 -163 -8 17 -124 -26 99 -99 -128 29 135 -92 -136 65 60 -89 3 135 47 -40 23 90 -8 -9 162 97 -35
2667 -35 -41 127 142 -19 38 124 -18 11 170 68 -91 -82 186 -35 -124 43 48 -37 -40 17 9 -129 -76 61 -5 -91 -50
2694 -50 65 -103 -174 -1 17 -72 -5 46 -23 -142 -39 121 -44 -169 -7 110 -136 -102 5 70 -58 -71 27 -66
2718 -66 -76 -9 134 -15 -159 40 9 -93 -72 3 -16 -131 0 84 -66 -48 96 51 -34 -43 63 -17 -1 85 57 -11
2744 -11 12 138 151 -19 17 194 55 -18 31 222 62 -19 135 162 -2 -76 216 106 -35 -1 175 85 7 118
2768 118 161 -27 -41 86 106 -103 -13 55 -19 -83 37 86 -46 -32 29 -37 -121 -1 34 7 -71 14 25 -95 -63 17
2794 17 34 -107 -43 44 -13 -95 19 62 -85 -95 111 83 -179 -56 53 53 -128 21 113 34 -86 86 70 -69 -99
2819 -99 47 54 10 15 162 -15 -62 73 137 -106 -39 140 51 -54 4 164 61 -81 79 134 -6 -20 81 117 -7
$$ packed form
2642a63J55K5j41R8J25j98k9J57J06k27m4K01nj49R2J32q8q7O3O7r8jJ71o5j32
2667c5oJ68J5j61N7Q6j42K9J59j02j59RK68k21q9J67Nq5lN7qj38N3J37o6q6M1
2694e0J15j68p1J73J8q9O7N1o9j19J03J60j65j25J62J17k46L4J07O5j28j3R8r3
2718f6j0O7J43j49j44J99l1j02K1P5j9j15J31Q4j50J8J44m5q5rJ06q0J6Q6k8o8
2744a1K3J26J3j70L6J77j39p3M9J91j60q1J54K7j64p4K92j10j41L4J76r0p8J11
2768A18M3j88j4J27K0k09R0O8p4o4J20M9j32J4O1o6q4J20L5k7p8Q5J1j20L2Q0
2794A7J7j41O4Q7n7q2J14M3j47j0K06k8k62J23J09%j81J49R2p9j20J72j6j39l0
2819i9J46Pm4NJ47j77m7J35O4k43O7J79q9j05N8J60j03j42J60N5j40j4J01L6j24
$$ plain form
2844 -7 4 63 14 -10 -5 63 50 -82 152 61 -72 -46 123 -42 -108 -25 89 -74 -109 4 23 -137 -96 24 -30 -157
2870 -157 -33 27 -69 -167 -88 29 -100 -107 -38 36 -148 -80 50 -51 -136 -69 9 -35 -96 32 25 -87 -56 18 -21 -74 -18
2897 -18 26 -39 12 32 20 -34 -6 21 54 -7 18 58 -43 -58 117 111 -2 -3 125 -8 -58 46 65 -47 -88 91 9
2924 9 -39 -24 71 67 -81 -35 40 6 -40 52 59 -25 -30 57 24 -26 -8 66 36 -48 34 64 -22 -38 63 49 -68 -12 77 13 11
2955 11 -8 35 -39 -79 8 86 -59 19 46 37 -109 -70 53 -32 -5 35 41 23 -13 56 26 10 -26 46 -26 21 19 -12 -54 -56 28
2986 28 13 -10 22 -8 -33 47 48 29 -25 59 41 75 -69 52 47 69 -81 45 89 -31 -5 80 62 -47 -34 96 110 -44
3014 -44 61 77 10 -19 40 82 -7 -18 -30 -18 -60 2 41 7 -75 6 0 24 -99 9 -61 -36 -80 3 -13 29 -24 -53 -80
3043 -80 -44 -61 -32 -39 28 -7 -29 -39 2 -15 -39 -15 6 55 -84 3 57 -13 -83 7 57 -28 2 44 26 47 -68 61 -10
$$ packed form
2844gJ1N9m9k4NO8j3j32K34r1j33K6J69j65o6Q3J14j63l5J13J9j60M1J20n4j27
2870a57J24O0r6r8P9J17j29pO9P4j84O8J30j01q5O7P8m4o1J28pj12L1P4l9n3N6
2897a8M4o5N1K0j2n4K8K7L3o1K5M0j01j5J75oj13jJ28j33n0J04J9j12m1J79q2
2924Im8J5R5mj48M6P5l4m6R2Pq4nQ7l3n0J8P4l0q4Q2L0q6j6J01j4j17N6Q9o4k
2955A1j9M3p4m0Q7P8j45P8K7rj46L9J23q5K7M0Oj8l6O9l0j6l6P2p2M7kl1m2kQ4
2986B8j5k3L2l0k5Q0Jj9n4Q4j8L4j44J21nK2j50J26M4j20K6Q5j8j09J3J30J4j54
3014d4J05J6o7k9N9M2q9j1j2J2m2O2L9l4q2Q1oK4j23J08p0K5m4Q3j6M2n3k9k7
3043h0L6j7K9pO7l5k2j0M1j7k4K4K1M9j39Q7N4p0p0R0N0q5L0M2j8K1j15J29p1
$$ plain form
3072 -10 -13 -20 29 -82 20 44 46 49 -31 -5 13 -34 6 -14 1 45 -21 -30 -41 -22 4 -80 -27 -8 30 -22 -49 25 -32 -31 1 -43
3104 -43 35 -36 -114 33 7 -18 -22 60 19 -72 -43 17 -57 -24 25 -13 -32 -47 -26 -4 -23 -20 -7 -52 -32 8 12 -5 -11 6 -45 -36
3136 -36 -7 33 15 -15 -2 13 -46 20 18 -35 24 32 -45 -49 44 92 84 -9 -31 89 88 -21 20 15 37 -7 49 26 -7 88 16 -18
3168 -18 41 -22 -11 64 51 59 60 40 75 38 23 28 47 53 67 8 66 28 54 28 51 -37 -16 27 59 43 -37 -22 35 51 -5 13
3200 13 106 24 -20 15 46 -24 -105 -16 -42 -31 -97 -34 -23 19 14 -49 -45 33 -104 -44 -37 -22 -47 18 -9 -5 -28 -10 5 -16 26 10
3232 10 -26 63 32 10 18 22 28 37 9 38 52 40 60 36 -17 17 92 14 -44 6 44 -16 -26 -7 63 1 -31 16 58 6 28 -23
3264 -23 -18 -10 -10 1 -24 -55 13 -11 61 39 -20 6 -49 3 19 -66 22 28 -8 40 -51 13 -9 15 -19 55 29 -18 -46 -47 -34 -30 42
3297 42 25 57 5 17 -57 -4 -105 13 -36 -76 -28 -5 -52 12 -39 -13 -14 -64 -66 -57 -5 -54 -35 -20 48 22 -32 -18 -10 -10 20 9
$$ packed form
3072a0lpM9j11J02K4KLq0K6J8m7M0k0J5M4o6rj1J9K6q4N3J9L8n2k7P4n7JL2m4
3104d3P8p1p8J47k6k5mQ2m1r1K9O0p4L3M9l8j9j5K1K2j9LJ3m5K0M0Mj7oJ7n1R
3136c6K9M0j8l0J3J5n9O6kn3N9Qp7mR3M8qr3k2J20jj09M1nK2m4N6k3l3R5p2l4
3168a8N9o3J1P5j3QJk0L5l7j5NJ9OJ4n9N8l8K6k6K3q8K1M3L2j6q0J5N7J6n6J8
3200A3R3q2m4L5L1p0q1Q9k6J1o6O3J1M2no3MP8j37O0PJ5k5O5k7Mk3J8J5k1M2j6
3232A0l6Q9l1k2QMORk8K9J4j2K0k4n3L4P5p8n8N0L8o0j0J9P0o2l2M7M2n2K2n1
3264b3NQ%J1k5l1O8k4P2k2n9K6n5N2J6q5Q8Ol6M8r1O4k2K4l4P4k6m7k8jJ3MP2
3297D2j7L2n2J2p4N3j01J18m9m0M8K3m7O4n1K6jn0kRN2m9J9J5O8k6n4J4Q%L0j1
$$ plain form
3329 9 27 -44 20 96 44 -2 28 17 28 24 7 -11 71 27 8 18 -1 52 35 3 11 -14 -28 48 15 30 63 -5 33 31 -39 -38 42
3362 42 35 27 27 21 -6 -5 -6 -32 44 -26 13 -79 -11 -63 -74 -13 -1 -39 -21 4 -19 1 -23 -52 -45 -25 9 -20 -6 27 10 20 -13 -27
3396 -27 -1 33 18 33 65 -14 -8 30 -20 -16 -61 35 50 -13 41 21 46 -9 73 1 -9 18 91 26 67 45 -19 66 78 52 46 28
3428 28 -22 -36 -54 -8 -16 -7 4 -31 -41 56 -69 14 -38 -60 -19 16 -20 -64 68 56 21 -44 -67 -16 -59 -49 -52 -36 -43 -31 7
3459 7 -1 -9 -58 -24 -14 5 47 -28 64 8 -63 -44 -15 19 -22 26 -33 6 -13 10 -4 -3 -48 8 5 1 43 23 45 -21 -5 31 15
3492 15 1 7 20 10 30 -67 30 50 -22 44 84 9 6 6 -18 -110 28 46 -62 -35 16 -11 -3 26 7 -6 50 -25 7 -16 4
3523 4 32 -68 4 12 15 -29 -6 3 -67 -50 -22 -80 -81 -48 -21 8 -62 -19 16 -75 15 -63 -56 -4 -80 25 -60 27 -78 -2 2 -36
3555 -36 -44 -15 51 6 24 59 41 5 26 55 40 51 8 20 12 -1 19 51 16 41 52 12 33 -32 30 -46 39 75 39 17 -41
$$ packed form
3329IJ8p1O4P6n2m6L0j1J1mj7j8Q2m4j9J0j9N3j7l2Qk5j4P6l3J5L3o8L8kp0JQ0
3362D2pq%ok7Jjk6P6p0L9r2O8n2j1O1J2l8J8K5k3K0k4k9PK0L4k9J4L3j7J0l3j4
3396b7K6L4j5J5L2p9OL8n0Mm5R6J5o3N4k0K5n5Q2p2j0K7P3o5M1k2o4Q5J2k6oj8
3428B8n0j4j8M6qRJ1l5j0R7j25Q3n2k2M1L5l6m4J32j2l5o5k3N1m3J0lJ6pJ2L8
3459Gqqm9L4J0J9M2p5R2n6p1J9K9L4m1M8n9L9j9K3j4Jm5N6lmM2k0K2o6J6L6j6
3492A5j4OJ3j0K0r7R7K0p2O6M0p5l%k4r2J38J8j08K7N1k7QK9j9j3N6p5L2k3K0
3523DK8j00P2QLm4K3Rp0J7K8n8jL3K7K9p0M3L5r1R0p8PN2p6J05q5Q7j05P6Ml8
3555c6qK9O6m5J8L5j8l6K1K9j5J1m3J2qj3K0L2l5K5J1m0K1o5O2p6Q5L6l6k2n8
$$ plain form
3586 -41 22 11 67 61 14 27 -14 32 -15 5 -6 -5 -76 21 -52 -19 -7 -46 2 -58 -12 -2 -27 -38 -12 -46 -59 -87 -46 -68 -27
3617 -27 -21 -48 -3 -29 -13 10 -52 -57 -59 19 21 -56 11 66 -26 -33 27 63 21 -8 40 42 46 11 52 19 -9 -7 16 84 53 35 -4 75
3651 75 20 -69 65 76 61 20 36 55 18 40 30 -2 60 -14 9 13 37 16 -3 -17 15 13 45 -4 -21 -57 10 -12 51 -23 -32
3682 -32 10 -5 -26 -37 -55 -51 -37 -42 26 -120 -100 -48 -52 -18 -37 -20 -34 -26 -47 -2 -14 -42 -22 -40 17 27 1 -75 7 -24 7 30
3714 30 14 54 5 -19 34 -1 -13 29 79 27 -9 101 59 36 14 33 39 23 -12 30 34 40 39 50 57 26 32 68 -22 57 74 21 73
3747 73 45 126 25 27 -2 16 26 68 33 35 -18 26 55 -4 -13 25 89 -76 -11 -45 -19 6 37 -3 11 -10 -29 -22 -80 -37 -26
3778 -26 -23 -13 63 -45 19 -44 9 -17 -49 -13 37 -26 -48 26 8 -15 -70 -33 -38 17 -35 -18 -14 49 26 4 9 37 0 104 60
3809 60 22 70 34 8 62 65 65 22 16 -5 42 65 70 58 0 121 10 -2 21 54 26 -29 -7 36 39 -13 -80 3 -92 -27 -50 20
$$ packed form
3586d1O3j1N6om7J3m1M6m7K0j1Jp1R7p3L3J2l9M8o0M6J0k5j1K6l4j3k8M1k2M1
3617b7Ok7M5k6J6K3o2nkP8Kp7O7N5r2pO0L6m2k9M8KMl5M1l3k8KK3O8l1j8l9P9
3651G5n5q9J34J1j5m1J6J9l7K2j0l2O2p4K3MK4k1j9j4L2kL2m9j7l6O7k2O3p4r
3682c2M2j5k1j1j8MJ4nO8j46K0N2mL4j9J7j4Qk1M5j2k8K0j8N7J0k6p6Q2l1L1K3
3714C0j6M0m9k4N3l5j2M2N0n2l6J10m2k3k2J9Oj6l5M2MOjJ1Pl1OL6r0P9J7n3N2
3747G3k8Q1j01Kk9J8J0M2l5Kn3M4K9n9rL8O4j65O5l4K6K5L1m0J4k1j9Pn8M3J1
3778b6LJ0P6j08O4o3N3k6l2L6N0o3k2P4j8k3n5L7nN5n2J7MO3k3k2NK8l7J04m4
3809F0l8M8l6k6N4L%m3ok1M7K3Nj2n8J21j11j2K3L3k8n5K2M3Ln2o7Q3r5O5k3P0
$$ plain form
3841 20 6 1 -12 -29 -19 -13 -37 -1 39 -42 19 -13 -2 -70 -15 -48 -49 -22 -49 -49 -17 -39 -28 -14 28 -23 4 -5 55 -25 38 -16 -16
3874 -16 -31 1 19 -37 6 -35 -25 43 10 10 -39 -32 38 5 5 1 28 -5 -11 21 6 -23 75 49 73 -14 -26 63 -5 1 33 -4 66
3907 66 48 60 47 -2 15 2 1 -27 -4 -22 -12 -4 2 -2 -24 3 -33 -29 -50 16 -29 -28 -51 7 -9 -41 42 12 17 -46 -72 -47 -20 20
3941 20 -40 -47 -27 -92 -29 -33 -75 -33 -57 -10 -34 1 -4 12 11 -21 -3 -41 -37 -17 -6 25 -7 -31 2 20 -32 -14 -10 36 -13 14 59
3974 59 -20 42 19 25 28 16 54 -42 11 39 27 41 33 58 8 -5 48 38 68 4 -44 20 19 -43 62 36 3 85 32 6 2 -25
4006 -25 -58 2 -34 -25 -31 -36 48 -28 -68 -60 -26 -78 1 -92 -58 26 -58 -16 10 -90 -36 9 -74 -50 -21 -57 -33 -52 -20 -23 -67 -1
4038 -1 57 14 30 -23 -8 -53 29 45 44 18 50 67 7 62 67 57 -3 19 30 53 -1 69 60 115 49 26 53 32 83 -25 0 -45
4070 -45 81 33 -37 56 22 39 50 -4 30 25 14 -12 -20 -1 -54 -53 9 -48 -63 -6 26 -34 -54 -34 -46 -22 -29 -55 -22 13 -19 -24
$$ packed form
3841B0j4nj3j7J0Ok4L6M0q1O1l2J1o8N5l3jK7k7%L2k2J1J4M2n1K7rO0q0O3n4%
3874a6j5L2J8n6M3m1J0O8l3%m9PP0l3%mK7l3oL2j5k9R8k6K4q7j2Q9o8OL2l7P0
3907F6j8J2j3m9J7j3jk8K3j8J0QOmk2K7l6Mk1O6m5Jk3N8j6l2Q3l0No3k6K5K7M0
3941B0o0pK0o5O3mm2M2k4M7k4L5nJ6jl2J8l8MK0J1L1l2k4L3J8n2J8MM6m9K7M5
3974E9p9O2k3OLj2L8r6N3K8j2J4qK5n0j3N3j0L0o4m8O4jo2J05k6l3Q2n3k6mk7
4006b5l3O0l6RonQ4p6m0QL4n2P9r3L4Q4q4M2K6j00N4M5q3K4K9l6K4j9L2lm4O6
4038aN8m3J6n3J5m5Q2J6jk6L2J7o0N5Nj0o0K2J1K3n4P0rN5o6k3K7k1N1j08K5m5
4070d5J26m8p0R3l4J7J1n4L4nj1k6qJ9n3JO2n7j5N7L2o0k0K0j2K4pk6L3L5l2n
$$ plain form
4102 -24 2 -33 14 -49 -54 19 3 -35 -25 -72 -20 -103 -40 -44 -60 12 -75 49 -24 -13 -28 17 -37 17 33 -25 -26 -15 76 34 -10
4133 -10 40 46 40 46 15 31 58 42 100 30 16 60 36 57 10 58 71 87 -10 -2 66 3 -4 -13 28 16 42 26 14 15 -10 5 -15 47
4167 47 -17 26 -45 17 -65 -25 -68 -26 -82 -43 -50 -69 -70 -46 -47 -55 -40 -5 -38 -95 45 -34 -46 -11 11 -68 7 -35 -55 -10 19 -57
4199 -57 -31 -54 -9 -56 16 14 50 -22 -7 55 37 7 49 32 57 29 63 20 41 65 13 53 5 71 38 31 49 40 105 57 70 58
4231 58 29 48 57 60 38 32 63 8 5 21 60 -25 -78 -18 23 0 -17 -27 -22 41 -33 -61 -27 3 -2 -62 -70 -124 15 -1 -91 -67 12
4264 12 -105 -71 -54 -84 -123 -72 -28 -22 -64 -116 -10 3 0 14 -51 -73 -46 -37 1 -50 19 -10 86 10 51 -38 8 6 15 29 28 7
4296 7 61 -40 32 1 52 79 66 34 89 34 -12 38 59 36 -2 99 69 131 -36 62 19 72 65 28 -32 73 -1 2 21 20
4326 20 12 -38 -8 -5 -64 1 -85 27 -76 -80 -18 52 13 -27 -2 -59 -68 -3 12 -77 -87 -48 -9 -15 -62 -51 -50 -97 2 8 -80 -27 -7
$$ packed form
4102b4K6l5M7o3nP3j6l8J0m7N2q3O3mj6P2q7J24p3J1j5M5n4N4J6n8jJ1R1m2m4
4133a0N0OoOl1J6K7j6N8p0j4M4k4K1m7M8J3J6r7QO8o3prM1j2K6j6j2Jk5J5k0O2
4167D7o4M3p1O2q2M0m3M2n6L9pj9jK4jqJ5L5l3n7J40p9j2L5K2p9P5m2k0M5K9p6
4199e7K6k3M5m7P2kL6p2J5O2j8l0M2j7K5k8L4m3K1K4n2M0m8O6l3pJ8rO5m8J3j2
4231E8k9J9RLk2oL1n5lJ6L9q5n3O0M1k3j7j0NO3p4k8L4L0no0qn4J39j6r0K4P9
4264A2j17L4J7l0l9N1M4Om2n2J06J3lJ4o5k2K7RL8n1O9k9R6p6M1q9M6kRJ4jk1
4296GN4j01P2l1N1K7j3l2N5n5m6N0K1k3l8J01l0O2j67R8m3N3pl7o0J05p4LJ9j
4326B0qn0L0Ln9O5q6J12j03mO2P0l9m0K5n7rO5J5q9j0L9L9om7J1Jm7R9Oq8N3K0
$$ plain form
4359 -7 3 -46 40 -13 -13 -50 11 -17 22 -36 -24 -23 5 60 32 82 11 -1 79 5 32 45 25 38 -4 105 43 34 -1 11 99 40
4391 40 20 13 32 46 84 60 -11 25 20 23 -16 66 -18 29 -64 15 -7 -75 -2 -16 -36 -8 -27 -11 -43 -43 -8 -79 -3 -47 -30 -50
4423 -50 -56 -53 -57 0 -59 -17 10 -27 -4 -27 8 -83 -44 -50 -69 -21 -57 -1 -72 -48 -90 -28 -95 3 -40 -8 47 17 58 3 9 -2 -43
4456 -43 6 -23 5 58 10 72 11 55 7 14 40 20 64 49 9 -8 64 67 -22 20 51 68 -16 83 65 -3 22 33 -4 -51 -4
4487 -4 -20 62 47 -3 33 60 -11 4 13 -48 -19 1 -52 -45 57 18 -39 -5 -10 -13 -51 -53 11 -33 -61 -45 -36 -88 -76 -20 50 8 -92
4520 -92 -43 12 6 -18 46 11 -15 -10 44 19 5 -11 8 61 22 -25 -22 41 35 3 -4 -38 27 28 32 36 54 61 69 16 64 -72 -3 77 71
4555 71 -13 22 32 62 -14 21 55 41 31 52 28 -6 20 -32 -17 32 21 -42 53 37 28 0 16 16 -38 -10 -36 -25 23 -33 -30 6
4587 6 -39 -26 33 -13 -63 -48 -51 27 3 -70 -58 -105 -68 -23 -70 -44 1 -87 -41 11 -3 -31 -8 -2 -22 -8 49 -40 -38 -10 2 85
$$ packed form
4359gJ0m9Q6n3%l7O1k8L9n8J2JK8N5k8N0p1j2Q0p4K7J3k0J3m2J09o2rl5J2Q8n9
4391D0k0pJ9J4L8k4p1L6nLl9Q2q4M7r3P9k2o8P3j4k0K8j9J6l2%L5p1P6m4J7k0
4423e0oLmN7n9M2K7l7K3k3L5r1L9oj9M8l6N6p1K4m2O2o7R8m3L2N5l0M1n5Oj1m1
4456d3M9k9K8N3m8O2o1M4m8PK6k0M4j5m0j7P2Lq9M2L1J7q4R9j8o8K5J1l7m7M7
4487dj6Q2j5n0L6K7p1J5Ro1K9K0n3PJ02l9n7L4nll8kO4m4k8J6Rn2J2N6P0m2j00
4520i2M9N5ok4O4l5k6NN4k5j4j6J9N3l9m7LO3ol2pl4O5JMMJ8PQn3M8j36O9Q0o
4555G1q4L5J0L0p6L5L4j4j0K1k4l4K6n2J5M9j1o3R5j6rk8J6%n4K8k6J1M8n6LL6
4587Fm5J3N9m6n0J5lP8k4p3J2m7L7M5m7K6M5q8M6N2j4k8K3Ok0J4N7q9KK8J2Q3
$$ plain form
4619 85 -2 40 4 34 5 54 46 59 -40 -7 46 49 41 3 25 84 7 80 109 -8 52 78 5 14 67 -21 63 27 46 -26 38 18
4651 18 67 9 15 -5 -15 105 -6 -5 -5 -2 -35 -13 -52 -90 -5 -58 -24 -75 -42 -32 -14 -48 -80 -27 -49 -13 -36 23 -22 14 -44
4682 -44 20 -9 -59 -56 11 -20 -60 -39 -55 -31 -39 -39 -25 5 -62 -44 -54 -32 24 30 20 -24 9 81 65 39 -56 18 81 8 59 10
4714 10 63 27 52 78 85 30 47 37 8 59 19 52 31 102 58 26 -10 35 82 27 -33 52 42 13 23 9 -7 -33 11 -44 24
4745 24 -97 4 -10 -12 21 -16 3 18 -22 -39 0 25 -10 -77 -48 -86 -25 -30 -11 -16 -50 -45 -30 -64 -15 0 2 -43 -35 -20 7 23
4777 23 -64 -12 -89 -20 -26 -21 -35 -36 21 48 -9 -4 50 -9 -43 42 22 44 3 71 52 85 36 39 84 36 12 68 17 39 96 -1 53
4810 53 54 56 2 69 30 55 61 69 51 5 -21 25 0 -27 -8 8 38 -26 -57 -46 -14 -68 -31 4 -75 -38 29 -39 -71 -51 -59 -35 -52
4843 -52 -50 10 -25 -13 -43 -39 -40 -25 -39 -66 -58 -75 -8 5 -26 -56 7 -15 -9 -42 19 -17 -9 49 -2 24 -4 -3 -12 -3 -5 -7 25 10 13 -13
$$ packed form
4619H5q7M2l6L0k9M9qJ3r9L3N3Lql8K2N9p7P3K9j17O0K6p3RN3q8Q4l6J9p2O4k0
4651A8M9n8Ok0j0J20j11J%Ll3K2l9l8Q5n3L4n1L3J0J8l4l2N3k2L6k3N9m5L6n8
4682d4O4k9n0LO7l1m0K1j6K4q%J4L0o7J8j0K2N6Oj0m4L3P2j6k6r5P4O3p3N1m9
4714A0N3l6K5K6Pn5J7j0k9N1m0L3k1P1m4l2l6M5M7n5o0Q5j0k9J0j4j6k6M4n5O8
4745B4j21J01j4kL3l7J9J5m0j7L9K5l5o7K9l8O1nJ9nl4NJ5l4M9J5Km5QJ5K7J6
4777B3q7N2p7O9oNj4jN7K7n7NN4n9l4Q5k0K2m1O8j9L3m9LM5m8k4N6n1K2N7r7N4
4810E3JKn4O7l9K5OQj8m6k6M6k5k7J9J6L0o4l1J1L2n4L7L5p9L7O7o8l2K0qK4j7
4843e2KO0l5J2l0MjJ5j4k7Qj7O7J3l1l0O3k2Ol3O1l6QN8n1K6k8JrRkkL2j5Lk6
$$ plain form
4879 -13 28 48 -17 50 57 28 89 6 -5 5 8 8 88 1 46 33 61 8 0 3 25 -6 26 12 10 57 32 25 -23 -8 -24 5 39 -25
4913 -25 -94 13 -22 11 22 -72 -10 -20 49 -33 -67 -33 -22 -11 -61 -9 -90 -5 8 -58 6 -95 -35 -37 -28 -28 -27 37 -31 8 6 32
4945 32 -20 14 73 -9 -49 19 41 45 -32 -25 82 36 -24 -5 42 17 7 44 39 36 24 9 123 1 24 46 -1 55 -6 11 27
4976 27 30 59 13 61 -24 67 37 16 34 6 4 -8 40 1 -70 41 48 -58 -59 -38 20 -49 -9 21 9 -53 18 -2 -2 -33 -2 -53
5008 -53 -27 -19 -16 -21 -6 -31 -11 -29 -29 -18 -54 -45 -67 -32 -4 -33 9 -34 -70 -67 -60 56 76 34 11 -71 20 12 -22 -39 32 -8 -34 -56
5042 -56 52 -21 -37 6 34 20 13 15 111 59 20 -37 59 -15 19 40 20 42 12 62 63 -3 14 62 34 8 30 74 56 1 -7 56
5074 56 26 -4 -2 44 -9 38 3 17 -13 -17 6 17 5 8 -1 -68 -101 -7 -13 -13 -16 2 -17 -62 -56 -57 -44 -55 -63 -12 -54 -80 -45 -23 -52
5109 -52 24 37 -53 -35 -46 3 -63 24 -67 12 -60 -77 -31 -23 44 -6 31 -15 41 -10 50 12 74 92 -18 15 149 36 34 -5
$$ packed form
4879a3M1K0o5O7Pk9O1q3j1J0L%Q0q7M5j3K8n3qLK2l1L2j4kM7k5pm8J5j6K9L4o4
4913b5o9J07l5L3J1r4O2j0O9q2l4L4J1J1n0N2q1Q5J3o6O4j01O0kR%JO4o8L9kK6
4945C2n2L4N9q2m0O8K2Mp7PJ07m6o0J9M7k5j0L7nlj2j5J14j22K3K2m7N6o1J7J6
4976B7LK9m6M8q5R1l0k1J8k8kj2M8l9p1J11Pj06jK1N8o9M0L0j2o2P1k0%l1L1n1
5008e3K6QLnJ5k5K0j8%J1l6Rk2L5K8k9M2m3l6LPJ16K0m2k3q2R1ql4j7P1m0k6k2
5042e6J08p3j6M3K8j4pKR6n2l9n7R6p4L4K1k0K2l0N0Jo6J7M8k8k6K2M4j8n5qO3
5074E6l0l0KM6n3M7l5J4l0mK3J1j2Lro7l3R4o%lJ8j9m5OjJ3j1qN1m2k6L5K2k9
5109e2P6J3r0J8j1M9o6Q7r1P9p2j7M6QO7n0L7m6N6n1O0l8O2J8j10L3J34j13kl9
$$ plain form
5139 -5 51 5 44 45 63 74 44 42 56 -5 55 54 80 46 61 46 14 18 47 -13 40 42 16 -19 -24 80 15 -26 -39 10 12 2 -43 -11
5173 -11 -30 -71 39 -24 -80 -37 -52 -20 -25 23 -56 -56 -51 -96 -72 -15 -11 -54 -71 -25 -56 7 -16 22 -12 -29 38 -42 -25 -30 -54 -29
5205 -29 -41 36 -15 45 -7 41 -15 63 -1 -21 -43 -26 112 30 41 31 78 58 27 22 64 33 50 37 48 126 -9 16 39 76
5235 76 78 50 9 30 47 1 20 16 58 13 -8 -52 15 16 -42 -15 -81 -32 -84 20 26 -42 -22 -7 -26 -30 -73 -76 -57 -51 -74 37 -60
5268 -60 -19 -108 -39 -82 -24 -80 -37 -28 -58 -10 -52 3 -13 -7 -28 15 22 16 31 34 -18 6 73 4 56 27 33 20 35 116 41 30 77
5301 77 85 49 -7 28 4 19 23 60 128 43 48 90 59 30 32 31 -19 49 2 26 33 19 -15 78 44 53 -61 20 36 23 -49 -88 -15
5334 -15 -59 -34 -17 -12 -36 -27 -51 -43 -13 -32 -14 10 5 -93 -59 -31 -83 -29 -54 9 -55 -51 -41 -58 -24 -51 -57 -43 -31 -13 -7 -28 10 -86
5368 -86 10 -34 27 26 -10 -6 9 20 -7 63 -12 56 13 55 80 102 41 31 2 28 24 41 67 73 52 34 -4 51 11 81 59 46
$$ packed form
5139eN6m6L9JJ8J1l0kJ4o1O0jK6l4J5j5l2MK9o0N3Kk6l5nJ04o5m1j3M9Kj0m5L2
5173a1j9m1J10o3n6M3j5L2nM8p9%Nm5K4N7Mm3j7M6l1O3k3L8l4j7O7q0J7nk4K5
5205b9j2P7n1O0n2M8n6P8o4k0k2J7J38q2J1j0M7k0l1nM2l1J7j3J1P8j35K5K3L7
5235G6Kk8m1K1J7m6J9mM2m5k1m4O7Jn8K7o6M9n2J04Oo8K0J5j9mm3lJ9Ok3J11r7
5268f0M1q9O9m3N8n6M3Rl0M8m2N5j6Ok1M3PoJ5Ln2K4O7o9N2k9Oj3J5Q1p5j1M7
5301G7Ql6n6L5k4J5ML7O8q5NM2l1k9Kjn0O8m7K4Pj4l4R3l4Rj14Q1J6j3p2l9P3
5334a5m4K5J7Nk4Rk4QL0j9J8K4nr8L4K8n2N4k5O3o4MJ0j7L4k7oJ4J2J8Ok1L8r6
5368h6R6m4O1jl6MJ5J1k7P0p5O8m3M2K5K2o1j0k9K6mJ7K6Ok1j8l8N5m0P0k2j3
$$ plain form
5400 46 41 73 67 9 62 31 39 21 50 58 28 -21 18 -12 -1 0 17 -36 17 -70 -18 -41 -20 -44 -21 -19 -37 -46 -85 -105 -80 -15 -100 -41
5434 -41 -75 -39 -43 -31 -51 -50 -26 -20 -3 -3 -31 -34 -67 -101 -57 11 -60 -4 7 8 -84 -38 -18 38 4 44 30 44 -16 68 52 76 94
5467 94 7 90 51 32 -15 28 88 0 -9 70 60 60 70 23 28 18 95 61 108 30 -17 43 97 38 8 7 47 -35 14 14 -23 -47 15
5500 15 63 -5 -17 -19 10 17 -20 -32 -9 -39 -52 -21 -9 -72 -28 -74 -73 -57 -8 -46 -73 -90 42 -38 -54 -1 -72 25 -55 -2 21
5531 21 -74 -5 71 12 -58 -55 -27 1 6 -9 -49 21 8 -23 35 2 -31 8 57 70 57 18 32 85 93 5 6 60 72 45 52 27 82
5564 82 -3 23 45 48 2 11 94 75 -3 29 95 77 47 78 1 36 58 72 46 8 9 11 12 -5 3 -8 47 -42 6 45 -28 15 -36
5597 -36 -38 -55 -79 -36 -67 -10 -77 -82 -81 -38 -52 -77 -104 -87 8 -54 10 -6 -45 5 -27 13 -9 7 -20 -12 -26 -8 -61 -41 38 44 67
5630 67 10 74 65 97 0 52 43 6 83 77 93 37 113 83 60 32 54 81 2 5 52 96 49 25 0 91 -5 38 8 71 -27 37
$$ packed form
5400D6nL2on8N3l1Qj8K9Ql0m9L9l0J1JJ7n3N3q7N2k3K1k4K3Kj8rl9k0K5O5q5N9
5434d1l4L6mJ2k0JK4OJ7%k8ll3l4M4O8p1N6J1Jr2M6K0N6l4M0j4J4o0Q4j6K4J8
5467I4q7Q3l9j9m7M3O0q8rP9j0%J0m7Nj0P7l4M7p8m7O0N4n9l0jM0q2M9%l7k4O2
5500A5M8o8j2kK9Pl7j2K3l0j3L1J2o3M4m6JJ6M9l8k7j7J32q0j6N3p1R7q0N3K3
5531B1r5O9P6n9p0LK8K8Nj5m0P0j3l1N8l3l3L9M9J3j3l9J4N3Qq8JN4J2k7Pk5N5
5564H2q5K6K2Lm6RQ3j9p8L2O6j8l0L1p7L5K2J4k6l8JKJj7Qj1N5q9M8L9p3M3n1
5597c6kj7k4M3l1N7o7nJM3j4k5k7J7R5o2O4j6l9N0l2M0k2J6k7Qj4J8n3K0P9OK3
5630F7n7O4rL2r7N2rl7P7oJ6n6P6l0k3k8K2K7p9LM7M4m7k4k5R1r6M3l0O3r8O4
$$ plain form
5662 37 -13 24 33 -38 -21 13 -70 -61 -1 -57 5 -23 -95 -86 -13 -76 -34 -13 -40 -31 -55 -3 -31 -81 -80 -56 -53 -54 -133 -8 37 -18 -26 -40
5696 -40 -6 -37 -23 -3 -26 -51 -2 -20 1 -60 4 8 -35 38 54 -9 3 51 79 20 24 86 3 -7 119 62 62 31 18 60 24
5727 24 17 112 35 14 72 88 56 15 50 68 22 22 71 62 96 96 -17 9 -13 -40 11 -1 -63 24 31 -36 -39 36 -18 -31 -85 -82 -75 -44
5761 -44 -48 -53 -36 -20 -40 -77 -72 -70 -86 -66 -57 -122 -34 -51 -82 -34 -57 -93 -53 -66 -32 -35 -29 -5 -7 -14 -33 17 26 4 0 -8 27 96 41 -42
5797 -42 68 36 28 -9 0 81 25 67 73 -13 71 50 47 25 7 96 24 23 41 32 56 41 44 34 26 35 -27 -19 20 53 71 48 10 5 16
5832 16 29 42 -56 -34 -22 -24 7 -36 -92 -28 21 -74 12 -28 25 -37 -66 -6 -29 -9 -39 -47 -74 39 -28 -15 33 -29 19 -37 5
5863 5 -18 -30 20 -29 7 -37 13 -31 45 -50 12 -12 9 -15 34 -29 -3 94 25 52 21 70 26 14 25 49 90 -28 36 50
5893 50 18 -14 49 6 -43 35 95 29 43 17 -49 25 -6 -3 -78 67 94 -5 -2 -14 -50 14 -26 -89 -66 46 -58 34 43 -23
$$ packed form
5662C7n0L7Rp1J7L4q3RO0n6O2k8p2RP3o3M2K1k7Rk4N2k8n0JK4Ljp9J25M5n5qj4
5696d0L4l1J4K0k3k5M9j8K1o1O4Mm3P3J6o3J2M8K8n9MO2q3j0J26n7%l1j3M2l6
5727B4pR5p7k1N8J6l2m1L5J8m6%M9rL4%j13K6k2k7N1j2o2Q7Po7lP5n4j3n4LPL1
5761d4mnJ7J6k0l7NKj6K0Ro5Q8j7l1M8k3l6M0j3L4lOK4kpj9N0Rk2mqL5O9n5q3
5797d2J10l2ql7RQ1n6M2Oq6Q4k1lk2j8Q9p2jJ8rK4j5Lj0qRo2QL9L3J8k3l8nJ1
5832A6J3J3r8K2J2kL1m3n6O4M9r5Q6m0N3o2k9O0k3K0l0qk7J13o7J3M8o2M8n6M2
5863Ek3j2N0m9L6m4N0m4P6r5O2k4K1k4M9o3K6R7o9K7l1M9m4j2J1K4M1j18O4J4
5893E0l2l2O3m3m9P8O0o6J4k6o6P4l1Lp5J45K7r9Lj2l6O4m0o3K3J12j04R2Ro6
$$ plain form
5923 -23 9 -37 -33 -55 -51 -89 15 -57 6 -26 -71 -39 -50 19 -6 -16 9 -9 -38 -37 11 7 -41 20 26 -37 -51 11 11 -5 -40 16 47
5956 47 10 21 1 30 42 44 -18 15 50 125 26 71 72 22 -6 21 4 12 -27 9 86 38 22 69 91 21 56 -15 80 21 14 61
5988 61 29 53 35 -28 52 26 -13 -8 -60 -9 -14 -16 -70 57 15 -58 -87 -25 -28 58 -13 -67 -64 26 -55 -11 -41 -36 -25 1 -66 -46 -24
6021 -24 -65 -48 -17 -34 -54 -49 -79 -81 -47 2 -5 -35 11 55 -11 -2 34 32 30 16 -56 15 36 31 40 27 -40 95 65 14 32 21 82 55
6055 55 -44 51 95 66 47 15 15 45 38 35 22 34 -12 56 55 64 59 31 25 8 32 16 32 1 -2 33 -46 31 7 -21 8 -18 -38 -44 -19
6090 -19 -42 -26 -71 -51 -54 -8 -78 -53 -79 -72 -65 -78 4 -39 -66 -5 -72 -23 2 -19 38 2 36 -15 -101 -50 8 -24 35 9 -15 -7
6122 -7 -24 23 -5 -43 -4 55 67 -23 58 61 -4 -6 110 19 8 63 56 -8 41 13 21 56 93 37 16 -22 19 20 9 -20 87 3
6154 3 -27 7 53 -1 -31 52 18 -38 -45 -17 3 49 -13 -6 -6 -22 -23 35 -80 -49 -43 -65 5 -6 -34 -39 -64 -13 31 -10 5 -12 -11 -35
$$ packed form
5923b3L2m6Mk2Ml8J04p2O3l2m5L2j1O9k5j0K5j8k9JM8mm8O1Oo3j4O2%j6l5N6L1
5956D7l7J1k0K9J2Ko2L3L5P5r9M5Jn0k8K7j7Ql9L6P7m8j6M7K2p0L5p1R5n9pM7
5988F1l2K4j8o3Q0k6l9Nn2N1nkn4J27m2p3k9O2lQ6p1n4LR0q1M4l0NJ1K6o7K0K2
6021b4m1J7L1j7k0Nl0kL4M9pl0M6M4o6RL6kkj4p2P1K1nRj3o7J35l0n1J8j1O1k7
6055E5r9R5M4k9j9l2%L0plj3J2m6O8jRnk8oj7K4j6J6l1lL5p9P7k4k8K9k6k0oK5
6090a9k3J6m5K0lM6p0K5k6PPj3Q2m3k7O1o7M9K5k1N7l6L4n1q6N1N8l2N9k6k4Q
6122gj7M7k8l8L9N9J2r0Q1Lo5kJ16r1j1N5po4M9k8QL5L7n6k1l8M1Jj1k9J07q4
6154Cl0L4M6n4l0Q3l4n6pK8K0M6o2P%j6jN8j15L1Ok2P0j1k8nk5N1M4m1J5j7Jk4
$$ plain form
6188 -35 -25 6 -61 3 -17 -15 -63 43 -74 -2 -63 -14 -25 -9 -8 20 38 -24 33 -1 26 1 10 24 27 19 58 27 7 16 19 34 11
6221 11 63 118 58 6 3 50 14 53 10 63 -30 -23 -9 18 21 -24 -23 43 11 -15 2 -39 29 9 -27 -28 -6 -30 -34 -8 -13 11 -9 -54
6255 -54 25 -68 -48 -21 -10 -61 -62 21 -91 -16 -65 -65 -29 -84 -8 -58 -28 -14 -30 38 7 9 38 -12 46 -18 4 64 -35 -18 -5
6286 -5 12 50 19 50 10 44 39 1 1 104 20 11 -24 3 66 -2 25 46 40 -25 101 50 74 11 65 -13 28 50 28 56 3 50
6318 50 71 27 47 45 20 0 48 35 17 -42 -10 16 -64 -15 2 31 -64 28 -28 -22 14 -65 -41 -27 -13 -26 -36 -23 -22 -21 -55 -72
6350 -72 -34 19 -16 10 20 -17 9 -27 -14 -20 -63 -36 4 -42 -62 -20 -9 -47 14 42 22 -9 20 79 46 52 15 34 61 64 5 -14
6382 -14 36 34 14 11 -2 68 42 -16 44 18 25 59 -50 77 20 44 9 -3 23 21 49 34 47 2 24 68 36 15 8 7 50 -19
6414 -19 36 7 -43 10 -35 -7 29 -44 -35 -100 -67 -20 -3 -55 9 -34 -40 -19 -18 -31 -37 -61 -42 -24 -36 37 2 -61 27 -29 -5 -8 -3
$$ packed form
6188c5J0L1o7O4k0Km8J06j17P2o1M9j1J6JK8J8o2N7l4K7k5RJ4LqL9l1k0RLJ5k3
6221A1N2N5o0n2lM7l6L9m3N3r3PJ4K7Lm5JO6l2k6J7m1O8k0l6jK2k4mK6nK4k0m5
6255e4P9r3K0K7J1n1jQ3j12P5m9%L6n5P6n0L0J4j6O8l1KK9n0N8o4K2O0r9J7J3
6286eJ7L8l1L1m0L4nl8%J03q4rl5K7O3o8K7K1oo5J26n1K4o3N4p8M1K2k2K8n3M7
6318E0K1m4K0kk5k0M8j3j8n9L2K6q0M9J7K9r5R2n6OL6p9K4J4J4j3j0J3JJl4j7
6350g2L8N3l5K6J0l7K6l6J3om3K7M0m6k0M2J1l8O1K8k0l1K9N9l3Ol7J9K7Ln9j9
6382a4N0kk0lj3P0k6n8O0k6PL4j09J27n7K4l5j2K6kK8j5J3m5K2M4l2k1pjM3o9
6414a9N5k9n0N3m5K8L6p3Ro5L3M7J7n2O4m3oK1Jj3ok4J9J8j2P3l5o3Q8n6K4lN
$$ plain form
6447 -3 -18 -43 -10 -9 -11 -27 -7 -78 -77 -21 -10 -7 24 34 48 26 13 -24 36 -21 2 -25 12 49 -5 5 44 81 24 47 48 -30 6
6480 6 18 -7 12 -18 7 -55 47 12 -12 -10 -95 16 24 37 6 6 -32 -43 -9 -81 -5 -16 20 -8 22 4 12 -20 -88 4 25 -16
6512 -16 -2 4 29 15 -19 9 40 -47 -5 -28 5 33 -51 13 30 -1 22 58 -70 34 33 8 3 -24 -3 -44 -25 58 2 -31 34
6543 34 28 49 35 32 64 -18 -4 31 43 -45 7 -28 15 10 16 -37 -4 -22 -24 47 -7 21 -27 -2 21 16 -25 0 11 12 -48 -32 14 1
6577 1 -75 -30 47 26 -43 -34 8 21 -20 -32 -47 -13 -72 -60 -24 39 0 -72 0 -21 29 45 0 21 -17 5 -8 17 -21 -22 -7 -26
6609 -26 13 -27 -23 -2 -23 -7 5 -15 21 28 21 9 48 24 29 3 69 70 33 59 55 32 7 0 37 97 -1 42 9 63 60 19 81 17
6643 17 46 -15 22 -19 38 28 46 -28 13 -43 32 6 -32 -47 24 14 1 -14 -34 -34 -29 -95 62 2 -26 38 -13 12 -8 -46 37
6674 37 -45 -20 -38 4 -38 -27 26 30 -14 -12 -17 20 -91 -14 49 5 -10 -8 56 7 1 41 66 -35 7 -19 41 37 28 39 120 -34
$$ packed form
6447cj5k5L3Jkj6K0p1JN6J1LL1J0J4k2j3l7O0n7K3k7L7L7n4J0L9L7n7K3Jp8L6
6480FJ2k5J9l0K5o2J02l5k4Kq5J11QJ3l1%l8j1L4p2P6j1L6k8L0j8Ql2o8R2K1m1
6512a6J4OK5j4l4K8L1q7M2k3L3K8q4O4J7l1K3L6j28J04jk5nk7K1m1J9Q3n6l3O5
6543C4oK1j4lL2q2J4L5J2q8N2l5M3nOn3L3j8kP1n4K8m8K5K3nm1K5J1Jo0J6M6j3
6577Ap6M5P7k1o9RM2J3m1j2j5L4n9J2L6O3l9p2P2k1N0J6m5K1l8K2j3K5l8jJ5j9
6609b6L9m0MK1k1J6J2k0L6Ppj2L9k4Nk6O6Jl7K6mk3k5pL7O0r8M3l3N4lm1O2o4
6643A7K9o1L7m1N7j0J8p4M1n6P5k6l8j5P1j0j3j5k0%No6J57o0k8O4n1K5k0l8Q3
6674C7q2K5j8M2m2J1N3Mm4KnL7j11P7O3m4j5KO4m9oM0K5j01M2k6O0mrJ1Q1j54
$$ plain form
6706 -34 56 35 -1 23 -36 45 22 -4 -43 35 -29 54 12 -6 7 30 31 -6 35 18 12 -50 38 14 11 22 66 -5 -35 5 29 12
6738 12 -60 -25 9 8 -22 31 -26 18 29 11 -18 67 -18 -49 -30 21 -35 10 -36 20 -23 -33 5 -3 34 -35 -36 25 33 -28 53 -71
6770 -71 49 -3 -56 -21 -42 17 45 47 17 51 12 -50 5 -27 12 -20 -33 -10 -5 -32 -61 28 40 -6 -3 1 43 67 21 -11 30 -8
6802 -8 46 17 -23 76 60 5 18 13 46 16 -8 30 -50 -13 -49 20 22 -36 31 -7 -19 -4 24 -34 36 -29 13 -8 -43 -27 65 -26
6834 -26 -56 -28 -22 6 73 6 -5 8 -9 -16 9 -45 -35 44 17 4 78 -4 -30 50 11 38 23 -35 -14 25 12 78 6 5 -22 71
6866 71 49 -50 24 8 38 -12 94 -10 -9 -19 46 33 39 -9 68 56 8 5 -46 -23 -15 58 -9 -8 -35 21 -31 15 -5 11 -8 30
6898 30 -31 7 17 10 8 10 37 4 -38 -4 20 -39 -13 -79 -25 3 -9 5 37 89 -20 11 17 -16 -78 53 18 21 -32 9 16 -16
6930 -16 -14 -48 14 31 24 35 3 -40 -21 24 -7 19 18 11 -7 55 5 34 3 -5 21 -39 15 33 -1 -1 -25 44 13 -17 46 49 -19 -14
$$ packed form
6706c4R0k1l6K4n9Q1k3k6l9P8o4Q3m2j8J3K3Jl7M1j7oo2Q8k4lJ1M4p1l0M0K4j7
6738A2p2L5L4jl0N3n7M4J1j8k9Q5q5l1J9N1n6M5m6N6m3j0L8qL7o9jO1Qo1Q1j24
6770g1J20n2n3L5k1N9K8Kl0L4l9o2N5l2L9l2j3K3Nk7k9Q9J2m6LMM2K4m6l2M1l8
6802hN4k9m0R9j6n5J3nL3l0k4L8q0L7l6O9Kn8O7l8j2J5K8n8P0o5M2k1l5J6R2r1
6834b6l0K8OK8O7o7j1J3j7pK5n4J0P9k7j3P4q2k6Q0l9K7j5n8K1L9j3O6p2jk7R3
6866G1k2r9P4j6L0n0J06j04Jj0O5j3Om8P7j2m8ln1K3QP3o7Jk7N6n2M6k0J6j9L8
6898C0o1L8J0pkKK7l3m2L4K4n9K6o6N4K8j2J4L2N2j09L1Ol3o2J31l5Ln3M1Pl2
6930a6Kl4O2J7pJ1l2m3J9M5l1K6jpj8O2n0K9l1qK6o0N4J8l4%k4O9l1l0O3Lo8N
$$ plain form
6964 -14 2 24 -28 -46 -5 3 19 24 21 57 -16 7 -31 -23 -4 19 -34 4 61 5 -67 -2 -17 -20 54 -34 5 -20 -52 9 -52 -53 -48 4
6998 4 48 -38 -61 0 -45 -14 -55 30 -16 21 37 -46 65 46 -61 -37 -36 25 -5 7 49 59 50 3 16 8 -90 -2 33 13 39
7029 39 -19 68 5 47 55 43 37 12 14 -3 -8 58 1 50 39 20 30 61 91 47 33 30 -15 28 36 -24 25 -44 78 -7 -2 -16 10
7062 10 34 34 -9 -30 -11 -22 -37 -45 -49 -36 -67 -19 8 -30 -55 32 29 29 17 14 -21 -16 -23 -4 -19 -66 -27 31 45 -25 0 -25 28 -10
7096 -10 -60 19 28 -14 -4 -25 -12 -54 63 -72 9 35 26 18 69 0 44 5 22 -20 13 31 4 -18 -19 -62 51 -38 17 -34 48
7127 48 49 -8 -61 -2 68 48 -24 36 8 -24 6 -63 29 1 -16 -1 18 44 21 7 0 25 21 14 -45 11 -4 -41 -11 -2 -22 -14 76
7160 76 10 -11 -6 -27 -39 1 -9 -45 -19 86 -29 -78 -33 -10 19 29 5 31 6 -37 7 18 49 7 -25 -23 -9 -20 26 18 49
7191 49 0 -3 44 56 33 -16 9 -38 21 -14 -46 -14 36 54 31 -31 17 8 -7 90 -21 4 -50 19 -1 -50 44 14 -37 -19 40
$$ packed form
6964a4J6K2n2j8M1QJ6NlL6p3K3l8QJ9K3n3L8N7n6p2O5j5lP4q8L9k5l2O1o1jNN2
6998DM4q6k3O1m5L1m1Q5m6L7J6q3J11j9j07K4JO1l0J2M2J0rm7J3qr8Q8L5k0K6
7029C9n8Q7o3M2Qj2ok5Kj7nO6n7M9j1j9J0L1L0m4j4lm5M3Qo0M9o9J22q5Nj4K6
7062A0K4%m3k1J9j1j5qmJ3l1M8K7l8k5Q7l%j2ll5NpJ9j5m7L9N8J4p0K5k5N3l8
7096a0n0P9Rm2J0k1J3m2J17j35Q1K6rqN1o9M4l9J7m2L3J8k7k2jm3J13q9N5n1Q2
7127D8Jn7n3N9P0k0p2O0k8l2L0o9R2k8j7J5J9K6k3j4pK5mpn9N6j5l7L0Rk0QR0
7160G6o6k1Nk1j2M0j0l6K6J05j15m9M5K3K9J0k4K6k5m3M4J1L1m2l2KJ4j1M6qL1
7191D9m9lM7J2k3m9K5m7N9l5l2L2N0J8k3o2M8rj5R7j11K5n4O9k0m9R4l0n1J8N9
$$ plain form
7222 40 -8 53 -14 -12 -78 -32 11 -33 -15 -50 -4 -18 32 -17 -8 -13 46 -48 -5 6 -1 -5 28 51 -34 23 28 -12 -20 8 -10 -30 -27 -23 -33
7257 -33 14 -17 25 -26 13 8 -34 -5 13 -8 4 -6 -11 -2 -7 -31 52 69 47 -42 15 55 25 100 70 25 -11 47 5 -4 -71 -42 -10
7290 -10 -4 -9 40 -31 0 -17 10 -16 -35 20 -9 -61 -15 18 44 49 43 -23 49 -22 -3 50 -17 -29 -35 -16 0 -52 15 7 27 -27 -26 12
7324 12 -65 -23 -26 10 -52 -36 4 11 44 -35 20 3 -49 -9 8 22 15 63 -11 -63 17 -7 29 -35 -9 65 -36 -7 1 -52 15 -28
7356 -28 31 -20 -8 14 -28 21 19 -4 -9 -15 25 -35 -6 32 59 33 10 49 16 50 -25 -23 82 -43 6 7 33 87 0 0 24 37
7388 37 15 72 -11 -9 28 -32 -37 15 0 -20 16 -8 13 75 -18 39 -48 22 12 -75 -3 13 16 -5 0 -11 22 43 -12 -67 -44 -25
7420 -25 -27 -52 -21 9 -23 -9 -22 46 14 -2 -12 35 -40 -20 21 -34 21 27 -9 26 -32 -64 1 54 -12 -64 -57 19 16 -16 7 43
7452 43 -6 -3 14 -26 -59 -53 17 17 -7 33 -29 6 -12 30 10 20 10 47 -38 46 15 18 -43 5 -12 -7 -11 -1 6 31 -4 11 -9 -10
$$ packed form
7222D0m8O1o7Ko6M6M3m4J8l5M6j4N0m9RnN9r4M3J1pmL3K3q5N7Nm0qK8j8k0LMj0
7257c3M7l1M2n1L9nm2K9J8k1J2j0nRnk4Q3J7k2q9N7M0l0P5l0m5l6N8m2ro7K9L2
7290a0OnM9p1L1j7K7k6j9N5k9n2M6L3K6Noo6P2p1J9N3o7j2oJ9J6n2O7qK0n4JL8
7324A2p7M2lL6o2J6M0PL3p9N5j7n2M0J7J4pM8p4n2Q0k4L6o4K6P4j01K9Qn3O7m3
7356b8N9n1J2K2m2M9kk3noM0o0K9L8K7k6k3L9l3L4p5KJ05j25M9JK6N4q7%K4J3
7388C7k2N7q3KL7o0nN2j5k0L6k4K1O2r3N7q7P0j0q7P2J6Lk1Nj1L3K1n5n5K3J9
7420b5kk5L1L0l2J4j3O8l2j6j0M7p5K0M1n5N5Ol6L5n8l2O5N3o6n2PP6ll2K3L6
7452D3m9LJ7m0l3OP0%k4M0o2L5j8M2k0J0j0L7q5Q4l1Lo1M8j7NmJ0PK5l5J5k0j
$$ plain form
7486 -10 -2 23 -23 -38 7 21 -1 -1 -1 36 -1 7 14 -19 -36 -27 -29 22 56 -8 -43 3 -38 15 20 -52 -44 19 0 2 52 -34 -48 19 29
7521 29 -47 22 -23 -17 22 43 59 13 -5 16 -8 -12 41 25 32 26 -17 -35 40 0 -43 -6 46 4 -1 -33 37 -7 -39 22 22 -9 54
7554 54 25 -37 -4 -8 6 19 43 5 6 56 3 -5 -17 -10 27 -32 39 -12 -25 31 12 -27 22 -31 -25 -82 -23 6 -9 3 -17 14 -58
7587 -58 -29 -67 -19 -47 39 -3 -36 -36 -32 39 30 23 0 32 0 -19 -49 32 14 44 28 42 49 35 1 53 -21 -37 17 32 78 32 21
7620 21 22 -14 21 78 -9 26 -3 7 84 0 33 48 42 -27 -44 19 55 44 -1 59 -29 -5 8 2 -26 1 -30 15 -30 56 1 -64
7652 -64 -48 -46 -84 -17 -1 -24 -33 -32 9 -46 -38 40 61 25 -31 45 33 -39 -26 23 -31 -12 -35 -42 -45 25 36 -30 -11 8 -38 -14 -1
7685 -1 -22 12 49 -22 -18 17 47 -26 32 30 -11 1 13 28 43 5 50 23 24 45 -9 -4 -50 27 12 41 37 11 103 46 60 9 -46
7718 -46 -16 8 6 55 -20 55 -20 17 36 35 8 -53 1 8 18 16 3 12 19 91 55 -16 -52 7 9 -17 -33 22 23 -40 20 38 18 -31
$$ packed form
7486a0QK5m6j5M5J4k2%%L7l7QPl3j7RkN1L4o4l5M6m1N3Np2QO3j9KN0q6j4O7J0
7521B9p6O9m5OL9K1J6m6j8K1k4mN3j6Pom3j8P5m0m3L7N2m2nl2P0m4l2O1%l1O3
7554E4k9o2L3mJ4J3K4l8JN0n3qj2PL7n9P1n1j3N6j9l9M9n3On7N9K9j5J2k0L1p2
7587e8K9l8M8k8Q6m2l3%MP1rpk3L2l2j9l0Q1j8L0j6J4Pj4l4N2p4j6N4J5M6m6j1
7620B1Jl6L5N7q7L5k9J0P7q4L3J5oo9j7O3L6j1m5O0q8K4J3ok8K7l1M5m5Q6n5o5
7652f4J6Kl8O7J6k3rJM1n5QP8K1l6n6P6j2p2J3M9n4J9k3plP0J1o6J9J9m6K4J3
7685ak1L4L7p1ML5L0p3N8km1J2J2J5J5l8M5k7JK1n4Nm6P7j5K9mk6R2n7J4n1n5
7718d6L0K4kM9p5P5p5L7J9jk7o1N4PJ0kj3RPP2l6p1l6N9Kk6j6N5Jo3O0J8k0m9
$$ plain form
7752 -31 -32 -18 24 -38 26 29 -13 -35 -14 -29 12 -3 -46 28 -33 8 10 19 -6 29 -2 -9 -14 -36 -2 -45 -14 -6 58 29 20 33 -27 26
7786 26 -25 -16 13 23 26 36 72 -26 -21 35 25 -21 58 21 21 5 -18 54 16 24 -2 -20 10 73 15 28 32 2 21 4 -6 40 0
7819 0 -13 10 -17 18 6 33 -53 21 -3 14 -34 38 -37 -25 -14 39 -10 -18 0 -14 -91 -2 -17 -45 64 15 -1 32 -52 15 1
7850 1 -35 -23 -50 44 -93 -82 30 69 -4 -3 -3 37 0 24 2 -24 3 16 13 -33 64 60 -11 36 50 68 14 1 -3 2 36 40 29
7883 29 71 -17 13 -13 48 16 19 -28 43 -26 -14 48 -30 -41 7 -7 31 -23 42 57 -67 80 10 -22 -30 7 -1 12 -64 28 -8
7914 -8 59 -49 76 30 -32 -1 -16 22 31 -12 13 -24 -35 31 -3 -11 -3 27 -24 49 -18 -55 50 -20 -27 -76 16 -12 -7 35 35 -33
7946 -33 3 -22 27 31 -8 17 24 21 -2 -48 45 -23 15 -1 86 47 -28 29 -11 6 10 10 -1 -39 4 47 -12 43 19 30 12 -18 -25
7979 -25 53 -14 26 -15 2 7 -5 23 -7 -4 25 36 -54 -45 12 15 9 -25 -16 10 79 -73 42 -49 -45 46 -34 -35 18 7 -15 -31 17
$$ packed form
7752c1jJ4M2o2O4Lm2k2K1j5M1j5m3P4o1M1KRk5L5l1pnk2L4m3L1QO4k9rJ3o0N3
7786B6n1RK9J0LJ0L6r8NN6j0m6P9l7%j6k3P2l8Qk6j8L0O3n8J3Ml0J9j7j0M6m0
7819@j3K3k7L5j2K7q6P4k4J7m8P2p5J2J1N3m9qJ8j4p7Q9j5k8J09m9j6L3q4O7j4
7850Al6J2k7R4j37J1J12L9p3J%M0l7K4k2k6K7J3lm6R7mp1M7J4J8n4j3mNL4Mj1
7883B9M2q8L0k6O1l2Lm7P1o9J2O2p8j1M8j4L8n4O5J5j24J47p0l2qL7qJ3p6R2l6
7914hO7j08J25m6o2L1j5L8Rm3K5l7j1O6l4qQL0n1P3o7l7J05p0pm9R2k8NM2%o8
7946c3L6k5M9Ml9K5Plk3m6R3o8L8j6Q7l9p5N7m0J7M%j1l8M3M3n9N5k4J1j8l0p
7979b5P8o7M0m1J7Nj2K8l0LK9J1r0RN7Lol4RK6O9j52J15r1MR1q0jN3j1k2j6M8
$$ plain form
8012 17 38 40 -16 -25 40 38 -43 -14 16 12 15 17 8 -39 2 -13 8 -4 10 48 5 41 25 36 44 3 41 5 -46 51 86 6 -29 -23 40
8047 40 0 6 11 -36 8 17 49 -6 64 14 -52 -59 17 -17 27 5 1 36 3 -2 19 -29 20 -3 -50 53 0 -20 -26 31 47 -39 43
8080 43 -15 4 -3 27 -35 33 43 8 19 1 16 -68 65 -20 6 1 57 18 -16 76 -34 -9 -28 -18 15 -43 32 -27 2 33
8110 33 38 -14 -20 4 -3 -16 28 -12 27 14 20 42 23 5 12 -24 41 10 -56 19 20 -31 1 6 36 19 32 8 34 -21 78 -1 39 47
8144 47 108 -68 15 39 55 70 -1 13 4 -13 -9 23 38 -75 -5 37 -52 -41 -33 -11 20 -24 70 34 23 -1 -13 22 19 28 6 -11
8176 -11 3 -32 11 -2 -16 -4 -49 3 27 -14 19 10 -33 35 74
$$ packed form
8012A7K1Kn6rO5kq1K9L0mLKrm7M1j5K1j2J4L8m3L6j6J1Qm1L8l6n1R7L5q0l5OO3
8047D0m0ONm7M4RL2n5P0n0o6pP6l4M4k2mL5l3nK1m8M9k3m7J03n3k0oN7J6q6Q2
8080D3n8J9pL0o2O8J0l5J1j8J5q4J33q5K6nN6l9l4R2j10K5j9J0L3n8P5n9K9L1
8110C3Nn2oK4pj3M4m0L9j3OK2j9j8Pl6O5l1o6P5Jn1L2NL0j7J3k4K6n5R9p9M0Q
8144D7O1j76Q3K4J6J5p1J4rj7ML2J5j13P0M2q9J1QK2L1m4R4l6j1k4j2L5lRk2j7
8176a1J4l5M3j3j4J2m5N2K4m1L3rm3O8L9
8191G4
$$ Imaginary data points
##PAGE= N=2
##DATA TABLE= (X++(I..I)), XYDATA
$$ plain form
0 0 0 0 0 0 0 0 0 0 0 0 0 -5 8 -8 8 -8 8 -8 9 -14 16 -16 21 -23 28 -29 35 -37 43 -49 54 -59 66 -74 81 -91
36 -91 100 -108 122 -136 148 -164 182 -203 223 -250 281 -316 357 -405 469 -547 648 -784 979 -1274
56 -1274 1753 -2637 4593 -10642 64113 320308 18563 -258826 26663 256749 16504 -126709
68 -126709 93973 153290 -53553 -28598 187427 113888 -108827 -16186 206959 132940 -68195
79 -68195 -34293 118825 130157 40265 -13133 1134 73724 115418 29910 -53655 24868 106890
91 106890 21526 -41362 49207 60341 -61772 -26372 126667 39076 -157639 -43111 176881
102 176881 40578 -192344 -54921 158029 16015 -161506 -19260 101981 -51304 -116283
112 -116283 47876 58104 -118886 -89721 89639 33157 -136569 -67132 76244 1190 -101978
$$ packed form
0@%%%%%%%%%%%nJ3j6J6j6J6j6J7k3L0l2L7m4N1n7O4p2Q0r2J03j13J25j40J55j72
36i1J91k08K30k58K84l12L46l85M26m73N31n97O73p62Q74j016J195j432J763k253
56a274L027m390P230j5235P4755K56195l01745k77389K85489K30086k40245j43213
68a26709K20682N9317k06843K4955K16025p3539k22715R2641K23145p4019k01135
79f8195L3902J53118J1332q9892n3398J4267P2590M1694q5508q3565P8523Q2022
91A06890q5364o2888R0569J1134j22113L5400J53039q7591j96715J14528K19992
102A76881j36303k32922J37423K12950j42014j77521J42246J21241j53285o4979
112a16283J64159J0228j76990K9165J79360n6482j69726O9437J43376p5054j03168
$$ plain form
123 -101978 -24899 30765 -45263 -50755 25224 -11184 -81066 -10756 49830 -39534 -80060 19624
135 19624 35725 -62494 -45463 48888 2420 -78698 -1547 67766 -26850 -74117 34694 61794
147 61794 -46062 -43334 61891 34441 -56513 -647 77387 4246 -52011 35054 70726 -16596
159 -16596 -23991 58996 39067 -30543 20040 74782 -2103 -39627 57897 77325 -32120 -34399
171 -34399 74687 55894 -45533 -7185 75171 11719 -52435 30502 70575 -33612 -57771
182 -57771 54587 59580 -57169 -51734 52707 32106 -56347 -25819 35414 -10537 -47268 9157
194 9157 19474 -47883 -40046 29129 7009 -58174 -28571 22327 -11874 -41253 -3674 339 -39206
207 -39206 -16045 27030 -17197 -59792 1664 43150 -24292 -56028 13827 33583 -29518 -28179
$$ packed form
123a01978P7079N5664p6028n492P5979l6408o9882P0310O0586q9364m0526R9684
135A9624J6101r8219J7031R4351m6468q1118P7151O9313r4616m7267J08811K7100
147F1794j07856K728J05225k7450r0954N5866P8034p3141n6257Q7065L5672q7322
159a6596p395Q2987j9929o9610N0583N4742p6885l7524R7524J9428j09445k279
171c4399J09086j8793j01427L8348Q2356o3452o4154Q2937M0073j04187k4159
182e7771J12358M993j16749N435J04441k0601q8453L0528O1233m5951l6731N6425
194I157J0317o7357P837O9175k2120o5183K9603N0898l4201k9379L7579M013l9545
207c9206K3161M3075m4227m2595O1456M1486o7442l1736O9855J9756o3101J339
$$ plain form
219 -28179 29459 8572 -38751 5299 47041 -12100 -44379 27224 53528 -18987 -33668 35858
231 35858 39698 -18452 -6365 39788 12850 -19165 22806 43022 -9614 -19362 38715 39364 -18170
244 -18170 -11320 38721 22993 -16914 5932 31153 -1364 -14791 22814 22737 -21007 -13961 27885
257 27885 12226 -27682 -9518 20188 -3259 -24213 -323 6835 -20701 -18643 7807 -4960
269 -4960 -31871 -14203 7940 -14163 -31481 -9070 -203 -22727 -23079 -2325 -10599 -28955 -12733
282 -12733 2813 -17979 -28625 -3819 2819 -21304 -20618 3797 -1676 -21374 -8132 9813 -6619
295 -6619 -18278 3929 12977 -9025 -11109 12935 12295 -8262 -1013 18951 9447 -4781 9733
308 9733 21820 6990 884 18059 21583 6069 7687 22782 18602 6761 14448 23840 14564 8911
$$ packed form
219b8179N7638k0887m7323M4050M1742n9141l2279P1603K6304p2515j4681O9526
231C5858L840n8150J2087M6153k6938l2015M1971K0216n2636r748N8077O49n7534
244a8170O850N0041j5728l9907K2846K5221l2517j3427L7605p7m3744P046M1846
257B7885j5659l9908J8164K9706k3447k0954K3890P158k7536K058K6450j2767
269d960k6911J7668K2143k2103j7318K2411Q867k2524l52K0754q274j8356J6222
282a2733J5546k0792j0646K4806O638k4123O86K4415n473j9698J3242J7945j6432
295f619j1659K2207R048k2002k084K4044o40k0557P249J9964r504j4228J4514
308I733J2087j4830o106J7175L524j5514J618J5095m180j1841P687R392r276n653
$$ plain form
322 8911 19471 21899 11084 11701 21665 18042 8867 14099 20627 12906 7292 14736 16735 7276 6055
337 6055 13502 10884 2219 4614 10249 4305 -2243 2299 5257 -1886 -5654 -1030 -977 -7359 -8403 -5068
353 -5068 -7399 -12023 -10809 -9023 -12556 -15458 -13279 -12494 -15727 -17252 -15407 -15149 -16825 -17198 -16526 -16570 -16537
370 -16537 -15758 -15899 -16169 -15072 -13843 -13693 -13377 -12403 -11816 -10827 -9035 -8263 -8986 -7698 -4387 -3371 -4711
387 -4711 -3782 -400 852 143 1051 3182 4028 4278 5777 6981 6559 6847 9154 10413 9216 8540 10549
404 10549 12441 11717 10266 10912 12575 12795 11468 10818 11526 11806 10946 10564 10547 9458 8420 9151 9369 6999
422 6999 4996 6373 7391 4750 2255 3237 4157 1973 152 808 347 -1817 -1900 -772 -2826 -5630 -4262
439 -4262 -2303 -5132 -8341 -6322 -4172 -7053 -9260 -7024 -6278 -8980 -9064 -6311 -7635 -10670 -8349 -5057
$$ packed form
322H911J0560K428j0815O17R964l623r175N232O528p721n614P444J999r459j221
337F055P447k618q665K395N635n944o548M542K958p143l768M624N3o382j044L335
353e068k331m624J214J786l533k902K179P85l233j525J845K58j676l73O72m4L3
370a6537P79j41k70J097J229J50L16R74N87R89J792P72p23J288L311J016j340
387d711R29L382J252p09R08K131Q46K50J499J204m22K88K307J259j197o76K009
404A0549J892p24j451O46J663K20j327o50P08K80q60l82j7j089j038P31K18k370
422F999k003J377J018k641k495R82R20k184j821O56m61k164q3J128k054k804J368
439d262J959k829l209K019K150k881k207K236P46k702q4K753j324l035K321L292
$$ plain form
455 -5057 -8007 -10987 -7227 -4068 -7682 -9718 -5416 -3768 -7249 -6828 -2696 -3666 -6835 -3456 576 -3250
471 -3250 -5889 -82 3214 -2129 -3664 2729 4175 -867 -33 5174 3566 70 4167 7583 2365
486 2365 408 7457 9218 1946 1335 8779 8755 2384 3862 8636 5548 2429 7182 8016 1293 1639
502 1639 9157 6996 -1547 840 8027 4245 -2099 1805 4821 -923 -1860 4354 1597 -6666 -2234
517 -2234 5903 -908 -9757 -2703 4167 -3685 -8649 -1238 1 -7789 -5408 2217 -3890 -11439 -2389
532 -2389 4909 -5635 -11496 -52 4221 -6218 -6904 3003 521 -7193 131 7084 -3323 -7793
546 -7793 6251 9719 -4897 -5461 9746 8493 -4615 507 11834 3821 -4215 7778 13062 -1407
560 -1407 -3506 12845 12401 -4217 -1201 13951 8352 -4346 3500 12336 1765 -3105 8873 9355
$$ packed form
455e057k950k980L760L159l614k036M302J648l481M21M132r70l169L379M032l826
471c250k639N807L296n343j535O393J446n042Q34N207j608l496M097L416n218
486B365j957P049J761p272o11P444k4o371J478M774l088l119M753Q34o723L46
502A639P518k161q543K387P187l782o344L904L016n744r37O214k757q263M432
517b234Q137o811q849P054O870p852m964P411J239p790K381P625o107p549R050
532b389P298j0544n861J1444M273j0439o86R907k482p714P324O953j0407m470
546g793J4044L468j4616n64J5207j253j3108N122J1327q013q036J1993N284j4469
560a407k099J6351m44j6618L016J5152n599j2698P846Q836j0571m870J1978M82
$$ plain form
574 9355 -4156 -1425 11444 5000 -6812 1807 9932 -1431 -5933 6347 5495 -8430 -3401 10343
588 10343 352 -13045 -13 10738 -5498 -13204 4284 7018 -12293 -10373 8813 1451 -17967
601 -17967 -6814 10656 -4061 -19423 -3295 7615 -9525 -15680 966 1193 -14801 -9625 4683
614 4683 -4993 -17340 -4727 4530 -8980 -13771 -870 -1123 -11465 -4681 3505 -8829 -13254 5096
628 5096 7319 -13557 -11806 11178 6833 -13437 -3935 13863 425 -11171 8833 16126 -7945
641 -7945 -9166 19753 17911 -11925 -5878 23394 15099 -9526 2252 20730 6125 -4498 13810
654 13810 16789 -4920 -1246 22468 13618 -10693 762 22052 8189 -8392 5514 13714 -1829
667 -1829 -2297 13440 4405 -13307 1540 18926 -1125 -18350 2250 15681 -4885 -13699 3764
$$ packed form
574I355j3511K731J2869o444j1812Q619Q125j1363m502J2280q52j3925N029J3744
588A0343r991j3397J3032J0751j6236p706J7488K734j9311J920J9186p362j9418
601a7967J1153J7470j4717j5362J6128J0910j7140o155J6646K27j5994N176J4308
614D683r676j2347J2613R257j3510m791J2901k53j0342O784Q186j2334m425J8350
628E096K223k0876J751K2984m345k0270R502J7798j3438j1596K0004P293k4071
641g945j221K8919j842k9836O047K9272q295k4625J1778J8478j4605j0623J8308
654A3810K979k1709L674K3714q850k4311J1455K1290j3863j6581J3906Q200j5543
667a829m68J5737r035j7712J4847J7386k0051j7225K0600J3431k0566q814J7463
$$ plain form
680 3764 4426 -10971 -4162 7979 -6884 -17708 2336 10722 -12147 -18454 3297 5636 -12486
693 -12486 -9733 2728 -6693 -13086 3241 3982 -18309 -14390 11935 4387 -22401 -11347 13067
706 13067 -945 -19625 -1362 10558 -11612 -15456 11442 8929 -20716 -12219 19368 7605 -22017
719 -22017 -6980 19336 3365 -16065 2076 14642 -3854 -8254 11510 9758 -9282 -2042 15944
732 15944 5805 -8459 3510 13076 1395 -1884 9222 6019 -3454 5991 13302 -1336 -5843
745 -5843 11780 12555 -6978 -3745 15152 6455 -11155 2270 16527 -1983 -13105 8790 15187
758 15187 -9641 -11658 13331 9971 -14415 -6476 15006 2239 -16102 356 13969 -5321 -14097
771 -14097 6182 9542 -10516 -8477 9769 2450 -12927 -1120 10499 -4912 -12252 5237 8223
$$ packed form
680C764O62j5397O809J2141j4863j0824K0044Q386k2869o307K1751K339j8122
693a2486K753J2461r421o393J6327P41k2291L919K6325p548k6788J1054K4414
706A3067j4012j8680J8263J1920k2170l844K6898k513k9645Q497L1587j1763k9622
719b2017J5037K6316j5971j9430J8141J2566j8496m400J9764j752j9040P240J7986
732A5944j0139j4264J1969R566j1681l279J1106l203r473R445P311j4638m507
745e843J7623P75j9533L233J8897q697j7610J3425J4257j8510j1122K1895O397
758A5187k4828k017K4989l360k4386P939K1482j2767j8341J6458J3613j9290q776
771a4097K0279L360k0058K039J8246p319j5377J1807J1619j5411p340J7489K986
$$ plain form
784 8223 -9500 -8006 8470 2578 -10996 -983 8788 -4903 -10274 6281 7279 -10805 -7872 10077
798 10077 3890 -12154 -2965 9567 -1902 -9445 4159 6409 -8682 -5495 10611 2991 -12649
811 -12649 -1460 12663 -608 -11292 3400 9633 -5255 -5918 9189 4411 -10238 -259 13653
824 13653 -37 -12389 3638 13519 -3280 -9566 6593 8316 -6683 -3483 9525 1459 -9899
837 -9899 1901 10930 -3649 -10447 4541 8346 -6207 -6798 5492 2012 -7687 -773 5930 -4482
851 -4482 -8463 4162 5415 -8190 -6934 5999 2312 -8614 -2356 5682 -2769 -7400 3212 4587
865 4587 -7130 -5274 7083 2822 -8546 -2076 7784 -189 -7033 2301 6120 -3823 -4022 6326
879 6326 3426 -6437 -880 8068 581 -6523 2321 7086 -2440 -4358 5289 4244 -5074 -1227 7124
$$ packed form
784H223j7723J494J6476n892j3574J0013R771j3691n371J6555R98j8084K933J7949
798A0077o187j6044R189J2532j1469p543J3604K250j5091L187J6106p620j5640
811a2649J1189J4123j3271j0684J4692O233j4888o63J5107m778j4649R979J3912
824A3653j3690j2352J6027R881j6799o286J6159J723j4999L200J3008q066j1358
837i899J1800R029j4579o798J4988L805j4553n91J2290l480r699O914O703j0412
851d482l981J2625J253j3605J256J2933l687j0926O258Q038q451m631J0612J375
865D587j1717J856J2357m261j1368O470R860p973o844R334L819r943j99J0348
879F326k900r863N557Q948p487p104Q844M765r526j918R647j045r318L847Q351
$$ plain form
894 7124 1049 -6105 1738 6885 -1947 -4957 4245 4765 -4129 -2209 5983 1833 -5062 890 6207
909 6207 -858 -4305 3466 4943 -2876 -2068 5262 2392 -4022 655 5683 -167 -3745 3067 4758
924 4758 -2291 -2161 4417 2412 -3629 -99 4739 -451 -4198 1574 3737 -2734 -3460 2557 1433 -4133
940 -4133 -1794 2624 -1195 -4708 -53 1890 -3426 -4340 896 389 -4586 -2869 1118 -1770 -4821 -830
956 -830 1087 -3538 -4102 908 501 -4161 -2556 1772 -646 -3809 -245 1953 -1927 -2795 1848 1943 -2567
973 -2567 -1442 3164 1638 -2098 434 3372 565 -961 2438 2990 -536 22 3962 2753 -953 790
989 790 4042 2198 -268 1785 3132 764 677 2949 2144 -582 937 3496 1598 -997 728 2626
1005 2626 989 -204 972 922 -142 737 1599 -368 -1572 744 1813 -597 -1713 99 735 -515
$$ packed form
894G124o075p154P843N147q832l010R202N20q894J920Q192m150o895N952N317
909F207p065l447P771J477p819Q08P330k870o414M677N028n850l578O812J691
924D758p049J30O578k005o041L530M838n190l747N772K163o471p26O017j124n566
940d133K339M418l819l513M655J943n316r14N236n07m975J717L987k888l051L991
956h30J917m625n64N010m07m662J605M328k418l163L564K198l880q68M643R5m510
973b567J125M606j526l736K532K938k807j526L399N52l526N58L940j209l706J743
989G90L252j844k466K053J347k368q7K272q05k726J519K559j898k595J725J898
1005B626j637j193J176n0j064Q79Q62j967j204K316J069k410j116J812O36j250
$$ plain form
1021 -515 -607 -56 -998 -1279 622 543 -1958 -2256 562 959 -1604 -2361 -519 108 -1004 -1069 -995 -1506 -1220
1040 -1220 174 -377 -2251 -2038 55 249 -1561 -1991 -1074 -364 -317 -797 -1627 -1632 -197 506 -928 -2129
1058 -2129 -855 568 -91 -1142 -849 -294 -120 199 220 -709 -840 822 1562 -9 -1042 403 1812
1075 1812 1174 -127 239 1095 1350 1155 853 586 804 1590 1679 829 364 1088 1722 1443 666 434 967 1447
1095 1447 1172 276 -17 677 1228 463 -317 -95 395 327 -121 -409 -469 -412 -86 -270 -988 -1082 -442 -272 -856
1116 -856 -1172 -866 -568 -701 -811 -870 -979 -771 -312 -620 -1155 -805 -13 -287 -895 -596 13 -238 -459 -130
1136 -130 50 -214 -110 422 160 -273 143 599 229 -153 269 668 202 -3 507 488 86 280 641 208
1156 208 -63 547 594 -42 -135 625 525 -281 -101 646 347 -308 133 678 9 -295 356 592 -117 -221 542
$$ packed form
1021e15r2N51r42k81J901p9k501k98K818L97k563p57J842O27j112o5P4n11K86
1040a220J394n51j874K13K093J94j810m30R17P10M7m80q30nJ435P03j434j201
1058b129J274J423o59j051K93N55J74L19K1r29j31J662P40j571j033J445J409
1075A812o38j301L66Q56K55j95l02k67K18P86Q9q50m65P24O34k79p77k32N33M80
1095A447k75q96k93O94N51p65p80K22M90o8m48k88o0N7L26j84p18r4O40J70n84
1116h56l16L06K98j33j10n9j09K08M59l08n35L50P92k74o08K99O09k51k21L29
1136a30J80k64J04N32k62m33M16M56l70l82M22L99m66k05N10j9m02J94L61m33
1156B08k71O10M7o36r3P60j00q06J80P47k99o55M41N45o69l04O51K36p09j04P63
$$ plain form
1177 542 489 -213 -1 593 238 -219 143 464 24 -114 288 80 -220 178 267 -382 -429 342 258 -651 -475
1198 -475 362 -41 -821 -318 318 -530 -879 157 196 -1131 -880 485 192 -1387 -912 583 92 -1127
1216 -1127 -626 339 -360 -767 109 52 -817 -443 734 204 -959 -218 754 154 -491 65 463 -27 203
1235 203 731 -8 -581 700 1405 -97 -754 764 1314 -42 -232 910 697 -110 613 1300 -11 -529
1253 -529 1105 1628 -172 -677 1061 1331 -169 -253 810 440 -260 652 784 -409 -539 1091 705 -961
1271 -961 -657 814 314 -899 -269 305 -676 -836 336 -31 -1621 -912 760 -250 -1888 -868 529
1288 529 -626 -1524 -398 -39 -1254 -1060 301 -326 -1697 -654 685 -389 -1379 -250 531 -563 -746
1305 -746 390 146 -827 132 1042 -180 -802 704 1250 -299 -379 1126 937 -468 270 1489 338 -706
$$ packed form
1177E42n3p02K12N94l55m57L62L21m40j38M02k08l00L98Q9o49m7P71q4r09J76
1198d75Q37m03p80N03O36q48l49J036L9j327K51J365k93j579M75J495m91j219
1216a127N01R65o99m07Q76n7q69L74J177n30j163P41R72o00o45N56L98m90K30
1235B03N28p39n73J281P05j502o57J518N50j356j90J142k13q07P23O87j311n18
1253e29J634N23j800n05J738K70j500q4J063l70p00R12J32j193j30J630l86j666
1271i61L04J471n00j213O30N74r81j60J172l67j590P09J672j010j638J020J397
1288E29j155q98J126L59j215J94J361o27j371J043J339j074r90J129P81j094j83
1305g46J136k44r73R59R10j222o22J506N46j549q0J505j89j405P38J219j151j044
$$ plain form
1323 -706 899 1667 -158 -833 1117 1466 -460 -440 1211 758 -645 135 1157 -15 -852 481 957
1340 957 -503 -692 547 518 -513 -240 424 -261 -438 495 269 -814 -336 821 10 -917 52 664 -410
1359 -410 -680 636 365 -1027 -318 1226 128 -1452 -110 1341 -75 -1322 132 952 -489 -819
1375 -819 544 319 -1051 -395 886 -112 -1250 -168 946 -225 -1044 101 411 -453 -296 314 -261
1392 -261 -771 238 641 -595 -688 564 521 -600 -232 704 69 -574 411 776 -428 -528 1031 705 -818
1411 -818 -264 1121 471 -610 113 930 -55 -509 686 694 -604 -257 985 369 -868 -26 1013 -7
1429 -7 -606 328 567 -518 -326 661 197 -902 -77 884 -75 -930 231 692 -431 -620 444 291 -683
1448 -683 -147 648 -128 -764 107 613 -270 -699 284 397 -513 -334 435 -32 -636 93 450 -397 -554 389
$$ packed form
1323g06J605P68j825o75J950L49j926K0J651m53j403P80J022j172q37J333M76
1340I57j460j89J239k9j031K73O64o85j77R33k26j083M78J157q11r27R69O12j074
1359d10k70J316k71j392P09J544j098j580J342J451j416j247J454Q20j441l30
1375h19J363k25j370O56J281r98j138J082J114j171q19J145L10q64J57O10n75
1392b61n10J009M03j236r3J252m3j121L68R36o35o43R85L65j204j00J559l26j523
1411h18N54J385o50j081P23Q17r85m54J195Qj298L47J242o16j237Q42J039j020
1429gn99R34K39j085J92R87m64j099Q25R61r59q55J161M61j123j89J064j53r74
1448f83N36P95p76o36Q71N06q83m29R83J13r10J79P69m67o04P29L57q47j57R43
$$ plain form
1468 389 238 -582 -273 440 -59 -542 61 468 -460 -559 453 317 -573 -292 572 135 -602 53 583 -265
1488 -265 -439 413 436 -425 -210 643 289 -507 2 643 57 -385 290 456 -236 -183 533 313 -400 -34 523
1509 523 12 -396 240 432 -144 -262 365 173 -366 -50 392 -25 -377 156 349 -170 -307 249 35 -299
1529 -299 -85 307 -89 -374 28 223 -256 -294 196 46 -330 -107 308 -130 -369 39 227 -270 -330 191 89
1550 89 -346 -170 197 -51 -350 81 246 -201 -223 204 152 -364 -148 241 -18 -371 105 212 -125 -233 164
1571 164 242 -229 -128 304 119 -261 24 353 29 -170 138 192 -77 -66 322 207 -157 -23 280 74 -140
1592 -140 163 207 14 -36 196 45 -24 -2 179 37 -88 90 96 -134 -124 123 13 -151 -29 173 -156 -251 -24
1615 -24 90 -173 -143 55 1 -263 -136 120 -94 -238 -23 124 -80 -190 34 41 -167 -103 50 -91 -154 35
$$ packed form
1468C89j51q20L09P13m99m83O03M07r28r9J012j36q90K81Q64m37p37O55N30q48
1488b65j74Q52K3q61K15Q53l54p96N09O41n86m42O75J66o92N3P16k20p13L66N57
1509E23n11m08O36J92n76j18O27j92n39L16M42m17l52N33J93n19j37N56k14l34
1529b99K14L92l96k85M02J95m79l8M90j50l76K23M15m38k39M08J88m97o0N21j02
1550H9m35J76L67k48k99M31J65m47k2M27n2n16K16L89k59l53M76J07l37j08L97
1571A64P8m71J01M32j85l80K85L29l24j99L08N4k69J1L88j15l64J34L03k06k14
1592a40L03M4j93n0K32j51o9K2J81j42j25J78Ok30J0K47j10j64J22K02l29r5K27
1615b4J14k63L0J98n4k64J27K56k14j44K15J47k04j10K24Pk08O4J53j41o3J89
$$ plain form
1637 35 88 -110 -136 116 41 -82 -71 152 -3 -62 63 139 -27 5 145 191 -108 -48 176 91 -111 27 186 87
1661 87 -10 54 77 -14 26 126 67 -47 -6 95 52 -87 39 55 -21 25 -2 -54 -39 92 59 -89 -62 56 39 -83
1687 -83 -53 77 -27 -88 4 41 -117 -53 102 34 -122 -135 74 65 -91 -79 68 11 -62 17 23 20 8 43 24 -2 -50 67
1715 67 21 6 17 -6 -30 31 19 -32 -29 14 36 -90 -66 49 16 -92 -43 54 32 8 -47 22 27 -85 -6 108 -29 -40
1743 -40 53 47 5 -18 70 24 12 24 6 -11 20 43 3 17 16 16 17 -26 78 27 -17 -44 39 41 14 -30 -6 -61 -51 6 0 -112
1775 -112 -122 -15 0 -64 -94 -19 -19 -101 -113 -37 -42 -51 -44 -122 -107 -9 -78 11 -1 0 -22 -16 27 -52 20 47 83 94 -88 -44 52 61
1807 61 -61 4 67 31 32 -47 -21 83 40 39 14 -42 12 54 42 -24 4 90 -15 24 5 20 -25 30 7 35 28 46 112 -23
1837 -23 -25 102 86 -11 -23 24 105 47 16 30 26 -5 22 23 -72 -73 -28 4 -103 -100 64 -5 -66 -51 -89 -60 -84 -27 -114 -188 -48
$$ packed form
1637C5N3j98k6K52p5j23J1K23j55n9J25P6j66L2J40M6k99O0K24q5k02J38J59r9
1661H7r7O4K3r1M0J00n9j14M1J01m3j39J26J6p6M6k7n2J5J31l3j48K7J18j7j22
1687h3L0J30j04o1R2L7j58O4J55o8j56j3K09rj56J2J47n7p3P9Olj2L5j9k6m8J17
1715F7m6j5J1k3k4O1j2n1LM3K2j26K4J15l3j08M9R7k2k4n5O9Nj12P9J14j37j1
1743d0R3om2k3Q8m6j2J2j8j7L1K3m0J4j%Jm3J04n1m4k7Q3Kk7m4K4n5J0N7oj12
1775a12j0J07J5o4l0P5%q2j2P6nrPp8J5R8o9Q9j2Jk2OM3p9P2K7L6J1j82M4R6R
1807F1j22O5O3l6Jp9K6J04m3jk5n6N4M2j2o6K8Q6j05L9j9J5m5N5k3K8pJ8O6j35
1837b3kJ27j6r7j2M7Q1n8l1J4ml1K7Jr5jM5L2j07LJ64o9o1J5l8K9k4N7q7p4J40
$$ plain form
1868 -48 -13 -102 -111 -27 67 -135 -4 -48 -44 -28 -8 14 -48 -33 133 119 -97 -11 106 83 55 41 115 14 16 101 89 2 2
1897 2 131 97 -67 4 119 146 -13 -6 41 60 31 75 97 -68 37 150 -36 -116 15 102 39 -87 25 44 -50 29
1923 29 137 52 -112 63 156 -17 -114 65 129 -14 -38 25 14 -30 104 67 -40 -83 32 85 -76 -97 33 28 -68
1948 -68 -57 -15 -86 -198 -21 16 -150 -132 49 87 -171 -134 15 -131 -159 -32 53 -122 -113 82 65 -160 -8 56 40
1973 40 -126 55 125 -7 9 160 142 -146 29 237 157 5 49 202 -20 -8 153 91 -106 -1 212 50 -147
1996 -147 15 178 -67 -123 -11 62 -152 -54 95 -80 -247 -11 88 -83 -225 -25 119 -63 -213 37 -63
2017 -63 -171 -33 54 -121 -193 46 139 -177 -160 119 105 -106 -115 74 -27 -126 126 151 -173 -180 141 101 -187 -116 157
2042 157 -26 -159 -19 130 -65 -110 198 111 -176 -74 167 75 -294 -54 182 -22 -141 42 169 -168 -99
$$ packed form
1868d8L5q9rQ4R4k02J31m4MJ6K0K2o2J5J66j4k16Q6J17k3k8j4P4j01KQ5j2q7%
1897BJ29l4j64P1J15K7j59PM7J9k9M4K2j65J05J13j86q0J31Q7o3j26J12J9r4P9
1923B9J08q5j64J75R3j73r7J79O4j43k4O3j1m4J34l7j07m3J15N3j61k1J30nr6
1948f8J1M2p1j12J77L7j66J8J81L8k58L7J49j46k8J27Q5j75RJ95j7k25J52O4j6
1973D0j66J81P0j32J6J51j8k88J75K08q0j52M4J53k22J2J61o2j97J05K13j62j97
1996a47J62J63k45n6J12P3k14R8J49j75j67K36R9j71j42K00J44j82j50K50j00
2017f3j08J38Q7j75p2K39R3l16J7K79j4k11rJ89j01r9K52K5l24pL21m0k88P1K73
2042A57j83j33J40J49j95m5L08q7k87J02K41r2l69K40K36k04j19J83J27l37O9
$$ plain form
2063 -99 228 75 -147 3 236 98 -144 101 219 -37 -78 223 136 -124 59 282 75 -220 109 256 -32
2084 -32 -115 131 150 -92 10 167 19 -141 11 251 -71 -176 162 155 -130 -79 167 10 -213 -48 119 -168
2106 -168 -266 120 173 -205 -150 68 45 -248 -144 104 -168 -230 7 162 -260 -248 106 7 -218 -150 112 -123 -270
2129 -270 -21 67 -127 -87 155 23 -211 -44 224 1 -132 62 215 -20 -3 226 150 -109 101 338 98
2150 98 -108 280 346 15 -49 316 255 -54 40 325 206 -103 168 395 99 -137 176 272 -62 -33 182 173 -104
2173 -104 -53 124 -35 -219 -73 41 -115 -172 -29 -21 -196 -89 31 -182 -222 -14 -81 -296 -180 49 -207 -317
2195 -317 -114 120 -227 -271 2 58 -288 -267 69 59 -227 -125 183 -64 -277 25 227 -97 -231 90 160 -146
2217 -146 -114 147 34 -101 -22 144 -50 -59 137 100 -26 -58 139 21 -29 115 166 -31 -84 170 191 -141 -9
$$ packed form
2063i9L27j53k22J50K33j38k42K45J18k56m1L01q7k60J83K23k07k95L29J47k88
2084c2q3K46J9k42J02J57j48j60J52K40l22j05L38pk85N1K46j57k23J65J67k87
2106a68r8L86N3l78N5K18k3k93J04K48k72o2K37J55m22J2L54r9k25O8K62k35j47
2129b70K49Q8j94M0K42j32k34J67K68k23j33J94J53k35J7K29p6k59K10K37k40
2150I8k06L88O6l31o4L65o1l09R4K85j19l09K71K27k96k36L13R6l34K9K15rk77
2173a04N1J77j59j84J46J14j56n7J43Qj75J07J20k13m0K08o7k15J16K29k56j10
2195c17K03K34l47m4K73N6l46K1L36j0k86J02L08k47k13L02K02l24j34L21P0l06
2217a46L2K61j13j35P9J66j94rJ96l7j26l2J97j18n0J44N1j97n3K54K1l32J32
$$ plain form
2240 -9 309 173 -101 -9 222 62 -116 173 232 -67 -49 224 200 -114 -61 257 166 -105 -50 121 39 16 82 -1
2264 -1 -120 -9 114 -11 -176 14 38 -60 -17 -26 -103 -190 -40 46 -231 -321 23 79 -241 -334 -14 37 -220 -210 36
2289 36 -131 -200 46 56 -96 -237 57 187 -126 -237 117 244 34 -54 82 45 72 181 151 59 59 308 193
2312 193 73 146 216 194 129 144 138 137 209 325 144 -9 173 268 127 -39 73 238 66 31 94 78 -8 27 160
2337 160 -127 -187 9 86 -119 -148 -31 -22 -111 -201 -59 -127 -145 -31 -98 -243 -214 -63 -31 -244 -190 -56 -51 -186 -66
2362 -66 -16 -166 -118 -12 73 -151 -83 18 113 -92 -47 72 41 -71 82 56 50 -16 102 104 -4 30 86 55 40 19
2388 19 57 18 92 145 10 14 43 128 16 -23 42 104 -63 70 103 66 -40 43 179 72 38 39 129 72 4 119 45
2415 45 -11 21 101 31 -81 119 86 -46 -54 28 -4 -72 -72 -17 -48 -107 -27 -77 -158 -142 -65 -96 -167 -140 -118 -77 -175 -142 -146 -241
$$ packed form
2240iL18j36k74R2K31j60j78K89N9k99J8K73k4l14N3L18r1k71N5J71q2k3O6q3
2264aj19J11J23j25j65J90K4r8M3rp7q7J50Q6k77r0L44N6l20r3L20N1k57J0K46
2289C6j67o9K46J0j52j41K94J30l13j11L54J27k10q8J36l7K7J09l0r2%K49j15
2312A93j20P3P0k2o5J5ojP2J16j81j53J82R5j41j66J12J65j72l5O3j6q6L5J33
2337A60k87o0J96P7k05k9J17Rq9r0J42o8j8J14o7j45K9J51L2k13N4J34Nj35J20
2362f6N0j50M8J06Q5k24O8J01R5k05M5J19l1j12J53k6oo6J18Kj08L4N6l1j5k1
2388A9L8l9P4N3j35MK9Q5j12l9O5O2j67J33L3l7j06Q3J36j07l4JR0n7o8J15p4
2415D5n6L2Q0p0j12K00l3j32qQ2l2o8%N5l1n9Q0n0q1J6P7l1p1K7K2M1r8L3mr5
$$ plain form
2445 -241 -166 -145 -173 -212 -188 -115 -117 -200 -161 -101 -153 -94 -89 -104 -27 -55 5 -67 -42 24 47 17 -38 138 51 29 74 114 91 84 161
2476 161 203 112 88 236 230 135 146 247 171 68 241 229 139 77 216 164 93 117 126 98 38 120 142 30 -2 89 77 -12
2504 -12 3 67 104 -37 -2 34 -50 -83 46 -63 -142 -162 -67 -71 -114 -135 -21 -135 -160 -88 -39 -181 -119 -61 -104 -168 -147 -64
2532 -64 -183 -127 -54 -27 -81 -88 35 -37 -51 21 68 -29 -49 59 77 -27 3 64 93 -20 126 171 72 70 171 182 70
2559 70 148 192 155 59 95 197 123 -29 35 160 1 -9 129 127 5 -35 76 29 -111 27 3 -10 -144 -6 26
2584 26 -99 -83 -102 -92 -69 -50 -6 -128 -132 -23 10 -134 -109 38 -59 -159 -44 -2 -86 -51 63 11 -116 -120 38 -44
2610 -44 -164 -117 49 9 -157 -86 -47 -137 -51 64 -23 -147 -37 37 -17 -107 -12 -44 -4 -32 34 -85 -112 52 115 -45
2636 -45 -102 99 66 -4 -87 55 23 -73 69 115 53 -87 115 192 30 -24 187 200 1 -32 141 12 -56 76 121
$$ packed form
2445b41P5K1k8l9K4P3kq3L9O0n2N9Nj5P7k8O0p2K5O6K3l0n5J76q7k2M5M0k3pP7
2476A61M2r1k4J48or5J1J01p6j03J73j2r0o2J39n2p1K4Rk8o0Q2K2j12l2R1j2q9
2504a2J5O4L7j41L5L6q4l3J29j09p9k0R5mm3k1J14j14k5P2M9j42O2N8m3o4K1Q3
2532f4j19N6P3K7n4pJ23p2j4P2M7r7k0J08J8j04L0O1K9j13J46M5r9kJ01J1j12
2559G0P8M4l7r6L6J02p4j52O4J25j59j0J38kj22m0J11m7j40J38k4j3j34J38L2
2584B6j25J6j9J0K3J9M4j22mJ09L3j44K5J47r7j00J15M2q4L5J14n2j27mJ58q2
2610d4j20M7J66m0j66P1L9r0Q6J15q7j24J10P4n4r0R5l2M0k8O6j19k7J64O3j60
2636d5n7K01l3p0q3J42l2r6J42M6o2j40K02P7j62n4K11J3j99l3J73j29o8J32M5
$$ plain form
2661 121 -9 -39 45 91 -60 -25 95 63 -55 -52 -3 -55 -43 -50 -51 -84 -41 100 -41 -104 -46 27 -27 -137 -68 2 -102
2688 -102 -73 120 -35 -93 -3 132 22 -80 8 127 -141 -129 60 80 -158 -19 232 4 -51 45 181 -9 -65
2711 -65 99 167 -60 0 156 62 -103 55 163 34 -49 66 124 76 -30 185 63 40 74 135 48 11 126 192
2735 192 -8 -25 148 135 0 47 175 -19 5 110 126 -118 -12 182 95 -99 -36 134 21 -29 54 112 -87
2758 -87 -5 82 25 -162 -110 64 -17 -153 -16 31 -62 -128 -18 -34 -165 -156 56 34 -135 -89 26 -35 -120 -17 -7 -60
2784 -60 -8 83 29 -71 -13 -7 -91 -69 36 49 -63 -15 131 20 -102 78 83 -58 -98 54 90 -34 -60 164 46
2809 46 -118 -9 115 -58 -62 41 117 4 -42 103 71 -60 -5 135 36 -80 -6 131 -26 -122 -31 29 -141 -69
2833 -69 66 -22 -95 -46 107 -57 -98 -13 -14 -86 -89 20 -30 -85 -75 4 -100 -157 35 -79 -88 -122 21 -56 -137 12 3 -86
$$ packed form
2661A21j30l0Q4M6j51L5J20l2j18LM9n2J2pjl3M3J41j41o3N8P3n4j10O9P0j04
2688a02K9J93j55n8R0J35j10j02Q8J19k68J2J89K0k38J39K51k28n5R6J36j90n6
2711f5J64O8k27O0J56r4j65J58J08j29q3J15N8m8j06K15j22k3L4O1q7l7J15O6
2735A92k00j7J73j3j35M7J28j94K4J05J6k44J06J94q7j94O3J70j13n0Q3N8j99
2758h7Q2Q7n7j87N2J74q1j36J37M7r3o6J10j6j31RK12k2j69M6J15o1q5J03J0n3
2784f0N2R1n4j00N8Oq4K2J05J3j12M8J46j11j22J80Nj41m0J52L6j24k6K24j18
2809D6j64J09J24j73mJ03P6j13m6J45l2j31N5J40r9j16P4J37j57r6R1O0j70P2
2833f9J35q8p3M9J53j64m1Q5jp2lJ09n0n5J0P9j04n7J92j14rl4J43p7q1J49rq9
$$ plain form
2861 -86 -138 3 27 -88 -70 52 11 -87 -18 57 -24 -108 -18 54 -83 -54 14 47 -85 -48 63 41 -55 37 119 48 -12
2888 -12 99 92 40 22 84 23 -34 41 59 -5 -1 127 48 27 -9 139 58 -51 56 100 -45 25 62 47 -65 7 66 22
2916 22 -43 46 58 -5 -10 25 61 -35 -71 23 -21 -34 -85 45 43 -34 6 74 -53 -85 96 77 -33 -80 35 45 22 48 45
2945 45 -28 -53 53 62 -36 24 102 41 -19 23 19 -15 -42 70 70 -49 -28 76 -16 31 8 90 -21 -70 -24 115 -47 -27
2973 -27 74 59 -41 11 94 7 -64 61 18 -43 27 58 -1 -42 -23 8 -13 -25 -13 14 -29 -6 85 17 -17 -14 75 5 -19
3002 -19 3 57 -55 -97 7 32 -66 -27 -25 -68 -75 -44 -8 -96 -98 4 11 -51 -100 9 16 7 -76 -14 -11 -116 0 -30 -50 28 -15
3033 -15 -95 -47 -19 19 -47 -27 -89 -18 -59 34 -42 -32 -54 92 23 43 9 27 41 8 61 83 35 -13 29 7 -2 -51 23 53
3063 53 -35 -19 22 16 -49 63 34 5 -48 -20 62 -35 -25 37 15 -44 -26 23 13 -13 -6 -44 4 -40 -45 0 16 2 1 -53 -45 29
$$ packed form
2861h6n2J41K4j15J8J22m1r8O9P5q1q4R0P2j37K9O8L3j32L7J11k2r6R2Q2p1o0
2888a2J11pn2j8O2o1n7P5J8o4MJ28p9k1l6J48q1j09J07M4j45P0L7j5j12P2N9m4
2916B2o5Q9J2o3nL5L6r6l6R4m4j3n1J30kp7M0O8j27l2J81j9j10m7J15J0k3K6l
2945D5p3k5J06Rr8O0P8o1o0M2ml4k7J12%j19K1J04r2M7k3Q2j11m9M6J39j62K0
2973b7J01j5j00N2Q3q7p1J25m3o1P0L1n9m1J9L1k1j2J2K7m3K3R1o8l4LQ9p0k4
3002a9K2N4j12m2J04K5r8L9Km3pL1L6q8kJ02Po2m9J09Prq3O2Lj05J16l0k0P8m3
3033a5q0M8K8L8o6K0o2P1m1R3p6J0k2J46o9K0l4J8J4l3N3K2m8m8M2k2rm9P4L0
3063E3q8J6M1oo5J12k9k9n3K8Q2r7J0O2k2n9J8M9j0k6Pl8M8m4nM5J6j4jn4QP4
$$ plain form
3095 29 -9 -34 -26 -38 51 3 -19 39 -1 9 39 44 -22 -35 -19 43 -7 -24 -29 -27 -14 8 3 -48 -16 25 54 45 -24 -22 31 -27 33 -2
3129 -2 -19 66 22 -33 82 62 41 14 17 44 55 42 21 10 -10 17 4 44 -5 50 20 66 65 15 -9 53 32 11 -17 -2 66
3160 66 42 24 20 -6 13 -52 10 22 7 30 -16 -11 -12 29 14 -15 53 -44 -29 13 -27 8 -24 -11 7 -22 -61 -70 -86 -28 -11 -4 -44
3193 -44 -25 -46 -34 -16 -42 7 -27 -18 -82 -87 -76 -69 -94 13 -2 6 -48 -15 -16 34 -68 -19 -18 -29 -49 -12 22 -2 -8 27 -16 46 12
3226 12 -3 48 30 -7 9 27 26 -29 -28 14 -15 -25 1 26 18 24 -24 87 -31 -24 28 -46 -8 -20 -69 -92 -42 -27 -24 -31 1 -42 -10
3259 -10 0 -70 -1 -25 -54 41 -35 19 -84 17 -73 -1 47 -23 7 40 26 -24 -29 9 39 22 31 16 33 -25 -13 -28 32 -15
3289 -15 11 25 60 14 -18 -2 -21 9 -44 -11 10 34 18 20 -10 33 -1 7 -22 65 92 -7 10 32 -3 41 61 21 16 17 116 105
3321 105 43 3 16 3 33 64 12 23 -58 -2 54 15 35 29 16 11 -4 11 69 -6 7 3 -21 22 64 17 54 23 41 38 -25 22
$$ packed form
3095B9l8k5Qj2Q9m8k2N8m0J0L0No6j3J6O2n0j7nKJ3K2nn1L2M1K9ro9KN3n8O0l5
3129bj7Q5m4n5J15k0k1k7LK7J1j3k1j1k0K7j3M0m9N5l0M6jn0k4O2k1k1k8J5O8
3160F6k4j8mk6J9o5O2J2j5K3m6NjM1j5k9O8r7J5M2m0L5l2J3J8k9l9rj6N8J7Pm0
3193d4J9k1J2J8k6M9l4Ro4nJ1Pk5J07j5Qn4L3jN0j02M9Jj1k0L7L4k4oL5m3O2l4
3226A2j5N1j8l7J6J8jn5JM2k9j0K6K5qOm8J11j18PN2p4L8j2m9k3N0J5LpL2m3L2
3259a0J0p0O9k4k9R5p6N4j03J01r0P2M8p0L0L3j4n0nL8L0j7Rj5J7n8J2j5O0m7
3289a5K6J4L5m6l2J6j9L0n3L3K1K4j6Kl0M3l4Qk9Q7K7r9J7K2l5M4K0m0nJR9j1
3321A05o2m0J3j3L0L1n2J1q1N6N6l9K0oj3nj5J5N8p5J3mk4M3M2m7L7l1J8lo3M7
$$ plain form
3353 22 -22 -4 -57 -24 -10 -22 17 6 13 -29 -62 31 -88 20 -49 2 17 -63 -35 -48 -17 -28 -5 7 -12 6 8 -30 -14 -51
3383 -51 68 -30 -26 17 37 10 23 43 19 -41 -18 3 53 40 -7 26 5 86 45 0 79 101 -7 3 28 -13 -51 52 13
3412 13 -20 11 19 -30 -80 7 -46 46 6 40 -41 -7 -78 -34 -45 -30 0 -34 -37 -41 20 -27 23 -2 -42 29 -24 -42 -25 -59 -47 -34
3444 -34 -66 -21 -65 0 60 -11 10 -1 5 -37 8 -28 -20 -16 7 30 11 8 61 20 -33 13 71 71 12 7 -62 -9 -33 6 -7 71 -27
3477 -27 -23 17 -7 -19 -38 -3 30 19 17 5 17 4 -15 -22 0 -10 -20 52 16 52 -12 -18 43 -8 -20 -6 35 -2 -106 -22 -59 12
3509 12 -13 -1 39 -17 28 -52 -30 -17 -28 -36 15 -58 -67 -10 9 -80 -5 -31 8 -68 -9 29 -31 24 -21 -14 21 -22 50 -33 63 14
3541 14 39 -8 -34 -18 73 -46 39 31 -21 21 31 50 35 -40 -25 34 2 47 48 -4 22 40 30 -34 44 -5 20 30 37 -34 12
3572 12 8 -37 31 -44 -1 -26 8 5 15 65 -27 -5 -10 -64 -6 22 -2 -69 -14 -61 -4 -67 -54 -55 -22 -44 -41 -45 -35 -20 -21 -60 -49 -94
$$ packed form
3353B2m4J8n3L3J4j2L9j1Pm2l3R3j19J08o9N1J5q0K8j3L1j1K3J2j9J8Kl8J6l7
3383e1J19r8MM3K0k7J3K0k4o0K3K1N0j3m7L3k1Q1m1m5P9K2j08J0K5m1l8J03l9
3412A3l3L1Qm9n0Q7n3R2m0L4q1L4p1M4j1J5L0l4lmO1m7N0k5m0P1n3j8J7l4J2J3
3444c4l2M5m4O5O0p1K1j1Om2M5l6QMK3K3j9lN3m1n3M6N8%n9no9N3k4L9j3P8r8
3477b7MM0k4j2j9L5L3j1kj2J2j3j9pK2j0j0P2l6L6o4oO1n1j2J4M1l7j04Q4l7P1
3509A2k5J2M0n6M5q0K2J3j1qN1p3rN7J9q9P5k6L9p6N9L8o0N5m5PL5m3P2q3R6m9
3541A4K5m7k6J6R1j19Q5qn2M2J0J9j5p5J5N9l2M5Jn2K6J8j0o4P8m9K5J0Pp1M6
3572A2mm5O8p5M3k5L4lJ0N0r2K2nn4N8K8k4o7N5m7N7o3J3jL3k2LmJ0J5jl9J1m5
$$ plain form
3606 -94 -47 -23 -2 30 -61 -1 6 24 -19 28 23 -14 31 -15 13 68 4 -19 -5 19 56 74 41 15 33 -19 13 2 -2 -2 12 29
3638 29 30 42 37 2 58 -12 5 15 -1 -23 -41 6 16 -24 -13 -9 73 -34 8 29 -16 -64 -10 17 -23 0 32 13 1 -34 32
3669 32 -6 -69 -58 -48 -43 -39 -1 -34 16 -7 -50 28 37 -14 -49 -18 52 -26 18 -34 -23 28 8 8 -21 -21 15 32 -63 -4 -29 -9 16
3702 16 29 24 17 23 -1 -35 45 30 63 46 20 42 -26 56 20 34 0 29 63 60 21 15 59 21 -39 29 61 -5 7 10 62 10 27
3735 27 -49 32 -10 -14 10 18 -43 -28 -48 21 -38 -56 -32 -17 5 -59 -90 -57 18 -59 -42 -17 -16 -37 -38 -66 -19 -31 -31 -50 -51 -60 -29 -47
3769 -47 -47 8 21 -15 -82 -6 12 5 1 -21 14 25 75 56 18 -27 37 0 37 39 15 68 60 -3 105 42 80 77 -38 73 96 62
3801 62 66 13 17 88 40 55 22 35 23 -22 -1 -3 -28 -38 -4 -13 -72 -7 -10 -45 -29 -22 -20 -5 -23 -6 -11 -30 -39 -34 -16 -38 -71 -25 -19 -44
3837 -44 -54 -36 9 -21 -95 13 -24 -55 -82 7 -21 25 -13 34 -10 -1 26 38 -36 -33 72 30 -44 -12 19 -57 -29 36 -14 17
$$ packed form
3606i4M7K4K1L2r1O0PJ8m3M7nl7M5m6K8N5o4k3J4K4L7J8l3k6J8n2L2j1m%J4J7
3638B9JJ2nl5N6p0J7J0j6k2j8M7J0m0J1MQ2j07M2K1m5m8N4K7m0K3L2j9j2l5O6
3669C2l8o3J1J0NML8l3N0k3m3P8Rn1l5L1P0p8M4n2J1N1k0%k9%L6J7r5N9k5K0K5
3702A6J3npOk4l4Q0j5L3j7k6K2o8Q2l6J4l4K9L4ll9oM4l8o0O8L2o6J2LN2n2J7
3735B7p6Q1m2mK4Qo1J5k0O9n9j8K4J5K2o4l1L3P5p7J7K5Jk1jk8M7j2%j9jrL1j8
3769d7%N5J3l6o7P6J8pmk2L5J1N0j9l8m5O4l7L7Kk4N3qo3J08o3L8lj15J11K3l4
3801F2Mn3MP1m8J5l3J3j2m5K1kk5j0L4rn9O5ll5J6PKJ5j8J7nj9rNJ8k2l3M6Ok5
3837d4j0J8M5l0p4J08l7l1k7Q9k8M6l8M7m4RK7J2p4LJ05m2p4L2L1p6K8O5n0L1
$$ plain form
3867 17 -19 66 70 35 6 6 38 4 6 28 -44 15 -10 -14 15 -36 35 36 51 41 75 25 25 5 97 -58 30 12 56 -15 -66 3 -12
3900 -12 -4 -64 -47 -35 20 7 -34 8 1 -15 -23 -27 -9 -27 -53 -31 44 -33 -33 -44 -83 -30 -50 -37 -52 1 -27 22 -31 -14 -26 -20 -23 -41
3934 -41 16 -15 65 -11 24 -39 13 24 -10 7 -67 -11 -14 -5 -10 -4 40 22 1 58 23 39 11 77 -31 38 45 29 21 -16 63 49 31
3967 31 43 18 6 26 43 53 3 23 -10 26 -31 -46 22 41 -24 -40 12 -58 -12 11 -11 -85 11 0 -30 -25 -108 -43 -53 -25 4
3998 4 4 -76 -5 -37 -21 -22 -9 -29 47 -59 17 -62 -29 -17 -65 -60 -57 1 -48 -55 14 -5 -57 -12 19 36 15 33 30 24 78 -49 36
4031 36 47 -21 -10 33 103 2 56 49 57 58 10 -44 -6 81 82 12 57 -35 62 15 55 39 24 21 12 24 29 71 37 -16 -48 -5 18
4064 18 -21 -28 -36 15 -60 -34 -69 -16 -25 -21 -47 -8 -60 -17 -48 -108 -125 -60 -37 -62 -5 42 -74 7 -46 6 -18 -26 -35 -30 -24 -41 18 -50
4098 -50 -56 -5 5 34 -80 -33 -33 9 -70 27 64 -28 23 18 11 32 38 6 40 51 42 8 26 21 78 -8 89 33 69 0 58 48 25
$$ packed form
3867A7l6Q5Ml5k9%L2l4KK2p2N9k5mK9n1P1JJ5j0L4n0%k0R2j55Q8j8M4p1n1O9j5
3900a2Qo0J7J2N5j3m1M2pj6qmJ8j8k6K2P5p7%j1l9N3k0J3j5N3k8M9n3J7j2Olj8
3934d1N7l1Q0p6L5o3N2J1l4J7p4N6lRnOM4j8k1N7l5J6k8O6j08O9Pj6ql7P9j4j8
3967C1J2k5j2K0J7J0n0K0l3L6n7j5O8J9o5j6N2p0M6K3k2p4R6j1l0Nq3O5j0K8K9
3998D%q0P1l2J6jJ3k0P6j06P6p9L3J2m8NLN8m9pO9j9n2M5L1J7k1J8loN4j27Q5
4031C6J1o8J1M3P0j01N4pQJm8n4L8Q7Jp0M5r2R7m7M0j6j5lrJ2NM2l4n3l2M3K3
4064A8l9pqN1p5K6l5N3rMk6L9n2M3l1o0j7O5K3k5N7M7j16Q1n3N2k4qrNOj7N9o8
4098e0oN1J0K9j14M7%M2p9R7L7r2N1npK1Ol2L4J1rl4J8nN7q6R7n6L6o9N8j0k3
$$ plain form
4131 25 -60 -12 36 4 16 10 30 36 -21 28 4 8 -49 20 -51 -38 -66 -62 30 -11 -54 -33 -68 -33 26 -29 -95 17 1 -50 -49 -42 -88
4164 -88 -59 11 -7 -18 -115 22 -51 20 -110 31 18 -50 -34 -12 -23 -5 -23 38 14 -16 -24 34 54 -62 50 85 44 37 19
4193 19 61 77 30 68 38 17 57 73 -2 72 76 32 27 -5 13 6 25 65 13 59 34 87 -41 -3 8 3 34 -3 27 64 11 -21
4225 -21 3 -8 0 -4 -42 -23 10 7 -28 -58 -46 -95 -62 -79 -37 -94 -61 14 -1 -5 -54 -82 -16 -59 -77 -80 -35 25 -83 59 56 -72
4257 -72 -56 29 -19 -65 7 9 -28 -7 7 73 62 27 1 67 66 -10 -7 25 61 0 66 40 62 -49 90 76 29 49 7 69 -12
4288 -12 48 40 20 33 52 -15 80 60 -9 91 59 80 39 -9 -21 34 -22 -5 0 -1 4 21 -9 -11 -56 -39 -37 -38 18 29 -76 -64 -22
4321 -22 -54 -52 -56 -11 -100 -52 -50 -66 -91 -73 -109 -97 -20 -49 -63 -51 -36 -19 35 -60 7 -19 -26 -85 -36 9 70 -2 24 6 21 33
4353 33 27 5 11 13 75 49 63 24 20 42 7 62 34 32 44 70 88 63 -3 42 18 -44 50 47 121 10 104 45 -40 29 -16 12 49
$$ packed form
4131B5q5M8M8l2J2oK0On7M9k4Mn7O9p1J3k8MR2m1m3K1l5L5N9n5o6J12j6n1JPm6
4164h8K9P0j8j1r7J37p3P1j30J41j3o8J6K2j1J8j8O1k4l0qN8K0j16J12L5m1pj8
4193A9M2J6m7L8l0k1M0J6p5P4Mm4nl2J8pJ9M0n2M6k5N3j28L8J1nL1l7L0L7n3l2
4225b1K4j1Qml8J9L3ll5l0J2m9L3j7M2n7L3P5j5mm9k8O6m3j8lM5O0j08J42lj28
4257g2J6Q5m8m6P2Kl7K1J4O6j1l5k6O6jp6LL2L6o1O6k6K2j11J39j4m7K0m2O2q1
4288a2O0qk0J3J9o7R5k0o9J00l2K1m1m8j2N5n6J7NjNJ7l0km5J7KjN6J1j05J2M2
4321b2l2KmM5q9M8Kj6k5J8l6J2P7k9j4J2J5J7N4r5O7k6pn9M9M5O1p2K6j8J5J2
4353C3ok2OKO2k6J4l9mK2l5N5k8kJ2K6J8k5o6M5k4o2R4lP4j11R4n9q5O9m5K8L7
$$ plain form
4386 49 -41 22 7 -13 -7 -61 34 -67 -16 -8 -3 -44 5 -34 -8 0 -64 -32 -87 -69 -66 -62 -62 -42 -90 -104 3 -43 -64 -69 26 -55 26
4419 26 -43 -29 -59 -104 8 -19 -7 -31 -35 -12 -11 -8 -22 82 -13 36 -26 -58 -26 47 11 19 27 57 69 -16 38 50 49 28 53 5
4451 5 -3 -7 41 46 18 59 88 27 26 26 117 -33 49 23 23 -56 68 29 -19 18 36 65 -69 -5 -18 -8 -12 -28 -5 -44 -73 1 -58
4484 -58 -65 -65 -24 -47 -20 -12 -69 -13 -90 -108 -125 -4 -76 -65 -75 -30 -12 -69 -60 38 -41 2 28 12 15 -31 -9 -19 12 -46 -5 -16
4516 -16 0 25 -19 22 19 -10 8 84 31 -24 83 47 32 60 56 80 56 19 68 -13 55 55 24 45 61 43 40 25 65 32 41 -6
4548 -6 82 85 110 -49 62 -23 -44 3 34 -50 -58 -46 12 -55 -90 -29 -34 -24 -20 21 -97 -35 -77 31 -48 -58 -69 -44 -27 -99 11
4579 11 -30 -11 7 12 -58 43 0 6 -56 30 37 -41 -35 2 26 -22 3 -85 54 22 7 50 -15 -53 -39 15 76 -41 -37 85 36
4610 36 -6 -42 -4 35 75 99 32 42 5 28 26 77 85 20 62 35 74 19 -25 26 77 58 25 12 -4 -24 -39 -11 1 -62 33
$$ packed form
4386D9r0O3j5k0On4R5j01N1QNm1M9l9K6Qo4L2n5J8LM%K0m8j4J07m6k1nR5q1Q1
4419B6o9J4l0m5J12k7J2k4mK3JLj4J04r5M9o2l2L2P3l6QQL0J2q5N4J2jk1K5m8
4451EqmM8Nk8M1K9o1j%R1j50Q2k6%p9J24l9m8L7J8K9j34O4j3J0mj6K3l9k9P4n9
4484e8p%M1k3K7Qn7N6p7j8j7J21p2J1j0M5J8n7RR8p9M3K6j6Lm6K2j0L1n8M1j1
4516a6J6K5m4M1lk9J8P6n3n5J07l6j5K8mK4k4l7M9q1O8%l1K1J6j8lj5M0l3Rm7
4548fQ8LK5j59J11q5k1M7L1q4qJ2N8o7l5O1nJ0MM1j18O2m2J08p9j0j1K5J7p2J10
4579A1m1J9J8Np0J01m3Oo2Q6Pp8OL7K4m8K5q8J39l2j5M3o5l8J4N4O1j17MJ22m9
4610C6m2l6L8L9M0K4o7J0l7K3kN1Qo5M2k7L9n5m4N1N1j9l3j3j6k0j5K8J2o3R5
$$ plain form
4641 33 56 -16 -6 -29 -5 -15 -42 -65 -80 11 9 -66 -88 -75 -36 -50 24 -29 -53 7 -89 -75 -37 -20 -74 -10 -73 -24 -84 -32 34
4672 34 4 -25 -41 -68 3 -46 -29 11 35 96 -7 22 -11 18 35 30 76 107 2 27 -14 7 14 54 98 -12 79 91 51 28
4702 28 -16 6 -20 4 3 55 36 77 69 6 -21 64 32 37 85 -5 33 17 -5 31 11 4 48 -10 -21 -40 5 -21 -54 -45 -47 -48 -50 -89
4736 -89 -92 -21 20 -82 -39 -10 16 -40 -27 17 35 -111 -51 -41 -36 -30 -6 -40 -12 5 29 -46 15 35 16 8 26 83 -24 3 8
4767 8 45 47 7 3 40 75 54 30 62 14 96 11 -3 51 40 76 33 68 40 28 12 89 25 36 60 35 25 31 38 25 -22 38 29
4800 29 -18 21 -17 11 47 9 -26 34 -39 0 -30 -77 1 0 13 -35 -50 -90 52 -60 -17 -41 -52 -101 -27 -87 -102 -42 -19 -2
4830 -2 -44 -19 -27 34 11 18 36 15 -50 -37 37 -16 12 -1 -48 42 -8 -18 40 6 -51 36 18 36 15 64 35 34 6 44 77 75 67
4863 67 19 55 -6 43 26 -6 37 48 40 46 30 9 54 35 -8 38 -3 -15 0 69 2 37 24 22 -14 33 3 -17 9 19 12 -41
$$ packed form
4641C3K3p2J0k3K4j0k7k3j5R1kp5k2J3L9j4P4n3k4O0r6J4L8J7n4O4o3M9o0N2O6
4672C4l0k9j6k7P1m9J7M0K4O1j03K9l3K9J7nM6L1j05K5m1K1PM0M4j10R1J2m0k3
4702B8m4K2k6K4jN2j9M1qo3k7Q5l2NM8r0L8j6k2L6k0pM4n8j1j9M5k6l3Rkjkl9
4736h9lP1M1j02M3K9K6n6J3M4J8j46O0J0NOK4l4K8J7K4p5O1K0j9qJ8N7j07K7N
4767HL7Km0mL7L5k1k4L2m8Q2q5j4N4j1L6m3L5k8j2j6P7o4J1K4k5j0OPj3m7O0r
4800B9m7L9l8K8L6l8l5O0p3L9l0m7P8jJ3m8j5m0J42j12M3k4j1m9P4o0j5O0K3J7
4830bm2K5qO1k3PJ8k1o5J3P4n3K8j3m7R0n0j0N8l4n7Q7j8J8k1M9k9jk8L8L3kq
4863F7m8L6o1M9j7l2M3J1qOj6k1M5j9m3M6m1j2J5O9o7L5j3kl6M7l0k0K6J0pn3
$$ plain form
4895 -41 7 -6 17 -24 8 -7 -14 -29 -20 -40 -29 -31 -51 -54 69 -26 -32 0 -16 -10 -2 -5 15 -87 -7 -3 -35 -56 20 43 20 0 -7 -1 5
4930 5 -17 23 8 37 0 32 49 59 20 70 121 31 66 -11 40 77 53 53 24 25 13 50 -39 51 43 13 -20 94 70 2 14 57
4962 57 15 7 -25 23 -42 -17 -25 -18 -31 -53 -40 -74 4 -7 -26 -44 12 -31 -76 -76 8 -36 -85 -23 -42 6 -57 -54 -33 -61 -74 -77 3
4995 3 -8 -74 -37 -4 -37 -80 -33 -6 -65 -34 -26 9 -31 80 0 -36 -30 -2 58 56 22 29 -20 -20 -51 20 -44 -27 50 20 11 4 0 58
5029 58 37 37 122 46 -13 48 31 15 64 38 41 54 53 47 26 22 22 108 52 49 123 5 -57 63 26 -7 2 12 55 -49 -13 -12 63
5062 63 30 -10 -46 -16 17 -71 2 -81 -75 -81 -21 15 -29 -27 -20 -65 -60 -21 -49 -60 -90 -88 -56 -62 22 40 -38 -38 -57 -9 -7 -29 -49 17 2
5097 2 14 -19 26 28 41 -6 9 -8 92 56 -3 64 115 15 91 15 -8 -6 74 19 21 19 14 -7 60 136 24 21 -23 123 14
5128 14 16 40 16 25 -24 -37 36 62 -11 -9 44 58 40 6 32 -8 27 -8 -22 -48 -21 -43 -34 -16 -62 -69 -39 -6 -47 -44 -102 -76 -67 -18
$$ packed form
4895d1M8j3K3m1L2j5pj5Rk0J1kk0lJ23r5oL2j6OQlK0j02Q0Ml2k1P6K3k3k0pOO
4930Ek2M0j5K9l7L2J7J0l9N0N1r0L5p7N1L7k4%k9Jj2L7q9R0ql0l3J14k4o8J2M3
4962E7m2ql2M8o5K5qPj3k2J3l4P8j1j9j8N6m3m5%Q4m4m9O2j9M8o3LK1k8j3lQ0
4995Cj1o6L7L3l3m3M7K7n9L1QL5m0J11q0l6OK8O0kl4Pm9%l1P1o4J7P7l0rpmN8
5029E8k1%Q5p6n9O1j7j6M9k6LJ3jok1m%Q6n6lP4j18o2J20l7l3RJ0M3j04L6JP5
5062F3l3m0l6L0L3q8P3q3OoO0L6m4KPm5NL9k8j1l0KL2oQ4J8p8%j9M8Kk2k0O6j5
5097BJ2l3M5KJ3m7J5j7J00l6n9O7N1j00P6p6k3KQ0n5Kknk1O7P6j12lm4J46j09
5128A4KK4k4Rm9j3P3K6p3KN3J4j8l4K6m0L5l5j4k6K7k2RJ8m6pL0L3m1Ln8K6RM9
$$ plain form
5162 -18 -6 -9 6 -54 -80 -48 -10 -34 1 43 -39 -45 -14 20 -64 -54 19 16 -31 -32 7 21 -30 22 17 -29 -37 65 17 25 -16 -8 56 25
5196 25 39 -41 23 57 38 41 22 5 25 -16 -3 -13 18 16 24 87 44 74 58 78 62 65 55 10 19 -17 31 69 28 33 -3 23 -61
5229 -61 -8 23 7 -71 48 -22 8 1 -42 -41 19 -85 -42 -35 -58 -71 -70 -35 -109 -59 30 54 -10 -64 -95 -44 -14 1 10 -33 21 -57
5261 -57 -28 -26 2 -15 40 -50 22 -3 79 30 2 38 95 58 9 74 46 26 -35 84 49 55 24 78 89 77 -6 46 47 42 39 72
$$ packed form
5162a8J2lJ5o0k6L2L8k4L5M2q2oL1L4q4J0P3lm7jL9J4n1N2nm6qJ02m8Qm1QO4l1
5196B5J4q0O4L4j9Lj9j7K0m1J3j0L1kQO3m3L0j6K0j6Lj0m5Rl6M8L8m1Nl6K6q4
5229f1N3L1j6p8J19p0L0pm3JO0j04M3Pk3j3JL5p4N0Q9K4o4n4l1N1L0J5Rm3N4p8
5261e7K9KK8j7N5r0P2k5Q2m9k8L6N7l7m9O5k8k0o1J19l5Ol1N4J1j2q3N2JnlL3
$$ [...]
8191D7
##END NTUPLES=NMR FID
##END=
