##TITLE=1H_1BnP3005
 CDCl3
 8 sc, 
 31.05.2022
##JCAMPDX= 6.0         $$ Bruker NMR JCAMP-DX V2.0
##DATA TYPE= NMR FID
##DATA CLASS= NTUPLES
##ORIGIN= UXNMR, Bruker Analytische Messtechnik GmbH
##OWNER= root
$$ XWIN-NMR		Version 3.5
$$ Tue May 31 14:15:24 2022 Russian Standard Time (UT+4h)  she@DPX200
##.OBSERVE FREQUENCY= 200.1313499996
##.OBSERVE NUCLEUS= ^1H
##.DELAY= (6, 6)
##.ACQUISITION MODE= SIMULTANEOUS
##.ACQUISITION SCHEME= undefined
##.AVERAGES= 8
##.DIGITISER RES= 18
##SPECTROMETER/DATA SYSTEM= spect
##.PULSE SEQUENCE= zg30
##.SOLVENT NAME= CDCl3
##.SHIFT REFERENCE= (INTERNAL, CDCl3, 0, 15.7039)
##AUDIT TRAIL= $$ (NUMBER, WHEN, WHO, WHERE, WHAT)
$$ ##TITLE= Audit trail, XWIN-NMR		Version 3.5
$$ ##JCAMPDX= 5.01
$$ ##ORIGIN= Bruker BioSpin GmbH
$$ ##OWNER= she
$$ F:/spectra/data/she/nmr/H-F/1/audita.txt
$$ ##AUDIT TRAIL=  $$ (NUMBER, WHEN, WHO, WHERE, WHAT)
(   1,<2022-05-31 14:14:26.18 +0400>,<she>,<DPX200>,
      <created by zg, POWCHK disabled, PULCHK disabled
       configuration hash MD5:
       00 E9 B6 7A A2 85 ED C7 34 08 36 98 17 FE 4E 26
       data hash MD5: 16K
       F9 97 A9 0E 70 93 F0 E0 03 B8 2C 97 82 8C 75 D1>)
$$ ##END=
$$ 
$$ hash MD5
$$ 08 40 5C D4 1B 27 2A 71 54 B0 0C 7F DA 76 39 CA
##$RELAX= 
##$RELAX= 
##$RELAX= 
##$RELAX= 
##$RELAX= 
##$RELAX= 
$$ Bruker specific parameters
$$ --------------------------
##$DU= <F:/spectra>
##$EXPNO= 1
##$NAME= <H-F>
##$PROCNO= 1
##$TYPE= <nmr>
##$USER= <she>
##$AMP= (0..31)
100 100 100 100 100 100 100 100 100 100 100 100 100 100 100 100 100 100 
100 100 100 100 100 100 100 100 100 100 100 100 100 100 
##$AQSEQ= 0
##$AQ_mod= 1
##$AUNM= <au_zg>
##$AUTOPOS= <>
##$BF1= 200.13
##$BF2= 200.13
##$BF3= 200.13
##$BF4= 200.13
##$BF5= 200.13
##$BF6= 200.13
##$BF7= 200.13
##$BF8= 200.13
##$BYTORDA= 1
##$CFDGTYP= 0
##$CFRGTYP= 5
##$CHEMSTR= <none>
##$CNST= (0..31)
1 1 145 1 1 1 1 1 1 1 1 1 1 1 1 1 1 1 1 1 1 1 1 1 1 1 1 1 1 1 1 1 
##$CPDPRG= <>
##$CPDPRG1= <>
##$CPDPRG2= <>
##$CPDPRG3= <>
##$CPDPRG4= <mlev>
##$CPDPRG5= <mlev>
##$CPDPRG6= <mlev>
##$CPDPRG7= <mlev>
##$CPDPRG8= <mlev>
##$CPDPRGB= <>
##$CPDPRGT= <>
##$D= (0..31)
0 1.2 0 0 0 0 0 0 0 0.06 0 0.03 0 0 0 0 0.0002 0 0 0 0 0 0 0 0 0 0 0 0 
0 0 0 
##$DATE= 1653992065
##$DBL= (0..7)
120 120 120 120 120 120 120 120 
##$DBP= (0..7)
150 150 150 150 150 150 150 150 
##$DBP07= 0
##$DBPNAM0= <>
##$DBPNAM1= <>
##$DBPNAM2= <>
##$DBPNAM3= <>
##$DBPNAM4= <>
##$DBPNAM5= <>
##$DBPNAM6= <>
##$DBPNAM7= <>
##$DBPOAL= (0..7)
0.5 0.5 0.5 0.5 0.5 0.5 0.5 0.5 
##$DBPOFFS= (0..7)
0 0 0 0 0 0 0 0 
##$DE= 6
##$DECBNUC= <off>
##$DECIM= 32
##$DECNUC= <off>
##$DECSTAT= 4
##$DIGMOD= 1
##$DIGTYP= 9
##$DL= (0..7)
0 120 120 120 120 120 120 120 
##$DP= (0..7)
150 150 150 150 150 150 150 150 
##$DP07= 0
##$DPNAME0= <>
##$DPNAME1= <>
##$DPNAME2= <>
##$DPNAME3= <>
##$DPNAME4= <>
##$DPNAME5= <>
##$DPNAME6= <>
##$DPNAME7= <>
##$DPOAL= (0..7)
0.5 0.5 0.5 0.5 0.5 0.5 0.5 0.5 
##$DPOFFS= (0..7)
0 0 0 0 0 0 0 0 
##$DQDMODE= 0
##$DR= 18
##$DS= 0
##$DSLIST= <SSSSSSSSSSSSSSS>
$$ [...]
##$SUBNAM2= <"">
##$SUBNAM3= <"">
##$SUBNAM4= <"">
##$SUBNAM5= <"">
##$SUBNAM6= <"">
##$SUBNAM7= <"">
##$SUBNAM8= <"">
##$SUBNAM9= <"">
##$SW= 18.0517283424761
##$SWIBOX= (0..15)
0 0 2 0 0 0 0 0 0 0 0 0 0 0 0 0 
##$SW_h= 3612.71676300578
##$TD= 16384
##$TD0= 1
##$TE= 0
##$TE2= 300
##$TE3= 300
##$TEG= 300
##$TL= (0..7)
0 120 120 120 120 120 120 120 
##$TP= (0..7)
150 150 150 150 150 150 150 150 
##$TP07= 0
##$TPNAME0= <>
##$TPNAME1= <>
##$TPNAME2= <>
##$TPNAME3= <>
##$TPNAME4= <>
##$TPNAME5= <>
##$TPNAME6= <>
##$TPNAME7= <>
##$TPOAL= (0..7)
0.5 0.5 0.5 0.5 0.5 0.5 0.5 0.5 
##$TPOFFS= (0..7)
0 0 0 0 0 0 0 0 
##$TUNHIN= 0
##$TUNHOUT= 0
##$TUNXOUT= 0
##$USERA1= <user>
##$USERA2= <user>
##$USERA3= <user>
##$USERA4= <user>
##$USERA5= <user>
##$V9= 5
##$VALIST= <valist>
##$VCLIST= <CCCCCCCCCCCCCCC>
##$VD= 0
##$VDLIST= <DDDDDDDDDDDDDDD>
##$VPLIST= <PPPPPPPPPPPPPPP>
##$VTLIST= <TTTTTTTTTTTTTTT>
##$WBST= 1024
##$WBSW= 4
##$XGAIN= (0..3)
0 0 0 0 
##$XL= 0
##$YL= 0
##$YMAX_a= 800715
##$YMIN_a= -748303
##$ZGOPTNS= <>
##$ZL1= 120
##$ZL2= 120
##$ZL3= 120
##$ZL4= 120
##$ABSF1= 10
##$ABSF2= 0
##$ABSG= 5
##$ABSL= 3
##$ALPHA= 0
##$AQORDER= 0
##$ASSFAC= 0
##$ASSFACI= 0
##$ASSFACX= 0
##$ASSWID= 0
##$AUNMP= <proc_1d>
##$AZFE= 0.1
##$AZFW= 0.1
##$BCFW= 1
##$BC_mod= 2
##$BYTORDP= 1
##$COROFFS= 0
##$CY= 11.3945322036743
##$DATMOD= 1
##$DC= 2
##$DFILT= <>
##$DTYPP= 0
##$F1P= 2.36226072786647
##$F2P= -0.459571619588291
##$FCOR= 0.5
##$FTSIZE= 0
##$FT_mod= 4
##$GAMMA= 1
##$GB= 0.15
##$INTBC= 1
##$INTSCL= 1
##$ISEN= 128
##$LB= 0.24
##$LEV0= 0
##$LPBIN= 0
##$MAXI= 10000
##$MC2= 0
##$MEAN= 0
##$ME_mod= 0
##$MI= 1.114404
##$NCOEF= 0
##$NC_proc= 0
##$NLEV= 6
##$NOISF1= 3.799351
##$NOISF2= 2.8
##$NSP= 1
##$NTH_PI= 0
##$NZP= 0
##$OFFSET= 15.70392
##$PC= 1
##$PHC0= -18032.06
##$PHC1= 7.600739
##$PH_mod= 1
##$PKNL= yes
##$PPARMOD= 0
##$PSCAL= 0
##$PSIGN= 0
##$REVERSE= no
##$SF= 200.130013532006
##$SI= 16384
##$SIGF1= 3
##$SIGF2= 2
##$SINO= 400
##$SIOLD= 16384
##$SREGLST= <1H.CDCl3>
##$SSB= 0
##$STSI= 0
##$STSR= 0
##$SW_p= 3612.71676300578
##$SYMM= 0
##$S_DEV= 0
##$TDeff= 0
##$TDoff= 0
##$TI= <>
##$TILT= no
##$TM1= 0
##$TM2= 0
##$TOPLEV= 0
##$USERP1= <user>
##$USERP2= <user>
##$USERP3= <user>
##$USERP4= <user>
##$USERP5= <user>
##$WDW= 1
##$XDIM= 8192
##$YMAX_p= 0
##$YMIN_p= 0
$$ End of Bruker specific parameters
$$ ---------------------------------
##NTUPLES= NMR FID
##VAR_NAME=  TIME,          FID/REAL,        FID/IMAG
##SYMBOL=    X,             R,               I
##VAR_TYPE=  INDEPENDENT,   DEPENDENT,       DEPENDENT
##VAR_FORM=  AFFN,          ASDF,            ASDF
##VAR_DIM=   8192,          8192,            8192
##UNITS=     SECONDS,       ARBITRARY UNITS, ARBITRARY UNITS
##FACTOR=    0.0002768,     1,               1
##FIRST=     0,             0,               0
##LAST=      2.2672688,     0,               0
##MIN=       0,             -748303,         0
##MAX=       2.2672688,     800715,          0
$$ Real data points
##PAGE= N=1
##DATA TABLE= (X++(R..R)), XYDATA
$$ [...]
2096E557k880o206n9O544M499l126o321q00N850L909m207o915K1O020K603m652
$$ 5557 2677 -3529 -3588 2956 7455 4329 -1992 -2792 3058 6967 2760 -4155 -4134 1886 4489 -163
2112a63n732k71N342L531l523n663R33O945L107m105m636J333P020L125m670n597
$$ -163 -5895 -6166 -824 2707 -816 -6479 -5546 1399 4506 401 -4235 -2902 4118 7243 2573 -3024
2128c024J926O598J414n409n141J193M916J632m670n404J264N942J285n520m250
$$ -3024 -1098 5500 6914 1505 -3636 -2443 2473 4105 -565 -5969 -4705 1237 2522 -2998 -7248
2143g248K936O561J704m788m070L442O314R44n335l432L747N265R7n173m352J885
$$ -7248 -4312 2249 3953 -835 -4905 -1463 4851 5795 460 -2972 775 6040 6137 964 -3388 -1503
2159a503N429J8n969m351L608N418j153n703k883M031N481l27n262k099M794N539
$$ -1503 3926 3944 -2025 -6376 -2768 2650 1497 -4206 -7089 -3058 2423 2096 -3166 -5265 -471 5068
2175E068q04m780k491L745N638m77o090l068M604M283k593n964j842M212L772
$$ 5068 4264 -516 -3007 738 6376 5899 -191 -3259 1345 5628 3035 -2929 -4771 -559 3213
2190C213j962n717j464M379M308k432m906n84M801M754j778n501j237N518M532
$$ 3213 1251 -4466 -5930 -1551 2757 325 -4581 -5165 -364 4390 2612 -2889 -4126 1392 5924
2205E924k749n355j74N182K912l164m841m79M474K944l291n067K4M760K706l535
$$ 5924 3175 -2180 -2354 2828 5740 2576 -2265 -2744 1730 4674 1383 -3684 -3660 1100 3806 271
2221B71n233j65N472L180l722n165J081N531K136l738m060J452N258K231l279
$$ 271 -4962 -5127 345 3525 -197 -5362 -4281 1250 3386 -352 -4412 -2960 2298 4529 1250
2236A250l829J388N190J534l723m187J419N261J577n036m820J781N095L35n311
$$ 1250 -2579 -1191 3999 5533 1810 -2377 -958 4303 5880 844 -3976 -2195 2900 3235 -2076
2251b076l744K070M661O80m263l452K083M999J260m020k607L281N276N71m635
$$ -2076 -5820 -3750 911 1591 -2672 -6124 -4041 958 2218 -1802 -4409 -1128 4148 4719 84
2266H4k593L562N458n85m942k728K921L811r25m934l226K056M001o15n083k742
$$ 84 -2509 1053 6511 5926 984 -1744 1177 4988 4063 -871 -4097 -2041 1960 1345 -3738 -6480
2282f480L154M031r82m482j171M348M534p61m246q30M527M066j155m099j337L425
$$ -6480 -3326 705 -277 -4759 -5930 -1582 2952 2191 -2055 -2885 1642 5708 4553 454 -883 2542
2298B542L831j600n346j897L239L035k476n239j165L863K804k522m520j78M403
$$ 2542 6373 4773 -573 -2470 769 3804 1328 -3911 -5076 -1213 1591 -931 -5451 -5629 -1226
2313a226L225k140l701M45M680L237j865m283O1M652L056k766m566k09M210J824
$$ -1226 1999 -141 -3842 -3397 1283 4520 2655 -1628 -1567 3085 6141 3375 -1191 -1400 2810 4634
2329D634l515m496L92M092J497l470l802O75M065K053l165l561J268M975K233
$$ 4634 1119 -3377 -2985 1107 2604 -866 -4668 -3993 72 2125 -1040 -4601 -3333 1642 3875
2344C875l272l834J689M730J542l557l399J788M007M98l697l353J149L671R14
$$ 3875 603 -3231 -1542 3188 4730 1173 -2226 -438 3569 4067 370 -2983 -1834 1837 2751
2359B751m003l014J587M418O58m090k977K444M908L35l945k236K635M000k28l594
$$ 2751 -1252 -4266 -2679 1739 2397 -1693 -4670 -2226 2682 3017 -928 -3164 -529 3471 3243 -351
2375c51k198K192L655l8l803k469K046L650l46m356k087L162L999j070m418j320
$$ -351 -2549 -357 3298 3260 -543 -3012 -966 2684 2338 -2018 -4105 -943 3056 1986 -2432 -3752
2391c752L031L502q31l710j191K802L476p28l765j819K984L475j273m097j101
$$ -3752 -721 2781 1950 -1760 -2951 -149 3327 2599 -1166 -2985 -1 3474 2201 -1896 -2997
2406b997L488L102k176m222n11L691K591j781l579m48L264K702j564l856q04L479
$$ -2997 491 3593 1417 -2805 -3316 375 2966 1185 -2394 -2842 422 3124 1560 -2296 -3100 379
2422C79L067j966l862l52L558K221k222l714M24L938J628k559l301N46L274K051
$$ 379 3446 1480 -2382 -2734 824 3045 823 -2891 -2467 1471 3099 540 -2761 -2215 1059 3110
2438C110k236l293J61L721K358k656l949N88L648J688k779l233J143L458J002
$$ 3110 874 -2419 -2258 1463 3821 1165 -2784 -2196 1452 3140 361 -2872 -1729 1729 2731
2453B731l283k817J377L632Q82k832k751J139L714J191l157l100J611M028R19
$$ 2731 -552 -3369 -1992 1640 2522 -310 -3061 -1922 1792 2983 -174 -3274 -1663 2365 3284
2468C284l366k395J613L492K54l348k097J993K805j2k857k006J340L321K69l639
$$ 3284 -82 -2477 -864 2628 2882 -466 -2563 -570 2235 2223 -634 -2640 -1300 2021 2290 -1349
2484a349k539K532L904k82l906j538K233L083j83l075j764K707K960p38l280j101
$$ -1349 -3888 -1356 2548 2266 -1640 -3178 -945 2138 1955 -1120 -2884 -177 2783 2045 -1235 -2336
2500b336K290K962l34l470j443K790K904j353l826q22K959K446j370l236j107
$$ -2336 -46 2916 2582 -888 -2331 459 3363 2010 -1816 -2638 321 2767 1397 -1839 -2946
2515b946K394K635j503l264m14K479K353r06k977m32K830K695j734l181L83L585
$$ -2946 -552 2083 580 -2684 -3098 -619 1734 828 -2149 -2581 249 2944 1210 -1971 -1588 1997
2531A997J847k049k825k30K610K098k100l238L0K802J300k324k928j28K737K064
$$ 1997 3844 1795 -1030 -1260 1350 3448 1348 -1890 -1860 942 2242 -82 -3010 -3138 -401 1663
2547A663k153k944Q30L339J235k484k055J418K961J241j816k647O85L219J196
$$ 1663 -490 -3434 -2604 735 1970 -514 -2569 -1151 1810 3051 1235 -1412 -727 2492 3688
2562C688k532k570O18K651Q56k564k750P91K926Q8l099j544J869K632L36k296
$$ 3688 1156 -1414 -796 1855 2711 147 -2603 -1812 1114 1202 -1897 -3441 -1572 1060 1396 -900
2578i00j941J193L192Q63k710j847J730L091K60k977j975J554K958j07l200j387
$$ -900 -2841 -1648 1544 2407 -303 -2150 -420 2671 2931 -46 -2021 -467 2491 2384 -816 -2203
2594b203K007K128r00k349j238J503K740O6l207j414K340L002o76l160r43K027
$$ -2203 -196 1932 1032 -1317 -2555 -1052 1688 1754 -1453 -2867 -527 2475 1799 -1361 -2304 -277
2610b77K781n81k956j233K475J816j259k463m87K169K050p92k807r96K636K490
$$ -277 2504 1923 -1033 -2266 209 2025 766 -1697 -2184 -15 2035 1243 -1564 -2560 76 2566
2626B566j465k783J4K761J481j181k832m11K568J563j248k607k00K087J249j249
$$ 2566 1101 -1682 -1668 1093 2574 1393 -1439 -1850 718 2281 1033 -1574 -1774 313 1562 313
2642C13k379k67K423J882j770k536N81L059J055k090k264N82K757J486j957k388
$$ 313 -2066 -2333 90 1972 202 -2334 -1753 1306 2361 271 -1993 -1411 1346 2832 875 -1513
2658a513L46K475Q37j716k196M54K227J303k312k451P34K936M97k326j632J415
$$ -1513 -1167 1308 2145 429 -1767 -1313 914 2217 -95 -2546 -1812 1124 1621 -705 -2337 -922
2674i22K488M81k215j847J063K566M22j952j962R47K490L03k136k053J203K721
$$ -922 1566 2047 -168 -2015 -952 1614 2036 84 -1878 -931 1559 1862 -274 -2327 -1124 1597
2690A597k19k648q95J654K088m14j855j320J445K494J30k321j291J547K059r7
$$ 1597 1378 -1270 -2165 -511 1577 1163 -692 -2012 -567 1927 2057 -264 -1555 -8 2051 1954
2706A954k442j356J559K293n14k750j043J843J520q71j862n73J869J525m26k158
$$ 1954 -488 -1844 -285 2008 1494 -1256 -2299 -456 1064 193 -1669 -2242 -373 1152 726 -1432
2722a432q12K071K367o48k305n28K051K116j017k499k43J983J180j171k061k22
$$ -1432 -2244 -173 2194 1546 -759 -1287 764 2880 1863 -636 -879 1104 2284 1113 -948 -1170
2738a170J340J238j271k240m41K128J651j531k224o5K381J505j218k006L06K616
$$ -1170 170 1408 137 -2103 -2544 -416 1235 -296 -2520 -2585 -204 1301 83 -1923 -1617 999
2754I99J465j231j955M54K016R50j230j786J78K069N84j792k186K13J942N69k020
$$ 999 2464 1233 -722 -268 1748 2698 1468 -318 -140 1929 2513 721 -1465 -1252 690 1259 -761
2771g61k176O99K350N06k070j637R20K181P00j153j235Q78K049Q06j189j572J192
$$ -761 -2937 -2238 112 618 -1452 -3089 -2169 12 712 -441 -1676 -798 1251 2057 868 -704 488
2788D88K316M21k198j470J222J617r5k362j708R30J896m12j865j625O64J769K18
$$ 488 2804 3225 1027 -443 779 2396 2301 -61 -1769 -839 1057 645 -1220 -2845 -2181 -412 -194
2805a94j671j191J350K254o7j701m95J867J957k24j728j96J610J586m80k039r74
$$ -194 -1865 -3056 -1706 548 481 -1220 -1715 152 2109 1885 157 -39 1571 3157 2677 638 -336
2822c36J193J737o65k327j243J259J266j033k218n56J611J260r58j696J55J861
$$ -336 857 2594 1929 -398 -1641 -382 884 -149 -2367 -2923 -1312 -52 -1010 -2706 -2551 -690
2838f90J382p04j447l2K290J777n78j919k55K044J313j051j996l27J790Q61j585
$$ -690 692 -12 -1459 -1491 799 2576 1998 79 -176 1868 3181 2130 134 -193 1597 2458 873
2855H73k037j72J195O58j387j826J96J455J126j396j445L26K130J419j177j268
$$ 873 -1164 -1336 -141 517 -870 -2696 -2500 -1045 81 -1315 -2760 -2434 -304 1115 -62 -1330
2871a330P20K165P03j047j199N24J784M11j342j312K09J219Q9j571j859M91J594
$$ -1330 -610 1555 2258 1211 12 536 2320 2731 1389 77 286 1505 1594 23 -1836 -1345 249
2888B49L24k081j453P28J693L43j498q94J183J969M83j109p23R71J579O81j323
$$ 249 573 -1508 -2961 -2233 -540 -197 -1695 -2589 -1406 563 1046 -63 -786 185 1764 2445 1122
2905A122j134J120J609l07k114j062Q62J379o61j989q73R87J230n69j669o46J077
$$ 1122 -12 1108 2717 2410 296 -766 96 1475 814 -1175 -2048 -1061 169 -400 -2069 -2715 -1638
2922a638J521L65j503n50J564J676k46j395j80J697J393n97j597k90J064J027
$$ -1638 -117 248 -1255 -1805 -241 1435 1189 -206 -386 1311 2704 2107 510 220 1284 2311
2938B311j140j593p48J103R54r97j574r13J237J157n19j579M8J624J264q03q27
$$ 2311 1171 -422 -1170 -67 887 -110 -1684 -2597 -1360 -203 -722 -2301 -2253 -629 635 -168 -995
2955i95L55J556J239o40j312L27J575O88r12j870m76J339Q41j294j809n28J487
$$ -995 -640 916 2155 1515 203 530 2105 2793 1881 11 -465 874 1715 421 -1388 -1916 -429
2972d29M22j585j226M31J430O96q18q44P72J586O81p36n83Q92J569Q77j255j595
$$ -429 -7 -1592 -2818 -2387 -957 -261 -1079 -1923 -1151 435 1116 380 -203 689 2258 3135 1880 285
2990B85O10J606j27j654j504M12Q28k97j310j324K91J050j8r73p10R10J634M65
$$ 285 895 2501 2374 720 -784 -372 456 159 -1151 -2475 -2184 -1134 -1152 -2125 -2835 -1925 -291 174
3008A74q57o95J262K198N04j449l84J135J144m13j190q97K76Q50k26j828j349
$$ 174 -683 -1378 -116 2082 2586 1137 753 1888 3032 2619 1429 532 808 1658 1432 -396 -1745
3025a745M84N66l77j401o37R01J432j61j277n9J711J343J5p88K63R75J448J57
$$ -1745 -1261 -695 -1072 -2473 -3110 -2209 -777 -938 -2215 -2274 -563 780 795 7 270 1245 2693 2850
3043B850j387q44J024R43r87j505n52P82N03r99j840m45J168O22p70r05J07J187
$$ 2850 1463 619 1643 2586 1599 94 -458 324 827 -172 -2012 -2457 -1289 -667 -1437 -2342 -2235 -1048
3061a048R80j21q80k8J719J398l70j233J51J216N95j022j274p0J052L93j401j181
$$ -1048 -68 -189 -1069 -1097 622 2020 1650 417 568 1784 2379 1357 83 13 1065 1458 57 -1124
3079a124Q4J007k71o74r79J65J256J061q70j380O76J483N91q29n12M20J320K52
$$ -1124 -1040 -33 -304 -978 -1957 -1792 -536 525 -345 -1725 -1049 434 1025 196 -316 104 1424 1676
3097A676j067r09M09J062r2j000q76L88O41M06j186j289O43J588K53j288o81Q87
$$ 1676 609 -300 109 1171 1079 79 -797 -409 232 638 -548 -1837 -1194 394 647 -641 -1322 -435
3115d35R82Q4p94m35O02J096k9r80m83N85P53l7j262p83Q42J273k52j570n00Q18
$$ -435 547 631 -163 -598 4 1100 1071 91 -392 193 946 909 -353 -1136 -294 979 727 -843 -1343 -525
3135e25R52l27p63l59P66R85o2j028l95R76P33k69p21j50M38J144m73j485j03
$$ -525 427 100 -663 -1022 -256 729 667 -361 -756 220 953 684 -37 -187 251 1395 922 -563 -666
3154f66R59Q03r18j010k05Q24O69l99q88l84R05O59k95p50Q3P87P68n65j012L27
$$ -666 293 1096 178 -832 -1037 -213 456 57 -831 -1215 -310 349 54 -696 -613 174 942 377 -635 -308
3174c08J206P11j145q65L52P80K97o25q24k19R01M19q10r04k4P63N12o07q32K15
$$ -308 898 1609 464 -401 -49 731 1028 403 -421 -640 261 680 -130 -1034 -1058 -295 217 -390 -1222 -1007
3194a007J295L21r75n93P69R14K80o56n66K14J016M05p50j258M61Q78J02q84p21
$$ -1007 288 609 -366 -959 -190 724 1004 348 -218 -4 1012 1417 667 -591 -130 748 850 -34 -755
3213g55K26O52j02o02p33N98R79k49o53k97M87Q41L03p43n43P03J089j2j069n35
$$ -755 -529 123 21 -581 -1314 -716 263 14 -639 -936 -449 392 695 -48 -591 112 1201 1189 120 -415
3233d15M45R18k43q68l02L18O66l79p75m56P57O20k58o98l86Q05J056m77r70r7
$$ -415 30 948 705 -163 -465 -147 519 140 -635 -1091 -334 286 28 -670 -1056 -251 805 328 -642 -739
3253g39J118O64l37r24j42N91O45m59q07j14N88M42j80j132j44P31N70l77r39
$$ -739 379 1043 706 -218 -360 231 876 417 -390 -504 84 526 346 -786 -930 -199 371 -6 -945
3272i45j9J160N96o44p57J65P97O23k85q18L8O71K87l49o27m06Q55J55n31r30
$$ -945 -964 196 792 148 -609 -444 353 976 691 -127 -89 582 869 520 -107 -513 342 497 -34 -964
3292i64J10J051J84r08n89L18R03J44l15o81L06P67L37l19n61O3Q46M25n41q25
$$ -964 -854 197 381 -527 -1116 -798 105 249 -66 -747 -441 326 663 344 -217 -154 692 1117 576 -249
3312b49J36R15j0q18o73N53O69l8r98m84M19N88rn18m64L92Q29L23p11n78M80
$$ -249 -113 802 792 -26 -699 -146 523 485 -513 -997 -578 10 1 -517 -981 -589 240 563 -148 -726 -246
3333b46J034l1o57k97N88M92m06o14j41L97N48l5p12n15L02Q19oj282k47N01R02
$$ -246 788 757 100 -197 391 883 477 -137 -278 119 667 632 -80 -595 -293 526 520 -762 -1009 -508 394
3354C94r0o94k60M27O28l96m01p5M07N77k56n02j52N12N76k79p24n9P06O35n17
$$ 394 304 -390 -650 -223 405 9 -392 -467 -60 517 261 -241 -393 119 695 416 -308 -367 339 974 457
3375D57o33j0M95M59l67o93LM31K26m32o01p1N84L37m49o78MP64M06n02o24L46
$$ 457 -176 -186 309 768 401 -292 -289 142 368 -64 -665 -736 -152 185 -264 -942 -938 -174 232 -270 -894 -548
3397e48Q72M25m69l21N3P97J37l23l30n9M35L00m99p59m6O63R4r38n52K66O74
$$ -548 324 749 280 -41 12 809 946 623 293 234 669 969 470 -289 -335 328 422 -516 -1068 -802 -128
3418a28j50n99k62J47P53M28l16k46J24P46L74k32o68N19P39J0p47l50L49M61
$$ -128 -278 -877 -1139 -992 -239 189 -127 -373 -249 497 871 639 -29 490 1229 1239 492 142 491 952
3438I52n05o50l48L41L13k51o25k91J46N56K16n11l59P23O01J00p10j12P35O22
$$ 952 447 -203 -551 -210 103 -148 -773 -1064 -918 -362 -146 -657 -1016 -293 308 408 -302 -414 321 943
3458I43n45l15J47M42J98k09m16m52M59L19j33p88j17K25N49k72n80k92N57L88
$$ 943 398 83 230 672 870 661 245 -207 252 571 438 -350 -467 -242 307 35 -545 -837 -280 108
3478A08l15l78K72L26J97k24l12j43O39L23p6p14L2O86J50j11n99k54Q42M42n03
$$ 108 -207 -585 -313 13 210 -14 -326 -469 170 493 417 -297 -265 421 571 460 -139 -393 449 891 388
3499C88m93J7K82L1k81m44J79L78K33n95n78J67P06M3j96m70J81O79K85l52l09
$$ 388 -105 -88 194 225 -56 -500 -321 57 290 -305 -883 -716 -10 33 -163 -633 -452 227 512 160 -149
3520a49J36N30Lk28j75K5K07J2l11m85O2N52P1o85j81K59N11k5m22l45M32O92
$$ -149 -13 517 520 292 117 142 349 361 50 -435 -373 179 250 -435 -616 -357 154 129 -293 -638 -206 486
3542D86pl84k51K06M33K8o8m97m1O31l29p44qO22J05k49l63k06L36N46k91k73
$$ 486 479 95 -156 50 483 511 443 -54 -95 536 207 -537 -545 77 182 -67 -430 -636 -300 246 -45 -318
3564c18j62N33K77J98l36k43L93M54j66n84q7L98O1l35l25j75J98K00l34m92J53
$$ -318 -480 53 330 528 192 -51 342 796 630 46 -41 357 418 83 -242 -417 -219 -19 -353 -845 -692
3585f92N28J83k41l32l4M24O31q8m73J1N54L92k66k17j01K72R3l46l20j58K95
$$ -692 -164 19 -222 -554 -588 -164 467 379 -94 -83 471 863 597 380 279 551 644 298 -22 -180 115
3606A15K65o56l71m6K64J20k83j27K5N57L13m10k14L99M25J44j70k28J44K79J51
$$ 115 380 -276 -647 -693 -429 -309 -592 -719 -694 -137 176 -234 -448 -49 376 520 350 122 266 545 696
3627F96l38m95K29N26j08n07m96j3O36J1q27k81P03K36j67k7o6O0K06K66j99k75
$$ 696 358 -137 92 618 510 3 -493 -506 130 141 -686 -967 -264 -28 -195 -222 -288 -228 -22 244 45 -230
3649b30K86N09O7m93j24K45M16p7n85k32L31K86l17n10J0J48j64L51j31m10K47
$$ -230 56 565 632 139 15 260 676 599 14 -218 113 399 82 -428 -418 -270 -434 -83 -214 -624 -377
3670c77L37J01l86K3N72J91l9k37k0L74K32k57m36k08M11J3l28k27k73k3K34m4
$$ -377 -40 61 -325 -302 270 461 422 185 165 539 771 514 78 -130 281 294 -34 -261 -534 -557 -323 -367
3692c67m49k2M37M48l24l2O7N13L80k35n6M6N59j01j98k98r9O7P3k29n06l89L48
$$ -367 -816 -838 -401 47 -277 -309 -242 271 651 416 360 406 965 864 666 368 269 336 409 180 -326 -715 -367
3715c67l07k20j37K9L46J68r2r7L72N77O8l8K18K13M93M1j48k54k30L60j99m24
$$ -367 -674 -894 -1031 -1002 -656 -488 -580 -677 -305 272 340 302 520 733 1226 1267 1119 865 635 995 796 372
3737C72o32N1p8k46m00k69J0N5p1p2j9N73N36K50j96J57M58O76K80l19k33L88
$$ 372 -260 -209 -287 -533 -933 -1202 -1192 -1137 -1208 -1280 -1299 -726 -190 60 -136 21 479 1155 1435 1116 883 1271
3759A271J81k63l00l78k42p4j66n67l95N4P4k29l34j69L16P25M5k66J57P32M75
$$ 1271 1452 1189 889 511 269 195 29 -538 -933 -879 -805 -1034 -1368 -1537 -1221 -496 -451 -717 -560 172 647
3780F47J4l1J7M83K8N9k68m95J77J12l30n20l55J79j40m20m13J48K90J63l9k36
$$ 647 661 630 647 1130 1158 1217 949 454 631 743 413 -107 -462 -283 -423 -843 -1256 -1108 -818 -655 -694 -930
3802i30L53L85K46rJ78O2J92M06j05j65k08L02Ql69k82M1k3K5n21k66K93m1J75
$$ -930 -577 -192 54 45 223 285 477 883 778 613 405 707 715 346 64 105 82 107 -414 -680 -387 -428 -253
3825b53k67k01L45J75J87O9j50LM26N4n2r6J38K50j28k51k04J7Qk45J2j14o0K98
$$ -253 -520 -721 -376 -201 -14 55 -95 -92 334 388 336 240 378 628 500 249 45 62 70 -175 -163 -277 -337 -39
3849c9j43j96K9j88O33K12l45j50K37K45r0j78kL27J16j86j32j23r8J67q9j16
$$ -39 -182 -378 -349 -537 96 308 -37 -187 50 295 205 27 25 352 468 282 150 27 -71 96 7 -109
3871a09k36J54L20n3l80o2M5M43k17n3O5K06J22K2l60K32k38L99k48k64J19R4
$$ -109 -345 -191 129 76 -304 -366 -321 122 -95 -148 -83 123 245 267 -93 139 -99 300 52 -212 -93 1
3893AK66l50k84J19K99J65j59m6j3n5J92p2j80M9K29R4o2k88O5n2nPl26J61J58
$$ 1 267 -83 -367 -248 51 216 57 11 -2 -57 135 63 -117 -68 161 255 193 -95 -30 -82 -87 -80 -406 -245 -87
3918h7K72m18j56J19L33L5j16j02J43O3K49N5l38N4K50J1k52j24J08J21k02m25
$$ -87 185 -233 -389 -270 63 98 -18 -120 23 86 335 390 52 106 356 367 115 -9 99 220 18 -407
3940d07j18K31J28ql92J62j04M21q7p9J3p6N15J07J00k05K17K00j04p4r4J85J21
$$ -407 -525 -294 -166 -174 -566 -404 -508 -87 -174 -253 -240 -316 199 306 406 201 418 618 514 440 346 531 652
3963F52l26k87q7q8N3m9l64j80R1R8J55k45j32J49N08l6nO6K64J7P6j22K93J20
$$ 652 326 39 -48 -136 -83 -132 -496 -676 -585 -487 -332 -577 -709 -560 -52 -88 -93 -27 237 254 330 208 501 621
3987F21J03k09N5k07k6J00j27m27r0R1lj66l66L4kM1p8O8M7K47J0O4J01jL83K85
$$ 621 724 515 570 363 337 437 310 -117 -207 -116 -119 -285 -651 -617 -619 -578 -656 -588 -541 -294 -284 -220 -119 -120 263 548
4013E48K2l42Q7O73q4l07k35j61L23k17m0j65m26J92k13m5k05j72J05R4p7j52
$$ 548 570 228 315 988 904 597 362 201 524 307 267 102 -324 -132 -345 -390 -595 -767 -662 -568 -645 -797
4035g97L06K84J44q5j43L48L39L12r2r3J01O0Kl09M6Jj26j38j76k71n5Q4j62k53
$$ -797 -491 -207 -63 -148 -291 57 396 708 616 523 624 684 686 377 423 424 298 160 -16 -287 -342 -258 -420 -673
4059f73j23L45R7k36%J85J37M4M92j11j1L06J72o9J39m4k44L65k31m30L3J42r5
$$ -673 -796 -451 -354 -590 -590 -405 -268 -224 268 157 146 452 624 555 694 650 406 771 540 110 143 285 190
4082A90l37k46P8O9j03k3j61j24L59J64p8l28L03K94M7J78P4k46K49K54l94o8
$$ 190 -147 -393 -315 -246 -349 -372 -533 -657 -298 -134 -212 -540 -237 57 104 282 356 110 359 613 219 151
4104A51O6k7o1J02l60j64J88J17j89k31M9J96J6J12k44p6M84j4k4k00L20J93j86
$$ 151 217 190 129 231 -129 -293 -105 12 -177 -408 -359 -163 -147 -35 -279 -355 129 115 91 -109 211 404 218
4127B18l8O7q7Q3R4m2n18J36J27J8k26r4N3n0K73l34n5J35J13j09J02K65o4J29
$$ 218 180 247 160 243 337 295 -223 -87 40 58 -168 -262 -209 -259 14 -320 -375 -240 -127 -236 -134 131 67 196
4151A96K56k54P9l3L10ro77J61J60k0N2k78j91l1K7Qj63l1p7P3J28K37k97L74
$$ 196 452 198 277 244 554 545 -132 29 189 169 221 -57 -248 -279 -252 -244 -407 -438 -515 -442 -314 -77 -374 0
4175@J23Po7L2K84K35k01j60Q6JQ0J5k77l17J42M8k44j80k93J31J08j5k42J39
$$ 0 123 130 63 95 379 614 413 253 339 340 420 435 158 -159 -17 31 -213 -393 -686 -555 -447 -462 -704 -565
4199e65J86K37j23J40J77L68jK34k15n8K63oj33l12q8j8N8m6m54R1p2k08l4j13
$$ -565 -379 -142 -265 -125 52 420 419 653 438 380 643 637 504 192 104 86 144 98 -356 -265 -337 -545 -579 -692
4223f92J66Q7J99k16P6N05l8L09J18J7j61K55J17k48k81j23J01J37l12l64P9J58
$$ -692 -526 -439 -240 -456 -380 125 87 396 514 531 370 625 742 494 213 90 191 328 16 -348 -269 -111
4245a11m67N2j22K73q0J18M7k8M09P4O8N2q2j5K43J47l1k08p1j36l6l03J70l59
$$ -111 -578 -526 -648 -375 -455 -337 -290 -318 91 165 233 285 203 188 431 578 547 339 268 132 96 -207 -37 -396
4269c96q5J4P2p0JP3J28m5K5L39K21m9r9K50j8K51j36Q9j58m8j56j48k14j39K0
$$ -396 -481 -467 -395 -465 -464 -391 -263 -308 -283 56 277 228 129 379 361 612 476 565 407 359 203 55 -159 -298 -278
4294b78N2j01k01k13L67P6j96k1J82J90L16R5r9P8K49L0J53j22j53p7J85k04j98
$$ -278 -226 -327 -528 -741 -374 -298 -494 -515 -333 -143 173 268 169 247 496 526 679 557 404 327 512 308 110
4317A10j69J11k49j01k03j2k4O7k4j19L6J05K86J05Mj19M34J81mj42J58J79J9
$$ 110 -59 52 -197 -298 -501 -513 -537 -470 -494 -613 -577 -472 -186 -81 -77 -196 238 419 415 273 431 610 629
4340F29j59j55m9R5k11k09j55j25Mo3rj37r0K20J9N6r4J01J83L83m8j04K81M0
$$ 629 470 315 266 361 150 -59 -214 -339 -335 -398 -407 -544 -634 -414 -395 -339 -433 -332 -149 234 186 82 363 403
4364D03J8nO0j07K7j03m9j47j3L2n5l28k03KJ58R9j80j15K7J71o3K16Q9J18J03
$$ 403 421 416 476 369 396 293 244 97 84 116 61 -267 -470 -468 -310 -211 -391 -506 -479 -308 -371 -155 -66 52 155
4389A55K20j94J77P2N7k9l25j23J54J62l4k90j97M9j0j95oj8o4J74J0o9K29M4
$$ 155 375 181 358 430 487 458 133 10 164 326 292 2 -195 -146 -156 -351 -357 -375 -439 -265 -255 -324 -95 -51
4413e1jK42k1o5J52M08k60qn7M8qj40j94p6k8J75j64k28j78j1J09k8l07M45J18
$$ -51 -52 190 169 104 256 664 404 396 339 387 379 239 45 -31 -59 116 -48 -276 -454 -465 -356 -384 -691 -246 -128
4438a28O0Q1j60K77J79R1k28K66k14K66k25K5j15k06p1O7J01j81j33m1J04l35
$$ -128 -68 13 -147 130 309 400 172 438 224 490 265 290 175 -31 -102 -35 66 -115 -248 -289 -185 -520
4460e20O3N7L37k28M3J93J02J94o5q0n8K29O7J8Mj58j25J47J5j24k72q6o4M9J6
$$ -520 -457 -400 -63 -291 -248 -55 47 241 176 96 38 267 334 352 356 198 73 220 235 111 -161 -247 -311 -262 -246
4485b46J1J02j11p6M4l1Q9K46J14k27L3J00L52k0J15m17J97M0k42M3q2r2o2o3
$$ -246 -235 -133 -244 -320 -276 -307 -218 28 142 -85 -52 48 400 380 495 78 275 315 73 116 34 -58 -120 -183
4509a83RJ18k07J29j2Q2qL03k4l3j00o9J43R8j50N6o2l1k3o8l8j08lj16P2l2o9
$$ -183 -174 -56 -263 -134 -146 -64 -72 231 207 174 74 5 148 246 96 152 90 59 36 -32 -70 -178 -181 -297 -225 -257 -326
4536c26N8J50J8K3k9J56L38j50j54K49M5K1l5k9r7j48r2J13j46k37p9q9m1m2p
$$ -326 -268 -118 -100 -77 -106 50 388 238 84 333 378 399 364 335 238 90 -2 111 -35 -272 -351 -440 -481 -523 -530
4561e30N1K54j50j36L41J36K80JK08J00R2N8J2j18L8j75P7m58O4j32k53j9m10
$$ -530 -479 -225 -375 -511 -170 -34 246 247 455 555 647 705 717 599 637 462 539 81 145 13 -240 -259 -669
4584f69j8k4o0J10o3m2K96K76r8K81M0K29K81K80L1p7K01n1k61p3j00j76j98j57
$$ -669 -687 -711 -771 -661 -724 -766 -470 -194 -292 -11 29 258 539 819 850 773 974 923 662 589 489 313 115 -42
4608d2j54k26l51J46l77J43J1KL05J67O7j36L13N75j57L8M25p7J5J74j69m3ll03
$$ -42 -196 -422 -773 -627 -1004 -861 -850 -848 -543 -376 -309 -445 -132 443 286 324 749 672 687 861 692 649 646 343
4632C43j87j98l0k36j06j4j53p0q3M19l51R1K95o2J13L67m1O4K19J07k6J4J69
$$ 343 156 -42 -72 -308 -414 -428 -581 -651 -734 -315 -666 -575 -280 -342 -229 138 97 161 380 487 461 475 644
4655F44j88j30o8j48K2n4o7k50k02k7J58l0L9P7m9p9J26K59o8LJ49J14J25k03
$$ 644 456 326 258 110 132 78 11 -239 -441 -468 -310 -340 -301 -224 -273 -352 -226 33 -35 -32 117 231 356 153
4679A53O5M1P1j87j76P0L46l92l2K0k10N9j88K74j63j33L25K7L7j9r7N0Q6L7K4
$$ 153 218 259 330 143 -33 37 383 -9 -41 -21 -231 -172 -360 -86 -249 -382 -57 -30 7 -12 -109 -59 27 64 88
4704H8J92R6j32k64K05l0jj15P0j95j86K78j23k5j25P8l8m1J94j09J66k5l4K03
$$ 88 280 376 244 -20 185 155 154 39 109 -86 -272 6 -117 -142 -267 -189 -227 -268 -74 -183 -17 -42 -76 127
4728A27j2J83m3k7m4P7nJ88j43j77j18J39Kj90r7J5o6n4m6j0m4R9j11J33M9J13
$$ 127 115 298 255 228 184 261 256 444 301 124 6 145 147 -43 -140 -125 -191 -245 -291 -301 -345 -246 -357 -224 -175 -62
4754f2N8J46k1p4K04L3j37J46R8j64J83k72J85j48k63J38l19M7RQj28R5j12n6
$$ -62 -4 142 121 47 251 284 147 293 391 227 410 138 323 175 -88 50 -269 -222 -213 -205 -333 -238 -350 -406
4778d06L0L25m5j51LJ58K63L1P9j35J8M6J65o6L0j58k09L6J8m8j34j6m2j62o5
$$ -406 -376 -51 -96 -247 -244 -86 177 208 287 152 170 216 381 315 345 187 -22 14 32 -16 -150 -166 -208 -370 -435
4803d35K68l3oKKJ10l1K44Q1j44k12K68J88o8k50J86J44j14o3j17J91j27j69j13
$$ -435 -167 -200 -206 -204 -202 -92 -123 121 202 58 -154 114 302 234 -16 170 314 200 137 20 211 84 -85 -198
4827a98R6m6n8L6N2q4Q4K8J03P1l0n1J62N6j42l6J95j62J23Rk64R5p2r5L1j51
$$ -198 -102 -148 -206 -170 -118 -202 -118 -90 13 84 54 3 165 221 79 43 238 76 199 208 -56 39 -33 -128 -97 -248
4853b48M7J40k55J63J7n7K09K5j57J02K06n6J03J20j20n9n2L3p2J5K1j15j24k7
$$ -248 -201 -61 -316 -153 -136 -193 16 41 -116 -14 192 136 239 359 239 180 128 161 89 104 125 10 -114 -141
4877a41k11N2L1j1o2o8K6K13N0J01p6J92j04K09K96q2PL6k2q5j05J03k32r3j21
$$ -141 -352 -300 -269 -280 -342 -410 -384 -171 -121 -20 -96 96 -8 201 497 415 422 458 436 351 246 349 117 24 -97
4902i7j72K33j97j67j42L6j36N6K92m9j4L16J5O5K44J00p7K90j30j6J39k5k26
$$ -97 -269 -36 -233 -400 -542 -506 -642 -586 -294 -343 -357 -41 -26 39 283 383 306 596 466 450 589 564 338
4925C38Pk95O3k11q6j42l8j66j53J55N3J05m9K11q0K78m8L00q7J02R8L45j45j11
$$ 338 345 50 113 -98 -184 -326 -364 -530 -683 -528 -475 -370 -419 -208 -288 -10 -58 242 155 257 355 700 555 444
4949D44m0j88j6q0P2k11l7k95k51M3J07j7o5J01K01mJ13K19J12k6K00n8K1J08
$$ 444 404 216 200 120 192 -19 -56 -351 -602 -559 -452 -469 -534 -433 -232 -236 -123 96 208 182 382 324 345 453
4973D53J02r0L1k05k4j77p3j05o8k43J05J58l24L2R9q6QL85k30L76M7k5J80P5
$$ 453 555 465 496 291 267 90 17 -88 -156 -399 -294 -136 -460 -428 -329 -415 -407 -22 -252 124 171 146 326 401
4997D01l6n7J1O7j40Q7j02j06l30JO2o6j70R9j35J3j29L33q7L3K89o5P1J58K2
$$ 401 365 308 319 386 246 333 231 125 -205 -204 -142 -208 -378 -279 -414 -401 -530 -197 -284 -251 38 -27 44 202 224
5022B24J58oO8q7rO4j71j17j78L1r6n1j23q2q8K09k35L0n4L96J2j09J47P5R5L40
$$ 224 382 376 444 357 348 412 241 124 -54 -23 -119 -170 -293 -375 -463 -254 -489 -459 -513 -117 -105 -214 -67 8 103 443
5048D43n6J2j78J05P2J81j43k16p6j39M9k68l3M8m9j05j21J30Q6J70j89P4J78
$$ 443 387 399 221 326 398 579 436 220 144 5 54 -214 -247 -199 -248 -353 -474 -344 -258 -88 -277 -203 -25
5071b5J09R9k3J26j35o3K74lp3j80RM8r0k54J3O4l70jP5J4P8l5l3K96RJ62J12
$$ -25 84 183 160 286 151 88 362 359 286 106 115 163 73 -181 -168 -104 -474 -475 -400 -386 -308 -343 -376 -80 -71 91 203
5098B03q5M9n3M0L19k04O6N6k45r6j84J80j92l6J8k44O2J0j3n4K27M4j36K94K95
$$ 203 118 167 114 154 473 269 335 391 146 50 -134 46 -146 -182 -164 -408 -346 -336 -349 -403 -176 -132 -268 26 321
5123C21j55p4K39M6J8p4J28r7r8j0o0j01k2l10J5r6j85M7P0K11k66P6J17K23J03
$$ 321 166 92 331 377 395 321 449 352 254 244 184 83 61 -249 -234 -330 -515 -468 -398 -187 -453 -377 -260 -37 66
5148F6r0K37N8J0R3L21k63j47J93j57j01j63N2k00L2j32j12j57J75j70O3o0J38
$$ 66 -24 213 271 281 374 695 432 285 478 321 220 57 109 -91 -59 -191 -303 -460 -285 -455 -392 -452 -314
5171c14m0J74J99j28OJ90K59j2N0L9j4r9O3l22J94L7m04M0j11M7j60P0OJ39j07
$$ -314 -354 -180 19 -109 -103 87 346 334 384 423 409 310 373 51 245 282 -122 -82 -193 -146 -306 -236 -230 -91 -198
5196a98n7K55j37l4m3J76m7MJ85O2Mj53J00p3R5l7j31O8J42r8p0Mj80L5q7J32
$$ -198 -255 0 -137 -171 -214 -38 -85 -81 104 166 170 17 117 44 139 102 -29 39 181 83 13 17 -163 -128 -215 -83
5222h3K5J37j57R9j26L0J06O3N0k76o6K28J56k81J27J20j40N4m2J5P7j96J62m8
$$ -83 -58 79 -78 21 -105 -75 31 94 144 -132 -198 30 186 -95 32 152 12 66 24 39 116 -80 82 34
5246C4n5n1Q9Mj07J55lmn9J20j71J57k27K08j22J04j7o9k09K55J7l5j53k7P0K28
$$ 34 -21 -72 17 21 -86 69 66 62 3 123 -48 109 -118 90 -32 72 55 -14 -223 32 49 14 -139 -166 -96 132
5272A32j24o3J1j63K04N8nK6j98K52k03M5K0L27l42J48k17O6qO1j54m4J6j5J55
$$ 132 8 -55 -44 -207 -3 55 50 76 -122 130 -73 -28 -8 319 -23 125 -92 -26 -34 27 -127 -171 -155 -170 -15
5297a5j28J27m7j33J9M8J00J2N6j28J44Oj23J46m7pM1j4Qp6J85k81R0K8J90j15
$$ -15 -143 -16 -63 -196 -177 -129 -29 -17 39 -89 55 61 -62 84 37 30 71 57 65 -11 174 -107 -17 11 201 86
5323H6k6Q7j63K0K3m9Ol0k68K55l8R1k05J99q5O9n4K04l7Pn5M2j4L4n6L3J87l37
$$ 86 60 147 -16 4 27 -22 -16 -46 -314 -59 -97 -6 -211 -12 -97 -28 -82 122 85 92 37 79 65 99 43 76 263 -74
5351g4R7K7l9j98J13o8L7k07L11j32J26l55K55p3K24q2k4J60j56m7J48O1N5K2
$$ -74 23 50 11 -187 -74 -142 -105 -312 -1 -133 -7 -362 -107 -180 44 -38 -62 98 -58 -105 43 104 159 181
5375A81jq2m8J54k40p6L8j23J32mOr8J06j13J3R9l7P1J11k29J51J12j67J94N9
$$ 181 180 98 50 204 -36 -112 -74 -197 -65 -69 -63 -161 -55 -168 -155 -56 -93 -22 89 -140 11 123 -44 150 209
5400B09k57J57r6n4K30l05j17K64kj02Q6P0k02q8J53K50k37R9K7j53K56l8L9l3
$$ 209 -48 109 13 -41 189 -116 -233 31 29 -73 13 83 -119 -207 -54 196 -41 58 85 -68 188 150 189 156
5424A56P6j99j29J29J2j22m9j02J51j16rJ05O3j90O7J04O8Kn8J75j89L01k09K20
$$ 156 232 33 -96 33 45 -77 -126 -228 -77 -193 -202 -97 -34 -224 -157 -53 15 17 -41 134 -55 246 37 257
5448B57r3R8j81mR8r1n6j83J87k04k9r5J66Q2q4n8N9l1O5j28K51K1R0K2M8M6j00
$$ 257 164 262 81 77 175 84 28 -155 32 -172 -201 -296 -130 -48 -132 -190 -131 -162 -97 -225 26 47 137 159 207 253 153
5475A53L1M9j51o5K26j93r2j90J24r1J00j60j7J51m0j48J54K4Q1j1l5K37j04p3
$$ 153 184 233 82 17 243 50 -42 -232 -108 -199 -99 -259 -276 -125 -165 -313 -159 -135 -54 -65 -100 137 33 -40
5499d0N1J92K7r6p2oN7R5k66J59j00R7J5j72n9J26j36R1L5q8l2l7J05l1R7k17
$$ -40 11 203 230 134 62 56 113 208 -58 101 1 98 113 -59 -118 8 -128 -37 -2 -90 -122 -159 -54 -85 12 -205
5525b05Q3J21J13o7ono1R3J58m5M3J25k64n6j19J66k08J60m1%j21M4J23k75M5
$$ -205 -122 -1 112 45 39 34 -27 66 224 179 222 347 83 27 -92 74 -134 26 -15 -15 -136 -92 31 -244 -199
5550a99p1K45J0P9M1q9N5o9J00M2L9j42j61K41k7j56j39J24m1j51K46n5k6l9K12
$$ -199 -270 -25 -15 64 105 16 71 2 102 144 183 41 -120 121 94 -62 -201 -77 -118 -269 -23 -78 -104 -143 69
5575F9l01L72J04L0k51K63q4j22J23J7k9p4k7j85r8M9l2m6k4m0K4j77K50n2K01
$$ 69 -232 140 244 274 23 286 202 80 203 220 191 117 90 -95 -193 -144 -176 -222 -246 -286 -262 -439 -189 -241 -40
5600d0j54K23J43P9p9R4r5L2J65J84k40p9p1n6k19Q5j33j30O0j24J5j16K34n6
$$ -40 -194 29 172 251 172 266 171 203 368 552 312 233 162 106 -113 -28 -161 -291 -231 -355 -340 -456 -222 -278
5624b78J1J08J04J21J09J2J25K7j16lL2O9j87j36J32m4k10p7L5j06q4r8J49L2
$$ -278 -267 -159 -55 66 175 187 312 339 223 220 252 321 134 -2 130 86 -124 -201 -166 -272 -356 -454 -305 -273
5648b73L2J2L4J11K36R8K9M1j46n7K99L1j49j49Oj67M8l0J05l04j22N6j38J25
$$ -273 -241 -229 -195 -84 152 250 279 320 174 117 416 447 298 149 155 -12 36 6 111 -193 -315 -259 -397 -272
5672b72Rm3J62R7JL7J12J95q0J0K50p7j08K3k44L1k25J46j32j20L2r0J29j97J71
$$ -272 -263 -306 -144 -47 -46 -9 103 298 218 228 478 401 293 316 72 103 -122 24 -108 -228 -196 -286 -157 -354 -183
5697a83k59K46q4J40j31K76K57L3k42K09j06N6J32L9j80j79p7J07j6j64Q4k70
$$ -183 -442 -196 -280 -140 -271 5 262 295 53 262 156 212 344 383 203 24 -53 54 38 -126 -42 -312
5719c12R5oR5j83K79j93qJ68J36j16J29N8o3k8K49N9l4P2j27L8k35J5o8m0j8j37
$$ -312 -217 -223 -128 -311 -32 -225 -233 -65 71 -45 84 142 79 51 300 359 325 397 270 308 73 88 20 -20 -38 -175
5745a75j10J55l0N7k37K08om3O8L14l00M1O1J09j33J08K54j55O0j1J0j5j12j08
$$ -175 -285 -130 -160 -103 -340 -132 -138 -181 -113 201 -99 -58 3 112 -21 87 341 186 246 235 245 230 118 10
5769A0R1n8j65Q0l1K6l27K86p1K8J8n5K4J39Nr4J69J30j6n5n6J18J20l08L0M5
$$ 10 101 43 -122 -42 -73 -47 -374 -88 -159 -131 -113 -168 -144 -5 0 -94 75 205 189 134 78 196 316 8 38 83
5795H3l2R1j11k92J73j87K31l4jo3nJ07k1J15m8O3P1j02K12j97K03j32p3p2L1
$$ 83 51 142 31 -261 -88 -275 -44 -78 -79 -142 -147 -40 -61 54 6 69 140 38 250 53 256 124 51 -21 10
5820A0j59L5K9q5m0O3Q1j40O3J42n0N4P3p3K55j85R2j2O8j05R2o8J3j50N7o7j3
$$ 10 -149 -114 -85 -170 -210 -147 -66 -206 -143 -1 -51 3 76 3 258 73 165 153 221 116 208 140 153 3 60 -7 -20
5847b0j79K9jr7J72j01J30J67j65N3m2J2J90K8l1P6k4o3M1J65k51j18J86l7j7
$$ -20 -199 -170 -171 -268 -96 -197 -67 100 -65 -12 -54 -42 148 176 145 221 197 134 175 340 89 -29 157 120 103
5872A03j53o7j62J32j94L13k00J39j88Q1N4R0J27n5P0Q8N6j88J24K5N5j87Rl2
$$ 103 -50 -117 -279 -147 -341 -28 -228 -89 -277 -196 -142 -52 75 20 90 178 234 46 170 195 250 63 72 40
5896D0nj69L2k22K82roJ17k07NL3R0m0K6M2J33K9k0JJ5L5n1k11K15k02J61k21
$$ 40 35 -134 -102 -324 -42 -51 -57 60 -147 -142 -109 -19 -59 -33 9 142 171 151 152 167 202 151 -60 155 -47 114 -107
5923a07q4M6J28k9m3n1n7j7J78K37k48J94j4J8rj9J06l6R8l38R4J26j71Q4q5r2
$$ -107 -191 -145 -17 -46 -89 -140 -197 -214 -36 201 -47 147 133 151 142 123 229 193 291 -47 47 173 2 86 1 -91
5949i1J00k44p6K40q0r4O6o4K88j39J98j61K1K40j06m9K44R6k29K7J6j56j8J46
$$ -91 9 -235 -311 -71 -151 -245 -179 -243 45 -94 104 -57 -36 204 98 49 293 389 160 187 203 47 29 175
5973A75l21J14j07l3j9n3j18R7J42j31oK56M1L9j68K85k2P0O6n7J86k45k35L2
$$ 175 -146 -32 -139 -172 -191 -244 -362 -265 -123 -254 -260 -4 37 76 -92 193 171 241 307 250 436 191 -44 -12
5997a2J97q2k17Mn9o3o4J95r0l1j4N8J2m9K76m9O6q1J63J8m5p4P9m8J11q1r2L3
$$ -12 185 103 -114 -110 -169 -232 -296 -101 -191 -222 -236 -178 -166 -215 61 12 78 -3 160 178 133 59 138 90 201 120 28 61
6025F1j53Q1j60J48m4j25K4j31J24L7R1j06m5K43q2K01q0J06q1o5O7o1K6J51k21
$$ 61 -92 -11 -171 -23 -67 -192 -168 -299 -175 -138 -47 -153 -198 45 -37 164 84 190 109 44 111 50 76 227 6
6050Fj38j2J46J8k11K38j85r6K4J07j1J74n1Q4j08J78N4k06J39l2j62J26q2p2
$$ 6 -132 -144 2 20 -191 47 -138 -234 -210 -103 -114 60 9 93 -15 163 217 11 150 118 -44 82 0 -72
6074g2P9j07K00j95M0J13j42j43r0K21J11j03Q2n0k6L9J85j94J45j65K91k17J29
$$ -72 7 -100 100 -95 -55 58 -84 -227 -317 -96 15 -88 -6 -56 -82 -43 142 -52 93 -72 219 2 131
6097A31j3J8k1r4O2q6K59k00Ml09J47J28o6K0j36O2n2M1P8j85J92o2K01M2j25
$$ 131 118 136 115 21 83 -3 256 56 60 -249 -102 26 -40 -20 -156 -94 -146 -105 -27 -212 -20 -82 119 161 36
6122C6K3J1J42k88M9K06J28k13j14P1m6k18L27p1j13j10R4j14p4J16N1Oq0K64
$$ 36 59 70 212 -76 -27 179 307 94 -20 51 5 -213 114 43 -70 -180 -86 -200 -274 -158 -107 -101 -181 83
6146H3k80K12L00l18n0K24Q3j24M5r1O7j44J09j37R3k75Q3k19J79J0j27K25j12
$$ 83 -197 15 315 -3 -53 171 254 130 175 84 151 7 116 -21 72 -203 -120 -339 -160 -150 -277 -52 -164
6169a64o3j1J29N5J15q2J15p3L4J39k7k0j93N3J27O0j67L3N0j46J47k14J02k4
$$ -164 -227 -238 -109 -54 61 -21 94 21 55 194 167 147 -46 7 134 194 27 60 110 -36 111 -103 -1 -25
6193b5j58J03J20r5j11K16P7j31N8J72p1p6j48J66r5l9L66k40k4L4l2l1l04J29
$$ -25 -183 -80 40 -55 -166 50 127 -4 54 226 155 79 -69 97 2 -37 329 89 65 99 67 36 -268 -139
6217a39J19l7M6K0M5J26j25j6j3M0k5n8N7l7j18J7K1J78O3q9j18m3Q4j71P7Q5
$$ -139 -20 -57 -11 9 54 180 55 39 26 66 41 -17 40 3 -115 -98 -77 101 164 75 -43 -86 -2 -173 -96 -11
6243a1j23J00O2K1L8j14J25j14n0J33O5j31Oq8KJ0J01p9k1J28o3p7K06o1O1k69
$$ -11 -134 -34 28 49 87 -27 98 -16 -66 67 132 1 7 -81 -79 -69 32 -47 -68 60 -3 -80 126 65 126 -143
6269a43M3K25K6k23M6j52J58k1J6qj08K4%R9J00k54J71NK5J08j31K03ll7p5j07
$$ -143 -100 125 151 -72 -26 -178 -20 -41 -25 -33 -141 -117 -117 -18 82 -172 -1 4 29 137 6 209 206 169 94 -13
6295a3L5J13J1o4j19j02J32j12N8L9k50K78N0j98O9J08j07N8L8Q2J27j43k2L9
$$ -13 22 135 146 82 -37 -139 -7 -119 -61 -22 -272 6 56 -142 -73 35 -72 -14 24 106 233 90 68 107
6319A07O5jl5R3j31q4j99J34J05j16mj62P4N0q8J61r6P8R2N7k9j18K12p4J5q7
$$ 107 172 171 136 229 98 14 -185 -51 54 -62 -66 -228 -154 -104 -192 -31 -127 -49 43 100 71 -47 165 91 106 19
6345A9J09j39O9j2J56k57q8J29m1K7lk06P4pK72m4j52J4J12j2M1K7P6k22J9m7
$$ 19 128 -11 58 46 202 -55 -143 -14 -55 -28 -31 -237 -163 -170 102 58 -94 -80 32 20 61 88 164 -58 -39 -86
6371h6o0O7j15K12j18J68j39O4lRj5L0J7j15J4J63j60J2J94l0nj56J01j4j30K23
$$ -86 -146 -79 -194 18 -100 68 -71 -7 -10 -1 -16 14 31 -84 -70 93 -67 -55 139 109 104 -52 49 35 -95 128
6397A28r7j3k9k35O4k1J69n3r1K13o3L7O0R3p6n5m5J22O6J4p5q9l5l1M5J0O2j16
$$ 128 31 18 -11 -246 -182 -203 -34 -87 -178 35 -28 9 69 162 86 31 -14 108 174 188 113 24 -11 -42 3 13 75 -41
6425d1j24K18k37l5J92M7j16J2J97r7L9q9O3n7k6J19Q2j05p9J78j31Q8Qj17m3
$$ -41 -165 53 -184 -219 -27 20 -96 -84 113 16 55 -34 29 -28 -54 65 147 42 -37 141 10 98 106 -11 -54
6450e4J51j08j01J51M0q5o3j07J94j21J39o5P6l25K60LM9N3j67NJ11M6rp9k0N3
$$ -54 97 -11 -112 39 79 -6 -69 -176 18 -103 36 -29 47 -278 -18 -15 34 87 -80 -75 36 82 73 -6 -26 27
6476B7k8J14Rp9j02M9M3j39M4P8L0q5O6j00mJ08j5k5J16k20J76Ok5r7l3J5M2J30
$$ 27 -1 113 122 43 -59 -10 33 -106 -62 16 46 -39 27 -73 -77 31 16 -9 107 -113 63 69 44 -53 -86 -71 -29 101
6504A01n5J1j59kj5J12j8J39j51O3o7K10k21K86j98J74j25J06o0j99K50k47j7
$$ 101 46 57 -102 -104 -119 -7 -25 114 -37 26 -41 169 -52 234 36 210 85 191 131 -68 182 -65 -82
6527h2O7j33O6o8o5J91j02O5R1j92J25O3OJ4J23O3j34P0j35j7%K30m2j49q4nl6
$$ -82 -15 -148 -82 -150 -215 -24 -126 -61 30 -162 -37 26 32 46 169 232 98 168 33 16 16 246 204 55 -29 -34 -70
6554g0O6L0k86J36l9j6n0J70J15k49J06J06n1n9RP5J0K01j98K06j22J6k7n3N3
$$ -70 -4 26 -260 -124 -163 -179 -229 -59 56 -193 -87 19 -32 -91 -82 -7 3 204 6 212 90 106 79 26 79
6579G9j40l0K00o0M4M0j08r1j37k4J40rj7JJ97j69J36K9j93L04q7j8j37Q4R9p5
$$ 79 -61 -91 109 49 93 133 25 -66 -203 -227 -87 -96 -113 -112 85 -84 52 81 -112 192 105 87 -50 34 133 58
6605E8Qn3p7J78k6k94K24N8Pj59lMR1p7j4J07L3N5k56P9O7j9J5JJ95j78P2n1R6
$$ 58 66 13 -64 114 88 -206 18 76 83 -76 -79 -75 16 -61 -75 32 65 120 -136 -57 10 -9 6 7 202 24 96 45 141
6634A41k50q7K38p3j1Q7N6lo7j98K04K6k7m0J08j01r7J95j38J28j19n8J83pj58
$$ 141 -109 -196 42 -31 -42 45 101 98 31 -167 37 63 36 -4 104 3 -94 101 -37 91 -28 -86 97 90 -68
6659f8J00k0M0j24Q9L7k41K1o9J36j14J48N0K19k30j07J02Q7J49p7L2l3rj16N1
$$ -68 32 12 52 -72 17 54 -187 -166 -235 -99 -213 -65 -15 204 -26 -133 -31 56 205 128 160 127 118 2 53
6684E3P5j7k54J71j17j7O3N2n7Pj30K0J53J06j20k06R5K96m1J14r3m0j15L82j43
$$ 53 128 111 -143 28 -89 -106 -43 9 -48 -41 -171 -151 2 108 -12 -218 -123 173 132 246 153 113 -2 380 237
6709B37k05J41j07L3n0j87J66k38K82n8m12L32p0R7J5o%j0NpJ0J91r5J94k54K53
$$ 237 32 173 66 99 49 -138 28 -210 72 14 -398 -66 -136 -39 -24 -30 -30 -40 -35 -42 -32 159 64 258 4 257
6735B57l2j01P9n8k11R1o1J7j04m9M5R6n1p6J49j06j67L92j80L9o9J70j02J4J41
$$ 257 225 124 203 145 -66 25 -36 -19 -123 -172 -127 -31 -82 -158 -9 -115 -282 110 -70 -31 -100 70 -32 -18 123
6760A23M9L1j77M8K5O1L9j20q5q4J58j25Q5n3m6P2m4P1j41J13J2o9J03K4k8K1
$$ 123 172 203 26 74 99 160 199 79 -6 -90 68 -57 28 -25 -71 1 -43 28 -113 0 12 -57 46 70 42 63
6786F3J7k16L05j62J98j50N3L5k28MP7J0J00k43M9KN0J09j44m9J24k5J2j0J65
$$ 63 80 -136 169 7 205 55 108 143 -85 -81 -4 6 106 -137 -88 -86 -36 73 -71 -120 4 -21 -9 -19 146
6811A46p9O5n4n8J29R9j33l44J91q6K05j71K6m8j44J09J55j17M6K8j00J69j0R8
$$ 146 67 132 78 20 149 248 115 -229 -38 -124 81 -90 -64 -112 -256 -147 8 -109 -63 -35 -135 34 24 122
6835A22j00R3l8j73J39K03L1r0l9j48j20mK9J62k99m3K80j08m8k2J5J88J0k34
$$ 122 22 115 77 -96 43 246 277 187 148 0 -120 -124 -95 67 -232 -275 5 -103 -151 -173 -158 30 40 -194
6859a94K33l0J30j15m6Q2J35j36J36j15j33J21m2j64J13j1o3J7r9QLJ22J15N6
$$ -194 39 9 139 24 -22 60 195 59 195 80 -53 68 26 -138 -25 -36 -99 -82 -181 -173 -170 -48 67 123
6883A23Jj00Rn1N4J30j08q1J02Q4qk79K10m0n7n6j22M3l0K01R3j02p3j09J25R
$$ 123 124 24 33 -18 36 166 58 -23 79 163 155 -124 86 46 -11 -67 -189 -146 -176 25 118 16 -57 -166 -41 -32
6909c2J41p3L2K8R5J8l46K01Q7k14J3o5P1J03r4j83Q3K8L8j00J90j10J74pk2m1
$$ -32 109 36 68 96 191 209 -137 64 151 -63 -50 -115 -44 59 -35 -218 -135 -107 -69 -169 21 -89 85 78 56 15
6935A5J2P7K1k20J79Jj02K24j69p7J06k33K00r5o1r2L0k1O9K0o8N8J27J05q9n8
$$ 15 27 104 125 -95 84 85 -17 207 38 -39 67 -166 34 -61 -122 -214 -184 -205 -136 -116 -184 -126 1 106 17 -41
6961d1m0K00j13O5M6O5k30P6j5Q1n5j68R6j4k9L8J22j29K5j13J7j9Q4NN1n4J67
$$ -41 -81 119 6 71 117 182 -48 28 13 94 39 -129 -33 -47 -76 -38 84 -45 -20 -133 -116 -135 -51 -46 5 -49 118
6988A18q7J59k21K88k05m3J00m0j4J4j40J21lj09l6J83j44m9K7J53k15J16k05
$$ 118 31 190 -31 257 52 9 109 69 55 69 -71 50 47 -62 -98 85 -59 -108 -81 72 -143 -27 -232
7011b32K59j08Jm9J39J28n7pP6J1k3L7j26r7J6J69o2o3R0%j11M4k5n7rn0L0N1
$$ -232 27 -81 -80 -129 10 138 81 74 150 161 138 175 49 -48 -32 137 75 12 102 102 -9 35 10 -47 -56 -106 -76 -25
7039b5J48o8m0l5n9J61j91P3k2K4j4p1J58k65J79J43k31M1R7j20J08N3r3J49q2
$$ -25 123 55 15 -20 -79 82 -109 -36 -58 -34 -48 -119 39 -226 -47 96 -135 -94 3 -117 -9 44 -49 100 18
7064A8K3p7P2l0J01j2l3pnP3L8q2j27N9J22l14L6R3n6J05j33J54J0r4j63J67R
$$ 18 41 -36 36 6 107 95 62 55 50 123 161 79 -48 11 133 -181 -145 -52 -108 -3 -136 18 28 -66 -229 -62 -53
7091e3J53L0K11j73jn4Kn9j7r2mQ9p9Q8j09p0J38Rk7k60K06n2j29K54K3j5Q0l1
$$ -53 100 130 341 168 167 113 115 56 39 -53 -57 32 -47 41 -68 -138 0 9 -18 -278 -72 -124 -253 1 24 9 89 58
7119E8J2L1j39Q8k6l7Q8k64J74J86j2j76J43k27J60n1j43J30r7P9qM6k6J47o9
$$ 58 70 101 -38 50 24 -13 75 -189 -15 171 159 -17 126 -101 59 8 -135 -5 -102 -23 -31 15 -11 136 67
7144F7j74J45J57k51k3J56r9J30N8q3L6n8kL1j15J33qj81j17J45M1R7R3k35m9
$$ 67 -107 38 195 -56 -79 77 -22 108 166 83 119 61 59 90 -25 108 100 -81 -198 -53 -12 85 178 -57 -106
7169a06J26r5R4l1q9J48j53J09J29j98K11j45j90K74n1M1L0j47L1M6j38K76k24
$$ -106 20 -75 19 -12 -101 47 -106 3 132 -66 145 0 -190 84 33 74 104 -43 -12 34 -104 172 -52
7192e2J30n1k26K27M1j60Q0p0J0J9J10l4M5j41J77r6p7J98r9j8p9J60k12jK16
$$ -52 78 27 -199 28 69 -91 -11 -81 -71 -52 58 24 69 -72 105 9 -68 130 31 13 -66 94 -118 -119 97
7217I7j99J57j44R4J58p0k10nL7O2lj4R4j7J7K9j70J25J7j17k5R6O6j83J7p6P3
$$ 97 -102 55 -89 5 163 93 -117 -122 -85 -23 -26 -40 54 37 54 83 -87 38 55 -62 -87 9 75 -108 -91 -167 -94
7244i4M7m0J39m3o7N9R7j28l4K35k87K22o8Q5n2J42j65L3Qo7j1M3j44KJ06k11
$$ -94 -47 -87 52 9 -58 1 98 -30 -64 171 -116 106 38 123 71 213 48 81 89 22 11 54 -90 -88 18 -193
7270a93J26P3lr7Mj11J08R5rl9J19O3j63J9Q9o2Q5o2rJ05K9k11J50j17l9Kj0N7
$$ -193 -67 6 3 -94 -90 -201 -93 2 -7 -46 73 136 -27 -8 81 19 104 42 33 138 167 -44 106 -11 -50 -48 -58 -1
7298aPj74r3L14J6M4j71okp8J71O1N9p9m9qK00k66J86p4N2j16p0R1J01j82J03
$$ -1 6 -168 -261 53 69 113 -58 -64 -66 -144 27 88 147 68 19 11 211 -55 131 57 109 -7 -77 14 115 -67 36
7325C6j31M0Q6j10q2J01l3j59K40q6J28J2r3j19J90j0k2L7N3r5n2P8o0Q9j48J90
$$ 36 -95 -55 31 -79 -161 -60 -93 -252 -12 -98 30 42 -51 -170 20 10 -12 25 78 -17 -69 9 -51 38 -110 80
7351H0j61J4j12J9J39k7N0j49J23J30q2m7J36l1j62O9n8J21j72j7K37p0q5M7j01
$$ 80 -81 -67 -179 -160 -21 -48 2 -147 -24 106 24 -23 113 82 -80 -11 -69 52 -120 -137 100 30 -55 -8 -109
7376a09J55M9j60Q9k0p2j39J71J03j42K20n9l5J12J4j58L7J0R7j50pO8k25Q9K
$$ -109 46 95 -65 24 4 -68 -207 -36 67 -75 145 86 51 163 177 19 56 66 163 13 6 74 -151 -62 -60
7401f0j7l9R0J65l14R8J49k05R8K4q3J99k26J53K8ML9p0j06R9O9m9k08J86J1j52
$$ -60 -77 -116 -26 139 -175 -77 72 -133 -35 -11 -94 105 -121 32 60 64 103 33 -73 26 95 46 -162 24 35 -117
7427a17R3r9L2m6Q8j91J65j3O6R1Q5k20K04j61j5K33j25r2n2L21k06M1pk5m4j00
$$ -117 -24 -123 -91 -137 -49 -240 -75 -88 -22 69 154 -66 138 -23 -38 195 70 -22 -74 247 41 82 75 50 6 -94
7453i4O6kJ5j63K19MJ6K3k5m8Q6Q2k66L8NJ96j71m1O8p0N4k1RL0m4J9r1lL6N6
$$ -94 -28 -30 -15 -178 41 45 61 84 59 11 97 179 -87 -49 -44 152 -19 -60 8 -62 -8 -29 -20 10 -34 -15 -106 -109 -73 -17
7483a7K1R6r1J6J34k17P9l1L0j10j17J77Q3k0J00l83K90r4J2Oo2K9k1pJ18J07
$$ -17 4 100 9 25 159 -58 21 -10 20 -90 -207 -30 53 33 133 -250 40 -54 -42 -36 -98 -69 -90 -97 21 128
7509A28p5j34L32j69j02N1K5J31j56j58J46j06J34P1k01QJ12J63k58Q7k36K52
$$ 128 53 -81 251 82 -20 31 56 187 31 -127 19 -87 47 118 -83 -75 37 200 -58 29 -207 45
7531D5j78J66jp4m8o8p5L7J05O3Q6j10m1J84J38n1p8K7K7k7J3p5rK3j45l5O2J78
$$ 45 -133 33 32 -42 -90 -158 -233 -196 -91 -28 58 -52 -93 91 229 178 100 127 154 127 140 65 56 79 -66 -101 -39 139
7559A39j09j37J31j55J31n1j1o6J74j16j1K31j96J77p8j41K44j26J92j71J40q
$$ 139 30 -107 24 -131 0 -51 -62 -128 46 -70 -81 150 -46 131 53 -88 156 30 222 51 191 183
7581A83j71j08K68j78n1N8m9k8Q2q8J31j81K33j73J23K4L4m0L3Or5Pp3K8j36K31
$$ 183 12 -96 172 -6 -57 1 -48 -76 6 -82 49 -132 101 -72 51 75 109 69 102 108 13 20 -53 -25 -161 70
7607G0k7K7q1k6L2J33q3l2j50J61J01k33K03M4q6L3j42O4j44J02J5j11J40k1j02
$$ 70 43 70 -11 -37 -5 128 45 13 -137 24 125 -108 95 139 53 86 -56 8 -136 -34 -19 -130 10 -11 -113
7632a13L8J74O8k24Or4K75j05j23J26M4L9k8j28J5O8nn3J00k87J91kj6j85J59
$$ -113 -75 99 167 -57 -51 -145 130 25 -98 28 72 111 83 -45 -30 38 33 -20 80 -207 -16 -18 -34 -219 -60
7657f0n3O9J09J8j13Q3j28Q7J8%j17PR4M2J47p7j55n8J16L5N1j44k6QL5q1J3J15
$$ -60 -113 -44 65 83 -30 53 -75 12 30 30 -87 -80 14 56 203 126 -29 -87 29 64 115 -29 -55 -47 -12 -93 -80 35
7685C5j62J46j2M4k7k9J88k88JlJ25N9k20M9J19o4l7R2m6R8p3k0l0Q2J8L2kO0
$$ 35 -127 19 7 51 24 -5 183 -105 -104 -107 18 77 -143 -94 25 -39 -76 16 -30 68 -5 -25 -55 27 45 77 75 135
7713A35p7oM9j86J31l3j77J53j86pJ78n2m1j34J23k1L2OJ86j93P3M0k9j4M9J40
$$ 135 58 52 101 -85 46 13 -164 -11 -197 -204 -26 -78 -119 -253 -130 -151 -119 -113 73 -120 -47 -7 -36 -50 -1 139
7739A39n0M3j4J3l5k25J37n3p9j5R9Kj36M3J63j2K2o3K57j32k8j7l2K2K02j52
$$ 139 89 132 118 131 96 -129 8 -45 -124 -139 -40 -38 -174 -131 32 20 42 -21 236 104 76 59 27 49 251 99
7765I9nn5p1JL3J6r4po0R3J12k62R3K09k08P4J22M0k33J04J8LO9j10J21l5q4J25
$$ 99 94 39 -32 -31 2 18 -76 -83 -143 -50 62 -200 -107 102 -106 -32 90 130 -103 1 19 22 91 -19 102 67 -17 108
7793A08j16o5nq0K40l9j13J91m8r7o2Q4o9P0P3J90j47JPo1k9R2p3M1j54J22j7
$$ 108 -8 -73 -78 -158 82 43 -70 121 73 -24 -86 -2 -71 -1 72 262 115 116 123 62 33 125 52 93 -61 61 44
7820D4l0O6j89J54r9m5J7J5p4J40M9j41QK03q3r0p4Q3J10Q1Q6j63M4j30J29j15
$$ 44 14 80 -109 45 -54 -99 -82 -67 -141 -1 48 -93 -85 118 35 -55 -129 -46 64 145 231 68 112 -18 111 -4
7846dJ26%j10lj33O2L9J41j81j09K5j52K57pk4O8Q2l6n5O6R7kR1j90q4J49n7k
$$ -4 122 122 12 9 -124 -62 -23 118 -63 -172 -147 -299 -42 -49 -73 -5 77 41 -14 52 149 147 238 48 -36 113 56 54
7874E4JO0k14N1J4M5k03K22j94O1O8N2j01p5J49R2r0m9J70jM4j16j67J67K7j12
$$ 54 55 115 -99 -48 -34 11 -192 30 -164 -103 -35 17 -84 -159 -10 82 -8 -57 113 112 156 40 -127 40 67 -45
7900d5J67j05j65J89J35l73O3J5K16q3r0K6n4J41j22j8J86m9N3q7j37J52q5j8
$$ -45 122 17 -148 41 176 -197 -134 -119 97 14 -76 -50 -104 37 -85 -103 83 34 87 0 -137 15 -70 -88
7924h8m6J22j19M0J3nN8j42J06O7n6K6q5J26P5j14J80k56K03n2N0J1j16J28j45
$$ -88 -134 -12 -131 -91 -78 -83 -25 -167 -61 6 -50 -24 -109 17 92 -22 158 -98 105 53 103 114 -2 126 -19
7949a9J7J73k90J06N9j83k1J0K62j48J51k67R1l7J29J28q2J5O2O3k40J23k8K0
$$ -19 -2 171 -119 -13 46 -137 -158 -148 114 -34 117 -150 -59 -96 33 161 79 94 156 219 -21 102 74 94
7973I4j18R3q5K8P4q7Q8k91K01P4j31m1J7p8J32r2J41k2j22M6K44j33l5M7M9j41
$$ 94 -24 69 -16 12 86 -1 87 -204 -3 71 -60 -101 -84 -162 -30 -122 19 -3 -125 -79 165 32 -3 44 93 -48
7999d8J29M0l6l9J5q9o1rJ62k4r5PJ87m3j64lR4M9k81K06J32PK4k45MK01j29q
$$ -48 81 121 85 46 61 -28 -89 -98 64 40 -55 -48 139 96 -68 -71 23 72 -209 -3 129 136 160 -85 -81 120 -9 -17
8027a7J15n1q6J22M2p1j08k2L5j51P8N7q0P3n8OJ30o6J37l2Jr5J80j98J04o6Q6
$$ -17 98 47 -39 83 125 54 -54 -76 -41 -192 -114 -57 -137 -64 -122 -116 14 -52 85 53 54 -41 139 -59 45 -21 65
8054F5nj41j1n9j03K95k6K3j4n8m5J50l3J15j57Q4j3n7M2n6q6qJ52k8Q4o9J6m5
$$ 65 60 -81 -92 -151 -254 41 15 38 24 -34 -79 71 38 153 -4 80 67 10 52 -4 -90 -98 54 26 110 41 57 12
8082A2k3MM0J9o2k97J72J4K3J14j35J97j50M3k7J40j44Q8ro7J89p5p6J33j32m
$$ 12 -11 -7 33 52 -10 -307 -135 -121 -98 16 -119 78 -72 -29 -56 84 -60 28 19 -48 141 66 -10 123 -9 -13
8108a3j3j55M6j8J01J6r9M1P2p5N5k9J57j63l0Q6n7J72j87O7J56l2k0o0j29J44
$$ -13 -26 -181 -135 -153 -52 -36 -135 -94 -22 -97 -42 -71 86 -77 -107 -21 -78 94 -93 -26 130 98 78 18 -111 33
8134C3pp7J69k64J90j61J65K8J7j12L7l2k0J18j21Q3Qj17L7J06p0j49K8J28k3
$$ 33 26 -51 118 -146 44 -117 48 76 93 -19 18 -14 -34 84 -37 46 54 -63 -26 80 10 -139 -111 17 -6
8159fJ01o3K6p2K08j52N1o6l1J0j0q2J51j18M9R3l6j25j8oN5pM7j88K07R6j56
$$ -6 95 32 58 -14 194 42 93 27 -4 6 -4 -86 65 -53 -4 89 53 -72 -90 -96 -41 -48 -1 -189 18 114 -42
8186d2j83K33R0q9n6
$$ -42 -225 8 98 9 -47
8191d7
$$ Imaginary data points
##PAGE= N=2
##DATA TABLE= (X++(I..I)), XYDATA
0@%%%%%%%%%qQqJ6j6J6k4L2m0M8n6P0q2R8j16J35j56J84k13K44k81L23l67M16
$$ 0 0 0 0 0 0 0 0 0 0 -8 0 -8 8 -8 8 -16 16 -24 24 -32 38 -44 54 -62 73 -83 101 -112 132 -149 174 -193 223
33B23m73N34o02O76p59Q48r48J055j171J300j442J594j759J943k144K363k605
$$ 223 -250 284 -318 358 -401 447 -501 554 -617 683 -759 835 -924 1019 -1125 1238 -1367
50a367K871l160L485l845M246m697N212n803O484p288Q253r428J0899j2812J5403
$$ -1367 1504 -1656 1829 -2016 2230 -2467 2745 -3058 3426 -3862 4391 -5037 5862 -6950 8453
65H453j9135K5015l5701O1317k38587k58710M31499L80385R7636j66432j0535
$$ 8453 -10682 14333 -21368 39949 -198638 -457348 -25849 354536 452172 285740 275205
76B75205K33580K91930l7768k95449j82406J37909J27043j80895l95376k24078
$$ 275205 508785 800715 762947 467498 285092 423001 550044 369149 -26227 -250305
86b50305P0401J18697j65773l50511j39606K09525K12869o7129k00671K2831L00118
$$ -250305 -179904 -61207 -226980 -577491 -717097 -507572 -294703 -361832 -562503 -539672 -239554
97b39554K86650J6598j30132M1496L01679K64640m6925k14826k5135K03079J23202
$$ -239554 47096 63694 -66438 -24942 276737 541377 494452 279626 254491 457570 580772
108E80772j66420k92261j03471J36539O8918k28577l19284o4438J70867R1287
$$ 580772 414352 122091 18620 155159 224077 -4500 -323784 -388222 -217355 -126068
118a26068j50032k12547N762K43785J84405q7114j60454Q7240K93040J72244r0658
$$ -126068 -276100 -488647 -482885 -239100 -54695 -141809 -302263 -215023 78017 250261 159603
129A59603j48493N8726K41827J21743j62596k13810K5936J88657M0199k06317
$$ 159603 11110 69836 311663 433406 270810 57000 82936 271593 311792 105475
139A05475k22974Q44J60712M1580j91662k05882L7509K05205P0021j58624j50500
$$ 105475 -117499 -116655 44057 85637 -106025 -311907 -274398 -69193 828 -157796 -308296
150c08296Q3200K23506Q5477j34662j21823J08143K25730N8741j56102j24006
$$ -308296 -225096 -1590 83887 -50775 -172598 -64455 161275 220016 63914 -60092
160f0092R3733J86805L2198j65902j46655O7845J74918P136j98133j43264Q5357
$$ -60092 33641 220446 252644 86742 -59913 7932 182850 189986 -8147 -151411 -66054
171f6054J63739o764j83267j20073R7101J68115n207j72988r1840J23219J70620
$$ -66054 97685 90921 -92346 -212419 -115318 52797 47590 -125398 -217238 -94019 76601
182G6601l657j54804p8934J24451J75934p873j71158p4976J40932J65247l3795
$$ 76601 72944 -81860 -160794 -36343 139591 131718 -39440 -114416 26516 191763 157968
193A57968j75304p0295J25164J37887m7089j74700o8625J22852J27031o2131j77389
$$ 157968 -17336 -87631 37533 175420 128331 -46369 -114994 7858 134889 72758 -104631
204a04631o1489J24387J27834n6432j70557m5500J46515J32387o3759j59286k0155
$$ -104631 -166120 -41733 86101 29669 -140888 -186388 -39873 92514 28755 -130531 -150686
215a50686J55664J27128n8755j43430j5388J47168J15238p0666j51354j6762J39470
$$ -150686 4978 132106 73351 -70079 -85467 61701 176939 106273 -45081 -61843 77627
226G7627R8347q6400j60881j9645J36405Q1865j05896j58321j038J43810P6205
$$ 77627 175974 89574 -71307 -90952 45453 127318 21422 -136899 -137937 5873 82078
237H2078j02172j38429J3958J45311Q2275q6284j24224K7420J57572Q1939r3699
$$ 82078 -20094 -158523 -144565 746 83021 -3263 -127487 -100067 57505 139444 45745
248D5745j23567L3577J53342O3083j11574j25410L6331J41642L6600j30556j27095
$$ 45745 -77822 -44245 109097 172180 60606 -64804 -28473 113169 149769 19213 -107882
259a07882L5869J30326L1835j23040j21233M0088J39997L7894j20732j07684O3304
$$ -107882 -72013 58313 90148 -32892 -154125 -114037 25960 63854 -56878 -164562 -101258
270a01258J53239L8947j15838r0621P6002J47289K4848j20151q6427P5114J34675
$$ -101258 51981 90928 -24910 -115531 -39529 107760 132608 12457 -73970 1144 135819
281A35819Q905j29737r4843O2013J23263o97j39331r6665P0326J25607p779j37428
$$ 135819 144724 14987 -79856 -17843 105420 104723 -34608 -131273 -60947 64660 56881 -80547
293h0547p7978Q4713J23716n938j18904n5476R7758J26075r759j18230m9670R9023
$$ -80547 -158525 -73812 49904 43966 -74938 -130414 -32656 93419 83660 -34570 -84240 14783
305A4783J20394j7965j26131n5106R4173J07581l9416j41016n2931R5417R4139
$$ 14783 135177 117212 -8919 -64025 30148 137729 98313 -42703 -95634 -217 93922
316I3922m8799j32456m1278R6547R1500m6412j20933k4809J12440J00208m3834
$$ 93922 45123 -87333 -128611 -32064 59436 13024 -107909 -132718 -20278 79930 36096
327C6096j15154j4138J18866R7800n1966j19729r265J20356Q2778o8696j23709
$$ 36096 -79058 -93196 25670 123470 71504 -48225 -57490 62866 145644 76948 -46761
338d6761j2658J05046O6477p2936j21154j1483J04884O4296p6699j18132R63J15935
$$ -46761 -59419 45627 112104 39168 -81986 -93469 11415 75711 -988 -119120 -118157 -2222
350b222O8368p2481j05758J8342J25952O5112p6013r8303K6126J20976N6960p6241
$$ -2222 66146 -6335 -112093 -93751 32201 97313 21300 -77003 -50877 70099 127059 50818
362E0818r8200J8416J07963M4025q8199j05005J8905J06803L2001r7801r9843
$$ 50818 -47382 -28966 78997 123022 34823 -70182 -51277 55526 87527 -10274 -110117
373a10117K8562J07042K6753r6384q4302M5333J13392L0280q6470p4070N0343
$$ -110117 -81555 25487 52240 -44144 -128446 -83113 30279 60559 -25911 -99981 -49638
384d9638J14666L1181q5478p3079N3416J13554J5994j02164p5115N3719R9606
$$ -49638 65028 96209 10731 -62348 -8932 104622 120616 18452 -56663 -2944 96662
395I6662k682j08247p1051N3713R1094j0062j08641o6000O0782R8076k885r9299
$$ 96662 93980 -14267 -85318 -31605 59489 49427 -59214 -125214 -64432 33644 30759 -68540
407f8540n5484P1723J07026n16r7218m3221Q3978J03792j0009r6358l7393P7412
$$ -68540 -124024 -52301 54725 54209 -43009 -86230 -2252 101540 91531 -4827 -42220 35192
419C5192Q5951k4340j03423m3826P0290P7708l5253j12581m6982O9941P4561l6916
$$ 35192 121143 96803 -6620 -50446 19844 97552 62299 -50282 -97264 -27323 47238 10322
431A0322j06413l2724Q3950Q0770l4710r4001j1488R4795P9834k9375p9641m399
$$ 10322 -96091 -128815 -44865 35905 1195 -92806 -104294 -9499 70335 40960 -38681 -43080
443d3080R2944P4831l9493r3008j0106Q8104N9079n8150j03054j6138P9971M6852
$$ -43080 49864 124695 85202 -7806 -17912 70192 129271 71121 -31933 -48071 31900 78752
455G8752p0954j06125o806Q5861M5010o2972q5161Q241R1607N4972n0067p3680
$$ 78752 7798 -98327 -105133 -19272 25738 -37234 -122395 -114154 -22547 32425 -17642 -91322
467i1322K3833J07994N8013n6082p3995K6085J00826M2668o9745q2958J7824Q6717
$$ -91322 -67489 40505 98518 42436 -31559 -5474 95352 138020 68275 -14683 3141 89858
479H9858K1711q6206q8619J1546P3932J6278q0041q1896J9649Q7745K6785p4892
$$ 89858 111569 25363 -63256 -51710 22222 38500 -41541 -123437 -103788 -16043 10742 -64150
491f4150o5194M5332J01346L0239o3315m8648N3123J00396K3012p3873n4674M7212
$$ -64150 -129344 -84012 17334 47573 -15742 -64390 -11267 89129 112141 38268 -16406 30806
503C0806Q4153M945q3289o6529K9318P0809o234r6743o7050M2957P4466j3192
$$ 30806 114959 119904 36615 -29914 -596 70213 63979 -32764 -99814 -56857 17609 4417
515D417q7981m5391N5541Q1760J57p3040l0753P2035Q9041j418p0886k7413O5828
$$ 4417 -83564 -128955 -73414 8346 8503 -64537 -95290 -23255 65786 64368 -6518 -33931 31897
528C1897P9560j0162q4646l9577O0176O6856l2970r5987l7069N4544N3933l3845
$$ 31897 111457 101295 16649 -22928 37248 104104 71134 -24853 -61922 -7378 46555 12710
540A2710q6460k9063O4467O3615l0140p9919j3028P8346P0449k1809p2229j0792
$$ 12710 -73750 -102813 -38346 25269 -4871 -84790 -97818 -19472 50977 29168 -43061 -53853
552e3853P8597O7420l3380p9548n644P5350M7939m5868p9149j2260O3264M4441
$$ -53853 24744 92164 58784 -20764 -26408 48942 96881 51013 -28136 -40396 22868 67309
564F7309m8290q2697o625P2759M2859m8576p2547L522P7712M7970m6295p0425
$$ 67309 19019 -63678 -70303 2456 45315 -3261 -75808 -72286 5426 53396 7101 -63324
576f3324J3777Q4092L8604n2896o4028J2276O9529L1927n1929o7269J1217P2265
$$ -63324 -49547 34545 73149 20253 -43775 -31499 38030 69957 18028 -49241 -38024 34241
588C4241K4415o2569o4700K0445P6195K6923n9206o0734K6423P9416K1103o2680
$$ 34241 58656 -3913 -68613 -48168 28027 54950 -4256 -64990 -38567 40849 61952 -728
600g28n1461L2415P0863J4966o0826n5966K5406P0654J0536p0495n5444L4159
$$ -728 -52189 -19774 51089 66055 5229 -50737 -25331 45323 55859 -14636 -70080 -35921
612c5921P0124M231o9013m7074L9969P3070M739o6793l8262M9707P2556K053o2940
$$ -35921 34203 38434 -30579 -77653 -37684 35386 40125 -26668 -64930 -15223 57333 59386 -3554
625c554l8035M1915O7865O46o9271m1284M4819O0510j7421p6098l5553M5786N6617
$$ -3554 -41589 326 68191 68837 -434 -41718 3101 63611 46190 -29908 -65461 -19675 36942
638C6942j6669p2417l0284N2807N9903j6596o4147j7792N7401O2017j0126o2419
$$ 36942 20273 -52144 -82428 -29621 30282 13686 -50461 -68253 -10852 51165 41039 -21380
650b1380j8580O1109N9654k3271o7878j4947N6709M5655l2717p1209j7950N2681
$$ -21380 -39960 21149 80803 57532 -10346 -25293 31416 77071 44354 -26855 -44805 7876
662G876L9596l8810p0622r924N7942M2407l3354o4672n261O6313N0021l0524n8598
$$ 7876 47472 8662 -61960 -71884 -13942 28465 -4889 -69561 -74822 -8509 41512 10988 -47610
675d7610O862P0764M1768l6934n6372O986O3409L3651m3341o2481K113N7735K4592
$$ -47610 -40748 30016 71784 34850 -21522 -14536 48873 82524 39183 -23298 -21185 36550 61142
688F1142n1366o4381K734N8857K6430n0313o1673J2423O7682K5590m7451m6917
$$ 61142 9776 -54605 -51871 6986 33416 -16897 -78570 -66147 1535 27125 -20326 -67243
700f7243K3566O7774K7163m1662m4299K3454O5934K0439n0303m7279K3087N9893
$$ -67243 -43677 24097 51260 9598 -34701 -11247 54687 75126 24823 -22456 631 60524
712F0524R962o0663n3870K0707N6635K713o2169m5725K7130N5228L213n3963l6819
$$ 60524 70486 9823 -44047 -23340 33295 36008 -26161 -71886 -44756 10472 13685 -40278 -77097
725g7097L4137O2207J0152m9268l0442M1785O3637L145n4443k9054M1554N7165
$$ -77097 -42960 19247 29399 -19869 -50311 -8526 55111 58256 3813 -25241 16313 73478
737G3478o927o1773l3212L5953M6454j5850o3559l2437L4510M6675j2630n9942
$$ 73478 66551 4778 -28434 7519 53973 38123 -25436 -57873 -23363 23312 10682 -49260
749d9260k7548M2912N2604j0765n4540j3428N3755N3987j2306n2823j1268N3056
$$ -49260 -76808 -33896 18708 7943 -46597 -60025 -6270 47717 35411 -17412 -28680 24376
761B4376M7854j9085n5603j4143M4922L8695k6743o2151j9584M2365L6407k9683
$$ 24376 72230 53145 -2458 -16601 28321 67016 40273 -21878 -41462 903 37310 7627
773G627o1010j1434M9220L5721k9549n1911Q74N6596L8495k5257m5042N912N5893
$$ 7627 -53383 -64817 -15597 20124 -9425 -61336 -60462 -3866 34629 9372 -35670 -29758 26135
786B6135L5684k7967m7875K373N2151K9962l6414n5270n93M8232J9916m4011n2270
$$ 26135 61819 33852 -14023 -11650 40501 70463 34049 -21221 -21814 26418 46334 2323 -49947
799d9947N910M8113J7700m0671m4557J2127N2623K2643l5205l8717J9238N8149
$$ -49947 -44037 4076 21776 -18895 -63452 -51325 1298 23941 -11264 -49981 -30743 27406
811B7406K3515l8520m0271J9875N6245J5644m5054m0754J8391M6749M752m8846
$$ 27406 50921 12401 -27870 -7995 48250 63894 18840 -21914 -3523 43226 47978 -868
823h68m0782J7243M4535M577m7333l7868K2697M9766O393m5751l0675L1646N4772
$$ -868 -41650 -24407 20128 24705 -22628 -60496 -37799 11967 18360 -27391 -58066 -26420 28352
836B8352O824m4344k6266L3792M9869N13m5123k5232K9706M2546n170m9084k9482
$$ 28352 35176 -9168 -35434 -1642 48227 48740 3617 -21615 8091 50637 45467 -3617 -33099
849c3099K6785L9720r911n1325k5047L2974M1457j1389m9236j8019L9163M3684
$$ -33099 -6314 33406 23495 -27830 -52877 -19903 21554 10165 -39071 -57090 -17927 25757
861B5757q794m2890j1372M0665M0883j0579m3139j2178L8613L7272j5947m7909
$$ 25757 16963 -25927 -37299 3366 44249 33670 -9469 -21647 16966 54238 38291 -9618
873i618j3928L6821L1157k4464n0885j0404L9388K9179k4719m6666n659M1507
$$ -9618 -23546 13275 44432 19968 -30917 -41321 -1933 27246 2527 -44139 -49798 -8291
885h291L0937k0697m0994p51M5376L3820k0578m1237R24M5403K8630k6778m2571
$$ -8291 22646 1949 -39045 -39796 5580 39400 18822 -22415 -21491 23912 52542 25764 -16807
898a6807L368M3027J9829l3429m3422J808L9293J7615l2349m1481L720M1717J9771
$$ -16807 -13439 29588 49417 15988 -27434 -25626 13667 31282 -1067 -42548 -38828 2889 22660
911B2660l1780l8847J0194M6549K0055l0502l3216J5598M5761J4529l3167l0399
$$ 22660 -9120 -47967 -37773 8776 28831 -1671 -34887 -19289 26472 41001 7834 -22565
923b2565J5974M1805J0199l5434l3123J3142L9164P280l9505l5004J6501M0988
$$ -22565 -6591 35214 45413 9979 -23144 -10002 29162 36442 -3063 -38067 -21566 19422
935A9422M615l9703k9819J9930M0060L724l6792k3306K5311M0261K065l5676k1431
$$ 19422 24037 -15666 -45485 -25555 14505 18229 -18563 -41869 -16558 23703 25768 -9908 -31339
948c1339K4358M0112J716l8105k3167K6758L9285m998m2630k1258K7166L5486
$$ -31339 -6981 33131 34847 -3258 -26425 333 39618 34620 -8010 -29268 -2102 33384
960C3384p135m1397j9392K7652L3134r909l9402j5316K8637L2720q135l8036j4405
$$ 33384 26249 -15148 -34540 -6888 26246 16337 -23065 -38381 -9744 22976 14841 -23195 -37600
973c7600L1697L4501j1780m0193r219L5708L1699j3267l7193q621L2474K8703
$$ -37600 -5903 28598 16818 -23375 -32594 3114 34813 21546 -15647 -24268 8206 36909
985C6909j4876l6449o422L2115K4878j7915l7097p633L1958K5018k0351l9640
$$ 36909 22033 -14416 -20838 11277 36155 18240 -18857 -26490 5468 30486 10135 -29505
997b9505k379L5923K0706k3976l4994J506L5201K1675k0668l3083K966L7288K0662
$$ -29505 -31884 4039 24745 769 -34225 -32719 2482 24157 3489 -29594 -26628 10660 31322
1010C1322k2063l1398M631L6300J9866k3869l3476O544L7342J2663l1065l1274
$$ 31322 9259 -22139 -17508 18792 38658 14789 -18687 -12143 25199 37862 6797 -24477
1022b4477R174L3500J0424k9146l2204O698L4448J0688k9832k8353J2243L5570
$$ -24477 -15303 18197 28621 -525 -32729 -26031 8417 19105 -10727 -39080 -26837 8733
1034H733J0640k7624k6606J5038L8607R537k9684k1800J9395L4602M169k9033
$$ 8733 19373 -8251 -34857 -19819 18788 28325 -1359 -23159 -3764 30838 35007 5974
1046E974k2252J5242L2795L327l3857k5235J7024L1000j877l5077k3147J6412
$$ 5974 -16278 -1036 31759 35086 1229 -24006 -6982 24018 22141 -12936 -36083 -19671
1058a9671L1032n21l3282j8691K3069L0742l644k9138j1443K4739L1677M84k9783
$$ -19671 11361 10840 -22442 -41133 -18064 12678 9034 -20104 -31547 -6808 24869 25353 -4430
1071d430j4811K6425L2126o690l3127j2079K4128K5897j0227l6310j5346K3553
$$ -4430 -19241 7184 39310 32620 -507 -12586 11542 37439 27212 -9098 -24444 -891
1083h91K3255j4673l4516r776K3666K1887j0216l0652q636K9551K8100j1127k9688
$$ -891 22364 7691 -26825 -36601 -12935 8952 -1264 -31916 -40552 -11001 17099 5972 -23716
1096b3716m25L3484K5624j2545k9270k331L0605K2662j6447l1731l729K5238J4306
$$ -23716 -24141 9343 34967 22422 -6848 -9179 21426 44088 27641 -4090 -7819 17419 31725
1109C1725k0429l2151n106K5070J6749k1691l3280Q82L1267J5544j9956k4388
$$ 31725 11296 -20855 -25961 -891 15858 -5833 -39113 -38231 -6964 8580 -11376 -35764
1121c5764P597L3148J8200j7144k3796Q850L3529J4881k0056k3563N736K7517
$$ -35764 -28167 4981 23181 6037 -17759 -8909 24620 39501 19445 -4118 1618 29135
1133B9135J1188k4971l0182M419K7316M000k9634k5238Q923K5975M186k5751k2228
$$ 29135 40323 15352 -14830 -10411 16905 20905 -8729 -33967 -25044 931 5117 -20634 -42862
1146d2862J2818L2057Q912k1756j6965J6314L1700Q725k2060j7986J6671L1417
$$ -42862 -30044 2013 10925 -10831 -27796 -11482 20218 28943 6883 -11103 5568 36985
1158C6985K859k9142j9136J5221K3558m941l0113j9471J2506K3004l751l0616
$$ 36985 39844 10702 -8434 6787 30345 25404 -4709 -24180 -11674 11330 7579 -23037
1170b3037j7946J6994K6228j675k5658j2108K2040L0218O18k5074q808K4997K6607
$$ -23037 -40983 -23989 2239 564 -25094 -37202 -15162 15056 15674 -9400 -18208 6789 33396
1183C3396m525k4130p726J9980K0908q858l0047j2888J8511J8928j2355l0797
$$ 33396 28871 4741 -2985 16995 37903 29045 -1002 -13890 4621 23549 11194 -19603
1195a9603j1527J8906J9127j1244k8276n779K5290K1702r360k2715P40K6378K0279
$$ -19603 -31130 -12224 6903 -4341 -32617 -38396 -13106 8596 -764 -23479 -22739 3639 23918
1208B3918q138k1583l11K6046J9049j3953k6639k323K3198J3440j9399k8837k565
$$ 23918 15780 -5803 -6114 19932 38981 25028 -1611 -3934 19264 32704 13305 -15532 -18097
1221a8097K2604J1479k0575k6658Q70K3461J1567j5299k0266M748K7081J4936
$$ -18097 4507 15986 -4589 -31247 -30377 -6916 4651 -10648 -30914 -26166 915 15851
1233A5851j5238k0094Q332K9384J2817j8085k0174P627K5400P465k2259k2364
$$ 15851 613 -19481 -11149 18235 31052 12967 -7207 420 25820 33285 11026 -11338
1245a1338N961K2217M310k2653k1641N179K1600N118k1509j9268J0439K5987N232
$$ -11338 -5377 16840 21150 -1503 -23144 -17965 3635 8753 -12756 -32024 -21585 4402 9634
1258I634k0759j4929J4674K5944L903j9840j3078J4435K4543K002k2250j5489
$$ 9634 -11125 -26054 -11380 14564 18467 -1373 -14451 -16 24527 26529 4279 -11210
1270a1210J2127K1265l00k3581j5823J2377K1095l249k5514j3032J5824K1138
$$ -11210 917 22182 21882 -1699 -17522 -5145 15950 12701 -12813 -25845 -10021 11117
1282A1117l893k2699q993J7585K0992l894k1884q146J8500K1582m034k2513q592
$$ 11117 7224 -15475 -24468 -6883 14109 10215 -11669 -19815 -1315 20267 16233 -6280 -14872
1295a4872J7943J9798p093k4108p520J8983J7648r338k3859n176J8640J5270r776
$$ -14872 3071 22869 15776 -8332 -15852 3131 20779 11441 -12418 -17594 1046 16316 6540
1308F540k1875l950J9839J6320r379k2568l753K0774J6471j0737k2011j579K1581
$$ 6540 -15335 -19285 554 16874 7495 -15073 -18826 1948 18419 7682 -14329 -15908 5673
1321E673J4296j3178k1154K43K0389J1813j2733j9273R00K0163J1274j3723k0460
$$ 5673 19969 6791 -14363 -14120 6269 18082 5349 -13924 -13024 7139 18413 4690 -15770
1334a5770J757K2096J1463j5271k0325L594K2105Q842j7052j8358N228K0917P339
$$ -15770 -14013 8083 19546 4275 -16050 -12456 9649 18491 1439 -16919 -11691 9226 16565
1347A6565j6292j7148N444J9912O518j6544j6786O993K2049O231j8456j6456Q994
$$ 16565 273 -16875 -11431 8481 14999 -1545 -18331 -11338 10711 16942 -1514 -17970 -8976
1360h976K2145M082j8623j4858J0275K0446K927j8711j4523R304J9035K525j8198
$$ -8976 13169 17251 -1372 -16230 -5955 14491 17418 -1293 -15816 -6512 12523 15048 -3150
1373c150j3821R832J9253P95k0055j2804J2499K0013m45j9686j0505J3358J8987
$$ -3150 -16971 -7139 12114 12909 -7146 -19950 -7451 12562 12117 -7569 -18074 -4716 14271
1386A4271j433j8881r482J3412J8501j239j9029r948J2885J7229l291k0281q741
$$ 14271 12838 -6043 -15525 -2113 16388 15149 -3880 -13828 -943 16286 12995 -7286 -16027
1399a6027J5013J6269o069k0328o882J5307J5377o639j8739m645J6350J5527n902
$$ -16027 -1014 15255 9186 -11142 -18024 -2717 12660 6021 -12718 -17363 -1013 14514 8612
1412H612j8674m914J6643J5910o561j8654l410J7229J3177j0021j9126k435J6985
$$ 8612 -10062 -14976 1667 17577 11016 -7638 -11048 6181 19358 9337 -9789 -12224 4761
1425D761J1265j0795j8580j696J6540J0670j0767j7983o61J7996J2781j0450j7603
$$ 4761 16026 5231 -13349 -15045 1495 12165 1398 -16585 -17246 750 13531 3081 -14522
1438a4522J080J9695J1052j1679j5966L059J8389Q418j2464j5866K194J6473O417
$$ -14522 -13442 6253 17305 5626 -10340 -7281 11108 19526 7062 -8804 -6610 9863 16280
1451A6280j4089j6345K967J7445O196j5016j6916M198J9100O292j4562j3485P728
$$ 16280 2191 -14154 -11187 6258 12454 -2562 -19478 -15280 3820 10112 -4450 -17935 -10207
1464a0207J8418M875j3674j1842P469J7858M832j4195j2377P297J6563K105j6594
$$ -10207 8211 13086 -588 -12430 -4961 12897 17729 3534 -8843 -1546 15017 17122 528
1477E28j3466P622J6974O97j8289j2185R188J5990m69j6179r543J0035J6254J516
$$ 528 -12938 -5316 11658 12355 -5934 -18119 -8931 7059 6590 -9589 -19132 -9097 7157 8673
1491H673j4848q684J1193J6528l37j5489p392J2365J5837k339j7838q565J2031
$$ 8673 -6175 -14859 -3666 12862 12525 -2964 -10356 2009 17846 15507 -2331 -10896 1135
1504A135J4677n033j7264o563J1334J2305m463j6459p195J2407J4123m142j6265
$$ 1135 15812 10779 -6485 -13048 -1714 10591 6128 -10331 -17526 -5119 9004 4862 -11403
1517a1403m643J4021J3489n213j5869k886J5607J2929p326j5747j291J4422J0243
$$ -11403 -16046 -2025 11464 6251 -9618 -12504 3103 16032 8706 -7041 -8332 6090 16333
1530A6333p571j5275l363J3577J1330q051j7057k113J4249R062r832j5002N08
$$ 16333 8762 -6513 -9876 3701 15031 6980 -10077 -12190 2059 11121 1289 -13713 -13205
1543a3205J5241R022j0440j4588K116J5618P708r238j2339J879J5105Q388j0096
$$ -13205 2036 11058 618 -13970 -11854 3764 11472 2234 -10105 -8226 6879 15267 5171
1556E171j4790K204J6441O434j2132j3497L545J4149M721j2394j2894M030J4718
$$ 5171 -9619 -7415 9026 15460 3328 -10169 -6624 7525 12246 -148 -13042 -9012 5706
1569E706L948j2689j1130N551J4597M202j2315j1987O112J7194M069j3627j0647
$$ 5706 9654 -3035 -14165 -8614 5983 10185 -2130 -14117 -8005 9189 13258 -369 -11016
1582a1016P193J4230J505j2728r693P062J4197P74j4513r582P836J2954J28j2881
$$ -11016 -3823 10407 11912 -816 -10509 -3447 10750 11524 -2989 -12571 -4735 8219 8347 -4534
1596d534q979Q113J4681nj4996p614J0686J3798j643j3267o298R237J2421j970
$$ -4534 -13513 -5400 9281 9276 -5720 -13334 -2648 11150 9507 -3760 -10058 -821 11600 9630
1610I630j3805o639R690J1332l147j3598n472J0080J1498l667j5164m599J2937
$$ 9630 -4175 -10814 -1124 10208 7061 -6537 -12009 -1929 9569 5902 -9262 -13861 -924
1623i24J2291m977j3620k524J1377J0230m302j2860l094J1502J0351n956j4429
$$ -924 11367 6390 -7230 -9754 1623 11853 7551 -5309 -8403 3099 13450 7494 -6935
1636f935k829J1507Q803o744j4001j907J2783Q619q510j3080Q06J3138P839o783
$$ -6935 -9764 1743 10546 3802 -10199 -12106 677 9296 786 -12294 -11488 1650 9489 2706
1650B706j1085N9J2896R222p500j2946Q50J2925O861q859j2187R47J2098M919
$$ 2706 -8379 -8320 4576 13798 6298 -6648 -5798 7127 13988 5129 -7058 -6111 5987 10906
1664A0906j0887j2476L099J2826L803r936j0215K610J2339N782q840j0530M510
$$ 10906 19 -12457 -9358 3468 7271 -2665 -12880 -10270 2069 7851 -989 -11519 -7009
1677g009J4437N034j0018r644M660J2759L237j1048r311M950J1868N91j2109r012
$$ -7009 7428 12462 2444 -7200 -2540 10219 13456 2408 -6903 -1953 9915 10506 -1603 -10615
1691a0615M971J0398J111j1354r032O161J2780J354j2018p438Q035J2881J326
$$ -10615 -5644 4754 5865 -5489 -14521 -8360 4420 5774 -6244 -13682 -5647 7234 8560
1704H560j0566o073Q269J1782p63j1504n565Q112J0013j698j1929o684O744J0312
$$ 8560 -2006 -8079 190 11972 11209 -295 -5860 2252 12265 10567 -1362 -8046 -1302 9010
1718I010k746j3609o244R069J0568l448j2179m400R415J0186k723j0657k432J0451
$$ 9010 6264 -7345 -13589 -4520 6048 2600 -9579 -13979 -4564 5622 2899 -7758 -10190 261
1732B61R701k600j0310k563R586R416l739j1841k747J0353Q054o906j2790k240
$$ 261 9962 7362 -2948 -5511 4075 13491 9752 -2089 -4836 5517 13571 6665 -6125 -8365
1746h365R514O733o371j1569j633R363O826o017j0281p5J0919P701n211r771J111
$$ -8365 1149 7882 1511 -10058 -11691 -2328 4498 -1519 -11800 -11875 -956 6745 1534 -8237 -7126
1761g126J2048P109p160r779K573J1642N158q002j0211Q68R785M066q412j0689
$$ -7126 4922 12031 4871 -4908 -2335 9307 14465 6463 -3748 -2880 6905 10971 2559 -8130
1775h130Q46R817L708q833j0340K000J0940L694q700p899M812J1787L226q341
$$ -8130 -7284 2533 6241 -2592 -12932 -10932 8 3702 -4998 -12897 -8085 3702 6928 -1413
1789a413o847N200J1326L708q246p314M173J0476J961r960q530M004R670K42j0678
$$ -1413 -8260 -3060 8266 11974 3728 -3586 587 11063 13024 3064 -5466 -1462 8208 8450 -2228
1804b228p936M878Q961q35j0243n982O269R768K19q991n321O956J0724O96r182
$$ -2228 -10164 -5286 3675 2840 -7403 -13385 -7116 2652 2871 -6120 -11441 -4485 6239 6935 -2247
1819b247m777P887J0645r10r988m893P165Q305k579j0170m203O623P216l416j0739
$$ -2247 -7024 863 11508 10598 610 -4283 2882 11187 8608 -1562 -5765 858 8074 4658 -6081
1834f081m232O945P863k740j0078l411Q877Q598l324r925j725R702Q059l380q662
$$ -6081 -10313 -3368 4495 1755 -8323 -11734 -2857 5741 2417 -7508 -9233 469 8528 5148 -3514
1849c514j092Q433O408m282q960j568Q224O286m904j0291j416Q651N901o224j0004
$$ -3514 -4606 3827 10235 5953 -3007 -4575 3649 9935 5031 -5260 -6676 1975 7876 1652 -8352
1864h352J04R543N453n954q910P07R221M632n142p931J097Q706N018n968q766
$$ -8352 -8248 1295 6748 794 -8116 -7409 1812 6444 1302 -6629 -5532 3174 8192 2224 -6542
1879f542J266R166M391p027q222K511R445K813p622p590K877R075L147o917o798
$$ -6542 -5276 3890 8281 1254 -6968 -4457 4988 7801 179 -7411 -4534 4541 7688 771 -6027
1894f027K391Q417K601p305p144L058R066J805q294o780M077Q630O27q681n305
$$ -6027 -3636 4781 7382 77 -7067 -4009 5057 6862 -1432 -8212 -4135 4495 5122 -3559 -8864
1909h864M756Q511R62p740n607M685Q917J079p683n010N119Q640M47q752n214
$$ -8864 -4108 4403 5365 -2375 -7982 -3297 5620 6699 -984 -5994 -875 7765 8212 -540 -5754
1924e754N572P858j545q694m023N621O791j969q920m012N905P511j079q246l604
$$ -5754 -182 7676 6131 -2563 -6586 -965 5826 3857 -5063 -9075 -3170 4341 3262 -4984 -8588
1939h588O422P756j395q242k822P414P485k455q045j773O841N544l410p537k170
$$ -8588 -2166 5590 4195 -4047 -6869 545 8030 5575 -2470 -4243 2598 8142 4732 -2805 -4975
1954d975O581N823l579q765k140P016N890l888q450j214P836N837m295p876OP565
$$ -4975 1606 7429 3850 -4915 -7055 -39 5851 1963 -6487 -7701 135 5972 1677 -6199 -6193 1372
1970A372M509l964o556K89O922M755m470q082J97Q279M307n534p582J002P744
$$ 1372 5881 1917 -4639 -4350 2572 7327 2857 -5225 -5028 3251 7558 2024 -5558 -4556 3188
1985C188L465n999o958J573Q057K936n444o179J453O682K954n249o362J359Q278
$$ 3188 6653 654 -6304 -4731 3326 6262 818 -5361 -3908 2774 5728 479 -5883 -4524 3754
2000C754K591o797o087K759P706J578o591n724L323P727J652o524m933K942O761
$$ 3754 6345 -452 -6539 -3780 3926 5504 -1087 -6811 -3488 4239 5891 -633 -5566 -2624 4137
2015D137J305n394n127K951P565Q54p652m886M458P292o18o910m006M237O602
$$ 4137 5442 48 -5079 -2128 5437 6291 -1361 -6247 -1789 5503 4885 -2025 -6031 -1794 4808
2030D808o38p231l899N112O445p29o325l730M214O712l76p093l620N742O574k052
$$ 4808 4170 -3061 -6960 -1848 4597 3868 -2457 -6187 -1973 4739 4363 -2730 -6350 -608 5966 3914
2046C914o804j919N517N301k215o817k240O103N826k594o873k229M947N300j770
$$ 3914 -2890 -4809 708 6009 3794 -3023 -5263 840 6666 4072 -2801 -5030 -83 5217 3447
2061C447p285k268O204N386l866p219n07O167L949k802n819n36N972M829l366
$$ 3447 -3838 -6106 98 5484 1618 -5601 -6108 59 4008 1206 -4613 -5149 823 5652 2286
2076B286o473N12O558M131l283o558n29O595M126m753o972O75O189K121m573n380
$$ 2286 -4187 -3675 2883 7014 3731 -2827 -3356 3239 7365 2612 -4360 -3685 2504 4625 52 -5328
2092e328L55N471K765m654n766J618P069K812m547n008J554O953L221m711n486
$$ -5328 -4973 498 3263 -1391 -7157 -5539 1530 4342 -205 -5213 -3659 3294 6515 1804 -3682
2107c682K776O892J421n732m953J685N382J337n313n239J510O083M85o014m169
$$ -3682 -906 5986 7407 1675 -3278 -1593 3789 5126 -187 -5426 -3916 2167 2652 -3362 -7531
2122g531K971O499J092n366m159M087P217M44n793l115L893N836K6m845m095K851
$$ -7531 -4560 1939 3031 -2335 -6494 -2407 4810 5254 -539 -3654 239 6075 6101 1256 -2839 12
2138A2N439r59o485l550L825M982j087o392l064M161N660j030n835j522N369N006
$$ 12 5451 4492 -1993 -5543 -1718 3264 2177 -4215 -7279 -3118 2542 1512 -4323 -5845 -476 4530
2154D530r16m957k011M246N493o68o049k546M985M461k928o242j703M458L524
$$ 4530 3614 -1343 -3354 892 6385 5717 -332 -2878 2107 6568 3640 -2602 -4305 153 3677
2169C677k735o170j022N092L708k702n178n09N163M752j526n517q77O071M190
$$ 3677 942 -5228 -6250 -1158 2550 -152 -5330 -5839 -676 4076 2550 -2967 -3844 2227 6417
2184F417l259n256L73N311K762l491n416j45M976K254m033n126J61N061K500l605
$$ 6417 3158 -2098 -1725 3586 6348 2857 -2559 -2704 2272 4526 493 -4633 -4472 589 3089 -516
2200e16n284K45N850L334l950m862J610N914K007l901m021J658N245J992m215
$$ -516 -5800 -5555 295 3629 -321 -5183 -3573 2341 4348 447 -3574 -1916 3329 5321 1106
2215A106l844J771N017J213m554m383J619N564J474n049m732K124N249K86n015
$$ 1106 -2738 -967 4050 5263 709 -3674 -2055 3509 4983 -66 -4798 -2674 2575 2861 -2154
2230b154l473K399M779P08m584l217K757N091L30m350k581L395N359L60m828l208
$$ -2154 -5627 -3228 1551 2259 -2325 -5542 -2785 2306 2636 -1714 -4295 -900 4459 4819 -9 -3217
2246c217L902N290o08n486k194L119M129j172n307k710K561L939j104m840k425
$$ -3217 685 5975 5367 -119 -2313 806 4935 3763 -1544 -4254 -1693 2246 1142 -3698 -6123
2261f123L389M361j405n116j273M599M957j376m708n38N100L813j587m072r70
$$ -6123 -2734 1627 222 -4894 -6167 -1568 3389 2013 -2695 -3233 1867 5680 4093 21 -949
2276i49L835L663j633n348j572L320K940k882n328j002M196K720l262m741p8M560
$$ -949 2886 6549 4916 -432 -2004 1316 4256 1374 -3954 -4956 -760 1960 -1302 -6043 -6121 -1561
2292a561L260k587l557M75M951L489j972m270L18N112K836k612m528M53M281J449
$$ -1561 1699 -888 -4445 -3970 981 4470 2498 -1772 -1454 3658 6494 3882 -646 -193 4088 5537
2308E537m063m569N10M122J024l930m142J164M127J498l320l617J555N034K377
$$ 5537 1474 -3095 -2585 1537 2561 -1369 -5511 -4347 -220 1278 -2042 -5659 -4104 930 3307
2323C307l257l427J923N089J292l597l183K192M150M97m214l261J702L456K88
$$ 3307 50 -3377 -1454 3635 4927 1330 -1853 339 4489 4986 772 -2489 -787 2669 2957
2338B957m239l189J801M377N13m517l230K745M611K76l679k199L105M080j65l701
$$ 2957 -1282 -4471 -2670 1707 2220 -2297 -5527 -2782 1829 2105 -1574 -3773 -668 3412 3247 -454
2354d54k027K726L679k94m026k211K536L676r72m675k249L161M063r87m778j516
$$ -454 -2481 245 3924 3630 -396 -2607 -71 3605 2633 -2042 -4291 -1130 2933 1946 -2832 -4348
2370d348L452L386j228l698j067L620L125q05l766j191L170L177j219m464q71
$$ -4348 -896 2490 1262 -2436 -3503 117 3242 2437 -1329 -2520 650 3827 2608 -1856 -2727
2385b727L774L124k638m327m44L708K570k284l677j50L456K424j738l685m60L749
$$ -2727 1047 4171 1533 -2794 -3238 470 3040 756 -2921 -3071 385 2809 1071 -2614 -3074 675
2401F75K657k114l612k1L982K218l130l740P99M232J489k811l474O55L631J526
$$ 675 3332 1218 -2394 -2415 1567 3785 655 -3085 -2286 1946 3435 624 -2850 -2195 1436 2962
2417B962k691l242N40L883J770k664l541P15L928J435l278l030J550L913P81l624
$$ 2962 271 -2971 -2431 1452 3222 558 -2983 -2268 1660 3095 -183 -3213 -1663 2250 3031 -593
2433e93k694J598L490O46k745k996J375L998R62l312k730J416L949O44l259k310
$$ -593 -3287 -1689 1801 2447 -298 -3294 -1919 2079 3041 -271 -3001 -1585 2364 3008 -251 -2561
2449b561J951L422j52l553k025K356L117l66l258j853J712L305Rl858k040K667
$$ -2561 -610 2812 2660 -893 -2918 -562 2555 2189 -1069 -2922 -1210 2095 2104 -1754 -3794 -1127
2465a127L760l98l733j588K591L241o80l369r95K682K777j344k945j083K525K662
$$ -1127 2633 2235 -1498 -3086 -495 2746 2066 -1303 -2298 384 3161 1817 -1128 -2211 314 2976
2481B976p62l775j248L194K953j474m225p69L231K187j040l566m94K914K146j653
$$ 2976 2214 -1561 -2809 385 3338 1864 -2361 -3130 101 2288 1248 -2318 -2812 102 2248 595
2497E95k901k72K700K297j242l244n34L444K352k011l588N40L562J874k209k963
$$ 595 -2306 -2578 122 2419 1177 -2067 -2601 843 3195 1184 -2404 -1864 1698 3572 1363 -1600
2513a600n8K961J924k334k952R9K903J242k145k820J2K930J581k663k860J225
$$ -1600 -1658 1303 3227 893 -2059 -1960 943 2185 40 -2780 -2768 162 1743 -920 -3780 -2555
2529b555L889R11k652k432J214L208J381j891k617J042L190R38k870k377R23K772
$$ -2555 1334 2245 -407 -2839 -1625 1583 2964 1073 -1544 -502 2688 3626 756 -1621 -698 2074
2545B074Q51k772k884J116L101o4l368j710J902K872p3k510j837J757L215N74
$$ 2074 2925 153 -2731 -1615 1486 1422 -1946 -3656 -1754 1118 1045 -1465 -3302 -1545 1670 2244
2561B244k701j638J704L149M45k901j884J799K926p75l195j299K452J946r62k985
$$ 2244 -457 -2095 -391 2758 3203 302 -1582 217 3143 2368 -827 -2126 326 2272 1310 -1675
2577a675j419J971K470k34k883j381K304K824p78l088q27K740K603p42l023o37
$$ -1675 -3094 -1123 1347 1113 -1770 -3151 -847 1977 1199 -1889 -2716 24 2627 1885 -1138 -1775
2593a775K678J706j475k355k12J950J761j107k699r88K659K490j867l126j14K825
$$ -1775 903 2609 1134 -1221 -1433 517 2278 1171 -1528 -2516 143 2633 766 -2360 -2474 351
2609C51K154j536k682k59K552J739j758k263L29K298R74j221k581l89K788J622
$$ 351 2505 969 -1713 -1972 580 2319 561 -1702 -1373 925 1899 678 -1903 -2292 496 2118
2625B118j941k731R75K740J218k197k468P45L037J201k008k361Q19K304P01j794
$$ 2118 177 -2554 -1579 1161 2379 182 -2286 -1541 1496 2697 689 -1672 -853 1451 2152 358
2641C58k060O81K155R35k366k381J294K720M1k368j788J422K586P04k285j890
$$ 358 -1702 -1021 1134 2069 -297 -2678 -1384 1336 1377 -991 -2779 -1357 1229 1933 -352 -2242
2657b242J522K259N49k158j641J308K390K65k450j904J369K624k23k708j199J842
$$ -2242 -720 1539 2088 -70 -1711 -403 1987 2252 -198 -2102 -733 1891 1668 -1040 -2239 -397
2673c97J932m19k355j225J643K567j89k519r59J639K320k06k582j235J878K293
$$ -397 1535 1116 -1239 -2464 -821 1746 1557 -962 -1921 -282 2038 1832 -750 -1985 -107 2186
2689B186p16k664o48K023J655j276k344k98J784K094p83k514o98K145J958o73
$$ 2186 1470 -1194 -1842 181 1836 560 -1784 -2082 -298 1796 1013 -1501 -2199 -54 1904 1231
2705A231k422l96K230K107j184k599k50K594R56j637j822lJ685Q96j150k485j50
$$ 1231 -1191 -1587 643 2750 1566 -1033 -1283 1311 2267 630 -1192 -1195 490 1386 236 -2249 -2399
2722b399K308J520j623k301K04K524J479j371k208N12K625J163j542j536M45J962
$$ -2399 -91 1429 -194 -2495 -2291 233 1712 341 -1867 -1355 1270 2433 891 -645 -200 1762
2738A762P29j409j985L33K310O67k123k218K83K296M61j977k096R05K327M19j879
$$ 1762 2491 1082 -903 -570 1740 2407 284 -1934 -1651 645 1106 -871 -2967 -2062 265 684 -1195
2755a195j504R69K040N38j094r69Q10K167P01j714j555J308K233K32k323j461
$$ -1195 -2699 -1730 310 848 -246 -1215 -405 1762 2463 749 -806 502 2735 2967 644 -817
2771h17J092K084n67k386j567J250J681m79j994j139R22J710K15j934r76J483
$$ -817 275 2359 1792 -594 -2161 -911 770 291 -1703 -2842 -1920 -210 5 -1929 -2905 -1422
2787a422K423J02j873q53K217K002m72k040l00J896J556p63k106q49J070J486
$$ -1422 1001 1103 -770 -1623 594 2596 2124 84 -216 1680 3236 2473 367 -482 588 2074
2803B074p22k214j029J170J458j210k337n15K065J376j239j420R6K224J384p20
$$ 2074 1352 -862 -1891 -721 737 -473 -2810 -3325 -1260 116 -1123 -2543 -2447 -223 1161 441
2819D41j580J08K132J649o84j799l2J715J278j191k177p5J674N85j639k065j2
$$ 441 -1139 -1031 1101 2750 2066 267 235 1950 3228 2037 -140 -215 1459 2044 405 -1660 -1672
2836a672J664J93j545j685L54J954Q00j140j643N42K267J282j134j383P80K237
$$ -1672 -8 185 -1360 -3045 -2691 -737 63 -1077 -2720 -2178 89 1371 237 -1146 -366 1871
2852A871R33j426j293O89J597L61j580j411M92J437o5k121j720O13J836m3j814
$$ 1871 2804 1378 85 774 2371 2732 1152 -259 233 1670 1605 -516 -2236 -1623 213 170 -1644
2869a644j537Q45K156K76j812q15J302J977L94j268l95Q66J890N9j353r73R61
$$ -1644 -3181 -2336 -180 96 -1716 -2531 -1229 748 1142 -126 -521 345 2235 2294 941 -32 929
2886I29J891k93k180j306J096J383p36k139q81J099J234l94j703p63R97J750K
$$ 929 2820 2527 347 -959 137 1520 784 -1355 -2236 -1137 97 -297 -2000 -2763 -1766 -16 -14
2903a4j263m18J541J792m58j337k69J552J530m41j765m01J435J031j168j846n81
$$ -14 -1277 -1695 -154 1638 1180 -157 -426 1126 2656 2215 450 49 1484 2515 1347 -499 -1080
2920a080R57R17n91j937p68J274J257q57j562K65J771R62p41j129M50J930P74
$$ -1080 -123 794 203 -1734 -2502 -1228 29 -828 -2390 -2125 -354 608 -133 -1262 -812 1118 1892
2937A892p05j221N04J598N52r53j597l19J245Q73j453j926mJ477J30j315j357
$$ 1892 1187 -34 470 2068 2620 1667 70 -249 996 1869 416 -1510 -1514 -37 93 -1222 -2579
2954b579L89J627L03q59q97O95J843O31p60q93M91J969Q37j105j494O88J576j67
$$ -2579 -2190 -563 -260 -1119 -2016 -1321 522 1153 393 -500 -9 1960 2797 1692 198 886 2462 2295
2972B295j632j237L85P82j65j492j251L63J325k8j642l87Q84J577N29j288o14
$$ 2295 663 -574 -189 593 428 -1064 -2315 -1952 -627 -655 -2297 -2684 -1800 -223 306 -982 -1596
2989a596J314K154L50j325o51J462J241l22j436p41N45Q96n86j723r97M31Q79
$$ -1596 -282 1872 2222 897 246 1708 2949 2627 1191 450 995 1891 1305 -418 -1415 -984 -105
3006a05o93j588j005J272J555m55j377p4J768J474k70p51M99J142J286q6j085
$$ -105 -798 -2386 -3391 -2119 -564 -1019 -2396 -2470 -702 772 502 -249 250 1392 2678 2592 1507
3023A507o52J206O84p03j737n14Q58K31j127k135j94J152P79j166j194L44J245
$$ 1507 855 2061 2745 2042 305 -209 649 880 -247 -2382 -2576 -1424 -645 -1811 -3005 -2661 -1416
3040a416J146j15r29J83J746J234n43p25N50J127N35j024j281J41J013K54j599
$$ -1416 -270 -385 -1314 -1131 615 1849 1306 581 1131 2258 2793 1769 488 629 1642 1896 297
3057B97j336K1Q37m7j033j099M4J168R94r18j053P36J561O02p86l93N74J497L54
$$ 297 -1039 -1018 -181 -228 -1261 -2360 -2316 -1148 -154 -1072 -2125 -1389 172 774 -12 -405 169 1666 2020
3076B020j014q98P87R58k71j118r07J85R49J25j401j319M19J556j02j178m98P37
$$ 2020 1006 108 895 1853 1582 464 -443 -258 691 816 -585 -1904 -1485 71 -31 -1209 -1707 -970
3094i70J299j38p94n26J117J143m8j000j53N21R66r4j070j108P31J494n65j426
$$ -970 329 191 -603 -1129 -12 1131 1083 83 -70 451 1417 1323 253 -855 -124 1370 805 -621
3112f21p12Q70Q02k68r68j36N54R31j59q62l10J084O10j58j067j67Q32J271o01
$$ -621 -1333 -463 339 71 -897 -1033 -479 452 293 -569 -879 205 815 657 -410 -577 255 1526 925
3131I25j528m0R78O94q01r23n1O83N89l84j305N5R54N55k98p96q9Q23R47p28q59
$$ 925 -603 -643 335 1029 228 -695 -746 -63 526 142 -1163 -1108 -154 401 103 -693 -782 41 988 260 -599
3152e99J2J542L44q63j014L83P93L73o29r28k61R48N75p94q57N3P43M12o88p57
$$ -599 -587 955 1299 436 -578 -195 598 971 342 -586 -847 101 676 -118 -975 -922 -179 233 -455 -1212
3172a212K52J285L96r49p85Q19J118K53q91m17J95R78K43j032o95L73R25Lp95
$$ -1212 -960 325 721 -228 -1013 -194 924 1177 286 -131 64 1042 1285 253 -442 -69 856 859 64
3191F4r00L47P96j04r41p54O85J114q2r88l13M96Q79L52p03o76O71J279L4j006
$$ 64 -836 -489 307 203 -738 -1492 -807 307 225 -763 -1076 -580 299 651 -52 -728 -57 1222 1256 250
3211B50n67N10R87m00r82k87N24P84p07q79k95M64Q72j53j026m18Q90R77j12j145
$$ 250 -317 193 1180 780 -202 -489 35 819 112 -767 -1062 -598 274 121 -905 -1323 -433 544 432 -713
3231g13k07J081Q04k15r09j5O31N63m97n99l19Q75K49k47j032j22O30P22p95j074
$$ -713 -920 161 965 750 -159 -174 457 1020 523 -76 -395 480 729 482 -550 -672 -42 680 -115 -1189
3251a189K85R90M99n82q23J61Q18M68k64p54K71P06K86n94p05P9O78L74p26q47
$$ -1189 -904 86 585 3 -820 -659 159 627 363 -391 -120 586 872 278 -427 -348 330 704 -22 -869
3271h69J83J016K68r72j026O19P69M25n38n08J51Q83L80o81n10L48R19J66m71
$$ -869 -686 330 598 -374 -1400 -781 -12 413 -125 -633 -482 401 781 100 -410 -62 857 1023 552
3290E52q87M28Q68j59r33p99O36Q32j71q74m89L66M95J15o80l02L69Q85L52p34
$$ 552 -335 93 961 802 -131 -930 -294 538 367 -507 -996 -630 -135 -20 -700 -1002 -633 252 604 -130
3310a30m71N89R33j61o45l15N10P11l78p00l26O91M08l67n89l98L75M92p4r98
$$ -130 -601 -12 921 760 115 -200 310 1021 643 -57 -383 308 716 349 -240 -638 -263 229 155 -843
3330h43k35M58Q83k71o77l3P26L87j78o34J89N08M44j69n63k91O22O14l20r15
$$ -843 -1078 -620 263 -8 -685 -718 8 395 217 -417 -228 280 724 555 -8 -299 323 937 617 -298
3350b98k9N32P49o49p55j71O08M72m82n68Q9P22J78m73n86k01Q80K37k92o78K4
$$ -298 -327 205 954 305 -450 -621 -13 459 -23 -591 -502 220 398 -75 -661 -862 18 255 -37 -715 -691
3371f91Q63M21o48q00M39Q33K58m38l78J64M67L12n10l32K04M63J80o83o76K89
$$ -691 172 593 -55 -855 -416 417 675 237 -141 23 490 802 292 -40 164 627 807 124 -552 -263
3391b63N69M8q38n61L02O32P1o57m33L83P08O8l45j62M20N38L03l41m41M97P55
$$ -263 306 354 -484 -1045 -743 -111 -40 -697 -1130 -747 -39 29 -316 -478 -58 480 783 442 1 498 1253
3412A253p3o34o53O99M10l66r35n48M89L85j34o30m34K07L92K16n91j29M92R23
$$ 1253 1180 546 -107 592 1002 636 -299 -847 -358 27 -107 -737 -1171 -964 -572 -356 -947 -1076 -584 339
3432C39j16m45J32P85M13l31m12L9N55L24l71o13l56L19L18l15p34l80M85L54
$$ 339 223 -222 -90 695 1108 777 365 404 959 1283 912 299 -57 262 580 265 -469 -849 -364 -10
3452a0k38p12J29N93K75m91l19K44P61J20l59k70P2N54N28k94o72O7O11K38l72
$$ -10 -248 -960 -831 -238 37 -454 -773 -529 232 352 -7 -277 -205 349 877 583 -89 -22 589 827 455
3473D55q39J44N27K02n18n50L56L29p7m23k30P8N66K39m47m99J68O48L28o29k16
$$ 455 -384 -240 287 489 -29 -579 -223 106 29 -394 -624 -546 20 259 -188 -687 -519 129 457 -172 -388
3494c88J53O13K15n41l65L10M49N3k52m7k25N03p9m07m23K77N44m3o75m43L03
$$ -388 -235 378 593 52 -313 -3 446 499 247 200 -25 478 399 -8 -431 -154 390 347 -328 -771 -468
3515d68M85K40o97k18M41N08k06k28j26L35M00j93l8l53L09M31p0o05k52M34L76
$$ -468 17 257 -440 -658 -217 291 85 -143 -269 66 466 273 235 -118 191 622 552 -53 -305 129 505
3536E05k80o36k85O82L56k03q01p4O33J99K6q1l05M53M14j98m65j78Q07Q7l42
$$ 505 225 -411 -696 -14 342 139 -662 -736 -103 96 122 41 -264 189 603 405 -60 -238 569 656 314
3557C14p00J74M58M8l11p07K0K32N52k08l84o6L69O75k05m03J0N63K83l95k31
$$ 314 -386 -212 246 294 -17 -724 -704 -472 80 -128 -512 -578 -209 466 261 -142 -132 431 714 319 88
3578H8J57K41K07l34m83J1L74J22o41l82n2K12K87j76l29n9O54K29n48j29N13
$$ 88 245 486 693 359 -124 -113 261 383 -258 -640 -692 -480 -193 -369 -698 -757 -103 126 -422 -551 -38
3599c8M62J58l25p9J29M50J33m44l92J67K84r4l16l79q8M46n6n59k72J09N67j66
$$ -38 424 582 257 178 307 757 890 446 54 221 505 411 95 -284 -372 74 18 -541 -813 -704 -137 -303
3621c03k30JL22J27K99l88j38N61N16p8m54n2K93L48j26o97k06L17L66m81l33
$$ -303 -533 -532 -210 -83 216 -172 -310 251 767 689 235 183 476 824 698 1 -205 112 478 -3 -336
3642c36k20J08K59j6l11k19L94L90j26n02K29L66M10J7l39j81O55L53l49n37Q1
$$ -336 -556 -448 -189 -205 -516 -735 -341 49 -77 -579 -350 16 426 443 104 -77 578 931 582 45 126
3663A26K40L3l3n10j91J56K20l7p25K15M44Ok30j68J14M51L70k52m73M20M67J86
$$ 126 366 399 366 -144 -335 -179 41 4 -721 -506 -62 -56 -286 -454 -340 111 481 229 -244 176 643 829
3685H29l07j80j01N8K62n05l53J40P0j6m81l13J89J77K52k98k46L59L89K15l11
$$ 829 522 342 241 299 561 56 -297 -157 -87 -103 -584 -897 -708 -531 -279 -577 -823 -464 -75 140 -171
3706a71J30L19O63J03k41k20J7M56k02n06k78P2j23k32n74j21j02L99m15k57Q6
$$ -171 -41 278 941 1044 803 583 600 1056 854 348 70 142 19 -213 -787 -908 -1010 -611 -1026 -1283 -1197
3727a197M29L83J83k2J41K24P10J89k57Q6L99J78k70l98k01n7l7l49n58k71J7
$$ -1197 -768 -385 -202 -224 -83 141 851 1040 783 869 1268 1446 1176 778 577 520 483 134 -424 -695 -678
3748f78j68j99l53o7J29N20P5k00J38Q16N07n8K4L03L23K06Kj67o6L3j08j10r52
$$ -678 -846 -1045 -1398 -1465 -1336 -816 -741 -941 -803 13 520 462 486 789 1112 1318 1320 1153 1087 1120 1012 902 -50
3771e0K4j9j14m30o81p9L61Q4j49k34L47L88L25J14J81J84M43J79J94k84J33K56
$$ -50 -26 -45 -159 -589 -1270 -1349 -988 -904 -1053 -1287 -940 -552 -227 -113 68 252 695 874 1068 784 917 1173
3793A173q4m11m55J74j1j72m55n38J60J10j10k68M0j4J61M79l4j0J09N12N5o6
$$ 1173 1089 678 223 397 386 214 -241 -779 -619 -509 -619 -887 -847 -861 -700 -221 -255 -265 -156 356 411 345
3815C45l1L07J58O4k97m03L76J05j59n35k38J27j92K44j21m91J97K54J99k63n1
$$ 345 314 621 779 843 546 143 519 624 465 -70 -308 -181 -373 -129 -250 -741 -544 -290 -91 -354 -405
3836d05L30M79k26k38M4N08O7j29j98j78L68j11k69r2j88J39K65j38k58m24L50
$$ -405 -75 404 178 -60 -16 492 559 430 232 54 422 311 42 -50 -238 -99 166 28 -230 -654 -304
3857c04J62Pr8l8L38J7j9N6k33L67N4r2l31J85J29J86j94l75l52N51J43j33l46
$$ -304 -142 -135 -233 -271 67 84 65 121 -112 255 309 217 -114 71 200 386 192 -183 -535 16 159 26 -320
3880c20K10J87j51J2j68P7J69J09j12o7m8L77j3j78k85J57K66Rk48k84K34j1K06
$$ -320 -110 77 -74 -62 -230 -153 16 125 13 -54 -102 275 262 84 -201 -44 222 231 -17 -301 -67 -78 128
3903A28j6k46P5J35J54r1n3k08K48K12l15j55Q1M08l1n20j53J1L18lk30j50J74
$$ 128 112 -134 -59 76 230 139 86 -122 126 338 23 -132 -51 357 326 -194 -347 -336 -18 -21 -251 -401 -227
3926b27J86N0L1k45J56J85K37l27q6K61L03J60m34m2K74Q4r6m69K2j9o8K9l88
$$ -227 -41 9 40 -205 -49 136 373 46 -40 221 524 684 250 208 482 566 470 1 23 4 -64 -35 -423
3949d23k25M2M21j18j47j66L32J06J11q2J64L23J73n4j51j22M72M9pk85j78K31
$$ -423 -648 -606 -185 -303 -450 -616 -284 -178 -67 -149 15 338 511 457 306 184 656 705 698 413 235 466
3971D66k5l39l73n0K9K33k11m19Q5M8P6q6nL21j01L79r9K19QL09J09O5l43J50
$$ 466 441 102 -271 -321 -292 -59 -270 -689 -604 -556 -480 -566 -571 -250 -351 28 -71 148 156 465 574 639 296 446
3995D46K89j5m7m61P0L8O5l83k82J45r0j82j82R6k20n8K66Q3j03K19J89K29j02
$$ 446 735 720 673 212 282 320 385 2 -280 -135 -225 -407 -589 -493 -713 -771 -505 -422 -525 -306 -117 112 10
4018A0r1J07L02L18m2j10N0K29j74o9o7j09r6j08l01j37j32Pj0l55j33K46K79
$$ 10 -81 26 328 646 604 494 544 773 599 530 463 354 258 150 -151 -288 -420 -413 -423 -778 -911 -665 -386
4041c86j66l3R4J86J80K52l2J38J20K72N4k8k55K47q0j10k00k42L24m2n53j45
$$ -386 -552 -585 -491 -305 -125 127 95 233 353 625 679 651 396 643 563 453 253 11 335 293 -260 -405
4063d05k32J93P4j02j36k01L27K01Q0l7j1K03K14L18j01N0J62J8k34j02K24O1
$$ -405 -637 -444 -370 -472 -608 -809 -482 -281 -201 -238 -249 -46 168 486 385 435 597 615 381 279 503 564
4085E64j43l07j49j33k1K02k33l88K52k5K7J24o5j79K82J79j70K80J02L0M2k6
$$ 564 421 114 -35 -168 -189 13 -220 -608 -356 -381 -354 -230 -295 -474 -192 -13 -183 97 199 229 271 245
4107B45J81j48J08J1j77j48j01K46j06k23j51j02K56l4o6k13K39L7J27k81J95
$$ 245 426 278 386 397 220 72 -29 217 111 -112 -263 -365 -109 -143 -209 -422 -183 -146 -19 -300 -105
4128a05J38J48J00p4j14O2K56j25j45j26K01J16k19M6l53J10p1j27j1J20M9n7
$$ -105 33 181 281 207 93 155 411 286 141 15 216 332 113 159 -194 -84 -155 -282 -293 -173 -124 -181
4150a81Qp7l3P4L88m9k99K13L84J18j93k13K8NK35Jl18P4R5l60R1l24j01J9J21
$$ -181 -173 -250 -283 -209 179 130 -169 44 428 546 353 140 168 173 408 409 91 165 260 -100 -9 -333 -434 -415 -294
4175b94J25l11o3L16M3o9oL09J03L59Rq7nJ1J05m4j4k59r4J41k18k87n7l5Jk93
$$ -294 -169 -480 -543 -227 -184 -253 -259 50 153 512 521 434 429 440 545 501 487 228 134 275 57 -230 -287 -322 -321 -614
4201f14k23L22J20P0k65J52K13K66J03J19j1R2J65M3J91l14k0J86j13k10l33m9
$$ -614 -837 -515 -395 -325 -590 -438 -225 41 144 263 252 344 509 552 743 429 409 595 482 272 -61 -110
4223a10J16k66j72l68K18L5J64k04PK69J11K69p4J0K37K50O8p3j41R3rk49l1o0
$$ -110 6 -260 -432 -800 -582 -547 -383 -587 -580 -311 -200 69 -5 5 242 492 560 487 346 439 430 181 150 90
4247I0j25j58p4k40K28j02k0O5Lj82J63L30J60n9n9K92K21O2k21J12Nk11L0k20
$$ 90 -35 -193 -267 -507 -279 -381 -401 -336 -333 -515 -352 -22 138 79 20 312 533 595 374 486 491 280 310 90
4271I0p5j10J8m8m01j26J60K08p6j23m9K77J56J45q1R9K90O9J82j81R3mL4j15
$$ 90 15 -95 -77 -125 -526 -652 -492 -284 -360 -483 -532 -255 -99 46 -35 64 354 423 605 424 517 513 547 432
4295D32l61l38L65k14l00o2q2R0k2j02k11L41J39R4K24j6O6O4K06J99o8l6K20
$$ 432 71 -267 98 -116 -416 -478 -560 -470 -492 -594 -805 -464 -325 -231 -7 -23 43 107 313 512 444 408 628
4318F28J30j86j86j50J41j52m17k29K86j57P7k78j4m2O8P6Q8j10J18J96O9J88
$$ 628 758 572 386 236 377 225 -192 -421 -135 -292 -215 -493 -507 -549 -481 -405 -317 -427 -309 -113 -44 144
4340A44m4J68K78P3j94KQ8j3j49k23J77l77q1K72k50k73j70J55R6q6j61J24Q7
$$ 144 100 268 546 619 425 427 515 502 353 130 307 -70 -151 121 -129 -402 -572 -417 -321 -407 -568 -444 -357
4363c57J74j37R0K43J53N1L0M8J9J87K22m67o9N1L10j84k26l45n3K37l24o3l6
$$ -357 -183 -320 -230 13 166 217 247 295 314 501 723 256 187 238 548 364 138 -207 -260 -23 -347 -410 -446
4386d46J10l2n5O1Q7M9R7J09P2kK06K95k78O0k4J09LK0l47o3M1l8k3j10k55q0
$$ -446 -336 -368 -423 -362 -275 -226 -129 -20 52 50 256 551 273 333 309 418 421 441 94 31 72 34 11 -99 -354 -434
4412d34M2m0K9L8P7P2J63o8J38R8L12j85oJ28P6m6j35j01n7K30j12l07p7k79K06
$$ -434 -392 -432 -403 -365 -288 -216 -53 -121 17 115 427 242 236 364 440 394 259 158 101 331 219 -88 -165 -444 -238
4437b38j82J7l8J7K18p6n7M0J47J71K7J39P9J0O9J55K8j36j09N6l5k49j88J30
$$ -238 -420 -403 -441 -424 -206 -282 -339 -299 -152 19 46 185 264 274 343 498 526 390 281 337 302 53 -135 -5
4461ek09J47m14K66j09o6p8J21J9J61L09k18J17r6j14O06m2j70r6K16j04j3q9
$$ -5 -214 -67 -481 -215 -324 -390 -468 -347 -328 -167 142 -76 41 -55 -169 437 395 225 129 345 241 228 139
4484A39m4J00k06l44L71p8k45N0l7k7m3K67J04M3k61m7L14J95j39o3J57P2j79
$$ 139 95 195 -11 -355 16 -62 -307 -257 -294 -321 -364 -97 7 50 -211 -258 56 251 112 49 206 278 99
4507I9kj2J0j93P1o7j97l1K27k1j6j61o8K99K82q8j90Q9J5K27R3k82Q9M5K8J4
$$ 99 97 85 95 -98 -27 -94 -291 -322 -95 -116 -132 -293 -361 -62 220 132 -58 31 46 273 366 84 173 218 246 260
4533B60j86Pj74k57k5O5M6J33Kk82n9L81j3J69L5J59N8rLJ78j91J13J71j00k20
$$ 260 74 81 -93 -350 -375 -310 -264 -131 -129 -411 -470 -89 -102 67 102 261 319 310 313 491 300 413 584 484 264
$$ [...]
8191h3
##END NTUPLES=NMR FID
##END=
