##TITLE=1H_1BEPA0207
 D2O, 8 sc, 
 5.07.2021
##JCAMPDX= 6.0         $$ Bruker NMR JCAMP-DX V2.0
##DATA TYPE= NMR FID
##DATA CLASS= NTUPLES
##ORIGIN= UXNMR, Bruker Analytische Messtechnik GmbH
##OWNER= root
$$ XWIN-NMR		Version 3.5
$$ Mon Jul  5 10:04:19 2021 Russian Standard Time (UT+4h)  she@DPX200
##.OBSERVE FREQUENCY= 200.131506
##.OBSERVE NUCLEUS= ^1H
##.DELAY= (6, 6)
##.ACQUISITION MODE= SIMULTANEOUS
##.ACQUISITION SCHEME= undefined
##.AVERAGES= 8
##.DIGITISER RES= 18
##SPECTROMETER/DATA SYSTEM= spect
##.PULSE SEQUENCE= zg30
##.SOLVENT NAME= CDCl3
##.SHIFT REFERENCE= (INTERNAL, CDCl3, 0, 15.7039)
##AUDIT TRAIL= $$ (NUMBER, WHEN, WHO, WHERE, WHAT)
$$ ##TITLE= Audit trail, XWIN-NMR		Version 3.5
$$ ##JCAMPDX= 5.01
$$ ##ORIGIN= Bruker BioSpin GmbH
$$ ##OWNER= she
$$ F:/spectra/data/she/nmr/H-F/1/audita.txt
$$ ##AUDIT TRAIL=  $$ (NUMBER, WHEN, WHO, WHERE, WHAT)
(   1,<2021-07-05 10:03:03.65 +0400>,<she>,<DPX200>,
      <created by zg, POWCHK disabled, PULCHK disabled
       configuration hash MD5:
       00 E9 B6 7A A2 85 ED C7 34 08 36 98 17 FE 4E 26
       data hash MD5: 16K
       C7 9F C5 40 66 9F 61 43 BE 02 28 6B EA 08 3A 9C>)
$$ ##END=
$$ 
$$ hash MD5
$$ 7A 21 89 03 68 13 6E D0 53 59 73 DB 34 4A CE CC
##$RELAX= 
##$RELAX= 
##$RELAX= 
##$RELAX= 
##$RELAX= 
##$RELAX= 
$$ Bruker specific parameters
$$ --------------------------
##$DU= <F:/spectra>
##$EXPNO= 1
##$NAME= <H-F>
##$PROCNO= 1
##$TYPE= <nmr>
##$USER= <she>
##$AMP= (0..31)
100 100 100 100 100 100 100 100 100 100 100 100 100 100 100 100 100 100 
100 100 100 100 100 100 100 100 100 100 100 100 100 100 
##$AQSEQ= 0
##$AQ_mod= 1
##$AUNM= <au_zg>
##$AUTOPOS= <>
##$BF1= 200.13
##$BF2= 200.13
##$BF3= 200.13
##$BF4= 200.13
##$BF5= 200.13
##$BF6= 200.13
##$BF7= 200.13
##$BF8= 200.13
##$BYTORDA= 1
##$CFDGTYP= 0
##$CFRGTYP= 5
##$CHEMSTR= <none>
##$CNST= (0..31)
1 1 145 1 1 1 1 1 1 1 1 1 1 1 1 1 1 1 1 1 1 1 1 1 1 1 1 1 1 1 1 1 
##$CPDPRG= <>
##$CPDPRG1= <>
##$CPDPRG2= <>
##$CPDPRG3= <>
##$CPDPRG4= <mlev>
##$CPDPRG5= <mlev>
##$CPDPRG6= <mlev>
##$CPDPRG7= <mlev>
##$CPDPRG8= <mlev>
##$CPDPRGB= <>
##$CPDPRGT= <>
##$D= (0..31)
0 1.2 0 0 0 0 0 0 0 0.06 0 0.03 0 0 0 0 0.0002 0 0 0 0 0 0 0 0 0 0 0 0 
0 0 0 
##$DATE= 1625464983
##$DBL= (0..7)
120 120 120 120 120 120 120 120 
##$DBP= (0..7)
150 150 150 150 150 150 150 150 
##$DBP07= 0
##$DBPNAM0= <>
##$DBPNAM1= <>
##$DBPNAM2= <>
##$DBPNAM3= <>
##$DBPNAM4= <>
##$DBPNAM5= <>
##$DBPNAM6= <>
##$DBPNAM7= <>
##$DBPOAL= (0..7)
0.5 0.5 0.5 0.5 0.5 0.5 0.5 0.5 
##$DBPOFFS= (0..7)
0 0 0 0 0 0 0 0 
##$DE= 6
##$DECBNUC= <off>
##$DECIM= 32
##$DECNUC= <off>
##$DECSTAT= 4
##$DIGMOD= 1
##$DIGTYP= 9
##$DL= (0..7)
0 120 120 120 120 120 120 120 
##$DP= (0..7)
150 150 150 150 150 150 150 150 
##$DP07= 0
##$DPNAME0= <>
##$DPNAME1= <>
##$DPNAME2= <>
##$DPNAME3= <>
##$DPNAME4= <>
##$DPNAME5= <>
##$DPNAME6= <>
##$DPNAME7= <>
##$DPOAL= (0..7)
0.5 0.5 0.5 0.5 0.5 0.5 0.5 0.5 
##$DPOFFS= (0..7)
0 0 0 0 0 0 0 0 
##$DQDMODE= 0
##$DR= 18
##$DS= 0
##$DSLIST= <SSSSSSSSSSSSSSS>
$$ [...]
##$SUBNAM2= <"">
##$SUBNAM3= <"">
##$SUBNAM4= <"">
##$SUBNAM5= <"">
##$SUBNAM6= <"">
##$SUBNAM7= <"">
##$SUBNAM8= <"">
##$SUBNAM9= <"">
##$SW= 20.0188882624521
##$SWIBOX= (0..15)
0 0 2 0 0 0 0 0 0 0 0 0 0 0 0 0 
##$SW_h= 4006.41025641026
##$TD= 16384
##$TD0= 1
##$TE= 0
##$TE2= 300
##$TE3= 300
##$TEG= 300
##$TL= (0..7)
0 120 120 120 120 120 120 120 
##$TP= (0..7)
150 150 150 150 150 150 150 150 
##$TP07= 0
##$TPNAME0= <>
##$TPNAME1= <>
##$TPNAME2= <>
##$TPNAME3= <>
##$TPNAME4= <>
##$TPNAME5= <>
##$TPNAME6= <>
##$TPNAME7= <>
##$TPOAL= (0..7)
0.5 0.5 0.5 0.5 0.5 0.5 0.5 0.5 
##$TPOFFS= (0..7)
0 0 0 0 0 0 0 0 
##$TUNHIN= 0
##$TUNHOUT= 0
##$TUNXOUT= 0
##$USERA1= <user>
##$USERA2= <user>
##$USERA3= <user>
##$USERA4= <user>
##$USERA5= <user>
##$V9= 5
##$VALIST= <valist>
##$VCLIST= <CCCCCCCCCCCCCCC>
##$VD= 0
##$VDLIST= <DDDDDDDDDDDDDDD>
##$VPLIST= <PPPPPPPPPPPPPPP>
##$VTLIST= <TTTTTTTTTTTTTTT>
##$WBST= 1024
##$WBSW= 4
##$XGAIN= (0..3)
0 0 0 0 
##$XL= 0
##$YL= 0
##$YMAX_a= 477469
##$YMIN_a= -379144
##$ZGOPTNS= <>
##$ZL1= 120
##$ZL2= 120
##$ZL3= 120
##$ZL4= 120
##$ABSF1= 10
##$ABSF2= 0
##$ABSG= 5
##$ABSL= 3
##$ALPHA= 0
##$AQORDER= 0
##$ASSFAC= 0
##$ASSFACI= 0
##$ASSFACX= 0
##$ASSWID= 0
##$AUNMP= <proc_1d>
##$AZFE= 0.1
##$AZFW= 0.1
##$BCFW= 1
##$BC_mod= 2
##$BYTORDP= 1
##$COROFFS= 0
##$CY= 11.3945322036743
##$DATMOD= 1
##$DC= 2
##$DFILT= <>
##$DTYPP= 0
##$F1P= 15.9154993809931
##$F2P= -4.1035820241983
##$FCOR= 0.5
##$FTSIZE= 0
##$FT_mod= 4
##$GAMMA= 1
##$GB= 0.15
##$INTBC= 1
##$INTSCL= 1
##$ISEN= 128
##$LB= 0.24
##$LEV0= 0
##$LPBIN= 0
##$MAXI= 10000
##$MC2= 0
##$MEAN= 0
##$ME_mod= 0
##$MI= 1.114404
##$NCOEF= 0
##$NC_proc= 0
##$NLEV= 6
##$NOISF1= 3.799351
##$NOISF2= 2.8
##$NSP= 1
##$NTH_PI= 0
##$NZP= 0
##$OFFSET= 15.70392
##$PC= 1
##$PHC0= -12073.84
##$PHC1= 6.800991
##$PH_mod= 1
##$PKNL= yes
##$PPARMOD= 0
##$PSCAL= 0
##$PSIGN= 0
##$REVERSE= no
##$SF= 200.130013532006
##$SI= 16384
##$SIGF1= 3
##$SIGF2= 2
##$SINO= 400
##$SIOLD= 16384
##$SREGLST= <1H.CDCl3>
##$SSB= 0
##$STSI= 0
##$STSR= 0
##$SW_p= 3612.71676300578
##$SYMM= 0
##$S_DEV= 0
##$TDeff= 0
##$TDoff= 0
##$TI= <>
##$TILT= no
##$TM1= 0
##$TM2= 0
##$TOPLEV= 0
##$USERP1= <user>
##$USERP2= <user>
##$USERP3= <user>
##$USERP4= <user>
##$USERP5= <user>
##$WDW= 1
##$XDIM= 8192
##$YMAX_p= 0
##$YMIN_p= 0
$$ End of Bruker specific parameters
$$ ---------------------------------
##NTUPLES= NMR FID
##VAR_NAME=  TIME,          FID/REAL,        FID/IMAG
##SYMBOL=    X,             R,               I
##VAR_TYPE=  INDEPENDENT,   DEPENDENT,       DEPENDENT
##VAR_FORM=  AFFN,          ASDF,            ASDF
##VAR_DIM=   8192,          8192,            8192
##UNITS=     SECONDS,       ARBITRARY UNITS, ARBITRARY UNITS
##FACTOR=    0.0002496,     1,               1
##FIRST=     0,             0,               0
##LAST=      2.0444736,     0,               0
##MIN=       0,             -379144,         0
##MAX=       2.0444736,     477469,          0
$$ Real data points
##PAGE= N=1
##DATA TABLE= (X++(R..R)), XYDATA
$$ [...]
1324c44J877j012K38L46j442j537Q3K035J276n00L7q16k466k01K692J629n51p59
$$ -344 1533 521 759 1105 -337 -1874 -1791 244 1520 1020 1057 241 -2225 -2426 266 1895 1344 585
1342E85l85j878q95K938J799j724K30M61l177k75L201j86m21J772j590k370N98
$$ 585 200 -1678 -2573 365 2164 440 670 1131 -2046 -2321 880 694 273 2045 455 -1915 -1317
1359a317N06J125J553r50o50m37k497J278L499j474o37K172l021k457L544P20
$$ -1317 -811 314 1867 917 267 -170 -2667 -1389 2110 636 -1 2171 -850 -3307 237 957
1375I57j262K014j85k912j52O44O85J522k06l88j92k428k83L229j11r56J949j329
$$ 957 -305 1709 1524 -1388 -1540 -896 -211 1311 1105 717 525 -1903 -2186 1043 932 -24 1925 596
1393E96l374J495K124q19O33J141j508k034J73J637O07j87P56p0k689o62K402
$$ 596 -2778 -1283 841 22 655 1796 288 -1746 -1573 64 671 484 1240 1170 -1519 -2181 221
1410B21M49n88J225R9k707r35K111R06p99R29R00k594j768K393J104j207J138
$$ 221 670 82 1307 1406 -1301 -2236 -125 781 -18 911 1811 -783 -2551 -158 946 -261 877
1427H77J046k547j625J769J036m87N58R92j333k433Q51K200p01k86K093j198l288
$$ 877 1923 -624 -2249 -480 556 69 627 1619 286 -2147 -1296 904 203 -83 2010 812 -2476
1444b476J280K189j141J78J927j264k523L96J741L4l44J263J71k728r05K576M10
$$ -2476 -1196 993 -148 30 1957 693 -1830 -1434 307 341 -3 1260 1431 -1297 -2202 374 784
1461G84j380J779P30l277p86K547L6r32J516P08k482j339J741J094r38O66J385
$$ 784 -596 1183 1913 -1364 -2150 397 433 -499 1017 1725 -757 -2096 -355 739 -199 467 1852
1478A852j961k173J734J425j159M44J786j681k365J289J613r60J46J789j148k565
$$ 1852 -109 -2282 -548 877 -282 162 1948 267 -2098 -809 804 -156 -10 1779 631 -1934
1494a934P94J836o78k03J771o17k505J10J856k22n06J558P9k519o21K044K53r58
$$ -1934 -1140 696 18 -185 1586 969 -1536 -1426 430 208 -298 1260 1339 -1180 -1801 243 496 -462
1512d62J453N37k488p33J963N1p93J326O17j889j150J130Q16n27O50R77j401j896
$$ -462 991 1528 -960 -1693 270 321 -472 854 1471 -418 -1568 -438 378 -149 501 1478 77 -1819
1530a819J119J406r51L18J630j483j986J188R88p77P35J144j291j480N69P70n2
$$ -1819 -700 706 -245 73 1703 220 -1766 -578 410 -367 368 1512 221 -1259 -690 80 28
1547B8K05P46k16j621l80J353mm10J393K21k452k64J723l33k36J624m89j982K64
$$ 28 233 979 763 -858 -1238 115 111 -299 1094 1315 -1137 -1401 322 -11 -247 1377 888 -1094 -830
1566h30Q69k67K46P32Jq59p47L24N71k81O54J045j377j629J175N67p75J366Q09
$$ -830 39 -228 18 750 751 -108 -855 -531 40 -241 413 1458 81 -1548 -373 194 -581 785 1594
1585A594k091p01J228k48k17J328R8j182l83K37J00J53K22O87j08j401l4R13q47
$$ 1594 -497 -1198 30 -218 -435 893 991 -191 -574 -337 -237 -84 138 825 717 -684 -718 195 -652
1604f52K90K049p56k302Q67O01j048J290J442j801j024R48j31j44P08J49j13m07
$$ -652 -362 1687 931 -1371 -504 97 -951 339 1781 -20 -1044 -96 -227 -371 337 486 373 -34
1622c4o10N47l2p77J604J113k302o60J721j284l28K791m39k436O56P02j004O85
$$ -34 -644 -97 -129 -906 698 1811 -491 -1151 570 -714 -1042 1749 1310 -1126 -470 232 -772 -87
1640h7J009m31n94l30J22M99o61J22J717q60j735J360J86j930J686K090k175j162
$$ -87 922 491 -103 -433 -311 188 -473 -351 1366 506 -1229 131 317 -1613 73 2163 -12 -1174
1658a174J497o80p38J879N33j507m40M11K15j18k20Q35M45j450k1J254j402p42
$$ -1174 323 -357 -1095 784 1317 -190 -630 -219 -4 -122 -342 493 938 -512 -533 721 -681 -1423
1676a423K880K10k821O64J128j919O99K450j171j719Q54K03l15K27J73N32m36
$$ -1423 1457 1667 -1154 -490 638 -1281 -582 1868 697 -1022 -168 35 -280 -53 120 652 216
1693B16j103J089M64k170J071K505k003j301K040j045j635K684J007k256j27N03
$$ 216 -887 202 666 -1504 -433 2072 69 -1232 808 -237 -1872 812 1819 -437 -564 -61
1709f1n59L93O38K16j77j212J28J575j082j175K287J47k169J288Q13k575M79K703
$$ -61 -620 -227 411 627 450 -762 -634 941 -141 -1316 971 1118 -1051 237 1050 -1525 -1046 1657
1727A657p96j415O18m25o47J002J017k02j125o90R91N19r96M97J116j463n26J915
$$ 1657 861 -554 64 -361 -1008 -6 1011 809 -316 -1006 -15 504 -492 5 1121 -342 -868 1047
1745A047p58j997J765J368j718P0Q77j444l59J799L76q35m35l56K98K64p3Q64
$$ 1047 289 -1708 57 1425 -293 -223 654 -790 -1149 650 1026 191 -244 -600 -302 -38 -111 753
1763G53kj862N88J675j711l65K197j015j371J914k71j986J248J080p83K18j36
$$ 753 751 -1111 -523 1152 -559 -924 1273 258 -1113 801 530 -1456 -208 872 89 307 171
1780A71r20M75J21K45J137j050j425J450L8j349J826N19k324P04J446j791L0J524
$$ 171 -749 -274 -153 92 1229 179 -1246 204 242 -1107 719 1238 -1086 -382 1064 -727 -697 827
1798H27p74l81R16o08m90L00n4P14L14j135O5M88j044N85J624j069j077J205m04
$$ 827 53 -328 588 -20 -510 -210 -264 450 764 -371 -306 182 -862 -277 1347 278 -799 406 2
1817Br48J345O02j308L3P61p29k67P01J4k12J98j32j35j41l75Q14N78r73o2O91
$$ 2 -946 399 1001 -307 -274 487 -242 -509 192 206 -6 192 60 -75 -216 -591 223 801 -172 -234 457
1838D57j116k23K013m30j492J073O8j471J135R78j250L1O42o73O1J74l06O96n4
$$ 457 -659 -882 1131 701 -791 282 350 -1121 14 992 -258 -227 415 -258 -197 -23 -329 367 313
1857C13p72R47l34j498J467J172j812K88J252j825k51J996m89r91R40k41p03L95
$$ 313 -459 488 154 -1344 123 1295 -517 -229 1023 -802 -1053 943 454 -537 403 162 -541 -146
1875a46K00K10J02p55M05N27j301J33J556q46p24J439m49j628J110J066j042j01
$$ -146 54 264 366 -389 16 543 -758 -625 931 85 -639 800 351 -1277 -167 899 -143 -244
1893b44Q06o45o99O39O98l93m08L31K17o09k94R93J33r55M02Q30j235o84J692
$$ -244 562 -83 -782 -143 555 162 -246 85 302 -307 -601 392 525 -430 -28 802 -433 -1117 575
1912E75K23j413O40Q11j464k10J477k19q23N44K25o37k47M00O16l16o14P92J34
$$ 575 798 -615 25 836 -628 -838 639 420 -403 141 366 -271 -518 -118 498 182 -432 360 494
1931D94j514O17J548j313m59J508p49j386J292O79r81J64M88l60n33J74P02N4
$$ 494 -1020 -403 1145 -168 -627 881 132 -1254 38 717 -264 -100 388 28 -505 -331 371 425
1949D25q59L46Q08j120n33J578j74j176R70N15j460M6J141k06n86M00K79n78m93
$$ 425 -434 -88 720 -400 -933 645 471 -705 265 780 -680 -634 507 301 -285 115 394 -184 -677
1968f77Q35L55p46J7P60n04q15P76N70p66p5P58m40q62P05O71o36k99Q47k77j008
$$ -677 158 513 -233 -216 544 40 -775 1 571 -195 -270 488 48 -814 -109 562 -74 -373 474 197 -811
1989h11P13O25o63r9N69j52o94J94O55r1n58M18L75q70j88R95q4q97Q27K71j067
$$ -811 -98 527 -136 -235 334 182 -512 -318 337 246 -312 106 481 -389 -577 418 334 -563 264 535 -532
2010e32L6Q94k82k75L99lm52j72M68K45m39K5M85l90o17O75L21p05K29O12p07
$$ -532 -496 398 116 -159 240 237 -215 -387 81 326 -113 -88 397 7 -610 65 386 -319 -90 522 -185
2031a85l44O97R7l85Q9L63l39l72L07M17m07p3N07k12o49L36N31m02r5M54j64
$$ -185 -529 168 265 -120 -31 332 -7 -379 -72 345 -62 -135 372 160 -489 -153 378 -24 -119 335 171
2052A71o24K92M47l00j58N23j78n72K18M78l02j53M45o2n29J02L79q2l00L82J87
$$ 171 -453 -161 286 -14 -172 351 173 -399 -181 297 -5 -158 287 225 -304 -202 177 95 -205 177 364
2073C64o28j26O30l1m83M72K10q18J7O65j94l75M90J38n27p2M09l3k58J08L78
$$ 364 -264 -390 240 209 -274 198 408 -410 -393 272 78 -297 193 331 -196 -268 141 108 -150 -42 336
2094C36k60o07N27L57o42J90O95n77o21P63J71o54K88N22n35l61M56K16m53M6
$$ 336 76 -531 -4 353 -289 -99 596 19 -602 161 332 -322 -34 488 -47 -408 48 264 -189 -143
2114a43N34j43n64J16N99m59m24Q49J02j009K55P65n85l19Q31m0q23L05N15m56
$$ -143 391 248 -316 -200 399 -60 -484 365 467 -542 -287 478 -107 -426 405 365 -458 -153 362 -94
2134i4j46N07P1m59k27N24O3o00K60O92o92n82R70P2r03N59O55q77l30Q75j39
$$ -94 -240 267 338 -121 -348 176 239 -361 -101 591 -101 -683 287 359 -544 15 670 -207 -537 338 199
2155A99n28K83M09l30l57K82L76m93k15P39N7r74K93Q07o69m07J051j49j037N34
$$ 199 -329 -46 363 33 -324 -42 334 -159 -374 365 422 -552 -259 548 -121 -528 523 374 -663 -129
2175a29O48p58j08O99r7o12K21K90j02l33K95M28m97l97O26J60q72M51Q64r51
$$ -129 519 -239 -347 352 255 -357 -136 154 52 -281 14 442 -55 -452 174 334 -538 -87 777 -174
2195a74m50J004j80p35O61M23q09o7N47p2k58Q0K21jm80R7O39n24m65R76J5j051
$$ -174 -624 380 200 -535 126 549 -260 -327 220 148 -110 -30 191 190 -290 -193 446 -78 -543 433 448 -603
2217f03N78M61q23N5Q49m12n24M19J53l22P3K23N5k52k48M81O5n59L53M82o97
$$ -603 -25 436 -387 -332 517 105 -419 0 153 -169 -96 127 182 -70 -318 163 228 -331 22 504 -193
2238a93k11Q27k28o79O56K34o80Q0N03l47l04M17J88k21j48O6J31j78J0M12j94
$$ -193 -404 423 195 -484 172 406 -274 -194 309 -38 -342 75 263 42 -106 -40 91 -87 -77 335 141
2259A41n59K99N35n64q3O13l39n17O50J99o95J98L96l03k7K01j56j99K7K96K28
$$ 141 -418 -119 416 -148 -231 382 43 -474 176 375 -320 -122 274 -29 -56 145 -11 -210 -183 113 341
2280C41l83k81M63o0l65O27N4r13K91P03n35j74N72l68l79O34L6l45j14Q6K46
$$ 341 -42 -323 140 80 -285 342 396 -517 -226 477 -58 -232 340 -28 -407 227 263 -82 -196 -110 136
2301A36P9k45P6n0l65L82O21p14l85O33j68k57N71l6p10J88N35j22k83Q7J4m0
$$ 136 215 -30 46 -4 -369 13 634 -80 -465 168 0 -257 314 278 -432 -244 291 169 -114 -27 -13 -53
2323e3M7K48j06m45o4P79j20m64K03O3m35K49P03n16n76M41K11l46K14K41l97
$$ -53 -6 242 136 -309 -373 406 286 -178 25 88 -347 -98 605 89 -487 -46 165 -181 33 274 -123
2344a23k28M30K26k96l29L01K36k39l0L30l96m44P82L60p81r3N44l81j70P08j59
$$ -123 -351 79 305 9 -320 -19 217 -22 -52 278 -118 -562 220 580 -201 -294 250 -131 -301 407 248
2365B48o83L04L43j10j74K1J27j22j92M29J57p62J09Q42m53m36O52j67o81N58
$$ 248 -435 -131 212 102 -72 -51 76 -46 -238 191 348 -414 -305 537 84 -352 300 133 -548 10
2385A0N19n56k30L24j8j76J14J63j1m32K12N30m86m67O95J15o60L46M11o68j21
$$ 10 529 -27 -257 67 49 -127 -13 150 139 -293 -81 449 -37 -504 191 306 -354 -8 403 -265 -386
2406c86P10m5n33J22L45l25j35M06P6m40q9N44m8n29K07M65m48j70N25j22n95
$$ -386 324 279 -254 -132 213 -112 -247 159 235 -205 -294 250 202 -327 -120 345 -103 -273 252 130 -465
2427d65L46N95n15l08N38r1m51L72L75m51k35L88J02k80n4K95k3l85J70M71m73
$$ -465 -119 476 -39 -347 191 100 -351 21 396 -55 -290 98 200 -80 -134 161 138 -247 -77 394 -79
2448g9l50O42L6n78M07K29n55m1O00j64l37R7K07j30r7J49J83l80j22N24o3m95
$$ -79 -429 213 249 -329 78 307 -248 -289 311 147 -190 -93 114 -16 -113 36 219 -161 -283 241 178 -317
2470c17K13M39n12K0M67l19l54L74K15k12j55K73p6k72J99L10l21j53K67J21l59
$$ -317 -104 335 -177 -157 310 -9 -363 11 226 14 -141 132 56 -216 -17 293 -28 -181 86 207 -152
2491a52L3L73j86k65L31J21l83j72N26j45k62K09J84m63O4L71q2k91J15J20j30
$$ -152 -119 254 68 -197 134 255 -128 -300 226 81 -181 28 212 -251 -187 184 102 -189 -74 46 -84
2512h4J8J11J09k97P6K55j72k60L37J43m26J31L31l43j67L38L2k50J51J10j69
$$ -84 -66 45 154 -143 -67 188 16 -244 93 236 -190 -59 272 -71 -238 100 132 -118 33 143 -26
2533b6j43K09J19k20j4K05j4l13J73K46k81j83L93n2l29K16K39l20n0L08r5k91
$$ -26 -169 40 159 -61 -75 130 116 -197 -24 222 -59 -242 151 99 -230 -14 225 -95 -145 163 68 -223
2555b23J92K49k24j84L18J2l21K8L18j43j85K64Q5k99j18M19n9m03K65K99l95
$$ -223 -31 218 -6 -190 128 140 -181 -153 165 22 -163 101 186 -113 -231 188 129 -274 -9 290 -105
2576a05j03L82n2l70K41K47l54j10L06N1k83O8K69j57k15K72J72l99q8M99j67
$$ -105 -208 174 122 -248 -7 240 -114 -224 82 133 -150 -82 187 30 -185 87 259 -140 -228 271 104
2597A04m38L28K37m39Q4L67j81l11K33K53k81j51K72Q0m24J71L41j99l11L50J63
$$ 104 -334 -6 231 -208 -124 243 62 -249 -16 237 -44 -195 77 157 -267 -96 245 46 -265 85 248
2618B48m79P9L61j32l44L35J87m51m3M82q0m28K71K87l11k05L44Q7m17J21L11
$$ 248 -231 -152 209 77 -267 68 255 -196 -239 243 163 -265 6 293 -18 -223 121 208 -209 -88 223
2639B23k22l18L97J30m03J4M05j86l73M07J49m01K0L98j31m09K39K91l37j15L49
$$ 223 1 -317 80 210 -193 -179 226 40 -333 74 223 -178 -158 240 109 -300 -61 230 -107 -222 127
2660A27P1m23J14L79k46k65L38J63m63O2L88k47k53L34J12l22O4J83j0k73J36
$$ 127 198 -225 -111 268 22 -243 95 258 -205 -143 245 -2 -255 79 191 -131 -67 116 106 -167 -31
2681c1K54k92j52L87ll35L6M20l53j63K80J02k86L8L73k80j81K43J01k75j3L34
$$ -31 223 -69 -221 166 163 -172 -136 284 -69 -232 48 150 -136 -98 275 -5 -186 57 158 -117 -130 204
2703B04j49l01K25K20j78k05L15n1l16J63L51l04j87M25o4l18O3K76k06p1J91
$$ 204 55 -246 -21 199 21 -184 131 80 -236 -73 278 -26 -213 212 148 -170 -107 169 -37 -108 83
2724H3O7k70RK19m3j68J12J59k92j5L18m5l59J73K41k72lJ98q1k31K05J85k00
$$ 83 150 -120 -111 108 65 -103 9 168 -124 -139 179 134 -225 -52 189 -83 -86 112 31 -200 5 190 -10
2747a0j18J79L1j59J25O8j57j79K68J48k31p0K04p5j58K07J41l23p0L81p3k70
$$ -10 -128 51 82 -77 48 116 -41 -220 48 196 -35 -105 99 24 -134 73 214 -109 -179 202 129 -141
2769a41J90O9k98J32K59j82j98M7J89Jr5O6R2k66k2M04j62l03K49J08k63J44K21
$$ -141 49 118 -180 -48 211 29 -169 -122 67 68 -27 39 131 -135 -157 247 85 -218 31 139 -124 20 241
2792B41l56j85L95P1k56L7P4p8l0K08J1j65k30K76J90l34O1K11k33j39M04Q2n20
$$ 241 -115 -300 95 166 -90 -53 21 -57 -87 121 132 -33 -263 13 203 -131 -70 141 -92 -231 173 255 -265
2815b65J04M21l03n3K67j67l01K65K30j34k17O7J60j32j9K08j8l77J68M14l37
$$ -265 -161 260 -43 -96 171 4 -297 -32 198 64 -153 -86 74 -58 -77 131 113 -264 -96 318 -19
2836a9k90M16M8l94K81K82m43j27M42nl09J08L3j10o2K37J58l14k37M28P6m34
$$ -19 -309 107 155 -239 42 324 -119 -246 196 191 -118 -10 23 -87 -149 88 246 -68 -305 123 199 -235
2858b35K00L78m14j74N24j56m25L15K20k76o8K35q8k18J25K37j14k06N9K86k08
$$ -235 -35 343 -71 -245 279 123 -302 13 233 -43 -111 124 36 -182 -57 180 66 -140 -81 205 -3
2879ck04L95o6m16K91L26m38j87M91o8l60L01J12l45L8K41k5j46k5J45%j50P9
$$ -3 -207 188 122 -294 -3 323 -115 -302 189 121 -239 62 174 -171 -133 108 83 -63 -88 57 57 -93 -14
2902a4K37l10k10M85l9m46K44K61l56m4M58k19l28L61J11j94q2P0J2j4m5K51l5
$$ -14 223 -87 -297 188 149 -297 -53 208 -148 -192 266 47 -281 80 191 -3 -85 -15 -3 -17 -62 189 154
2925A54m42K12L27l04j63M13j41l34M19Q0l99PL09j29r0J82J6k07k3J93O6j68
$$ 154 -288 -76 251 -53 -216 197 56 -278 141 221 -178 -171 138 9 -81 101 117 -90 -113 80 146 -22
2947b2j40K19Pk13K08J62m09k0M30j25k80K48L9l01J53K64k62j67K33Q7j60l6
$$ -22 -162 57 64 -149 59 221 -188 -208 222 97 -183 65 104 -197 -44 220 -42 -209 24 111 -49 -85
2969h5J69l8j75O9K41j06k28J84J77l47M4L11k49j74L30k8k66K03Q3j59k3J59
$$ -85 84 46 -129 -60 181 75 -153 31 208 -139 -95 216 -33 -207 123 95 -171 32 115 -44 -67 92
2991I2N7k28k6J32O8j89L6J69j84j16L94j06l41K72J43k68%K58j57q8J02N9q8
$$ 92 149 -79 -105 27 95 -94 -58 111 -73 -189 205 99 -242 30 173 -95 -95 163 6 -82 20 79 -9
3014ij15K05Oj42k5J65k6k36J23K27k91K2K16m9k59J60J68k23n4K33p6k39K56
$$ -9 -124 81 87 -55 -80 85 59 -177 -54 173 -118 -96 120 71 -188 -28 140 -83 -137 96 20 -219 37
3037C7J00j62j60L36j0k74Q9J66j13j05J47R6k52J8L04j65k30K53R9l25O1K25
$$ 37 137 -25 -185 151 141 -133 -44 122 9 -96 51 147 -105 -87 217 52 -178 75 174 -151 -90 135
3059A35n9k60K12K9j27l7K36L2l24J05K73j87k10K67M4k95J53K63l14j40L15J00
$$ 135 76 -184 28 57 -70 -107 129 161 -163 -58 215 28 -182 85 129 -166 -13 250 -64 -204 111 211
3081B11l28QK53j24k21K51R7k27j45L82ll29Q8L28l22p3K87j7k85J38J85j92j19
$$ 211 -117 -109 144 20 -201 50 147 -80 -225 157 154 -175 -87 241 -81 -154 133 116 -169 -31 154 -38 -157
3104a57J51J96k80kK94r7l10J85J79k49j19L52k3l33J49K44k07r7K19O4l18R9
$$ -157 -6 190 -90 -92 202 105 -205 -20 159 -90 -209 143 120 -213 -64 180 -27 -124 95 159 -159 -60
3126f0K11j31k18K82Q6l08RK88l7l26K20J58k94%K37l9k90K03K49k56r0K43j8
$$ -60 151 20 -198 84 170 -138 -129 159 122 -204 16 174 -120 -120 117 78 -212 -9 240 -16 -106 137 119
3149A19k58J23J44j22j63K21K8j63j0K75j20k82K84J20k68o2L01j45j85J78J24
$$ 119 -139 -16 128 6 -157 64 92 -71 -81 194 74 -208 76 196 -72 -134 167 22 -163 15 139
3170A39k81J7K03l9j21J5K70k59o0J97M4k93R1K88k07j70K56Q7l06Q2K35j39j42
$$ 139 -142 -125 78 39 -82 -67 203 -56 -116 81 125 -168 -77 211 4 -166 90 177 -129 -47 188 49 -93
3193i3J11J48j39j68L01j55j47J46J02j27p8K05k4j65O7K07j83j54K11Q4l17P6
$$ -93 18 166 27 -141 160 5 -142 4 106 -21 -99 106 82 -83 -16 191 8 -146 65 149 -168 -92
3215i2K37j90oJ62o7j49L4J70j75m9P7J59j69o8K18j9k19J29K40l04o5K55m9k34
$$ -92 145 -45 -51 111 44 -105 -71 99 -76 -125 -48 111 -58 -126 92 73 -146 -17 223 -81 -146 109 60 -174
3239a74K25J24k35%K09n2j39pJ73j22o7O7J52k08p9K61r1j75J56J78l67L5K85
$$ -174 51 175 -60 -60 149 97 -42 -49 124 2 -65 2 154 -54 -133 128 37 -138 18 196 -171 -136 149
3262A49q6k83K16J34k20k4J97p5n2O0J42j41j43K03M4k39PL13j84k42K86R3l04
$$ 149 63 -220 -4 130 -90 -114 83 8 -44 16 158 17 -126 77 121 -118 -111 202 18 -224 62 155 -149
3285a49J27K44k96j13L28qk32R7J59j38p3N3J63k09j21K34O0l21O2L80k51k25
$$ -149 -22 222 -74 -187 141 133 -99 -2 157 19 -54 -1 162 -47 -168 66 126 -195 -133 247 -4 -229
3307b29L34O6l80J50K11k60J3J97Jk18L7J55l0j68O7J65j02j74K48R0m08J19M19
$$ -229 105 171 -209 -59 152 -108 -95 102 103 -115 -78 77 47 -121 -54 111 9 -165 83 173 -235 -116 303
3330C03l94r5L07jl37K32J23k75Q9O3N1j35m5J49J38l08K6L20k56j78L89o7l39
$$ 303 -91 -186 121 120 -217 15 138 -137 -48 15 66 -69 -114 35 173 -135 -109 211 -45 -223 166 99 -240
3353b40J76L72m05q9L82j47k54K11R3j84q2K04O4j13j03J72M0k49J9M27k98k96
$$ -240 -64 308 -97 -186 196 49 -205 6 99 -85 -167 37 101 -12 -115 57 97 -152 -133 294 -4 -300
3375c00M99n5m12K68K26l60M7K82j43k39J90R7j25M%O6m2j81K24J15m13J70L60
$$ -300 199 144 -268 0 226 -134 -87 195 52 -187 3 100 -25 -21 -21 45 3 -178 46 161 -252 -82 278
3398B78l79j27M16j27l28M10Q4l79Q3K00j93m1J63p4rl8K2J30l9k73L04P0l74
$$ 278 -101 -228 188 61 -267 143 227 -152 -69 131 -62 -103 60 -14 -23 -61 -39 91 52 -221 83 153 -221
3421b21J86K69l63p2M18j67k87L76n6k93K82R5k27M7M9r2J02p1k5J92k18j15L76
$$ -221 -35 234 -129 -201 217 50 -237 139 83 -210 72 167 -60 -13 36 -56 46 -25 -50 142 -76 -191 185
3444A85j24l64L72J51m74K01L00l34n8L14j41j44J62J4q9mL9m1J24j97R6K24k62
$$ 185 61 -303 69 220 -254 -53 247 -87 -145 169 28 -116 46 60 -29 -33 6 -35 89 -108 -12 212 -50
3467e0m8L48k35k81M21o5l75K98K16l59K4K15j47o1J65p2m3L9J3P2pk08J61M4
$$ -50 -98 250 15 -266 155 90 -285 13 229 -130 -106 109 -38 -99 66 -6 -49 -10 3 75 68 -140 21 65
3491F5k32J52K46l51j53M83p7l84L10K9k79K29J11j51j06J13M2m4n1qJ43j14j23
$$ 65 -167 -15 231 -120 -273 210 133 -251 59 88 -191 38 149 -2 -108 5 47 3 -48 -56 87 -27 -150
3514a50L37n2l87K15K70l26J9L08k98j78L62Qk30N2R4j06L4Q6j2j4j24R7J55k04
$$ -150 187 135 -252 -37 233 -93 -74 234 -64 -242 120 128 -102 -50 44 -62 -28 58 46 32 -92 5 160 -44
3538d4j47L21q3k22L23L8m18Q9M13l53m1K84r3k34J45J16n1j79R1J49q5j02P8
$$ -44 -191 130 47 -175 148 186 -232 -143 270 -83 -124 160 67 -167 -22 94 43 -136 -45 104 19 -83 -5
3561eJ12k23qM45l12k71M05P1m16J37K54k33j12K37J2j37j0J06K4j82O0J53r8
$$ -5 107 -116 -124 321 9 -262 143 214 -202 -65 189 -44 -156 81 93 -44 -54 52 76 -106 -46 107 9
3584Ij95K55R6l10N5K81k97q0L45k1l44J66K13j79q1J19L6j20k5K11l3l10J63
$$ 9 -186 69 165 -145 -90 191 -106 -186 159 138 -206 -40 173 -6 -87 32 68 -52 -77 134 101 -209 -46
3607d6J97j91j22K75Kk78J65K13l00p9L16n7j90N5J59j64j09K23L7j60j3J22J9
$$ -46 151 -40 -162 113 115 -163 2 215 -85 -164 152 95 -95 -40 119 -45 -154 69 106 -54 -67 55 74
3630G4k20J52J24j95j30L15k6k35R2K47j96j30K81j20j94J02J83j48j16J58K2
$$ 74 -146 6 130 -65 -195 120 94 -141 -49 198 2 -128 153 33 -161 -59 124 -24 -140 18 40
3651D0j11J0K34j33j94J42J42k09rK65j22k10K19R3k94J18J19m1j31N7J04r5r0
$$ 40 -71 -61 173 40 -154 -12 130 -79 -88 177 55 -155 64 157 -137 -19 100 59 -72 -15 89 -6 -96
3674i6J55P0k45O1J63p4j96J51J15k69J06J15n1q1P7P4j68P6J35j11j07R8R1j94
$$ -96 59 129 -116 -55 108 34 -162 -11 104 -165 -59 56 5 -76 1 75 -93 -17 118 7 -100 -2 89 -105
3698a05K9K14q3k01J55J30j50j23K23k5j54Q3Q0o0k09K33O4k09R4P6o4j05J29
$$ -105 -76 138 55 -146 9 139 -11 -134 89 64 -90 -7 73 13 -196 37 101 -108 -14 62 -2 -107 22
3721B2N5j51o2K54j7k13J32Q8k34j2K64p3k22J69J44k69K6J66o1o0P4J13j93l3
$$ 22 77 -74 -136 118 101 -112 20 108 -126 -138 126 53 -169 0 144 -125 -99 67 6 -54 20 133 -60 -93
3745i3J32O2k11M8J89j24j91K17J38k99L2K47j36j82J83J07j94k0K70j27j95J17
$$ -93 39 101 -110 -62 127 3 -188 29 167 -132 -100 147 11 -171 12 119 -75 -95 175 48 -147 -30
3767c0J56j88j07K66L9k21L5K06j57j97L28n4k57J20J75o7k35K06J44k83pK49
$$ -30 126 -62 -169 97 136 -85 -50 156 -1 -198 130 76 -181 -61 114 47 -188 18 162 -121 -128 121
3789A21n0k08J27J23j97p8K50N9l16J75J47j69j66L22k3k85J32J68j55o6J18Q6
$$ 121 71 -137 -10 113 -84 -162 88 147 -169 6 153 -16 -182 140 117 -168 -36 132 -23 -89 29 115
3811A15j82rJ99m9k39J76J65k13j14K97j2l09J06K33k41n9K07Lk33J23J39j16
$$ 115 -67 -76 123 74 -165 11 176 -37 -151 146 134 -175 -69 164 -77 -136 71 74 -159 -36 103 -13
3833a3r5J18J18j93m8J68J7k08J31K10k94o0L25p1k45J92J11k20j10L26j20j00
$$ -13 -108 10 128 -65 -113 55 72 -136 -5 205 -89 -149 176 105 -140 52 163 -57 -167 159 39 -61
3855f1O6O8n2j52R1J46j80n0K42p0k12J49J72k72j8K85j69j48J81J24k69M9J47
$$ -61 5 73 21 -131 -40 106 -74 -124 118 48 -164 -15 157 -115 -133 152 -17 -165 16 140 -129 -80 67
3878F7j35M0LO0o0j03P4J52j77j7K51q3l10K39J69l36M5L07j91j18K42o9j98J59
$$ 67 -68 -28 -25 35 -25 -128 -54 98 -79 -96 155 72 -238 1 170 -166 -121 186 -5 -123 119 50 -148 11
3902A1P6l8p7j7J37l7j05N8J73k69m0L20j89k54L15K0k54J98J36k33q4K42o6n4
$$ 11 87 49 -28 -45 92 55 -50 8 181 -88 -128 192 3 -251 64 84 -170 28 164 -69 -153 89 23 -31
3926c1k9O7QlJ5O3q9j78J93J68l25K4L19k92r2L86j92k28K50J21k25O3J07j62
$$ -31 -60 7 15 12 27 90 1 -177 16 184 -141 -117 202 -90 -182 204 12 -216 34 155 -70 -7 100 -62
3950f2j8R9j0k5o1JK14j54r2K33o5k32K44K01l68p1L43j83j58L09p3k57J88Q0
$$ -62 -80 19 9 -16 -77 -76 138 -16 -108 125 60 -172 72 273 -95 -166 177 -6 -164 145 72 -185 3 83
3974H3r8M9k4M4n5r9J55J51l09n8K81j9l11K18J05l45J77K98l23q9K45M2j83J27
$$ 83 -15 34 10 54 -1 -100 55 206 -103 -161 120 101 -210 8 113 -232 -55 243 -80 -169 76 118 -65 62
3998F2M9j74l6P4J07m1k21J36K36k32JK77k86k19L77P3l86R0K57k37l8K58m1k06
$$ 62 111 -63 -99 -25 82 41 -180 -44 192 -40 -39 238 -48 -267 110 183 -203 -113 144 -93 -131 127 86 -120
4022a20N6J56j8j42o3J97j4k28K34J56l86J00L37k69j50L06j4l81K49J48j94n5
$$ -120 -64 92 74 -68 -131 66 52 -176 58 214 -172 -72 265 -4 -154 152 138 -243 6 154 -40 -95
4044i5J44Lj53N8J04k4j13N8J73j27k16K75O0l60J05L39l17j02L04lk22P4J75
$$ -95 49 52 -101 -43 61 37 -76 -18 155 28 -188 87 147 -213 -108 231 -86 -188 116 113 -109 -35 140
4067A40j34j26J64Lj57JK04j00j06P0J89k27l1K56o4k36J13K30k51l5K45j21j31
$$ 140 6 -120 44 47 -110 -109 95 -5 -111 -41 148 -79 -110 146 82 -154 -41 189 -62 -97 148 27 -104
4090a04J05J45j83p5K15k5j34m6J08j3j08R0J71k12j32L39j04j87J46J65k42k9
$$ -104 1 146 -37 -112 103 78 -56 -102 6 -7 -115 -25 146 -66 -198 141 37 -150 -4 161 -81 -110
4112a10K76j38j61Q1J63j07p0J01rj24m5K76m8j82J09J30k48K5K33j12j46J68
$$ -110 166 28 -133 -52 111 4 -66 35 26 -98 -143 133 85 -97 12 142 -106 -81 152 40 -106 62
4134F2Mj21J8J06r3n0J06L2q2p4J08R5k25P6J59j56o6J86N0k78P4K58j45j11J37
$$ 62 66 -55 -37 69 -24 -74 32 64 -18 -92 16 111 -114 -38 121 -35 -101 85 135 -143 -69 189 44 -67 70
4159G0k5j54J17Q7p8j41J67N1j91J6J48o1j17R9J18j29o6R1R9j81J11J07k15p
$$ 70 45 -109 8 95 17 -124 43 94 -97 -81 67 6 -111 -12 106 -23 -89 2 101 -80 31 138 -77 -84
4183h4J18rj22J01Q5p7j64K81m7j12l6J35q7j09J57J03k03j2K13p7j75J60Q2j54
$$ -84 34 25 -97 4 89 12 -152 129 82 -30 -66 69 -18 -127 30 133 -70 -82 131 54 -121 39 121 -33
4207c3k6J10K9j55J00J17j50o8J59j9j20J8J11n0j49J74L6j58L2J85j40j61K11
$$ -33 -59 51 80 -75 25 142 -8 -76 83 64 -56 -38 73 23 -126 48 84 -74 -42 143 3 -158 53
4230E3mj84O1K44j12j58J20J18j73o7J94l5j40N1J74j84p5J64N9k41P5K12j19
$$ 53 49 -135 -74 170 58 -100 20 138 -35 -102 92 57 -83 -32 142 -42 -117 47 106 -135 -60 152 33
4253C3j82J79J24j99jJ54k3k21J87N5j32p5K15k9j73J11Q8j08j40K30M2k24N7
$$ 33 -149 30 154 -45 -46 108 85 -136 51 106 -26 -101 114 85 -88 23 111 3 -137 93 135 -89 -32
4276c2J58j21j13J64P0k12N0J53q5p5P9R9k39L5J43k9j05L0J23j22j29K16M8k16
$$ -32 126 5 -108 56 126 -86 -36 117 32 -43 36 135 -104 -69 74 45 -60 -30 93 -29 -158 58 106 -110
4300a10P9J73j29j46J69M5j33m9K38j03j34J11J26j90l4K40o1k22J03J71k47p
$$ -110 -31 142 13 -133 36 81 -52 -101 137 34 -100 11 137 -53 -87 153 92 -130 -27 144 -103 -110
4322a10J85Qj47N3J33j30j51K42J6j71J2J80r7r0J26P1k29R9J12j17j22J25R1
$$ -110 75 83 -64 -11 122 -8 -159 83 99 -72 -60 120 23 -67 59 130 -99 0 112 -5 -127 -2 89
4345H9j46kJ30nk04J16J03o0j44J90k0j45O9J64j47j30K25jj85O3J85j43j05J27
$$ 89 -57 -59 71 66 -138 -22 81 21 -123 67 47 -98 -29 135 -12 -142 83 82 -103 -40 145 2 -103 24
4369B4J13k05N5N0l9j09J46M7o4r9J61l6j57J08R6j21m8J52j4j13N6R0j79j4J59
$$ 24 137 -68 -13 37 -2 -111 35 82 18 -81 80 44 -113 -5 91 -30 -78 74 60 -53 3 93 -86 -100 59
4394E9O3j31l0J60q5j04J17N2j80o6K05k3r4J55J07k65k8J67K9j45L9J52j46k8
$$ 59 122 -9 -39 121 36 -68 49 101 -79 -145 60 37 -57 98 205 -60 -88 79 108 -37 2 154 8 -20
4418b0J32p1j51j2J90pj67J42P3j87N8J71j62j48J48Q6j70L0J51j43o4J55J22
$$ -20 112 41 -110 -122 68 61 -106 36 109 -78 -20 151 -11 -159 -11 75 -95 -65 86 -57 -121 34 156
4441A56k10k4J54jj45Q6J13j30r2R6J22k34RK45j48q6J45P9k55J02J33r4q8M0
$$ 156 -54 -78 76 75 -70 16 129 -1 -93 3 125 -109 -100 145 -3 -89 56 135 -120 -18 115 21 -67 -27
4465b7R5j67O4J74j03j57J29J07j58k4J86r5r1M9J47j41j16K24K5k07R9J29j39
$$ -27 68 -99 -35 139 36 -121 8 115 -43 -67 119 24 -67 -18 129 -12 -128 96 121 -86 13 142 3
4488Cq6J01P9j77o5K82j01o3M4J64k40o4K56l3j99Q8J40j65rK07j51j36J10P0
$$ 3 -83 18 97 -80 -145 137 36 -27 17 181 -59 -123 133 100 -99 -11 129 -36 -45 162 11 -125 -15 55
4512E5q1n2Q4P4j58J4J77k0k20J28J46j61q8K41q8k09J62J25j93lJ48J7j55P2
$$ 55 -26 -78 6 80 -78 -64 113 93 -127 1 147 -14 -102 139 51 -158 4 129 -64 -67 81 98 -57 15
4536A5J01j06j11J59J9j81L4J94j27p2R4P9j55qJ27p5j40J28J36j92J4J81p4r7
$$ 15 116 10 -101 58 77 -104 -70 124 -3 -75 19 98 -57 -65 62 -13 -153 -25 111 -81 -67 114 40 -57
4560e7R1N9j47m4J42Or3mJ86j05j05J47M3j92qJ95r6j07J89Lj25p6K54j08j79
$$ -57 34 93 -54 -98 44 50 -43 -47 139 34 -71 76 119 -73 -81 114 18 -89 100 103 -22 -98 156 48 -131
4585a31Q9J36j01o0J43lj59J11Q5q0j19P2J03j75L3K44k52n5J86ko6j7J67j48
$$ -131 -42 94 -7 -67 76 73 -86 25 110 30 -89 -17 86 -89 -56 188 -64 -119 67 65 -1 -18 149 1
4609Aj43J76P6j18j5O5L1j52P4O0j42J5J84Kk67J57R6q7q2J43j8j39Q4J24j40
$$ 1 -142 34 110 -8 -23 42 73 -79 -5 55 -87 -72 112 114 -153 4 100 13 -69 74 56 -83 1 125 -15
4634a5q7J40M9j32J0J46p2j32Q5P0q8m0J11n0k9O8K8q3q3J53Oj37P0J13j46m1
$$ -15 -102 38 87 -45 -35 111 39 -93 -8 62 -26 -66 45 -5 -34 34 62 -21 -104 49 55 -82 -12 101 -45 -86
4660h6J73o5j30N5J33k8r4M7R9j80M5J19Nk01R2R9r5n1J09L0j63Q3J10k11L6J97
$$ -86 87 22 -108 -53 80 52 -42 5 104 -76 -31 88 93 -108 -16 83 -12 -63 46 76 -87 -4 106 -105 -69 128
4686A28n8j45O1J13j13j3O6N3j67J1J56n5j01N6J04j64NJ54o6j42J55O6j61m8
$$ 128 70 -75 -14 99 -14 -27 39 92 -75 -64 92 37 -64 -8 96 -68 -63 91 25 -117 38 104 -57 -105
4710a05J97q8j59K03j3j01k7J19N4j29m5K26j12j64J72R2j42qJ66j03r3J16K5
$$ -105 92 4 -155 48 35 -66 -93 26 80 -49 -94 132 20 -144 28 120 -22 -30 136 33 -60 56 81
4733H1j60OJ78o3j30R0P6j09o3J77k4j76K7K08p4j39J81J4j44l8K08j27p4J04
$$ 81 -79 -73 105 42 -88 2 78 -31 -94 83 59 -117 -90 118 44 -95 86 100 -44 -82 126 -1 -75 29
4757B9k1p2K2R3q8k5R4K9n9j66J96Q8k10M3J67j51q1J52N7j95P8J31j04l1J09
$$ 29 8 -64 -42 51 -37 -62 32 61 2 -164 32 120 -90 -47 120 -31 -112 40 97 -98 -20 111 7 -24 85
4782H5rj29J1J35j4j37N7J26j45q2J68rj92J12K07k30l8J74k2j45P5N5k8k7R6
$$ 85 76 -53 -42 93 79 -58 -1 125 -20 -102 66 57 -135 -23 184 -46 -84 90 68 -77 -2 53 25 -2 94
4807I4p6r1M1Q0lj25L9J42j33KO8j0j36J06J79j78p9J21J9j23P4M1o3j0P0L5r8
$$ 94 18 -73 -32 48 45 -80 -41 101 -32 -30 38 28 -108 -2 177 -1 -80 41 60 -63 11 52 -11 -21 49 84 -14
4834a4l1J01o4r4J12M6r1m7J41k3j36J50J9j08l0J46k9j01R2J2o9o8J79r6ql3
$$ -14 -45 56 -8 -102 10 56 -35 -82 59 36 -100 50 69 -39 -69 77 48 -53 39 51 -18 -86 93 -3 -11 -44
4860d4J08m1m1O2j2o7J4J38r5j42J50ro7lJ30o4r2J52Kr7j5J46q9j31P8R6j55
$$ -44 64 23 -18 44 32 -35 -21 117 22 -120 30 21 -46 -49 81 17 -75 77 79 -18 -33 113 24 -107 -29 67 -88
4887h8K0J20J7j11L4J10r5p6R9Jr3P5Q3j36k9Q8K9j15N7P8k0j16Q1R6j19q9K11
$$ -88 -68 52 69 -42 -8 102 7 -69 30 31 -62 13 96 -40 -69 19 48 -67 -10 68 48 -68 13 109 -10 -99 112
4914A12o2j88O4J60j60l5J83l4j87Q8J36j63M3J33%j59k5K02r4o6O3K7m4m2J54
$$ 112 50 -138 -74 86 -74 -109 74 40 -147 -59 77 -86 -43 90 90 -69 -94 108 14 -52 11 38 -6 -48 106
4939A06q9r5Q1P0p1j3Q9p4p3N3M8n3o9J21J8j26J6J34l3j64Q0J48j66N1J03p4
$$ 106 17 -78 3 73 2 -11 78 4 -69 -16 32 -21 -90 31 49 -77 -61 73 40 -124 -44 104 -62 -11 92 18
4965A8r7J21L0j50N8O5k4q6R6K7l9q2J07J8q2jJ23j00j02J85oj49K6K03j63o4
$$ 18 -79 42 72 -78 -20 45 21 -65 31 58 19 -63 44 62 -20 -21 102 2 -100 85 79 -70 -44 159 -4 -68
4991f8J41qj54M0J51j43k6J29M3j71o8J92mr7M5J11j04j57J47M8j69Q1J06n9j32
$$ -68 73 65 -89 -49 102 -41 -67 62 105 -66 -134 58 54 -43 2 113 9 -148 -1 47 -122 -41 65 6 -126
5016a26J32M9j88O8J45o3j01P6kql6R4Oj38O9J39j50j30J55L3p4L1J62j84j6Q4
$$ -126 6 55 -133 -65 80 17 -84 -8 -10 -18 -54 40 46 -92 -23 116 -34 -164 -9 24 -50 -19 143 -41 -57 27
5042B7K6q4nO6n3n7J04N3j26j0O0Q7j52K0J25j94N1J54r9q8R1N2j10P0kj2m3K9
$$ 27 53 -31 -36 30 -23 -80 24 77 -49 -59 1 88 -64 -44 81 -113 -62 92 -7 -95 -4 48 -62 8 6 -6 -49 -20
5070b0J34j21o3J20J4q5LQ8o4o3P2N5j09qQ6k6q3J54m4p7LM7K5r5k6Q3m1o0J29
$$ -20 114 -7 -70 50 64 -21 -18 70 6 -57 15 70 -39 -47 39 13 -70 84 40 -37 -34 13 38 -57 -83 0 -41 -101 28
5099B8M3j40kJ63j64L8P4oj11O8R5k6j21Q5qk7n8J33p9m3P3L9j28j8J56k0j42
$$ 28 71 -69 -71 92 -72 -34 40 34 -77 -9 86 60 -61 24 16 -11 -69 64 -15 -58 15 54 -74 -92 64 44 -98
5126i8R3N0rl7P6m0j03Q1O2p7o8J17k0q0l0J69k5j60R6O5r7k1J49p4r4J35Qo8
$$ -98 -5 45 36 -1 75 35 -68 13 75 -2 -70 47 27 -53 -83 86 61 -99 -3 62 -35 -56 93 19 -75 60 68 0
5154@k8N9l0p7R2Rn8k6J11ol4k1P5l2j30J35P4j61J3J40p2j55J62K5j25O7O8n8
$$ 0 -28 31 1 -76 16 25 -33 -59 52 46 12 -9 66 34 -96 39 113 -48 -35 105 33 -122 40 65 -60 7 75 17
5182A7n9J1N6l7JK3K7j07M1J04l9q3N8Q0k05J22J12j42o7J37J2j43L5J04k4m2
$$ 17 -42 -31 25 -12 -11 12 39 -68 -27 77 38 -45 13 93 -112 10 122 -20 -87 50 62 -81 -46 58 34 -8
5208hK1M6n7p4J26Nq1q0J69p5o3J58q2j10J09J00j09p8P6L6j00K4J31o8q8O6Q0
$$ -8 13 59 2 -72 54 59 -22 -102 67 -8 -71 87 5 -105 4 104 -5 -83 -7 29 -71 -47 84 16 -72 -6 74
5235G4n1p5R9m4j42J33N1n7j10K04q3j08Q4Q9j19LP9K2l3p4R9Mj21J11J3j03N4
$$ 74 23 -52 47 3 -139 -6 45 -12 -122 82 -1 -109 -25 64 -55 -52 27 49 16 -58 41 45 -76 35 48 -55 -1
5262aL7J4r6O3O4j62k0K13k8j27Q3J9o9l6Q1j1o6M1No0k1Q0J07j15j04J18J5r3
$$ -1 36 50 -46 17 81 -81 -101 112 84 -43 40 59 -10 -46 35 24 -42 -1 4 -56 -77 3 110 -5 -109 9 24 -69
5290f9P1K0j04lJ19Rn5l5N0j8k1M1O2j25L2J12j27q0J21P5p3o5J29o4p1J21Mj38
$$ -69 2 22 -82 -85 34 43 -12 -47 3 -15 -36 5 67 -58 -26 86 -41 -121 0 75 2 -63 66 2 -69 52 56 -82
5318h2L5P7K0q2L4K0mo5Q7L0j01M8N7q9j28J92Lj15N6R4j45J1P5O4j26%R4j31
$$ -82 -47 30 50 -32 2 22 18 -47 40 70 -31 17 74 -15 -143 49 52 -63 -7 87 -58 -47 28 92 -34 -34 60 -71
5346g1P0K8N7r9k5P0n4n9N9O9l2r0J08M1j00j6J72j35r4J31k0q6K9J03n8o0J28
$$ -71 -1 27 84 -15 -40 30 -24 -83 -24 45 13 -77 31 72 -28 -44 128 -7 -101 30 10 -76 -47 56 -2 -62 66
5373F6or0m0Q9jq0R6J16k27K6J16l8j04O6Q5p9o5J35l8o4M3K4m4l2K2O0o4NO4
$$ 66 60 -30 -70 19 18 -62 34 150 -77 -51 65 27 -77 -11 74 -5 -70 65 27 -37 6 30 -14 -46 -24 36 -28 -23 41
5402D1Lo4R4Lj48L7N0j8j14J38L4q1l9R3l5l7K9J10j69M8N4Pn9j9J76j37j32J31
$$ 41 44 -20 74 77 -71 -34 16 -2 -116 22 56 -25 -64 29 -6 -43 -14 96 -73 -25 29 36 -23 -42 134 -3 -135 -4
5430dL4m8%O5k4p5P2L8o1j6P3r4l6J48k0o4m5N5M1q1J3O0j9j52J54L4j45N8Q7
$$ -4 30 -18 -18 47 23 -52 20 58 -3 -19 54 -40 -76 72 52 -12 -57 -2 39 -42 -29 31 12 -140 14 48 -97 -39 48
5459D8l7r0J01N6j20L5L1J4j55J22K4o2M1N2o0q8R1M2j4j20J17K3j28M4J20j29
$$ 48 11 -79 22 78 -42 -7 24 38 -117 5 29 -33 8 60 0 -88 3 45 31 -89 28 51 -77 -33 87 -42
5485d2j6P3J1p2m7J20Nr3P4M9n7jQ0q2k7o1J23J9j26J16J1o9QO1l0j1l5O4o1j0
$$ -42 -58 15 26 -46 -93 27 32 -61 13 62 5 4 84 2 -25 -86 37 56 -70 46 57 -12 -4 57 27 16 -19 45 -16 -26
5515b6M7o4l2J32qj30J2J22j9j10Q3J1m2QO0l5m0N3Kp8K5Q7Pp6k2P7j9k3K9j9
$$ -26 21 -43 -75 57 49 -81 -69 53 34 -76 7 18 -24 -16 44 9 -31 22 24 -54 -29 58 65 -11 -33 44 25 2 31 12
5545A2J5o1Q2o8kJ8j9l1MN2JML2j4k9jO5op3lL3K3n1K7R1j52M0N1qo6R3k1r3O4
$$ 12 27 -34 48 -20 -22 -4 -23 -54 -50 2 3 7 39 25 -4 -5 60 54 -19 -22 11 34 -17 10 101 -51 -11 40 32 -34 59 38 -55 9
5579IN2pr0K0J5j8J8O6l4r7Q8N1j05k1R8J5j03L8O6o6n0J30lj11lO4L9r7O5M6
$$ 9 61 54 -36 -16 -1 -19 -1 65 31 -66 22 73 -32 -53 45 60 -43 -5 61 -5 -55 75 72 -39 -42 22 61 -36 29 75
5609G5j19%J16l9p1rJ26o9o7P1J2o6K6P0j17N5L0op3JJ31m4j10L5P5p1PO5o3J4
$$ 75 -44 -44 72 33 -38 -47 79 10 -57 14 26 -40 -14 56 -61 -6 24 18 -55 -54 77 33 -77 -42 33 -38 -31 34 -29 -15
5639a5N2R7k07P1K5Kj4kP3o5p0P6M5p4J5k5k9j4N8M4n7jL5j9o8R6kl5j8J05k0
$$ -15 37 134 -73 -2 23 25 11 9 82 17 -53 23 68 -6 9 -16 -45 -59 -1 43 -14 -15 20 1 -67 29 27 -8 -26 79 59
5670E9r0O6Mr0O5K4k6l1j4J2M7k9N5J3j29M0J05j07l0J13L5j64M3L4j9nM5N0q5
$$ 59 -31 35 39 -51 14 38 12 -19 -33 -21 26 -3 52 65 -64 -24 81 -26 -56 57 92 -72 -29 5 -14 -19 26 76 -9
5699il5M9K8j33P9P8q4L0N5m4j08Q2Q8q8nJ0N2n8N8j0p2pN4K9q9L4PrKnR0q7J2
$$ -9 -44 5 33 -100 -21 57 -27 3 58 14 -94 -12 76 -12 -17 -7 45 -13 45 35 -37 -44 10 39 -50 -16 -9 -18 -16 -21 69 -18 -6
5732fK7J0q3J07K9j00kRQo2Q5Jm9J4K1jj9lQ1m3j61R5J32j40J3Q9n5p3P5N6l6
$$ -6 21 31 -52 55 84 -16 -18 -9 -1 -63 22 23 -26 -12 9 8 -11 -14 67 24 -137 -42 90 -50 -37 52 -3 -76 -1 55 19
5763A9j7J1PLl2L6n6oj3Q7q2O9Q4j38j7J07K8j21PK9nn5N6j2j0N3m2k3%L1lJ3
$$ 19 2 13 20 23 -9 27 -29 -35 -48 39 -43 26 110 -28 -45 62 90 -31 -24 5 0 -55 1 -11 -21 32 -10 -33 -33 -2 -5 8
5795HJ9Kl3n1P4J8o6J3M6Nn8mJ16q4l7J5L9k0l4J4om5P2K2k1j1J8K7j04N7O7l8
$$ 8 27 29 -4 -55 19 37 -29 -16 30 35 -23 -27 89 5 -32 -17 22 2 -32 -18 -24 -69 3 25 4 -7 11 38 -66 -9 58 20
5827B0p2M0R5j41M7P7m9n5J7Oj6%M1l0j5L6L8%n1M0l3j7L7K7l1n1Q2m6j14J13
$$ 20 -52 -12 83 -58 -11 66 17 -38 -21 -15 -31 -31 10 -20 -35 1 39 39 -12 28 -5 -22 15 42 11 -40 42 -4 -118 -5
5857eN2j8m2L6lj08Q7rj4L1k5J11j22O4j3K9l7K3po3J0N9j0n0R9m5j3m4P8l4l5
$$ -5 47 29 -13 23 20 -88 -1 -10 -24 7 -18 93 -29 35 22 51 14 37 30 -33 -23 36 26 -24 75 30 17 -27 51 17 -18
5888a8L0%k4L9L8n7j8j3N6j9q7M7O4r6O5N2qq0L7kp9L7O7k3Ql6M4L2q1M0K9k6
$$ -18 12 12 -12 27 65 8 -10 -23 33 14 -73 -26 38 -58 7 59 51 -29 8 6 -73 -36 31 8 16 -20 24 56 -25 15 44 18
5920A8m5Q9q3K4J2O9j37O6K4p5KM7N3j29N5RL5l9J2N8o2o9R1k1o6P9n9M2n1O1
$$ 18 -27 62 -21 3 15 84 -53 13 37 -38 -36 11 64 -65 -10 -1 34 -5 7 65 3 -66 25 4 -62 17 -42 0 -51 10
5950A0J9k4k4O0j9%jjk5mM9Ql9nN7o9jN4k0n0mQ5k6j8K3m3k2J3J3L7l7j0M1o1
$$ 10 29 5 -19 41 22 22 21 20 -5 -9 40 48 9 4 61 -8 -9 45 25 -25 -29 56 30 12 35 -8 -30 -17 -4 33 -4 -14 27 -34
5984c4kR2m9p4M9N7j3j3jM0j13Q7Mj07J0P0Ok5L2O3m4q8J29o6L1qK2j7Mk0O8o5
$$ -34 -36 56 7 -67 -18 39 26 13 12 52 -61 26 30 -77 -67 3 9 -16 16 79 35 -53 76 10 41 33 55 38 42 22 90 25
6016B5nm1K9J6k6nj2K0kKl0pQ4p0RM5k2l3N8M9j21K3K2K1j2l5K8M9o0O0m2m5L
$$ 25 20 -21 8 24 -2 -7 -19 1 -1 1 -29 -36 48 -22 -13 32 10 -23 35 84 -37 -14 8 29 17 -18 10 59 -1 59 17 -28 -25
6049b5Q9m0o3P3j7pj4J4j5k2N2k7j6K9M4p1l0L5J1K7j8NK9j00P9k1Ql6P2J4n8
$$ -25 64 24 -39 34 17 10 -4 10 -5 -27 25 -2 -18 11 55 -16 -46 -11 0 27 9 14 43 -57 22 1 9 -27 45 59 1
6080AJ6j3j1o7Q2J1o3j1RQ4p6L8M4o7K7N6m1o4kO3O7j21J9P5o2j7P0q0J8k8N9
$$ 1 17 4 -7 -74 8 19 -44 -55 -46 38 -38 0 44 -23 4 60 19 -45 -47 16 83 -38 -19 56 -6 -23 47 -33 -15 -43 16
6111A6J7m4M4l6j2M1M7j05%R1n2n3N2K0o8P6j9M6o7L6k0o5K1L4L9p0l8J26m0o2
$$ 16 33 -11 33 -3 -15 26 73 -32 -32 59 7 -46 6 26 -42 34 15 61 -6 30 10 -55 -34 0 39 -31 -69 57 17 -45
6141d5K9J4n6M2J8RPn7Q3k2m9P5Kp8N2J9K1j14pM4K4o7J17p4j5L2N0k5l7k3L3
$$ -45 -16 -2 -58 -16 2 11 18 -39 44 22 -27 48 50 -28 24 43 64 -50 -57 -13 11 -56 61 -13 -28 4 54 29 -8 -31 2
6172Bm3O8Nl3n6P5Nj05P4L9r0kQ8J3J0j20R8ll7J9N0n7mJ6qJ8K3J9j33M8O5K9
$$ 2 -41 27 32 -1 -57 18 23 -82 -8 31 -59 -61 27 40 50 -70 28 25 -12 7 57 0 -4 12 4 22 45 64 -69 -21 44 73
6204G3n7N4p3j7lQK7n1O7Nk6q0L4P1m1jM9k7n3P7qk5KK3o8K4N2n0K2j3O0o1ro9
$$ 73 16 70 -3 -20 -23 -15 12 -39 28 33 7 -73 -39 32 -9 -10 39 12 -41 36 28 3 5 28 -40 -16 36 -14 8 -5 55 -6 -15 -84
6238h4J18m1j2lN4m6j6N7k7p5J16J0j03K4N9Ml6PK1m5N1l9K9k1nM4n7j9M0K7p6
$$ -84 34 -7 -19 -22 32 -14 -30 27 0 -75 41 51 -52 -28 31 35 -1 6 27 -18 33 -6 23 2 -3 41 -16 -35 5 32 -44
6269d4K6L1k4qO0p9J03j6o6kJ9o6P3JJ2j0nq8P8L3J4j09L8P8q2P4K3j1r1N3j9
$$ -44 -18 13 -11 -19 41 -38 65 49 -17 -19 0 -66 7 8 20 10 5 -83 -5 28 42 -67 -29 49 -33 41 64 53 -38 15 -4
6300dqk1J4M2l2K2k9j5l9O3L6q3KL7ml9R5l9o7K7N7k7o5J09J1l6M5l0lk1L3lm4
$$ -4 -12 -33 -19 23 -9 13 -16 -31 -70 -7 29 -54 -52 -15 -19 -58 37 -2 -69 -42 15 -12 -77 32 43 7 52 22 19 -2 31 28 -16
6333a6k0L1M6m4OM7o2jM0rOp4R0o6O2l2M1k6jrM9r3L9M1j09P8M3m9l8Q4l3ml3
$$ -16 -36 -5 41 -3 3 50 -12 -13 27 18 24 -50 40 -26 36 4 45 19 18 9 58 -35 4 45 -64 14 57 8 -30 54 21 17 -16
6366a6k0j1oK7M3j7PJ7l6l1L5N1l6n8Q3p6K8nL6J5J2m0O2l2j3M1j04qO5M5l3m5
$$ -16 -36 -47 -53 -26 17 0 7 24 -12 -43 -8 43 7 -51 32 -44 -16 -21 15 30 42 2 64 32 19 60 -44 -52 13 58 25 -20
6398b0R0m8m0ON3l1l3M8J9m6L5N6j06J9k8M3q4J20Pq2rQ7n2m7K5O0Qo4L2K4m7
$$ -20 70 22 -18 -12 41 10 -23 25 44 -2 33 89 -17 2 -26 17 -67 53 60 -22 -31 56 4 -43 -18 42 50 -14 18 42 -5
6429eL0j3onJ0J2l4K3jL0p8L4K7n8M8k8M1K7o6K0Nl7J09o2kk8L2J6n7O1j2k2l3
$$ -5 25 12 6 1 11 23 -11 12 11 41 -37 -3 24 -34 14 -14 27 54 -12 8 13 -24 85 23 21 -7 25 41 -16 45 33 11 -22
6462b2L5K4k9j5L3k2j3L3k2lN5l4K3n1Q4Nl1p9M8k0l3J1L0j2J6K4m0j2k4Q9l6
$$ -22 13 37 8 -7 26 4 -9 24 2 -1 54 20 43 -8 76 81 50 -29 19 -1 -34 -23 7 -5 11 35 -5 -17 -41 48 12
6493A2J9q1L2m1J16J5r8RL1N0p7j3O2k3o1M4J1Rk5L1m1L3k8l4P7p4M5k2J1N2j5
$$ 12 31 -50 -18 -59 57 72 -26 -17 14 64 -13 -26 36 13 -48 -4 7 16 -9 22 -19 14 -14 -48 29 -45 0 -22 -11 41 26
6524B6pk6J7N2k4k2m5mJ7p1J27Ll6L6k2p6N3M8k3k0qO7m0jm0J7k6N5k7l8jL3j
$$ 26 19 -7 10 62 38 16 -29 -33 -16 -87 40 43 7 43 21 -55 -2 46 23 3 -5 62 22 21 -19 -2 -28 27 0 -38 -39 -6 -7
6557gM8m4rj7PQM4r9P9l8L5J0l3O4m4J9j4k2J7N2j0n0l9Q2n1j8M6l4nrL1KJ7j9
$$ -7 41 -3 -12 -29 -22 -14 30 -69 10 -28 7 17 -16 48 4 23 9 -13 4 56 46 -4 -43 39 -12 -30 16 -18 -23 -32 -1 1 18 -1
6591aK4n1K3O9o1k4lK6l2P3o2Q4j07R3n7j1k8N4j4N3o4J31p3n8J3l6O2j2j7N2
$$ -1 23 -28 -5 64 3 -21 -24 2 -30 43 -19 65 -42 51 -6 -17 -45 9 -5 48 -16 115 42 -16 -3 -39 23 11 -6 46
6621D6q3L7Q7j29M9J6pK0m6JJ6n2L7qj5j3O3qnqj3j8K0l0O6ko0O7m7j8P6n4Oj8
$$ 46 -37 0 87 -42 7 23 16 36 -10 -9 7 -45 -8 -16 -31 -44 19 11 6 -2 -15 -33 -13 -43 23 21 -39 28 -19 -37 39 -15 -9 -27
6655b7O2l1o5R8jl7pM2Oq8P2p1K1N6Ok7k0K1j2J9k3m7N1k2N4n3N1l9j6P1o6Nk4
$$ -27 35 4 -61 37 36 -1 -8 34 40 -48 24 -47 -26 30 36 9 -11 10 -2 17 -6 -53 -2 -24 30 -23 28 -11 -27 44 -22 -17 -41
6688d1Q1k2m3M5Qp4K5M0n9k5J14p0K4j3k0J9M5K6n7k3M1k0qL4J4jm1N9l6j9PM3
$$ -41 40 18 -25 20 28 -46 -21 19 -40 -65 49 -21 3 -10 -30 -11 34 60 3 -20 21 1 -7 27 41 40 -1 58 22 3 10 53
6720E3kp8N1J9r0O2lj6k2N7o3j1K5K7N2o9M7k2k3k1L6k7OM6l5K4o7R5m9j6J07
$$ 53 51 -27 24 43 -47 15 12 -4 -26 31 -32 -43 -18 9 61 -8 39 17 -6 -27 9 -18 -12 34 -1 23 -44 51 2 -14 93
6751I3p5l6K8J5pm2RMk3K2L8k1rj7N2k8j0mQ4p5J3NO2o9j2P1q4J5K8Jp2N3Lj5
$$ 93 18 -18 10 25 18 -24 -15 -11 -34 -12 26 5 -4 -21 31 3 -7 -11 73 -2 11 16 78 9 -3 68 -16 -1 27 28 -44 9 12 -3
6785ck6Q5nj10N8RRm8M0l1roMN3p3P8n5O6p4O1j1o2R3m9km2L7O3q5O5l9Pk6Q5
$$ -3 -29 56 51 -59 -1 8 17 -31 9 -22 -31 -37 -33 20 -53 25 -30 36 -38 23 12 -50 43 -6 -8 -50 -13 50 -35 30 -9 -2 -28 57
6819E7l1p7L5J2k5K7l3N4m3k7K9P9r5jk1N5QM2n2k0O6j6l6%M7n5L3j1RJ4o8R8
$$ 57 26 -51 -16 -4 -29 -2 -35 19 -24 -51 -22 57 -38 -39 -60 -5 3 45 -7 -27 39 23 -13 -13 34 -21 12 1 10 24 -44 54
6851E4l0J4n2L2j5n1K5L3Om8O9j6l0kk8P0l3k3Q1o4l4O0jp6P9L3o5k6M7m1j1P3
$$ 54 24 38 -14 18 3 -48 -23 10 16 -32 37 21 -9 -11 -39 31 -2 -25 56 -8 -42 18 17 -59 20 53 -12 -38 9 -32 -43 30
6883C0JQl2%M6r2M2N7r0L7Qk1j2J6N7k1o8mO2j1j3J3J2n6J7L7n4OO4m5K2k9M0
$$ 30 31 39 7 7 53 -39 3 60 -30 7 15 -6 -18 -2 55 34 -34 -38 24 13 0 13 25 -31 -14 23 -31 -25 39 -6 16 -13 27
6916B7ok6LL6NKn8K3j8N4k8o8Q9m4M4n0m2N0kn3P5M5l8n3O4n3K6m3O2j29J39k0
$$ 27 21 -5 -2 34 39 41 -17 6 -12 42 14 -54 35 -9 35 -15 -57 -7 -9 -62 13 58 20 -33 31 -22 4 -39 23 -106 33 13
6948A3k3J0Q7p6Jk4M7kk7j2k4P4j05Q3M7q3M5p3J6J5m7O8r8O8K0J0j3K8p4M7l4
$$ 13 -10 0 87 11 12 -12 35 33 6 -6 -30 44 -61 22 69 -14 31 -42 -26 -11 -58 10 -88 -20 0 10 -3 25 -49 -2 -36
6979c6J1K1oL1mo6L5M9l1k9L6M3m8L7mk7k7j8M5m8mO3PKk7L2q0L9M9m9j0kQ1o5
$$ -36 -25 -4 -10 21 17 -49 -14 35 4 -25 11 54 6 43 39 12 -15 -33 12 -36 -40 23 30 32 5 37 -43 -4 45 -4 -14 -16 65 0
7013@l8L3nj9RN7n5j3L5m0K3qL9n8J7M9k0l2j4L0K1m7QN7n1j0M4J9k7L6l7N6o6
$$ 0 -38 -5 -10 -29 -20 37 -18 -31 4 -36 -13 -21 18 -40 -23 26 6 -26 -40 -10 11 -36 -28 29 -22 -32 12 31 4 40 3 59 -7
7046gK4K4KRl6k0j8RNJ0l9N3R0j26M2m8J3N7n0L3l4L2k5N4p6N1l3J8m0O6m6n7
$$ -7 17 41 43 52 16 -4 -22 -13 -8 2 -37 16 106 -20 22 -26 -13 44 -6 27 -7 25 0 54 -22 29 -4 14 -26 40 -6 -63
7078f3Q3K9j6rn4O4L3q1O6L3o6k7Kl8N9O9j6o9kJ7l3j7M8J2p3K7M6l1K3qJ2k1
$$ -63 20 49 33 24 -30 34 67 -14 52 85 19 -8 -6 -44 15 84 68 -1 -3 14 -19 -36 12 24 -49 -22 24 -7 16 8 20 -1
7110aJ0K5r6M3L8l0m7J7Q9p9qJJ6L4m3M9j1l1L0K5o5qO7j6k9K2Rl8R3o0%pjK8
$$ -1 9 34 -62 -19 19 -11 -58 -41 48 -31 -39 -38 -22 12 -31 18 7 -24 6 31 -34 -42 25 9 -20 2 11 -27 66 6 6 -1 -2 26
7144B6l0kN6r2O0k7K7No5O4m9j1MN9L4n6mRlp6J25p6n0N3NLK8k2O7r3M2P7o2j1
$$ 26 -4 -6 50 -42 18 -9 18 23 -42 22 -27 -38 -34 25 59 3 -1 8 5 -71 54 -22 -72 -19 -14 -11 17 -5 62 -31 11 88 26 15
7178A5k0L0qk5L6K5k9j4L1p4P8m5k7M8k3K7k9J4J1Lnkj1l8NJ9QK1j9N5l3j5L2
$$ 15 -5 25 17 -8 28 53 24 10 41 -33 45 0 -27 21 -2 25 -4 10 21 24 19 17 6 -32 -27 -8 0 21 2 57 24 9 41
7211D1l9Qm4L2m8L8k8j1O0m1R6n2j7J5mk4K5J1%ql8J4qK3j9M1J7l5%J0m7J3J0
$$ 41 2 10 -34 -2 -50 -12 -40 -51 9 -32 64 12 -5 10 6 -18 7 18 18 10 -28 -14 -22 1 -18 23 40 5 5 15 -32 -19 -9
7244ik6L1l0J1l2K7N1k3qJ08n3o0m0M9j2M4ll2L0j4Mo2P0J5J1p4JK4k1k3J33o5
$$ -9 -35 -4 -34 -23 -55 -28 23 0 -8 100 47 -13 -53 -4 -16 28 25 -7 23 9 13 -49 21 36 47 -27 -26 -2 -23 -46 87 22
7276B2n1K4OQK4Pl4L9o9l0R7n9J2L6Jnq0O3m9k5L0K8l9N5%qj6Q8q4q5J16k2J5
$$ 22 -29 -5 1 9 33 40 6 45 -24 -54 43 -16 -4 32 33 28 -52 11 -38 -63 -33 -5 -44 11 11 3 -13 75 -9 -94 22 0 15
7309A5j0j3N0l1m9M1J5k8O7k2n0L2M4p3j8N1lk9J1m0J4M7L1j2p4oJ17r8n7J08
$$ 15 5 -8 42 11 -38 3 18 -10 57 35 -15 17 61 -12 -30 21 18 -11 0 -40 -26 21 52 40 -34 -40 77 -21 -78 30
7339C0o0L6n8R1n0o2P5M4j00M7O4l5k2N4o8k7P6l9M2m9m2O3L5q9O0%j8m7P6k6
$$ 30 -30 6 -52 39 -11 -73 2 46 -54 -7 57 22 0 54 -14 -41 35 -4 38 -11 -53 10 45 -44 16 16 -2 -49 27 1
7369Aj4P0l3j2m0P4n3l4N3j3J6m3N5n1JK3K5l9jNL5n3O6Lq8J0L4j3nk0Q5p1m8
$$ 1 -13 57 24 12 -28 46 -7 -41 12 -1 15 -28 27 -24 -23 0 25 -14 -15 -10 25 -28 38 41 -47 -37 -3 -16 -21 -41 44 -27 -75
7402g5R2Mm4J6pN2j02P4j0l8N7M3J4n1lKj5j5K5o5J2J02j7o4m9P5N7l9J5%m0j2
$$ -75 17 21 -23 -7 -14 38 -64 10 0 -38 19 62 76 25 22 24 9 -6 19 -46 -34 68 51 -13 -62 13 70 31 46 46 6 -6
7434fl8J20j18J7K2pm1O6o5L5K2j2M6q8M8M0m9n9Q1k9k2j3Q8%p4M1KL6p8M7k6
$$ -6 -44 76 -42 -25 -3 -10 -51 15 -50 -15 7 -5 41 -47 1 41 -8 -67 14 -15 -37 -50 38 38 -36 5 7 43 -35 12 -14
7465a4OO8p7J9k0M6L4q3L3J7%o4M7pk5%R1m6n6N5j1p0J8N3M0m2n8Q5k4m8L5K6
$$ -14 -8 60 -17 2 -18 28 62 -21 12 29 29 -35 12 5 -20 -20 71 25 -31 24 13 -57 -39 14 54 12 -46 39 15 -33 2 28
7497B8mk3N8k2j21J42p8j7N7L2p3J5K8K6j13J5P7J5n0k1N0p2PK7K6j7L4K4o5J3
$$ 28 24 1 59 37 -84 58 -20 -37 20 52 -21 -6 22 48 -65 -50 27 42 -8 -29 21 -51 -44 -17 9 -8 26 50 -15 -2
7527bM2l4k7j9N1Lk9N6k8o0K3k9Q8k8qJ6k7L4J5jo8J2N7m9K4j4MM2n7M9o7J1J8
$$ -2 40 6 -21 -40 11 14 -15 41 13 -47 -24 -53 35 7 -1 15 -12 22 37 36 -32 -20 37 -12 12 -2 2 44 -13 36 -31 -20 -2
7560bL0p5M0M0n1J4M4m1j4O6n4M5l4M8q5K9m0P2j4rL0l3J2l1P3o9MqL8q3M2PK5
$$ -2 28 -47 -7 33 -18 -4 40 -1 -15 51 -3 42 8 56 -29 0 -40 32 18 9 39 6 18 -13 60 -9 -5 -13 25 -58 -16 -9 16
7593A6m0k7N1J5j10P4L2J1L1m8L7o2j7O6l8l7N5j4KJ0K4k1l4nN0k8k8O4q7L3N
$$ 16 -24 -51 0 15 -95 -21 11 22 53 5 42 -20 -37 29 -9 -46 9 -5 -3 7 31 10 -24 -29 21 -7 -35 29 -58 -25 -20
7624b0J2L6J4mm9N5k3l8nmN7l5m7K9P4j02M3K1l2K3l2rN4K4j4pj1j6P7o1l5M3
$$ -20 -8 28 42 38 -11 44 21 -17 -22 -26 31 -4 -51 -22 52 -50 -7 14 -18 5 -27 -36 18 42 28 21 10 -6 71 10 -25 18
7656A8jK2onl3j4K6J6k9m1M7k7L3J7k3K2m4K1J7q5L2N2l5L0K9K1r1L5%m3P9k3
$$ 18 17 39 33 28 -5 -19 7 23 -6 -47 0 -27 6 23 0 22 -22 -1 16 -69 -37 15 -20 10 39 60 -31 4 4 -39 40 17
7688A7nl1K0j2m3K0N3j4LK0L3k6l1J5LL5p2L1L%kM4l3m9RK7l3K5J6Rj9J3k7n9
$$ 17 12 -19 1 -11 -54 -34 19 5 8 28 61 35 4 19 22 57 -15 16 19 19 17 61 28 -21 -12 15 -18 7 23 32 13 26 -1 -60
7722f0Mj4R7o7K8O1q2O1Qm7O8o0K3k6pk8K7nJ2J9MnK2l6k7K4M0K1m4nK8k2o1J16
$$ -60 -56 -70 27 -40 -12 49 -33 28 36 -11 57 -3 20 -6 -13 -41 -14 -19 -7 12 16 11 33 -3 -30 -6 34 55 11 6 34 12 -49 67
7756F7m1q1Q7k3k3J2l4P6m9K9j1n4N9l4K0l2J04j07K8n4O0K1l7Jm1K3J2L4p0O6
$$ 67 26 -55 32 9 -14 -2 -36 40 -9 20 9 -45 14 -20 0 -32 72 -35 -7 -61 -1 20 -17 -16 -57 -34 -22 12 -58 8
7786Hq9J75j20N0Rn0MrM2m2J7N0L9r3N5r0K7O6n0M3j9j0%lk6k0O7p7M8j4Qk6M0
$$ 8 -81 94 -26 24 33 -17 -13 -22 20 -22 -5 45 84 -9 46 -44 -17 49 -1 42 23 13 13 10 -16 -36 31 -46 2 -12 -4 -30 10
7819A0nL9k5k8Pj7j0%L8NL8o2K7PMLk5j9N5l9j6OJ4L4n7K5J8j6nO2k4j1jo0O2
$$ 10 5 44 19 -9 -2 -19 -29 -29 9 14 52 -10 17 24 28 31 6 -13 42 3 -13 -7 7 41 -16 9 27 11 6 68 44 33 32 -28 34
7854C4J1J5k2p3j3J19r5J8O3p5mk6Q8p0m3M8RN6Rn0j7L3k6K0Jn5J00k8k2P2o9
$$ 34 45 60 38 -35 -48 71 -24 -6 57 -18 -22 -48 40 -30 -73 -25 -16 40 49 -1 -18 15 -11 9 10 -45 55 27 5 77 8
7885Hm3j3R9Lr8Q3m8J4j5O9l4r9Q2L2ll5L2k8Nk9K6K4l0K6m4k5Q4j6J2k2j5k7
$$ 8 -35 -48 51 54 -44 39 -9 5 -10 59 25 -74 8 40 37 2 34 6 11 -18 8 32 2 28 -16 -41 43 27 39 17 2 -25
7917b5K6m8L3N8r1N4m0j3L7K4K2p9K9L6j6k4Q0p3mK6J9jm6N4q0P%J3K2k6J4Q4
$$ -25 1 -47 -14 44 -47 7 -33 -46 -9 15 37 -42 -13 23 7 -17 63 -10 -14 12 31 30 -16 38 -42 -35 -35 -22 0 -26 -12 72
7949G2o6k8J00j05j3P4m0p1J15n1J4m4L2M5Kn4J0mL5on8oK0PM6q8M7K0N8j3n9
$$ 72 6 -22 78 -27 -40 34 -6 -77 38 -13 1 -43 -11 34 36 -18 -8 -12 23 17 -41 -47 -27 -20 26 -62 -15 5 63 50 -9
7980iN9q6L9M8m6J4k9N3m5NL7k6K2j7rKk7O3J4r2P6k3k9m2Q5kk5J1j4M2o3rJ0
$$ -9 50 -36 3 51 5 19 -10 43 -2 3 40 14 36 19 10 12 -15 48 62 -30 46 23 -6 -48 37 35 10 21 7 49 -14 -23 -13
8013a3NOJ7mJ5N6q1lL7Pp0K9PL0J0o6L5n3J8K2K8j8n3Q6n7k4N7Pn3j8N7K7o0k6
$$ -13 -8 -2 15 11 26 82 1 -2 35 42 -28 1 8 38 48 -18 17 -36 -18 4 32 14 -39 47 -10 -34 23 30 -23 -41 16 43 -17 -43
8047d3O6l7loM0l3RL9p7K7mN6rp1J5M4m0K6K4l4k7K2O8J3k4Pj3n6M1M1k1k7K1
$$ -43 23 -14 -17 -23 17 -16 -7 32 -45 -18 -22 34 25 -46 -31 13 -27 -1 23 -11 -38 -16 52 65 41 48 35 -21 20 61 40 13 34
8080C4n9PL5j1Rk2J8K3l9j1J9J6K4Nm3p9Q4N2m3k6L7j5q8P3Kl8Lj8M6Kj4N7k1
$$ 34 -25 -18 17 6 15 -7 11 34 -5 -16 3 19 43 48 5 -74 10 62 19 -7 30 15 -73 0 2 -36 -33 -51 -5 -3 -17 40 19
8113A9l5j3O2j4l1N1jmk7qm0M6KQ7r4J7k0N6q4K8oj4K2J8m2LL6J5l2J4l0L8k1
$$ 19 -16 -29 33 19 -12 39 38 34 7 -1 -41 5 7 94 0 17 -3 53 -31 -3 -9 -23 -1 17 -25 -22 14 29 -3 11 -19 19 -2
8146bM5k5K9j04M7ojJ3Qm7P4J0mm5j8L5L3K1k2k8Ol1J27j57L0O6L1n9j7L4N2j12
$$ -2 43 18 47 -57 -10 -16 -17 -4 4 -43 31 41 37 -8 -26 9 42 63 41 13 19 -12 115 -42 -12 54 85 26 9 43 95 -17
8178a7K3P7r4N3l5l0K3LJ9K8q9J20q2
$$ -17 6 83 -11 42 7 -23 0 3 22 50 -39 81 -1
8191a
$$ Imaginary data points
##PAGE= N=2
##DATA TABLE= (X++(I..I)), XYDATA
0@%%%%%%%%%%%%%%nNqJ6j6J6j6J6k4L2l2M0m8N2o0O8p9Q9r8J12j27J41j56J72
$$ 0 0 0 0 0 0 0 0 0 0 0 0 0 0 0 -5 0 -8 8 -8 8 -8 8 -16 16 -16 24 -24 28 -32 36 -43 46 -52 60 -67 74 -82 90
38I0j92K14k37K62k90L19l52L89m25M69n18N70o29O91p63Q47r37J042j164J306
$$ 90 -102 112 -125 137 -153 166 -186 203 -222 247 -271 299 -330 361 -402 445 -492 550 -614 692
58F92j477J684j939K265k697L286m137N464p751J2382k5010J17734L76973k53072
$$ 692 -785 899 -1040 1225 -1472 1814 -2323 3141 -4610 7772 -17238 100496 477469 224397
72B24397j76636r9521l23659Q5822L83847J26351O0867j09148l36692p7115N3585
$$ 224397 47761 -51760 -375419 -289597 94250 220601 281468 172320 -164372 -241487 -187902
83a87902L5052L35796J99406k54872j81625j26775j78526K31300L71111J7656
$$ -187902 -152850 182946 382352 127480 -54145 -180920 -359446 -128146 242965 260621
93B60621p0495j40266l19255o7268K52219K30887J27039n2835k23238j82400q7127
$$ 260621 190126 49860 -269395 -336663 -84444 146443 273482 220647 -2591 -184991 -272118
104b72118R8530K99795J43541j02362j19568j59697j44471P0811K07438J91340
$$ -272118 -173588 126207 269748 167386 47818 -111879 -256350 -185539 21899 213239
114B13239M6030j77322j99144j01809k1815K12369K82022n534j53207j69593j97070
$$ 213239 259269 81947 -117197 -219006 -240821 -28452 253570 248036 94829 -74764 -271834
125b71834O2877K52706R2014O0341r210k74127j49199J03850N7419J52493J85805
$$ -271834 -208957 43749 135763 196104 186894 -87233 -236432 -132582 -75163 77330 263135
136B63135j21502j77377q5878j30469J21530K98285J9852o0428m6753k56784r2237
$$ 263135 141633 -35744 -121622 -252091 -130561 167724 187576 127148 80395 -176389 -268626
147b68626K16526J17832Q9064P7364k13558j96402L5039J0882J24247K34663m9038
$$ -268626 -52100 65732 154796 232160 18602 -177800 -142761 -131879 -7632 227031 177993
158A77993j70520o5391j20380R21K14835J04601P295k1420j98500j45623Q9868
$$ 177993 7473 -57918 -178298 -177377 37458 142059 149354 127934 -70566 -216189 -126321
169a26321J07560J15867J15281r9277j89983p6631n739J10418J77397L5341o8109
$$ -126321 -18761 97106 212387 113110 -76873 -153504 -159243 -48825 128572 163913 95804
180I5804r6805j41379l1526J25941J23992P3906j2472j31778j25405l9502N9907
$$ 95804 -1001 -142380 -173906 -47965 76027 149933 137461 5683 -119722 -159224 -99317
191i9317J60434J02626m2047r0030j23710q5678Q5393J37675P2872L0796r1133
$$ -99317 61117 163743 121696 31666 -92044 -177722 -92329 45346 118218 149014 57881
202E7881j60076l9721M4405Q7182J39957K2225j09423q7390q5430j4515J49979
$$ 57881 -102195 -141916 -97511 -10329 129628 151853 42430 -44960 -130390 -144905 5074
213E074J07711m879j0635j12991j45746M1941J09030O7883Q5168k9968j52161
$$ 5074 112785 107906 97271 -15720 -161466 -119525 -10495 57388 142556 112588 -39573
224c9573p3021l783M9810J43332O3347o4256o2507r7928o9523J01546J15840K8618
$$ -39573 -112594 -116377 -66567 76765 140112 75856 13349 -84579 -154102 -52556 63284 91902
236I1902K1657p0826j46804k3773O8253P2533R5466J6695r8259r1698n2580J9316
$$ 91902 113559 42733 -104071 -127844 -59591 12942 108408 125103 26844 -64854 -117434 -98118
248i8118J17279Q2763l881l7389j01559r2447M4289R5981O1978M2862l7397j13039
$$ -98118 19161 101924 98043 60654 -40905 -133352 -89063 6918 68896 111758 74361 -38678
260c8678o9370J1493P3013R4025L5627l3901p7872r4954j2180Q8619P7863L9042
$$ -38678 -108048 -96555 -23542 70483 106110 72209 -5663 -100617 -112797 -24178 53685 92727
272I2727q90q7181r8877p801N7812Q0114O2030j1248o9562q3563m5874N3070R5261
$$ 92727 91837 4656 -94221 -102022 -44210 35904 97934 86686 17124 -66439 -112313 -59243 36018
285C6018M3171O511m1834j05783m9934N5471O8406N5636L0397n2096r2770m8439
$$ 36018 79189 85700 43866 -61917 -111851 -56380 12026 67662 98059 45963 -46807 -95246
297i5246J8195P4811P3531J5536l2721p4918p7752J4168Q2026N4798K8364j0535
$$ -95246 -77051 -2240 71291 86827 54106 -20812 -98564 -84396 -2370 52428 80792 70257
309G0257q3712p5402Q436N6536O5012M3907j5966o8085p3229j9586N7727P3109
$$ 70257 -13455 -88857 -80421 -23885 41127 85034 69068 983 -72246 -91832 -34105 39004
321C9004L3993q34n2875q5789k3754N2346N9410M4797J3096n2338p9661l3084
$$ 39004 72997 72163 19288 -66501 -90255 -37909 21501 66298 79394 27056 -52605 -85689
333h5689L2338O5603N2214J0443l8324p3662m9208K6792O4994M7388J9706k5276
$$ -85689 -53351 12252 64466 74909 36585 -37077 -86285 -59493 5501 52889 72595 47319
345D7319p2425n4147J4374N6543N4434K7065k0400o5267n9493J471N4013N5563
$$ 47319 -25106 -79253 -64879 -8336 46098 73163 52763 -12504 -71997 -70526 -16513 39050
357C9050K9059j0786n7862o2952p821M4817N4030L6533j808n1931o4905j8639
$$ 39050 68109 57323 -539 -63491 -71312 -26495 27535 64068 62260 10329 -54576 -73215
369g3215L7480N5484L9916L741m3829o3775k7030K9254N2758M1557J1270l3311
$$ -73215 -35735 19749 59665 63406 19577 -44198 -71228 -41974 10784 52341 63611 30300
381C0300o2937l6999K0941N0385M4033J9021k7245o2491m0159J3117M4505M6548
$$ 30300 -32637 -69636 -48695 1690 45723 64744 37499 -24992 -65151 -52034 -7529 39019
393C9019K3484k1219n4652m4713R41M1232M7657K7389j0920n1553n0336l822L4666
$$ 39019 62503 41284 -13368 -58081 -57140 -15908 31749 59138 48218 -3335 -53671 -57493 -22827
406b2827M5822L4997o837m8205m6257j3699K4436M9072L6791j534l7464n1431
$$ -22827 22995 57992 51155 2950 -43307 -57006 -32570 16502 53293 51759 14295 -37136
418c7136k2466K5126M2460L6697J2793l6915n4884j7627J4717L2547M6048J6484
$$ -37136 -59602 -34476 7984 44681 57474 20559 -34325 -51952 -37235 -4688 41360 57844
430E7844l3367m5257k8443K633L9229M3370J6533j7098m7829l9717P264L3485
$$ 57844 24477 -20780 -49223 -46590 -7361 36009 52542 35444 -12385 -52102 -44838 -11353
442a1353L6293K8060j3743m8959l2133k399K0761M3785L1302j2886l7679l5260
$$ -11353 24940 53000 39257 -9702 -41835 -44234 -23473 20312 51614 38728 1049 -34211
454c4211j3876K0605M0947L2558M1l7804m1918j0972J5235L2701L9243P497l7582
$$ -34211 -48087 -27482 13465 46023 46064 8260 -33658 -44630 -29395 3306 42549 50046 12464
467A2464m1866j3390J2076K8824L5942J4639k8327m3283j7434P854K3075L6765
$$ 12464 -29402 -42792 -30716 -1892 34050 48689 20362 -22921 -40355 -32501 -9426 27339
479B7339K0289k0954l8708k6859j355K7955L7223J9934j1344m0905l3247M051
$$ 27339 47628 26674 -12034 -38893 -40248 -12293 24930 44864 33520 -7385 -40632 -36581
491c6581K1994K9880L1335j1402m5452j9528J0L707L4559L5594j0870l1190k4015
$$ -36581 -14587 15293 46628 35226 -10226 -29754 -29744 -26037 8522 44116 33246 2056 -21959
504b1959j4909J0196K9946K9073J2251k9309m5833o708J5618J5488L7212J9194
$$ -21959 -36868 -26672 3274 32347 44598 15289 -30544 -37252 -21634 -6146 31066 50260
516E0260l9198l7755l135K919K0369L6438O909k2247k4369j9844j051K1945K5817
$$ 50260 11062 -26693 -29828 -26909 -6540 29898 36807 14560 -9809 -29653 -30704 -8759 17058
529A7058J7929o292l4282k5178M76J1747L0171L3175j2576m2157j8238K10O930
$$ 17058 34987 28695 -5587 -30765 -30289 -18542 11629 44804 32228 -9929 -28167 -27957 -21027
542b1027L2059L0978j3975l4347j5951l519O618K4306K3090J033k0493k7255j0365
$$ -21027 11032 42010 28035 -6312 -22263 -25782 -19164 5142 28232 29265 8772 -18483 -28848
555b8848R673J4715K4391J9976k2433l8651p632N362J3100L7339J4825l1595k6252
$$ -28848 -19175 -4460 19931 39907 17474 -21177 -28809 -23447 -10347 26992 41817 10222 -16030
568a6030q601l603K3001L1137J703j3982j8717k0128K363J5948J3556K1238O68
$$ -16030 -24631 -28234 -5233 25904 27607 13625 -5092 -25220 -22857 -6909 6647 27885 28553
581B8553l4076j7397M014k031K2724L6566r779l3392j3300q297M600L1500K1353
$$ 28553 -5523 -22920 -18906 -20937 1787 38353 28574 -4818 -18118 -26415 -21815 9685 31038
594C1038p249j9723k3446q176J5164J6317J4264R370j8357k6619j930M220N536
$$ 31038 23789 4066 -19380 -27556 -12392 3925 18189 27559 9202 -17417 -19347 -15127 -9591
607i591K6687J5595k1984k1249o632q245J2856L4601R021j8986j7693j6060m853
$$ -9591 17096 32691 10707 -10542 -17174 -25419 -12563 22038 31059 12073 -5620 -21680 -26533
620b6533K0790K2416P181n742k2790j8280O278Q494J0982K3066l294k8597p244
$$ -26533 -5743 16673 23854 18112 -4678 -22958 -16680 -8186 2796 25862 22568 -6029 -13273
633a3273j416o830K3973K6911j1548j5328r334j9142M726K9102J2552j08r325
$$ -13273 -14689 -21519 2454 29365 17817 2489 -6845 -25987 -21261 7841 20393 20285 10960
646A0960k5716r816J2639J0709J6992J0709k0839j8223K55n582Q743K7938K979
$$ 10960 -14756 -24572 -11933 -1224 15768 26477 5638 -12585 -12330 -17912 -9169 18769 21748
659B1748j5201o575j4506j0656J8820K1247L685l215j4489k0182j841J3772J6406
$$ 21748 6547 -28 -14534 -25190 -6370 14877 18562 15347 858 -19324 -21165 -7393 9013
672I013J2506m914j9009j2044k785M862J8966J5002q191j3212p023j0844L77K2520
$$ 9013 21519 16605 -2404 -14448 -17233 -12371 6595 21597 13406 194 -6829 -17673 -17296 5224
686E224J3488n888n061j1845j8422N204K1512J0194L082o605k0324r748O047J0176
$$ 5224 18712 12824 7763 -4082 -22504 -17300 4212 14406 17488 10883 -9441 -19189 -13142 -2966
700b966J7199O172j6295r354l566j0867J2005K4904l108q317J44j8642j1124J9894
$$ -2966 14233 20405 4110 -5244 -8810 -19677 -7672 17232 14124 5807 5951 -12691 -23815 -3921
714c921J4582K368K220j3363j7108m91O292J4619J5114q624j3733l275j1001N18
$$ -3921 10661 13029 15249 1886 -15222 -15713 -9421 5198 20312 11688 -2045 -5320 -16321 -15803
728a5803K4745Q298j0672j191p832j6267N258J7785P498N98m599j1416j1088j652
$$ -15803 8942 17240 6568 5377 -2455 -18722 -13464 4321 11819 12417 7818 -3598 -14686 -16338
742a6338J4273J7502k01j0155p515j0571m308J5432J6305j764q254m763q592p069
$$ -16338 -2065 15437 15236 5081 -2434 -13005 -17313 -1881 14424 12660 4406 -357 -8949 -16018
756a6018J0197J6339J080m736k309j2482j1027J1449J6056L678j360p422j2772
$$ -16018 -5821 10518 11598 6862 4553 -7929 -18956 -7507 8549 12227 10867 3445 -9327
769i327n831N610J4754J0547o975q500k591j1239j379K1085Q118q783k29n712
$$ -9327 -15158 -9548 5206 15753 8778 278 -2313 -13552 -14931 6154 14272 5489 5260 -452
783d52j4915L462J4211O265K666m135j0459o540k766P417J6865K172r821l880
$$ -452 -15367 -11905 2306 8571 11237 7102 -3357 -9897 -12663 -5246 11619 13791 3970 90
797I0r196p676J4583J4059l411k412l619j2272l171R519Q939M267j622n859p309
$$ 90 -9106 -16782 -2199 11860 8449 6037 2418 -9854 -13025 -3506 5433 9700 8078 2219 -5090
812e090q386L565J6308N738n676k911p353j0307M966J3870N519k162m717o577
$$ -5090 -13476 -9911 6397 12135 6459 3548 -3805 -14112 -9146 4724 10243 8081 3364 -3213
826c213p209l70J1390J0114k067m791m981r668m18J1912P060M39j559p649q439
$$ -3213 -10422 -10792 598 10712 8645 3854 -1127 -10795 -11213 699 7759 8198 6639 -1010 -9449
841i449n09O825R420L841m000n234q010o122R273J2488p78k484j886j0438m967
$$ -9449 -9958 -3133 6287 10128 6128 894 -7116 -13238 -3965 8523 7745 5261 3375 -7063 -12030
856a2030Q400P734L094N19m955p579n220J861J0780P295k951l868n892q262L391
$$ -12030 -3630 4104 7198 7717 2762 -4817 -10037 -8176 2604 9899 6948 3080 -2812 -11074 -7683
871g683J0764L447L69j190q685o626K672O098O325L452l285p237p161o00Q790
$$ -7683 3081 6528 6897 5707 -2978 -9604 -6932 -834 5491 8943 5658 -1579 -8740 -9340 -550
886e50O908K3n27m871r632l50P896M708K569J286n811q647k333N518P693L331
$$ -550 6358 6381 5854 983 -8649 -8999 -1103 3605 6174 7460 1649 -6998 -9331 -3813 3880 7211
902G211q13m033q038l865N974O367K284J887k975q808l846L809N457M771K275
$$ 7211 6398 2365 -5673 -9538 -3564 2803 5087 6974 3999 -4809 -8655 -4846 611 5382 7657
917G657l186p998n528L457O972K899J799j71p860o877L382N641K444L787N23p720
$$ 7657 4471 -3527 -9055 -5598 1374 4273 6072 5901 -1959 -8836 -5454 187 2631 6418 6941 -779
933g79p411J376O051L977K408P69n533q206Q4O423L063J986K739m440q935j188
$$ -779 -8190 -6814 -763 3214 5622 6391 858 -7348 -7264 -841 2222 4208 6947 2507 -6428 -7616
949g616N534L621K783K732l745q843k329N270L934K040K973j887q387m054M567
$$ -7616 -2082 1539 4322 7054 3309 -5534 -7863 -2593 1341 3381 6354 4467 -3920 -7974 -3407
964c407M305J571L473o6q686n511M628M312J009L946P72q005n777K997M095K144
$$ -3407 898 2469 5942 5876 -2810 -8321 -3693 619 1628 5574 6346 -1659 -7436 -4439 -344 1800
980A800L106J260n658p503Q19O120J943J452L326m800q895J152N642Q56K431L542
$$ 1800 4906 6166 508 -6995 -6176 -56 1887 3339 6665 1865 -7030 -5878 -236 620 3051 6593
996F593m163p586r28M001K877K055K839j522q209l278N281K987P70M170j081q364
$$ 6593 2430 -5156 -6084 -2083 794 2849 5688 4166 -4043 -7321 -2040 947 1717 5887 4806 -3558
1012c558l141M065L004J514K797J61o136n379K996M474nK818K664o575o208K656
$$ -3558 -6699 -2634 370 1884 4681 4842 -1294 -6673 -3677 797 792 3610 6274 -301 -6509 -3853
1028c853L211J358L545J299m784o023m16M874K748N07K738k488q463K14N784j15
$$ -3853 -642 716 4261 5560 776 -5247 -5663 -789 1959 2466 5204 2716 -5747 -5533 251 136
1044A36J698M321m112o220P9J788K207K808J278k89m987n303L620M314q10L935
$$ 136 1834 6155 2043 -4177 -4098 -2310 -103 2705 3983 3694 -1293 -6596 -2976 1338 528 4463
1060D463J601r123l567N091R35J674M611k325n385j844L04L115K545O2J798k300
$$ 4463 6064 -3059 -6626 -1535 -600 1074 5685 3360 -2025 -3869 -3565 -450 2095 2157 3955 1655
1076A655o734J236M126j127L252M178n927n387J574Q79K158M212N29l273m650
$$ 1655 -5079 -3843 283 -844 2408 6586 659 -4728 -3154 -2275 -117 4095 4624 1351 -3299
1091c299j892L625K879O48K425k098o201K68L009k11K358K610k100l148j820j38
$$ -3299 -5191 -1566 1313 1961 4386 2288 -3913 -3645 -636 -847 1511 4121 2021 -1127 -2947 -3085
1107c085J921K137K936J009o059m150K862J076K042N390k571o571O2Q16M78M000
$$ -3085 -1164 973 3909 4918 -1141 -5291 -2429 -1353 689 6079 3508 -3063 -3001 -2185 -1707 2293
1123B293Q56j458p58l625n44L279r08J900M973n001n106K929j572j02Q008J6o002
$$ 2293 3149 1691 933 -2692 -3236 43 -865 1035 6008 1007 -4099 -1170 -2742 -2844 5164 5180 -822
1140h22n05j847j061N647K026j010k69m820j504M725j134m4N727l197n114L303
$$ -822 -1327 -3174 -4235 1412 3438 2428 2159 -2661 -4165 560 -574 -618 5109 1912 -3202 101
1156A01j419l301O248L534l488j541k211k311K857L352K056p9n451k456L319j12
$$ 101 -1318 -4619 1629 5163 1675 134 -2077 -4388 -1531 1821 3877 3798 -1653 -4109 -790 -902
1172i02M22M494j358m580Q41O16k128J279L940J249k962k727J19j185M82O144
$$ -902 -480 4014 2656 -1924 -1083 -467 -2595 -1316 2624 3873 911 -1816 -1697 -2882 -2400 3744
1188C744J569n887j662P05j547K665L918q92j951k325p21K345r54p9N518j918
$$ 3744 5313 -574 -2236 -1531 -3078 -413 3505 2613 662 -1663 -2384 -39 -993 -1072 4446 2528
1204B528n569L444p45n276O477N487n571j416L27m057K208M769N1K78l402m047
$$ 2528 -3041 403 -342 -5618 859 6346 775 -641 -314 -4371 -2163 2606 2657 2935 -467 -4514
1220d514M366Q92l338N536J332p488K355L227o548J478P032k068j985O25l734
$$ -4514 -148 744 -2594 2942 4274 -3214 -859 2368 -4180 -2702 4330 2262 277 902 -2832
1235b832q57L432K283K157k359n556J555K201j965L592L148n717j897L934j672
$$ -2832 -3689 -257 2026 4183 1824 -3732 -2177 24 -1941 1651 4799 -918 -2815 1119 -553
1250e53k343L639K392k177j325M05j409k002L008M661j427l764o24o73r9L001
$$ -553 -2896 743 3135 958 -367 38 -1371 -3373 -365 4296 2869 -895 -1519 -2192 -2291 710
1266G10K868j000l759j760K541K73j365L772Q32n232J293K715m991M18O046j347
$$ 710 3578 2578 -1181 -2941 -400 -127 -1492 2280 3112 -2120 -827 1888 -3103 -2685 3361 2014
1282B014k010J301l205j663L278J689J755o51n256L81K888k757K739M829n885
$$ 2014 4 1305 -1900 -3563 -285 1404 3159 2508 -2748 -2367 521 -2236 503 5332 -553
1297e53k605M858k666k473N571K30k852J672j287k505J552P83J719K094l600k250
$$ -553 -3158 1700 -966 -3439 2132 2362 -490 1182 -105 -2610 -1058 -275 1444 3538 -62 -2312
1313b312J864j610P49N361j763m341J859l50k320L118K545k105q46L45j242p08
$$ -2312 -448 -2058 -1309 4052 2289 -2052 -193 -543 -2863 255 2800 695 -151 194 -1048 -1756
1329a756R13K083Q07j395r67l84j362N78K964J166j897j443k34n82l4K679J759
$$ -1756 -843 1240 2047 652 -315 -699 -2061 -1483 1481 2647 750 -693 -927 -1509 -1543 1136 2895
1346B895k564j195J091j928m14L847J79j945R49r69k376J348J712L52Q47j308
$$ 2895 331 -864 227 -1701 -2115 1732 1911 -34 915 -54 -2430 -1082 630 982 1829 521
1362E21j618K46r16R96L567j309k473J674j470k421L830J859k593O90L42k898
$$ 521 -1097 -851 -1767 -771 2796 1487 -986 688 -782 -3203 627 2486 -107 583 925 -1973
1378a973J45K021O36O55n60j354o8j105Q2L243K26k362R89l92l000J701L112j078
$$ -1973 -1828 193 829 1484 924 -430 -498 -1603 -1521 1722 1948 -414 575 183 -2817 -1116 1996 918
1396I18o79P75j435j678J094J940N12r02j70j38j936k63K863P76j547L09J84k269
$$ 918 239 1014 -421 -2099 -1005 935 1447 545 375 237 -1699 -1962 901 1677 130 439 623 -1646
1414a646m30K628J165j310k24N90j874j405K777J672j749o6R98k167j391K436
$$ -1646 -2076 552 1717 407 183 773 -1101 -2506 271 1943 194 128 1126 -1041 -2432 4
1430DJ571j001l38N33j197j692J212K539n22j444J316o77k873J363L073j103j022
$$ 4 1575 574 236 769 -428 -2120 -908 1631 1109 -335 981 304 -2569 -1206 1867 764 -258
1447b58J399r91k341J020K256J4r88M03P2k127n28K947Q84k011N47Q34k667p02
$$ -258 1141 150 -2191 -1171 1085 1099 111 514 586 -1541 -2069 878 1762 -249 298 1132 -1535 -2237
1465b237L030O49j616O39N95k181j036K255J385j201k66R97j473j838J942K030
$$ -2237 793 1442 -174 465 1060 -1121 -2157 98 1483 282 16 1013 -460 -2298 -356 1674
1481A674j258n88J391j336k153J548K198r38p50J282q73k261J003K419n44j022
$$ 1674 416 -172 1219 -117 -2270 -722 1476 538 -212 1070 197 -2064 -1061 1358 814 -208
1497b08J086m27k189L77K306N7j141P63J44k250l46K563N36j511O52N82k218o23
$$ -208 878 451 -1738 -1361 945 1002 -139 624 768 -1482 -1828 735 1271 -240 412 994 -1224 -1847
1515a847K422N22j241N60N02j754q76J631J168o77j76N87j152j512J303J887r31
$$ -1847 575 1097 -144 416 918 -836 -1712 -81 1087 410 234 821 -331 -1843 -540 1347 416
1532D16n66J144j033j924J449J684r37j83J051j274j407R78J274j60k05K37l29
$$ 416 -150 994 -39 -1963 -514 1170 233 50 1101 -173 -1580 -602 672 512 307 544 215
1549B15j257j52J558M48q66O52K47k150k69K244J64r76R81l37j927M14J543k13
$$ 215 -1042 -1194 364 812 -54 598 845 -1305 -1574 670 834 -142 839 502 -1425 -1011 532 319
1567C19k21N16k90q15m36N00R46j46p5O33j184j529J414J294r17L74Q13j918q77
$$ 319 98 614 324 -491 -927 -427 519 373 298 931 -253 -1782 -368 926 9 383 1196 -722 -1599
1586a599J773L55o72R18j1j396k45O72K87J90K6K09j96j195n6J314j75l80J451
$$ -1599 174 529 -143 775 764 -632 -877 -205 82 272 298 507 311 -884 -940 374 199 -181 1270
1605A270n64k390P93J639r20M60J275j861j344J459N77n68O24J00n21k89l71M54
$$ 1270 706 -1684 -891 748 -172 288 1563 -298 -1642 -183 394 -174 450 550 29 -260 -631 -177
1623a77N37o71Q08J038k140j115K158j61r54K162k00k901N54J693q40J80J102
$$ -177 360 -311 497 1535 -605 -1720 438 277 -677 1485 1285 -1616 -1062 631 -209 -29 1073
1640A073p58r20N2L24M83k59j90J199m94j933J057J045j555R11K004k125j820
$$ 1073 315 -605 -553 -229 254 -5 -195 1004 510 -1423 -366 679 -876 35 2039 -86 -1906
1657a906J888L27r71J365O23j813o30J016K95j31o3L95L20j245l75J390n77r21
$$ -1906 -18 309 -662 703 1326 -487 -1117 -101 194 63 0 395 715 -530 -905 485 -92 -1013
1675a013K190N34l086J47K016j217j15K352j098k246R78J008n26J48J99R4k99
$$ -1013 1177 1711 -1375 -1228 788 -429 -544 1808 710 -1536 -558 450 -76 72 271 365 66
1692F6r29P07R39j606K82K458j619k147K140J49j883K155J394k828n99J428k54
$$ 66 -863 -156 783 -823 -541 1917 298 -1849 291 440 -1443 712 2106 -722 -1321 107 -147
1709a47J43P10k47n12o59L6J488n77j395J814O42k400N69J606k061j9K829p61
$$ -147 -4 706 459 -53 -712 -676 812 235 -1160 654 1296 -1104 -535 1071 -990 -1009 1820 1059
1727A059k268P43M83n66Q52Q12p31j137l12J166P37j037q2J168j072r88J800n
$$ 1059 -1209 -466 17 -549 303 1115 384 -753 -1065 101 838 -199 -281 887 -185 -1173 627 622
1745F22k014J287J799j887p41J362q33n61J890K84j467l81K8M47N85j88J85Q4
$$ 622 -1392 -105 1694 -193 -934 428 -405 -966 924 1208 -259 -640 -612 -165 420 232 417 501
1763E01j498K27J944j123j083K045l13j968J529N93k076Q98J609j108m05K82p89
$$ 501 -997 -770 1174 51 -1032 1013 700 -1268 261 854 -1222 -324 1285 177 -228 54 -735
1780g35M59O56j47N88o97j545J330Q99j515J034R39k291J38J914j277o32J839
$$ -735 -276 380 233 821 124 -1421 -91 808 -707 327 1266 -1025 -887 1027 -250 -882 957
1797I57n29j035Q46k35o48O05K45J44K17j017k07Q53n53J25J485r30j457J141
$$ 957 428 -607 239 4 -644 -39 206 350 567 -450 -657 196 -357 -232 1253 323 -1134 7
1815GM14j124R13Q67j425j98R41m61m62P87J88n29J13q4j47JpN01M82q96n45R12
$$ 7 421 -703 210 1077 -348 -546 395 -66 -528 259 447 -82 31 -53 -200 -199 -206 295 777 -119 -664 248
1837B48m94n53J750q5j852P49P83j414O95J291j237n09J009n25j96N22k27K39
$$ 248 -246 -799 951 866 -986 -237 546 -868 -173 1118 -119 -628 381 -144 -340 182 -45 194
1855A94K11q48M31L21j253Q99J527j803n20J610j148p17K107j87j586P25K69p88
$$ 194 405 -443 -12 309 -944 -45 1482 -321 -841 769 -379 -1096 1011 824 -762 -37 232 -556
1873e56M71M19p4Oo00J22O80r81j75J646n24j327J253J53j697R11J446j112o51
$$ -556 -85 334 260 266 -334 -212 468 -513 -688 958 434 -893 360 513 -1184 -273 1173 61 -590
1892e90Q64k57p52P54O64n18n74K56M45n08k45Q37K91j057P3Q85p91p40J462N11
$$ -590 274 17 -735 19 683 165 -409 -153 292 -216 -461 376 667 -390 -317 568 -223 -963 499 1010
1912A010j558J49J173j181m40J579m5j258M98M54p01j19N20M55l27p28N60M31
$$ 1010 -548 -399 774 -407 -847 732 687 -571 -73 381 -320 -439 81 536 209 -519 41 472
1930D72j211K23J646r57j112J543j84j572J106J058j179k83Q05l76m59L46N88
$$ 472 -739 -516 1130 173 -939 604 420 -1152 -46 1012 -167 -450 355 -21 -480 -134 454
1947D54p7o91N9P59o49p57J427J72j400N83Q49j263j82J365q5r24L22L39n54k57
$$ 454 377 -314 -255 504 -145 -902 525 697 -703 -120 729 -534 -716 649 564 -360 -38 301 -253 -510
1967e10P42L96p89k26P47k89q19P29P26p64l35P63k68q34O38Q56p62m38P22n6
$$ -510 232 628 -161 -387 360 71 -748 -19 707 -57 -392 371 103 -731 -93 763 1 -437 285 229
1987B29r90O54Q52o99m66O22%p09K61O27o8o26K06M86o77k57R82Q6j020M89N16
$$ 229 -761 -107 745 46 -420 202 202 -507 -246 381 313 -313 -107 379 -298 -555 427 513 -507 -18 498
2008D98r46r3J061j81n73K94R5l99j89N97K02m14k38N77k81n80O43N18p64k3O15
$$ 498 -448 -541 520 339 -234 60 155 -244 -433 164 366 -48 -286 291 10 -570 73 591 -173 -196 419
2029D19n35m85P95K33n09n0L50l11l41L38M83l51k88M40p0n76K77O76m06l39M26
$$ 419 -116 -601 194 427 -82 -132 218 -93 -434 -96 387 36 -252 188 118 -458 -181 495 89 -250 176
2050A76k8n34K57N29l37k62L17P5n64J54N74k46l28L61L2n09J19M41o8l05J36
$$ 176 148 -386 -129 400 63 -199 118 193 -371 -217 357 111 -217 144 176 -333 -214 227 159 -146 -10
2071a0K86n38j18N85J21o54L37L44o47j74Q57j44n52L84K15n33p3M42Q5k94JL91
$$ -10 276 -262 -380 205 326 -328 9 353 -294 -468 389 245 -307 77 292 -241 -314 128 213 -81 -80 311
2093C11j90o15M96M29n50p5O68l89p20P27M04p62J62N30m32m92N56K80m13j03
$$ 311 121 -494 2 431 -119 -194 474 85 -635 92 496 -266 -104 426 -6 -498 58 338 -75 -178
2113a78L56N9n86J11N54j78n17N25K73r16J2R83m03n51P35P1q85K44O74k97l54
$$ -178 178 237 -349 -238 316 138 -379 146 419 -497 -485 498 95 -456 279 350 -535 -291 383 86 -268
2134b68L91J56m33k76N29K26n03NO63n11o27Q52L37r75K71P48p02m98Q73J38o81
$$ -268 123 279 -154 -430 99 325 -178 -173 490 -21 -648 204 541 -434 -163 585 -117 -615 258 396 -285
2155b85K29M52l73l81L16L67l03l62O17J79r13O2R42m61o58R50K3j084L98Q99
$$ -285 -56 396 23 -358 -42 325 22 -340 277 456 -457 -395 547 86 -572 378 401 -683 -285 614
2175F14o29l95P34j00o04K26M38j70l15K61K82l76m24N45L46q08K12Q72p51p21
$$ 614 -15 -410 324 224 -380 -154 284 114 -201 60 342 -34 -458 87 433 -375 -163 709 -42 -763
2195g63J050J18q79M74N65p63k46O23j2l13N0J74N3l94J2O21l05n49P55K25j090
$$ -763 287 405 -474 0 565 -198 -444 179 167 -146 -96 78 131 -263 -251 370 65 -484 271 496 -594
2216e94L08Q34p24k72Q87k28p58N16K59l63P5J76L0k80j65L45K62n71J24N32n74
$$ -594 -286 548 -176 -448 439 211 -547 -31 228 -135 -60 116 146 -134 -299 46 308 -263 -139 393 -181
2237a81l10Q08m7o90M19M89p10j18N94k51k55M04J62l61j78J02K52r3q7L15j31
$$ -181 -491 317 270 -420 -1 488 -222 -340 254 3 -252 152 314 -47 -225 -123 129 36 -51 264 133
2258A33n68K28O40m57l38N92j38n63N14L24p08J04N45k90j82L02j66j29J39J71
$$ 133 -435 -207 433 -24 -362 230 92 -471 43 367 -341 -237 308 18 -164 138 -28 -157 -18 153
2278A53L8k25l32L69J91l51L02K25p58O6Q34l89m21N11j71l95M70K42n55L7K15
$$ 153 191 -34 -366 3 194 -157 145 370 -388 -322 512 123 -298 213 42 -353 117 359 -196 -159 56
2299E6O8Rk26o4K41k73J48N61m99o61P37P5m32M57J13o95K8P31k25l86J69J16
$$ 56 124 133 -93 -157 84 -189 -41 520 21 -640 97 172 -260 197 310 -385 -357 374 149 -237 -68 48
2321D8j35P8J30k4l73R3N45j0o45J39K89l25R3N60l17o76M35M32l79p9L70l23
$$ 48 -87 -9 121 97 -276 -183 362 352 -293 -154 135 -190 -97 463 146 -530 -95 337 -42 -121 249 -74
2343g4k84M76K56l48k83K42K55j98j70K21j14l97O21L98q21k15P13k24m14P31
$$ -74 -358 118 374 26 -257 -15 240 42 -128 93 -21 -418 203 601 -220 -435 278 54 -360 371
2363C71o7p45J89O15k16l23J58R5o6j89K81J84o13l1Q92k51p32N67K06p44L53
$$ 371 304 -441 -252 363 147 -176 -18 77 11 -178 103 287 -326 -357 535 284 -448 119 325 -419 -66
2384f6O47o05l83N57J7k26L5K15o6l31K0N95l51m76N28K98o90Q8N43n01l19P68
$$ -66 581 -24 -407 150 167 -59 -24 191 125 -206 -186 409 58 -418 110 408 -282 -194 349 -152 -471 297
2406B97M8o48K6M46j68k29L19J50m35p3N04k5n38J57N20l26l36M75P7o26K31O49
$$ 297 345 -303 -277 169 1 -228 91 241 -194 -267 237 212 -326 -169 351 25 -311 164 241 -385 -154 495
2428D95l66n18N03J32n05K38L95l51k74L36R5k33j04L09N6l97Q0M36k98m67O10
$$ 495 129 -389 114 246 -259 -21 374 23 -251 85 180 -53 -157 152 208 -189 -109 327 29 -438 172
2449A72K07o84J43M28m23j53N74n0m66J02K99j60j14J56J46k56k26N23k2n23K56
$$ 172 379 -305 -162 266 -157 -310 264 214 -252 -150 149 -11 -125 31 177 -79 -305 218 196 -327 -71
2470g1L95l79k08N24r8m85L44L28m33j22K94J6l12K12K35j79k86J97J88k91JL25
$$ -71 324 -55 -263 261 163 -322 22 350 -83 -205 89 105 -207 5 240 61 -225 -28 160 -131 -130 195
2492A95j31l00K11J99k92k5L31q2l15K52J36l28lM69j56l76J66K39k38k7J98R
$$ 195 64 -236 -25 174 -118 -143 188 106 -209 43 179 -149 -152 317 161 -215 -49 190 -48 -75 123 132
2514A32k38m8K94j01k72K71K00l36o5L50j79j92L01Q0l27M5K41j50j77K71N8k24
$$ 132 -106 -154 140 39 -233 38 238 -98 -163 187 8 -184 117 197 -130 -85 156 6 -171 100 158 -66
2536f6n4K14L1l76J86L09l15j48L50N8m63K01K75j90k10L33l0l30P4L63k03k04
$$ -66 -120 94 125 -251 -65 244 -71 -219 131 189 -274 -73 202 12 -198 135 105 -225 -151 212 9 -195
2558a95K50R3k93L8L35j38k94K09J77l37p1L93j9l52J84K80l45k05M59Rl67J97
$$ -195 55 148 -145 -107 228 90 -204 5 182 -155 -226 167 148 -204 -20 260 -85 -290 169 178 -189 8
2580HK26k65k03L44N4k67K7K74j23l74K87K35k83k02M03k6m76L08K94l59j39M73
$$ 8 234 -31 -234 110 164 -103 -76 198 75 -299 -12 223 -60 -262 141 115 -361 -53 241 -118 -257 216
2602B16j26l19J70L22k73j65K57J15m21L0M70k02k80K74K45m84l8M59j97l84L40
$$ 216 90 -229 -59 263 -10 -175 82 197 -224 -194 276 74 -206 68 313 -171 -209 250 53 -331 9
2623IK75m22j15M59l1l69J71L32l20k66L67J11l89K8M00j50l88L44J54l85j27
$$ 9 284 -138 -253 206 175 -194 -23 309 -11 -277 90 201 -188 -160 240 90 -298 46 200 -185 -312
2644c12N50j06l98K97K39l97n1L26r0l14K19K89k52k96M07J21m11N3L79j87l39
$$ -312 238 132 -266 31 270 -127 -178 148 58 -256 -37 252 0 -296 111 232 -179 -126 253 66 -273
2665b73L87J53m42n2M72j14l65K44K06l76j15M56n3k87P1K78j68k47K51K27m07
$$ -273 114 267 -175 -227 245 131 -234 10 216 -160 -275 181 128 -159 -88 190 22 -225 26 253 -154
2686a54L1L40j78l15L76J25m17O2L26j65k76K57J43k17k6K16m6k73J02K97j81
$$ -154 -123 217 39 -276 100 225 -192 -130 196 31 -245 12 155 -62 -88 128 82 -191 -89 208 27
2707B7k39L01R6l31M4L33j99k21K70J31l65J03K49j44k45L52o1j81r5L19k3k87
$$ 27 -212 89 185 -146 -102 231 32 -189 81 212 -153 -50 199 55 -190 162 101 -80 -175 144 121 -166
2729a66R5J52j33j36L12J3l90K00K02j52k41L18Jk76K04K19k54j92K48R1k06O5
$$ -166 -71 81 -52 -188 124 137 -253 -53 149 -3 -244 74 75 -201 3 222 -32 -224 24 115 -91 -26
2751b6K19k10j06J43J57j55j51J85R5k00O1K49l80n3L49K9m54K03J36k45M7L30
$$ -26 193 -17 -123 20 177 22 -129 56 151 -49 12 261 -119 -172 177 206 -248 -45 91 -154 -107 223
2773B23j70l17J63J63Jp4lP5j95j5L20n5m15K46J96k05M0K44l06k17M22J37l18
$$ 223 53 -264 -101 62 63 -11 -14 61 -134 -149 171 116 -299 -53 143 -62 -22 222 -84 -301 121 258 -60
2796f0p6J68r4J9J80K5l00m9K58J64l08q2L12p0l09L85P6m79kN74k90j97K41j6
$$ -60 -136 32 -62 -43 137 162 -138 -187 71 235 -73 -155 157 87 -222 163 239 -240 -242 332 42 -155 86 70
2820G0l04J84L39k54k15P9J92l5j51J21J6k91Q0M86k66l82M12J09m50K04L76m68
$$ 70 -234 -50 289 35 -180 -101 91 56 -95 26 42 -249 -169 317 51 -331 81 190 -260 -56 320 -148
2842a48r2L77N6k91J8J57o8j05J64J15k11k05L05J29l78N2M35l38k62N08k3n14
$$ -148 -240 137 193 -98 -80 77 9 -96 68 183 -28 -233 72 201 -177 -125 310 -28 -290 218 195 -319
2864c19K17L57k82j56K96o2k72J55K19q9k50Q6K60j44k31L48P3m47J34M24l06
$$ -319 -102 255 -27 -183 113 51 -221 -66 153 64 -186 -100 160 16 -215 133 206 -241 -107 317 11
2885A1l09M87l1m22K28K45k70r0L43m0k55l3K15j1j36L6K45k30k16M20J30n67
$$ 11 -298 189 158 -264 -36 209 -61 -151 192 152 -103 -136 79 68 -68 -32 213 -17 -233 187 317 -250
2907b50J09M23l93j29M43q2l81K29K57k70o3J43m1j5qJ51nk85O3L06j81k70L87
$$ -250 -141 282 -111 -240 203 121 -260 -31 226 -44 -107 36 -5 -20 -28 123 118 -167 -104 202 21 -249 138
2930A38l5l76K44K64m71Q7L49j19k53J48K3q0K7R1J00j78j39K76n4j39J63J33
$$ 138 103 -273 -29 235 -236 -149 200 81 -172 -24 -1 -81 -54 37 137 -41 -180 96 42 -97 66 199
2952A99k94j04L75m2l53K45J14l15L7L49j45k75K34P5j24l2O6K9j62M2K15n5k65
$$ 199 -95 -199 176 134 -219 26 140 -175 -138 211 66 -209 25 100 -24 -56 10 39 -123 -81 134 79 -186
2975a86J19K73l31K2K71k06j58K65J35l67Q6K47j83m0J65l6j57L4P9R9j75rK04
$$ -186 -67 206 -125 -103 168 -38 -196 69 204 -163 -77 170 -13 -53 112 76 -81 -47 32 131 -44 -53 151
2998A51j55j46K72O0m08J62K74l09n5K17K1k29J38J08j12p8Q1J16j46q0K32m6
$$ 151 -4 -150 122 182 -226 -64 210 -99 -154 63 84 -145 -7 101 -11 -89 -8 108 -38 -118 114 68
3020F8k94K11J75k31k6J99n8j80J65J61k09j38K33j0j56J12K08k76j34K56M4k53
$$ 68 -226 -15 160 -71 -97 102 44 -136 29 190 -19 -157 76 66 -90 22 230 -46 -180 76 120 -133
3042a33N9K49j78j78K17P4k04mJ98J9l30K16J30k41n3L20q5k56J79J44k68j8K13
$$ -133 -74 175 -3 -181 36 110 -94 -98 100 119 -211 5 135 -106 -159 161 76 -180 -1 143 -125 -143 70
3065G0M7k45P0K19k00j57J81K38l50M8L27k50j91K96J16k42r2K48o7k11J27K20
$$ 70 117 -128 -58 161 -39 -196 -15 223 -127 -79 248 -2 -193 103 219 -23 -115 133 66 -145 -18 202
3087B02k55j13K86O6l36J21K60j89k49L25K7k51K0K73j44j97J62J01k65J3L18
$$ 202 -53 -166 120 186 -150 -29 231 42 -207 118 145 -106 -86 187 43 -154 8 109 -156 -143 175
3108A75r8k62J30K40k43j06L27m8l03J35K76k72j42K46J13l05Q3K71j65k39K12
$$ 175 77 -185 -55 185 -58 -164 163 115 -188 -53 223 -49 -191 55 168 -137 -54 217 52 -187 25
3129B5K12l53J8K65j30j85J89J89k57j77L75ql71J08K89k01j29K26M8k22n7K81
$$ 25 237 -116 -98 167 37 -148 41 230 -27 -204 171 163 -208 -100 189 -12 -141 85 133 -89 -146 135
3151A35j61j49J43J65j82j12K81p6j86R8K40l06j05K88J4k06J29J50k20j15K74
$$ 135 -26 -175 -32 133 -49 -161 120 44 -142 -44 196 -110 -215 73 87 -119 10 160 -60 -175 99
3172I9l5j27K1J48r5j26J55Q0j55l6K22j04k35K25J24k37l9L14j86j34J84Q6j84
$$ 99 64 -63 -42 106 11 -115 40 120 -35 -71 151 47 -188 37 161 -76 -115 199 13 -121 63 149 -35
3195c5j05K13k8j67Q2J82j23j68J76N2k28N0J86q2j79K16O1k01j5K73j43j53J35
$$ -35 -140 73 45 -122 -40 142 19 -149 27 79 -149 -99 87 5 -174 42 103 -98 -113 160 17 -136 -1
3218aO8j92M9K13q4j39Q5J22j30p7J92K1k43Q3J92j90p8J87L8k12O7J92j95o1
$$ -1 67 -125 -76 137 53 -86 -1 121 -9 -86 106 127 -116 -33 159 -31 -109 78 116 -96 -29 163 -32 -93
3242i3J42O5j91O2J44j62k1M9J20j74n2J77L0k27M4K33k67ML17j62k26K02J67
$$ -93 49 114 -77 -15 129 -33 -54 -5 115 -59 -111 66 96 -131 -87 146 -121 -117 200 38 -188 14 181
3265A81k99J4K22n5j80Q0J40q1r4Q3R7k21LK86j42k25K26J77k97l6K66j21j99
$$ 181 -118 -104 118 63 -117 -37 103 22 -72 11 108 -113 -110 176 34 -191 35 212 -85 -121 145 24 -175
3288a75K34R5k21p7K00j2o9NP0m9j42J11J93k27j08L33q6l26L57R4l50M6L33k05
$$ -175 59 154 -67 -144 56 44 -25 -20 50 1 -141 -30 163 -64 -172 161 75 -251 106 200 -150 -104 229 24
3312B4k16K24P7k37J70J27j24j35L1K50j40j76J35K35m02N6L98k45l74L94R6m55
$$ 24 -192 32 109 -128 42 169 45 -90 -59 191 51 -125 10 245 -157 -101 297 52 -322 72 168 -287
3334b87J74M10l21j42K68j9j51j3J47J9j88RK62j53k40K68J57m08R8L32k12k52
$$ -287 -113 297 -24 -166 102 83 -68 -81 66 85 -103 -94 168 15 -225 43 200 -208 -110 222 10 -242
3356b42M20j6l64K84P8j84m0J13K6oj32R8J30k39p7L64j73l70M96R5m76Q0M66
$$ -242 178 162 -202 82 160 -24 -64 49 75 69 -63 35 165 -74 -151 213 40 -330 166 261 -215 -135 331
3379C31m22q1M30j95k66J91Q9q1n3L2M3J4m2L5J90l65k7L79j56k96M38l7m08K86
$$ 331 -91 -172 258 63 -203 -12 77 -4 -57 -25 18 32 -10 25 215 -150 -177 202 46 -250 188 151 -257 29
3403B9K57m32k9L80k61m5K32j19l9J5oJ20p0j89J18K13l52J09L56l34j85M28r7
$$ 29 286 -146 -175 205 -56 -101 131 12 -27 -12 -18 102 32 -157 -39 174 -178 -69 287 -47 -232 196 99
3426I9l51L28J28l85J07K32j94k0J20p9L6k4q4J72k7k69L35L6m33J99L30l40n0
$$ 99 -252 76 204 -181 -74 158 -36 -56 64 -15 21 -3 -87 85 58 -211 124 160 -273 -74 256 -84 -134
3449a34M02l14j30L44o4l08L02%r1j7R1j07P6o8k1J84j70j23K90k8l36L30J11
$$ -134 268 -46 -176 168 104 -204 98 98 7 -10 81 -26 50 -18 -39 145 -25 -148 142 114 -222 108 219
3472B19m32J63L50m08p8L47j13j67J87j1k35J57K1L0N9k14Q3J26j18p4K44k35
$$ 219 -213 -50 300 -108 -186 161 48 -119 68 57 -178 -21 0 30 89 -125 -42 84 -34 -108 136 -99
3494i9j50M53qm73J86K67l51J10L01k12j80J90PK2j01l5J73j03j51K62N7m10J46
$$ -99 -249 204 196 -277 -91 176 -175 -65 236 24 -156 34 41 63 -38 -73 100 -3 -154 108 165 -245 -99
3517i9L51k97j27M06k23k46L26J69m09K5K76j67n1K5P8l8j16J05J51j69j52K93
$$ -99 252 -45 -172 234 11 -235 91 260 -149 -124 152 -15 -66 -41 37 -1 -117 -12 139 -30 -182 111
3539A11Jl32K57J59m01L1M21j66k56K96K7k75P6K20j03j69J7J58M2k28J09R8j54
$$ 111 112 -220 37 196 -205 -174 247 81 -175 121 148 -127 -51 169 66 -103 -86 72 114 -114 -5 93 -61
3562f1j48M45j27l57L43R8l29L6L20k12k19L03N0k38rJ61k8q2K4J95j33k58K92
$$ -61 -209 236 109 -248 95 193 -136 -100 220 8 -211 92 142 -96 -105 56 28 -54 -30 165 32 -226 66
3585F6J18l43J2L73k14k31L48O2l61L4L14j24j88J63M8j32k1J44J4k41J46J84
$$ 66 184 -159 -147 226 12 -219 129 191 -170 -136 178 54 -134 29 77 -55 -76 68 82 -159 -13 171
3607A71j40k15L15ok99Q7L24k88o3K52k7k36L6J88j38q9J73O8k07m5K39n2j84
$$ 171 31 -184 131 125 -174 -87 237 -51 -114 138 111 -125 -89 99 -39 -128 45 113 -94 -139 100 48 -136
3630a36Q5J85j48j51K78j0k45Q8K38k61q1L04l2j72L3J71j44r3J22N2j51m1K44
$$ -136 -51 134 -14 -165 113 103 -142 -54 184 -77 -158 146 114 -58 -25 146 2 -91 31 83 -68 -109 135
3653A35r0j99J76J70k54n2K20j1k06J36J66k26j08K45r1j28O7J57j68p7J27J03
$$ 135 45 -154 22 192 -62 -114 106 95 -111 25 191 -35 -143 102 11 -117 -50 107 -61 -138 -11 92
3675I2j84K7J39m9j62J08J46k02l6K46r2j59J13J52k47J4K14j33j15J27J02j32
$$ 92 -92 -65 74 25 -137 -29 117 -85 -121 125 33 -126 -13 139 -108 -94 120 -13 -128 -1 101 -31
3697c1n2J25O0j62J9J71n0j91K22M4k45N3K26j75j18J75Oj31k2J24r3q6R2J63
$$ -31 -83 42 102 -60 -41 130 80 -111 111 155 -90 -37 189 14 -104 71 77 -54 -76 48 -45 -131 -39 124
3721A24j80m2J75l5j57J12J58k36jK25m4k15R1J71j99o2J94J5k11J33J09j59m4
$$ 124 -56 -98 77 42 -115 -3 155 -81 -82 143 99 -116 -25 146 -53 -115 79 94 -117 16 125 -34 -78
3744g8J19Q8j52n8J92n4j84J96J04k71K3K65j13k04J41J78k53j07K38Rj84Q0J74
$$ -78 41 129 -23 -81 111 57 -127 69 173 -98 -75 190 77 -127 14 192 -61 -168 70 79 -105 -25 149
3767A49j96q4J83J24l09M9K48j15k10J61J94k65j03L37j46j52K17K8j82j6J76
$$ 149 -47 -131 52 176 -133 -84 164 49 -161 0 194 -71 -174 163 17 -135 82 110 -72 -88 88
3788H8jj73P6J02q5j87K54O5k74LL52j82j62K11O7l10O3K38j38j56J59J15j97
$$ 88 87 -86 -10 92 7 -180 74 139 -135 -132 220 38 -124 87 154 -156 -93 145 7 -149 10 125 -72
3811g2l0J84n5j75O7K06j38j49K75Kk84P3K83j41k60K91J8j96P0J76j36j43J57
$$ -72 -102 82 27 -148 -81 125 -13 -162 113 115 -169 -96 187 46 -214 77 95 -101 -31 145 9 -134 23
3834B3J02r1j54J49Q2k49J16K33k14k02K85J21l24P2K48k56n6K23l2j75JJ57m
$$ 23 125 34 -120 29 111 -138 -22 211 -3 -205 80 201 -123 -51 197 -59 -115 108 76 -99 -98 59 55
3857E5j50J16Q9j27r5K37j4l14J75J97k24o3K29ol63K67J80k51k5K13j23j22J41
$$ 55 -95 21 110 -17 -112 125 111 -203 -28 169 -55 -118 111 105 -258 9 189 -62 -87 126 3 -119 22
3880B2N1l7j97J68J62j71j21K25M1k88J39K05k82m3K59j03j70J97R7k93R6P6k1
$$ 22 73 36 -161 7 169 -2 -123 102 143 -145 -6 199 -83 -126 133 30 -140 57 154 -139 -43 33 12
3903A2m7L6O3j2j14L6J37k19NK51j03k61K14J23k86Q4K94k78p7K51m0j22K8M6
$$ 12 -35 1 64 52 -62 -26 111 -108 -103 148 45 -216 -2 121 -165 -81 213 -65 -142 109 69 -53 -25 21
3927B1n1Oj3J6J8p8J60R0k56n4K95j43j58K67Pl19K03J97k89L5J27j08q4J24Q
$$ 21 -30 -24 -37 -21 -3 -81 79 169 -87 -141 154 11 -147 120 127 -192 11 208 -81 -46 81 -27 -111 13 21
3952B1l5m9KJ33m3j77J43J16k48P2L02l21j24L63p4k95K98L5k64N4K47r4j26L5
$$ 21 -14 -63 -61 72 29 -148 -5 111 -137 -65 237 -84 -208 155 81 -214 84 119 -145 -91 156 62 -64 -29
3976b9M6Mk5J0J48k21j03L06P0l93J45K33l03Q8L15k87k28K76R1j97Q1R4j71k3
$$ -29 17 21 -4 6 154 -67 -170 136 206 -187 -42 191 -112 -24 291 4 -224 52 143 -54 27 121 -50 -73
4000g3J08R5r5k38J36J89j38j00K36p3l10L40J31l83K1L04j83j05K34l4k08J25
$$ -73 35 130 35 -203 -67 122 -16 -116 120 47 -263 77 208 -175 -154 150 -33 -138 96 62 -146 -21
4022b1KQ8r4q5J55k1j68K24P5k87l2M05j76k76L01N7l70J54K83k76j53K47O7j89
$$ -21 -19 69 -25 -110 45 24 -144 80 155 -132 -164 241 65 -211 90 147 -223 -69 214 -62 -215 32 99 -90
4046i0jP0M5j13m3K32j03k42K77J79l87Q0K56k16j69L37m0k35J03K36j96j28J66
$$ -90 -91 -21 24 -89 -132 100 -3 -245 32 211 -176 -96 160 -56 -225 112 72 -163 -60 176 -20 -148 18
4069A8kk0k8J16k1j42LK18j28j74K69J2k97J34K67k59r3K27mk54J61J35j88m5
$$ 18 16 -4 -32 84 63 -79 -76 142 14 -160 109 121 -176 -42 225 -34 -127 100 96 -158 3 138 -50 -95
4093i5J19P6j39o5J14N1k35O5K63j93o4K05Q5l84J61J98k19k3J51Jk01P6J96j32
$$ -95 24 100 -39 -104 10 61 -174 -109 154 -39 -103 102 187 -197 -36 162 -57 -80 71 72 -129 -53 143 11
4117A1m3%J30j53L1J20jj47K2K25k20n5K20j14j74J73R3j50l7J83n6j82J49N6
$$ 11 -32 -32 98 -55 -24 96 95 -52 -30 195 -25 -80 140 26 -148 25 118 -32 -69 114 58 -124 25 81
4141H1n5q9R2P5j91Q6R0m6j73J10R0j22JK11j47j38J66nj40L3K00j75m0J37M9
$$ 81 26 -63 29 104 -87 -1 89 43 -130 -20 70 -52 -51 160 13 -125 41 36 -104 -71 129 -46 -86 51 100
4166A00j44m5J35J4j81N2K10r5j31J96m3j98J45N3r1q4K23m3j98J11J03p5j10
$$ 100 -44 -89 46 60 -121 -69 141 46 -85 111 68 -130 15 68 -23 -107 116 73 -125 -14 89 14 -96
4189i6J56jj17o4J72j5j49J10J15j59K0J31p9j42P6J28j30j02K22j8j37N1J26
$$ -96 60 59 -58 -122 50 35 -114 -4 111 -48 -28 103 24 -118 -42 86 -44 -146 76 58 -79 -28 98
4212I8m8j72J61L9j63M6J36l7j88J47J39k30M1J23%k30J84J03k60oJ37Q1k42O6
$$ 98 50 -122 39 78 -85 -39 97 60 -128 19 158 -72 -31 92 92 -138 46 149 -111 -117 20 101 -141 -75
4236g5J97j00j86J92L1j03o3K34j10j97J99Q6k30k5K62m7k01J78R1k17RJ65L4
$$ -75 122 22 -164 28 59 -44 -107 127 17 -180 19 105 -125 -150 112 65 -136 42 133 -84 -75 90 124
4259A24k53R4J95j70j00J46O0j69J3K03j64r0J65J4j24k6J82l3j64J11O5j77l6
$$ 124 -129 -35 160 -10 -110 36 96 -73 -60 143 -21 -111 54 68 -56 -82 100 67 -97 14 79 -98 -134
4282a34J93k9j16O0J38k21K4J42P7k12PJ52j09j11K14L4k42J6K45r7j11J08J00
$$ -134 59 30 -86 -26 112 -109 -85 57 134 -78 -71 81 -28 -139 75 109 -133 -117 128 31 -80 28 128
4305A28j95k9J72Nj76R5J68j34j45K11k3j56N1J17m7j65J41J08k00N3J47r5j39
$$ 128 -67 -96 76 81 -95 0 168 34 -111 100 77 -79 -28 89 42 -123 18 126 -74 -21 126 31 -108
4328a08J30R0j99oJ39K0k31J57R2j51l1J92q8r3Q0R4j18q1J98Pj92P0J20p7j25
$$ -108 22 112 -87 -93 46 66 -165 -8 84 -67 -98 94 6 -87 -7 87 -31 -112 86 93 -99 -29 91 14 -111
4353a11J75J11k64N5J55q6j21J42M0j03o0J20Nj25J09P2j24o9J35J0j92J14J26
$$ -111 64 175 -89 -34 121 35 -86 56 96 -7 -67 53 58 -67 42 114 -10 -79 56 66 -126 -12 114
4376A14j33q6J16K0j55J17J02j03j10J30L2j11M5J79j62j15J07O3q1J7J34j00
$$ 114 -19 -105 11 31 -124 -7 95 -8 -118 12 44 -67 -22 157 -5 -120 -13 50 -31 -14 120 20
4398B0q9P9J07j50n3J56L1k14J09R7j85OK28n8j97R6J43j60j4J22K0k13N3J37
$$ 20 -69 10 117 -33 -86 70 101 -113 -4 93 -92 -86 142 84 -113 -17 126 -34 -48 74 94 -119 -66 71
4422G1n3r3P2O2j05m3K17j18j28R9J74k50lJ67n7j61K15J24k56QJ34M1j40k8Q4
$$ 71 18 -75 -3 59 -46 -89 128 10 -118 -19 155 -95 -98 69 12 -149 66 190 -66 -58 76 117 -23 -51 33
4447C3n9j09K13N3k09k3K38q1j44J62J2j98K0K54j54j57R8J28j51jJ49m4j35m4
$$ 33 -26 -135 78 131 -78 -101 137 56 -88 74 86 -112 -92 162 8 -149 -51 77 -74 -75 74 30 -105 -149
4471a49K90j68q4J66l8j07K7K08j13k07J66R6j52M7J26j05o4J08J89l05n4J99
$$ -149 141 -27 -111 55 17 -90 -63 145 32 -175 -9 87 -65 -18 108 3 -61 47 236 -69 -123 76
4493G6l6r6L8J54j28j71K26N2k34O7K00j73n7J38n7j04L2J75j12o2J13O6j47q1
$$ 76 40 -56 -18 136 8 -163 63 115 -119 -52 148 -25 -82 56 -1 -105 -73 102 -10 -72 41 107 -40 -121
4517a21J70k8j46P3K05k12m1J39P9k24O2J45j22r5K14k9j77K6J48l8j45J01J00
$$ -121 49 21 -125 -52 153 -59 -100 39 118 -106 -44 101 -21 -116 98 69 -108 -82 66 28 -117 -16 84
4540H4j69J6J84j08j35J40J49k25k4J86qj94J15J50k09n1J35K4j39N1J26j48n7
$$ 84 -85 -69 115 7 -128 12 161 -64 -88 98 90 -104 11 161 -48 -99 36 60 -79 -28 98 -50 -107
4563a07J80P6j82n4J63l4j64J03J55k08n2J75k9j50N2J24j23J5J83m8k26J38J32
$$ -107 73 149 -33 -87 76 42 -122 -19 136 -72 -124 51 22 -128 -76 48 -75 -60 123 75 -151 -13 119
4586A19r7o7R4lj09L7P2l7n6P9L9r0PJ12o9j57J55O5j24n9J35o8q1J35Jo1%J33
$$ 119 22 -45 49 46 -63 -26 46 9 -47 32 71 -19 -12 100 31 -126 29 94 -30 -89 46 -22 -103 32 33 -28 -28 105
4614A05p1j05N3P5q4p9J97j5j63L4J66q1r7P4K5n5k9J76j07j40J21Q0j39J0J13
$$ 105 34 -71 -18 57 -27 -106 91 76 -87 -53 113 32 -65 9 34 -21 -50 126 19 -121 0 80 -59 -49 64
4639F4r2oK9N4o4l3R8Rq1K4J24j25j26K39j1j69l9J73k2j25P7P9j55J0J34n6j31
$$ 64 -28 -34 -5 49 -15 -48 50 59 -22 2 126 1 -125 114 103 -66 -105 68 46 -79 -2 77 -78 -68 66 10 -121
4666a21J37Q0j00p4J47Qk27J44J14j66J8P9L2j36O2Q8j90nK05Jk48J18J21j04
$$ -121 16 96 -4 -78 69 77 -150 -6 108 -58 -40 39 71 -65 -3 85 -105 -110 95 96 -152 -34 87 -17
4690a7j2O1rp1k1J23rj30P0J18j42j34K61l1j65L6J60j37n1K10j05j33J24M2o8
$$ -17 -29 32 23 -48 -69 54 45 -85 -15 103 -39 -173 88 57 -108 -72 88 -49 -100 110 5 -128 -4 38 -30
4715c0l0O3N1q4n5J23j6r4Q0J37k02J5J48o7j28J46N8j78%J16J9j40R1N4j16k8
$$ -30 -60 3 54 -30 -85 38 22 -72 8 145 -57 -42 106 39 -89 57 115 -63 -63 53 72 -68 23 77 -39 -67
4741f7Q9O7j46n0J95j3k38J82M1k00K8K39j10j43J36J4q4n6J74lj40M8R8j07r8
$$ -67 22 89 -57 -107 88 75 -163 19 60 -140 -112 127 17 -126 10 24 -60 -116 58 55 -85 -37 61 -46 -144
4766a44J72N8j87J1J91q7j43K13M6k64O8J07m5p9J23N2r0n8J33n9j20Q1J54j36
$$ -144 28 86 -101 -90 101 14 -129 84 130 -134 -66 41 -4 -83 40 92 2 -56 77 18 -102 -21 133 -3
4790cn0J11l4j52J43O4j23q3J84K7j93N6J70j36j12J93j7o3MQ7q6m0L3J08j37
$$ -3 -53 58 24 -128 15 79 -44 -127 57 84 -109 -53 117 -19 -131 62 45 -18 -14 73 -13 -53 -20 88 -49
4815d9jJ48pj85O7P8q2m3J24K2j30M1J28j30q2J79Oj32o2J74r6kO0K3j25J5J18
$$ -49 -50 98 91 -94 -27 51 -31 -74 50 72 -58 -17 111 -19 -101 78 84 -48 -110 64 -32 -34 26 49 -76 -61 57
4842E7r5l1Q2O7j23k7K11q5j38J20K9r2l1N2j3%j1R7o4r0J22rp2K3R3n1j52K05
$$ 57 -38 -69 13 80 -43 -70 141 56 -82 38 67 -25 -56 -4 -17 -17 -28 69 5 -85 37 28 -44 -21 72 21 -131 74
4870G4L0j62L4J25n1j38J12R7r9r5J15N9j98J23P9j38o9J97l4j39M2P0m3p7J45
$$ 74 104 -58 -24 101 50 -88 24 121 22 -73 42 101 -97 26 105 -33 -102 95 61 -78 -36 34 -9 -86 59
4895E9k1q0K0K7j1o5J11Pj04N7P7q8qM4K7l1q9Q5Nr4J6J57r7o5J13L6j75P1J49
$$ 59 38 -42 -22 5 -6 -71 40 47 -57 0 77 -11 -19 25 52 21 -68 17 22 -72 -56 101 4 -61 52 88 -87 -16 133
4924A33j53l0R0no1K6P8o9r1O7O3o9o1J36l7j44Q5J19j02p6J62p3r3J28M8j40
$$ 133 -20 -50 40 35 -26 0 78 9 -82 -15 48 -21 -82 54 17 -127 -42 77 -25 -101 61 -12 -105 23 71 -69
4950f9o6K15J4j69L7R4o2q1J05N1j13j5J82j13r3J76Kj48NJ18m6r3Q1O3q3k0O5
$$ -69 -135 80 94 -75 -38 56 -6 -87 18 69 -44 -59 123 10 -83 93 95 -53 -48 70 24 -69 12 75 -8 -28 37
4977C7L6j61j4J28K3j34R8O8j71J7J50k8j64J41N2j77N3J28l0j34L6J34n3r2N3
$$ 37 73 -88 -102 26 49 -85 13 81 -90 -73 77 49 -115 26 78 -99 -46 82 52 -82 -46 88 35 -57 -4
5002dR9j39k1J65n2j01Q6M7j03m0K10j14j27J61Nj10L1J12p1j24O5K17j56r0M6
$$ -4 95 -44 -65 100 48 -53 33 80 -23 -63 147 33 -94 67 72 -38 -7 105 34 -90 -25 192 36 -54 -8
5027hN6r2L0J05n4j65J91k2j47O1Q6j11J1J25Kj27qO3K4l4K9N2r0o3J36J8j29
$$ -8 48 -44 -14 91 37 -128 63 41 -106 -45 41 -70 -59 66 68 -59 -67 -4 20 -14 15 67 -23 -86 50 68 -61
5054f1M3R7j24m6K22j30j20J46J00j18q1J42q7rK0Q5l9j59R4J18k8o6J1l3m0J28
$$ -61 -18 79 -45 -91 131 1 -119 27 127 9 -72 70 -17 -26 -6 79 40 -119 -25 93 65 -1 10 -23 -63 65
5080F5N9j65l5J64r1p3O7J2q7N5Q5J1j09K2J28j26j5M7O0j50N4P0m2l9K0J02j71
$$ 65 124 -41 -76 88 -3 -76 -9 3 -84 -29 56 67 -42 -20 108 -18 -33 14 74 -76 -22 48 6 -33 -13 89 -82
5107h2P2J13j06m1J04j0n0j4M8p6j3M7J21j39l2J18L4j78N5P6j38MJ74n0j17J2
$$ -82 -10 103 -3 -44 60 50 0 -14 34 -42 -55 -8 113 -26 -58 60 94 -84 -29 47 -91 -87 87 37 -80 -68
5133f8J50j29OO1O9j44j5J74o7j14RJ17j16J7J32p0j13J16M0r3j2J38q5m9L2M8
$$ -68 82 -47 -41 20 89 -55 -70 104 37 -77 -68 49 -67 -50 82 12 -101 15 55 -38 -50 88 3 -46 -14 34
5159C4l8k8K8Q1j19r4J54J2j16J17P1j10m4J38o5j01J17Nq6p4K00k3j51P9K7l5
$$ 34 -4 -32 -4 77 -42 -136 18 30 -86 31 102 -8 -52 86 21 -80 37 42 -44 -118 82 59 -92 -13 14 -21
5185b1k3M4L9q7L0R3k4j31P3R1j50lJ52r3m6J43L2j63J8M4mk3kN9k0o7N5J18j72
$$ -21 -44 0 39 -48 -18 75 51 -80 -7 84 -66 -69 83 -10 -56 87 119 -44 -26 18 14 -9 -11 48 28 -39 16 134 -38
5214c8k6J41o3r7J47L6k03J5J74j15m9Q4K4j09P5J9J2o4n4J21J0j43J44Mj45O9
$$ -38 -64 77 14 -83 64 100 -103 -88 86 -29 -78 6 30 -79 -4 15 27 -37 -91 30 40 -103 41 45 -100 -31
5240c1R5j03l3J15Rq9j5J48j38k7J04J9r1rQ5mk3m2R3q5n2P4N1j28R4P0j48n5
$$ -31 64 -39 -72 43 52 -37 -52 96 -42 -69 35 54 -37 -46 39 35 12 -30 63 -22 -74 0 51 -77 17 87 -61 -116
5268a16J97k5j30Q7K8n0JL3l2j6k2N9k2q1N9J02o4q4J58m3q9Q4N7o4m2J52j10
$$ -116 81 56 -74 13 41 -9 -8 25 -7 -23 -45 14 -8 -89 -30 72 8 -76 82 39 -50 34 91 27 -15 137 27
5295B7q5O3P7p1k8O2l4k7j4Q7n2j34R7R1n2qk6M1p7R5j9r5P8M1l0r0J10pm4l1
$$ 27 -58 5 82 11 -17 45 11 -16 -30 57 5 -129 -32 59 7 -1 -27 14 -63 32 13 -82 -4 37 7 -83 27 20 -24 -55
5325e5J06k1m7k0L7rq2J13L2r7KJ24m6j04M5J43j41L5R9r3o8P2P0j42K3K1L6j22
$$ -55 51 30 -17 -37 0 -9 -91 22 54 -43 -41 83 37 -67 -22 121 -20 15 114 21 -47 25 95 -47 -24 -3 33 -89
5353h9Q5L0k9k0M6L6j04J4J26r3n0O5J7q1L6M7Kq0P8N1j51M3O1l9o0M5O9p5k4
$$ -89 -4 26 -3 -23 23 59 -45 -31 95 2 -48 17 34 -47 -11 36 38 -42 36 87 -64 -21 40 1 -59 -14 55 -20 -44
5382d4Q0nq8M3J21j46RQ0rq4Q9N3p5n2O5L0j57Q0Q4p3j31J73O1j44j1J09k0q5
$$ -44 36 31 -57 -14 107 -39 -30 50 41 -43 46 99 24 -28 37 67 -90 -10 74 1 -130 43 104 -40 -51 58 38 -47
5410d7O7P0j74K6J25q8k8N6K7m7kQ6j3p5K1J04q8j12M6J41q4lQ1q4m2N5M6n2k4
$$ -47 20 90 -84 -58 67 -21 -49 7 34 -13 -15 71 58 -17 4 108 20 -92 -46 95 11 8 89 5 -37 18 64 12 -12
5439a2L6Qr7O4J02j44O7L6n7r7OJ81j10m7R9Q6j87oJ33l1j06Q2N3o8nN7k4n9K2
$$ -12 24 32 -65 -1 101 -43 24 60 3 -94 -88 93 -17 -64 35 121 -66 -72 61 30 -76 6 59 -9 -14 43 19 -40 -18
5468a8P5q2l9J61k5j46J08K9oj45R6k9l4K0Q9p0M9J5Qj08%Q9mm6k1R5n8q0J18
$$ -18 57 -25 -64 97 72 -74 34 63 57 -88 8 -21 -55 -35 54 -16 33 48 56 -52 -52 37 33 -13 -34 61 3 -77 41
5497D1k2q5N0O4n4q7J61k4l4N5k3o7k4L9M4r1M0N0J1r3K6R7l1j13J20J0j22M7
$$ 41 19 -66 -16 48 -6 -93 68 44 10 65 42 -25 -49 -10 34 -57 -17 33 44 -49 -23 74 43 -70 50 60 -62 -15
5525a5O0l5J7K3K4j02QO8k0o9M5L0q3J0N3J0p3Q1J3p4j9J13o4p2N0R6j21J0R0
$$ -15 45 10 27 50 74 -28 -20 48 28 -41 4 34 -49 -39 14 24 -49 32 45 -29 -48 65 1 -71 -21 75 -46 -36 54
5554E4j3q8O5M7p4L5m6K5n1j3R0k3p0O9O2j10N6J0l3l0P5N6j36mN8J5p9Q9Om8
$$ 54 41 -47 18 65 -9 26 -20 5 -46 -59 31 8 -62 7 69 -41 15 25 -8 -38 37 93 -43 -47 11 26 -53 36 42 -6
5584fK0j0j1p4R8M1r6l1R4M1j47L2P7l4p8J06J6j57N6J61j50k4P8L7n2k0J13m4
$$ -6 14 4 -7 -81 17 58 -38 -69 25 66 -81 -49 28 -6 -84 22 38 -119 -63 98 -52 -76 2 39 -13 -33 80 36
5612C6r8L7R1j13L0R5l0j26P4J9m2P1l6L5p3L7M9j4q9O2N9m9pM2l6r8P3K6j5m2
$$ 36 -62 -25 66 -47 -17 78 48 -78 -4 15 -27 44 8 43 -30 7 56 42 -47 15 74 25 18 60 24 -74 -1 25 10 -32
5642c2M7k5l9O1m5j2lO4K1m7j3O0m9n1J23Mj60N7Q9m4n2Q7j9q4O1J31o7j09R9
$$ -32 15 -10 -49 12 -33 -45 -48 16 37 -10 -23 37 -12 -63 60 64 -96 -39 50 6 -46 41 22 -62 -1 130 63 -46 53
5671E3M4q0m2n1J04j10J07O7j10RM0L7j16L4N7m7o7R7M4r9J15o1k0j8J7J03j19
$$ 53 97 17 -25 -76 28 -82 25 92 -18 -9 31 68 -48 -14 43 -4 -71 26 70 -29 86 25 5 -13 4 107 -12
$$ [...]
8191A0
##END NTUPLES=NMR FID
##END=
