##TITLE=1H_1B1g-3
 CDCl3
 8 sc, 
 30.10.2024
##JCAMPDX= 6.0         $$ Bruker NMR JCAMP-DX V2.0
##DATA TYPE= NMR FID
##DATA CLASS= NTUPLES
##ORIGIN= UXNMR, Bruker Analytische Messtechnik GmbH
##OWNER= root
$$ XWIN-NMR		Version 3.5
$$ Wed Oct 30 14:19:16 2024 Russian Standard Time (UT+4h)  she@DPX200
##.OBSERVE FREQUENCY= 200.1318
##.OBSERVE NUCLEUS= ^1H
##.DELAY= (6, 6)
##.ACQUISITION MODE= SIMULTANEOUS
##.ACQUISITION SCHEME= undefined
##.AVERAGES= 8
##.DIGITISER RES= 18
##SPECTROMETER/DATA SYSTEM= spect
##.PULSE SEQUENCE= zg30
##.SOLVENT NAME= DMSO
##.SHIFT REFERENCE= (INTERNAL, DMSO, 0, 15.7039)
##AUDIT TRAIL= $$ (NUMBER, WHEN, WHO, WHERE, WHAT)
$$ ##TITLE= Audit trail, XWIN-NMR		Version 3.5
$$ ##JCAMPDX= 5.01
$$ ##ORIGIN= Bruker BioSpin GmbH
$$ ##OWNER= she
$$ F:/spectra/data/she/nmr/H-F/1/audita.txt
$$ ##AUDIT TRAIL=  $$ (NUMBER, WHEN, WHO, WHERE, WHAT)
(   1,<2024-10-30 14:17:31.53 +0400>,<she>,<DPX200>,
      <created by zg, POWCHK disabled, PULCHK disabled
       configuration hash MD5:
       00 E9 B6 7A A2 85 ED C7 34 08 36 98 17 FE 4E 26
       data hash MD5: 16K
       99 0C C5 60 94 B9 8C AA D7 C8 87 A9 D3 8E 44 5A>)
$$ ##END=
$$ 
$$ hash MD5
$$ 31 E4 EE C7 FC 4E 23 A8 78 6D F1 3A 75 75 79 46
##$RELAX= 
##$RELAX= 
##$RELAX= 
##$RELAX= 
##$RELAX= 
##$RELAX= 
$$ Bruker specific parameters
$$ --------------------------
##$DU= <F:/spectra>
##$EXPNO= 1
##$NAME= <H-F>
##$PROCNO= 1
##$TYPE= <nmr>
##$USER= <she>
##$AMP= (0..31)
100 100 100 100 100 100 100 100 100 100 100 100 100 100 100 100 100 100 
100 100 100 100 100 100 100 100 100 100 100 100 100 100 
##$AQSEQ= 0
##$AQ_mod= 1
##$AUNM= <au_zg>
##$AUTOPOS= <>
##$BF1= 200.13
##$BF2= 200.13
##$BF3= 200.13
##$BF4= 200.13
##$BF5= 200.13
##$BF6= 200.13
##$BF7= 200.13
##$BF8= 200.13
##$BYTORDA= 1
##$CFDGTYP= 0
##$CFRGTYP= 5
##$CHEMSTR= <none>
##$CNST= (0..31)
1 1 145 1 1 1 1 1 1 1 1 1 1 1 1 1 1 1 1 1 1 1 1 1 1 1 1 1 1 1 1 1 
##$CPDPRG= <>
##$CPDPRG1= <>
##$CPDPRG2= <>
##$CPDPRG3= <>
##$CPDPRG4= <mlev>
##$CPDPRG5= <mlev>
##$CPDPRG6= <mlev>
##$CPDPRG7= <mlev>
##$CPDPRG8= <mlev>
##$CPDPRGB= <>
##$CPDPRGT= <>
##$D= (0..31)
0 1.2 0 0 0 0 0 0 0 0.06 0 0.03 0 0 0 0 0.0002 0 0 0 0 0 0 0 0 0 0 0 0 
0 0 0 
##$DATE= 1730283451
##$DBL= (0..7)
120 120 120 120 120 120 120 120 
##$DBP= (0..7)
150 150 150 150 150 150 150 150 
##$DBP07= 0
##$DBPNAM0= <>
##$DBPNAM1= <>
##$DBPNAM2= <>
##$DBPNAM3= <>
##$DBPNAM4= <>
##$DBPNAM5= <>
##$DBPNAM6= <>
##$DBPNAM7= <>
##$DBPOAL= (0..7)
0.5 0.5 0.5 0.5 0.5 0.5 0.5 0.5 
##$DBPOFFS= (0..7)
0 0 0 0 0 0 0 0 
##$DE= 6
##$DECBNUC= <off>
##$DECIM= 24
##$DECNUC= <off>
##$DECSTAT= 4
##$DIGMOD= 1
##$DIGTYP= 9
##$DL= (0..7)
0 120 120 120 120 120 120 120 
##$DP= (0..7)
150 150 150 150 150 150 150 150 
##$DP07= 0
##$DPNAME0= <>
##$DPNAME1= <>
##$DPNAME2= <>
##$DPNAME3= <>
##$DPNAME4= <>
##$DPNAME5= <>
##$DPNAME6= <>
##$DPNAME7= <>
##$DPOAL= (0..7)
0.5 0.5 0.5 0.5 0.5 0.5 0.5 0.5 
##$DPOFFS= (0..7)
0 0 0 0 0 0 0 0 
##$DQDMODE= 0
##$DR= 18
##$DS= 0
##$DSLIST= <SSSSSSSSSSSSSSS>
$$ [...]
##$SUBNAM2= <"">
##$SUBNAM3= <"">
##$SUBNAM4= <"">
##$SUBNAM5= <"">
##$SUBNAM6= <"">
##$SUBNAM7= <"">
##$SUBNAM8= <"">
##$SUBNAM9= <"">
##$SW= 24.0689170037331
##$SWIBOX= (0..15)
0 0 2 0 0 0 0 0 0 0 0 0 0 0 0 0 
##$SW_h= 4816.95568400771
##$TD= 16384
##$TD0= 1
##$TE= 0
##$TE2= 300
##$TE3= 300
##$TEG= 300
##$TL= (0..7)
0 120 120 120 120 120 120 120 
##$TP= (0..7)
150 150 150 150 150 150 150 150 
##$TP07= 0
##$TPNAME0= <>
##$TPNAME1= <>
##$TPNAME2= <>
##$TPNAME3= <>
##$TPNAME4= <>
##$TPNAME5= <>
##$TPNAME6= <>
##$TPNAME7= <>
##$TPOAL= (0..7)
0.5 0.5 0.5 0.5 0.5 0.5 0.5 0.5 
##$TPOFFS= (0..7)
0 0 0 0 0 0 0 0 
##$TUNHIN= 0
##$TUNHOUT= 0
##$TUNXOUT= 0
##$USERA1= <user>
##$USERA2= <user>
##$USERA3= <user>
##$USERA4= <user>
##$USERA5= <user>
##$V9= 5
##$VALIST= <valist>
##$VCLIST= <CCCCCCCCCCCCCCC>
##$VD= 0
##$VDLIST= <DDDDDDDDDDDDDDD>
##$VPLIST= <PPPPPPPPPPPPPPP>
##$VTLIST= <TTTTTTTTTTTTTTT>
##$WBST= 1024
##$WBSW= 4
##$XGAIN= (0..3)
0 0 0 0 
##$XL= 0
##$YL= 0
##$YMAX_a= 44432
##$YMIN_a= -48905
##$ZGOPTNS= <>
##$ZL1= 120
##$ZL2= 120
##$ZL3= 120
##$ZL4= 120
##$ABSF1= 10
##$ABSF2= 0
##$ABSG= 5
##$ABSL= 3
##$ALPHA= 0
##$AQORDER= 0
##$ASSFAC= 0
##$ASSFACI= 0
##$ASSFACX= 0
##$ASSWID= 0
##$AUNMP= <proc_1d>
##$AZFE= 0.1
##$AZFW= 0.1
##$BCFW= 1
##$BC_mod= 2
##$BYTORDP= 1
##$COROFFS= 0
##$CY= 11.3945322036743
##$DATMOD= 1
##$DC= 2
##$DFILT= <>
##$DTYPP= 0
##$F1P= 15.6554695791079
##$F2P= 12.8336369535428
##$FCOR= 0.5
##$FTSIZE= 0
##$FT_mod= 4
##$GAMMA= 1
##$GB= 0.15
##$INTBC= 1
##$INTSCL= 1
##$ISEN= 128
##$LB= 0.24
##$LEV0= 0
##$LPBIN= 0
##$MAXI= 10000
##$MC2= 0
##$MEAN= 0
##$ME_mod= 0
##$MI= 1.114404
##$NCOEF= 0
##$NC_proc= 0
##$NLEV= 6
##$NOISF1= 3.799351
##$NOISF2= 2.8
##$NSP= 1
##$NTH_PI= 0
##$NZP= 0
##$OFFSET= 15.70392
##$PC= 1
##$PHC0= -26515.38
##$PHC1= 23.18743
##$PH_mod= 1
##$PKNL= yes
##$PPARMOD= 0
##$PSCAL= 0
##$PSIGN= 0
##$REVERSE= no
##$SF= 200.130013532006
##$SI= 16384
##$SIGF1= 3
##$SIGF2= 2
##$SINO= 400
##$SIOLD= 16384
##$SREGLST= <1H.CDCl3>
##$SSB= 0
##$STSI= 0
##$STSR= 0
##$SW_p= 3612.71676300578
##$SYMM= 0
##$S_DEV= 0
##$TDeff= 0
##$TDoff= 0
##$TI= <>
##$TILT= no
##$TM1= 0
##$TM2= 0
##$TOPLEV= 0
##$USERP1= <user>
##$USERP2= <user>
##$USERP3= <user>
##$USERP4= <user>
##$USERP5= <user>
##$WDW= 1
##$XDIM= 8192
##$YMAX_p= 0
##$YMIN_p= 0
$$ End of Bruker specific parameters
$$ ---------------------------------
##NTUPLES= NMR FID
##VAR_NAME=  TIME,          FID/REAL,        FID/IMAG
##SYMBOL=    X,             R,               I
##VAR_TYPE=  INDEPENDENT,   DEPENDENT,       DEPENDENT
##VAR_FORM=  AFFN,          ASDF,            ASDF
##VAR_DIM=   8192,          8192,            8192
##UNITS=     SECONDS,       ARBITRARY UNITS, ARBITRARY UNITS
##FACTOR=    0.0002076,     1,               1
##FIRST=     0,             0,               0
##LAST=      1.7004516,     0,               0
##MIN=       0,             -48905,          0
##MAX=       1.7004516,     44432,           0
$$ Real data points
##PAGE= N=1
##DATA TABLE= (X++(R..R)), XYDATA
0@%%%%%%%%%%%%Qj6J6j6J6j7K5l2L3m1M8n6O5p3Q8r7J06j22J38j57J79k00K24
$$ 0 0 0 0 0 0 0 0 0 0 0 0 0 8 -8 8 -8 8 -9 16 -16 17 -24 24 -32 33 -40 48 -49 57 -65 73 -84 95 -105 119
35A19k48K74l06L42l81M22m68N18n74O35p02P78q64R64j078J209j365J552j780
$$ 119 -129 145 -161 181 -200 222 -246 272 -302 333 -369 409 -455 509 -569 640 -725 827 -953
54i53K071k452K972l738M990p482K0462m6189O226O4340o1821M351O1196n3362
$$ -953 1118 -1334 1638 -2100 2890 -4592 15870 -30319 -24093 40247 -21574 -17223 43973 -9389
68i389l5846P8446j6685n2863N4427L860o3801N0317L2859p2483J2894N3359n2124
$$ -9389 -45235 33211 16526 -36337 18090 21950 -41851 8466 41325 -31158 -18264 35095 -17029
81a7029k314N9321m6039l4691O7804r666m9700M8967N563o1470M1261L6363o4383
$$ -17029 -19343 39978 -6061 -40752 27052 17386 -32314 16653 22216 -39254 2007 38370 -26013
94b6013J0050N0124n0344o509N9701l9118l4107O1848r808m8419M7515P266n8595
$$ -26013 -15963 34161 -16183 -22692 37009 -2109 -36216 25632 15824 -32595 14920 22186 -36409
107c6409L7045L4712n9478R812M7003m8093p363N7544l4401l3032N5937r291m6801
$$ -36409 636 35348 -24130 -14318 32685 -15408 -22771 34773 372 -32660 23277 13986 -32815
120c2815M5239J1216n6183L0668L5348n5603O203M8808m4091j3221N6648k8566
$$ -32815 12424 23640 -32543 -1875 33473 -22130 -15927 32881 -11210 -24431 32217 3651
132C651l6538N2920m427m8195M2165J6526n5835K4489L7236n1591L474M9023m0969
$$ 3651 -32887 20033 15606 -32589 9576 26102 -29733 -5244 31992 -19599 -16125 32898 -8071
145h071j7174N3393k3935l4939M9027k728m5836L7251J7297n0178K0252L4964
$$ -8071 -25245 28148 4213 -30726 18301 15573 -30263 6988 24285 -25893 -5641 29323
157B9323m5433P90M4843l5542j8381M8086j8192l3042M3000j27m3074L1865J9316
$$ 29323 -16110 -15320 29523 -6019 -24400 23686 5494 -27548 15452 15325 -27749 4116 23432
170B3432m5199J5845L3449m1760j745M3002l1353j9337M5476j5967l2427M0845
$$ 23432 -21767 -5922 27527 -14233 -15978 27024 -4329 -23666 21810 5843 -26584 14261
182A4261P54m1650L0720J9337m3955J4596L2151m0211k044M2190k9750j9565M3470
$$ 14261 15015 -26635 4085 23422 -20533 -5937 26214 -13997 -16041 26149 -3601 -23166 20304
195B0304j4178l1907L8834K695m0331K7671J9868m1692J1179L2179l6407m671
$$ 20304 6126 -25781 13053 15748 -24583 3088 22956 -18736 -7557 24622 -11785 -16456
207a6456M0665k5962k1405M1212j0310l1964L5694N109l9644K4184K1121l9364
$$ -16456 24209 -1753 -23158 18054 7744 -24220 11474 16583 -23061 1123 22244 -17120
219a7120Q567L1825l3329o584L8827k2684k1570L8455p771l0751L1978N949l6717
$$ -17120 -8553 23272 -10057 -16641 22186 -498 -22068 16387 8616 -22135 9843 15792 -20925
232b0925K0809K0344l5068O407K9145k9220p082L5103j8862k0262L4078n952k8607
$$ -20925 -116 20228 -14840 -8433 20712 -8508 -15590 19513 651 -19611 14467 8515 -20092
245b0092K8264O491l3681J8251J9562l2433N148K7969k6925p533L3646j7105k0512
$$ -20092 8172 14663 -19018 -767 18795 -13638 -8490 19479 -7446 -14979 18667 1562 -18950
258a8950L2388m656k8666K7079P617l3216J6918J9946l1444M182K8035k5500q419
$$ -18950 13438 8782 -19884 7195 14812 -18404 -1486 18460 -12984 -8802 19233 -6267 -14686
271a4686L2571j5757k0654L0952l413k8279K5233Q600l2092J5297K0235k9793
$$ -14686 17885 2128 -18526 12426 9013 -19266 5967 14567 -17525 -2228 18007 -11786
283a1786K862K7566k3506r784L1255j3664k1167K9330j556k8260K3055J0358l0863
$$ -11786 -8924 18642 -4864 -14648 16607 2943 -18224 11106 9550 -18710 4345 14703 -16160
296a6160J3160K0719k7877R13K6916k1294j0709K9242j1497k0628K6704k17k6474
$$ -16160 -3000 17719 -10158 -9245 17671 -3623 -14332 14910 3413 -17215 9489 9272 -17202
309a7202K0693J0411k8279J1595J9343k5762N15K4859j9387j0175K6821j0394
$$ -17202 3491 13902 -14377 -2782 16561 -9201 -8686 16173 -3214 -13389 13432 3038
321C038j9196K4813K97k4950J9164J0389k6826J0402J8771k4411k02K4084j8240
$$ 3038 -16158 8655 8952 -15998 3166 13555 -13271 -2869 15902 -8509 -8711 15373 -2867
334b867j0491K5947r287j9093K3909J046k4501J8089J0864k6312R389J8986k3835
$$ -2867 -13358 12589 3302 -15791 8118 9164 -15337 2752 13616 -12696 -3307 15679 -8156
347h156r49K4017j7441j0991K5645q310j9289K3069K200k4541J6697J1839k5717
$$ -8156 -9105 14912 -2529 -13520 12125 3815 -15474 7595 9795 -14746 1951 13790 -11927
360a1927P714J9420k2580k388K3853j5553j1871K4360o260j9273K0921L649k3527
$$ -11927 -4213 15207 -7373 -9761 14092 -1461 -13332 11028 4768 -14505 6416 10065 -13462
373a3462J4412J2337k4039N956J8923k0480l201K2558j3821j1557K2539n236j8307
$$ -13462 950 13287 -10752 -4796 14127 -6353 -9554 13004 -817 -12374 10165 4929 -13378
386a3378J9176L809k2202J2872J2122k2305M864J8257j8903l560K1494j2496j1617
$$ -13378 5798 9607 -12595 277 12399 -9906 -5042 13215 -5688 -9248 12246 -250 -11867
399a1867K1360m425j7890J7880M235k1270J1777J2047k1270M243J8103j8058l939
$$ -11867 9493 5068 -12822 5058 9293 -11977 -200 11847 -9423 -5180 12923 -5135 -9074
412i074K1132j1869j1829K0867m002j7942J7339M715k1284J1227J2773k1040L421
$$ -9074 12058 189 -11640 9227 5225 -12717 4622 9337 -11947 -720 12053 -8987 -5566
425e566J8611j7406m976K1154j0944j2707K0334k868j8242J6228N869k0792R895
$$ -5566 13045 -4361 -9337 11817 873 -11834 8500 5632 -12610 3618 9487 -11305 -1410
438a410J3320j9790K086J8408j6079n891K0394r754j2856J9077j891j7622J4997
$$ -1410 11910 -7880 -5794 12614 -3465 -9356 11038 1284 -11572 7505 5614 -12008 2989
451B989O134j9509Q714J3197j8513J167J7651j4619o374J9179q489j2710J7709
$$ 2989 9123 -10386 -1672 11525 -6988 -5821 11830 -2789 -9163 10016 1527 -11183 6526
464F526q97j6802J3561O617j8234P347J2863j7072L08J6773j3309o702J8247p553
$$ 6526 5629 -11173 2388 9005 -9229 -1882 10981 -6091 -5783 10990 -2319 -9021 9226 1673
478A673j2444J6855m35j6244J2803O791j7779O828J2776j6572l56J6779j2691
$$ 1673 -10771 6084 5649 -10595 2208 8999 -8780 -1952 10824 -5748 -6104 10675 -2016
491b016p338J8087o559j2989J6398O65j6596J2051P708j7625N506J3317j5681
$$ -2016 -9354 8733 2174 -10815 5583 6248 -10348 1703 9411 -8214 -2708 10609 -5072
504e072j604J6805j1510q159J7651n183j3340J5464J633j6505J0980Q141j7037
$$ -5072 -6676 10129 -1381 -9540 8111 2928 -10412 5052 6685 -9820 1160 9301 -7736
517g736M459J3405j4691k458J6560j0306q603J6948m091j3427J4388K337j5915
$$ -7736 -3277 10128 -4563 -7021 9539 -767 -9370 7578 3487 -9940 4448 6785 -9130
530i130R688Q368j6052L465J3109j3331k861J5592r042q621J5906l460j2960J3269
$$ -9130 558 8926 -7126 -3661 9448 -3883 -6744 8848 -194 -8815 7091 3631 -9329 3940
544C940K495j5087Q903Q156j5132L049J2685j2530l077J5142q382q667J5242k845
$$ 3940 6435 -8652 251 8407 -6725 -3676 9009 -3521 -6598 8544 162 -8505 6737 3892
558C892j3087J2626L181j5112Q237Q672j4856K429J3021j1963l745J5053p733
$$ 3892 -9195 3431 6612 -8500 -263 8409 -6447 -4018 9003 -2960 -6705 8348 615
571F15r161J4887k169j3358J2056L821j4958P624R004j4339J830J3178j1428m395
$$ 615 -8546 6341 4172 -9186 2870 6691 -8267 -643 8361 -5978 -4148 9030 -2398 -6793
585f793J4752o867r673J4225j225j3469J1125M736j4503O520R574j3571P14J3096
$$ -6793 7959 1092 -8581 5644 4419 -9050 2075 6811 -7692 -1172 8402 -5169 -4455 8641
599H641j0227n138J3805n549r839J3065k17j2978J0007N167j3709N590R431j2610
$$ 8641 -1586 -6724 7081 1532 -8307 4758 4541 -8437 1570 6737 -6972 -1382 8049 -4561
613d561L13J2339r481n237J3148n047r535J2358K16j2640R425N458j3219M907
$$ -4561 -4248 8091 -1390 -6627 6521 1474 -8061 4297 4513 -8127 1298 6756 -6463 -1556
627a556R476j2074k93J2114q714n684J2667m098r730J1758R06j2449Q618O019
$$ -1556 7920 -4154 -4447 7667 -1047 -6731 5936 1838 -7892 3866 4772 -7677 941 6960
641F960j2872M085R603j1670r09J2280q280o199J2711l522r949J1285J661j2609
$$ 6960 -5912 -1827 7776 -3894 -4803 7477 -803 -7002 5709 2187 -7762 3523 5184 -7425
655g425P945O721j2808L209R985j1116j707J2257p340o714J2147k434j0090J0391
$$ -7425 520 7241 -5567 -2358 7627 -3489 -5196 7061 -279 -6993 5154 2720 -7370 3021
669C021K472j2333O768P092j2070K262R943j0113k334J1869o454o851J1420j652
$$ 3021 5493 -6840 -72 7020 -5050 -2788 7155 -2958 -5292 6577 123 -6728 4692 3040
683C040r917R513K786j1782N979P140j1440J623R878r364k682J1555n891o928
$$ 3040 -6877 2636 5422 -6360 -381 6759 -4681 -3058 6820 -2544 -5226 6329 438 -6490
697f490J0900j216r648Q647K999j1245N249P288j0781J018R761q657l006J1284
$$ -6490 4410 3194 -6454 2193 5192 -6053 -804 6484 -4297 -3279 6482 -2175 -5181 6103
711F103n281p060J0313p62r587Q088L482j1185M676P671j0363K18J0190q065l822
$$ 6103 822 -6238 4075 3313 -6274 1814 5296 -5889 -1213 6458 -3905 -3687 6503 -1562 -5384
726e384J1262m523p803J0069M6j0001P473M194j0997L976Q188r862m78J0172p327
$$ -5384 5878 1355 -6448 3621 3667 -6334 1139 5333 -5664 -1688 6500 -3362 -3840 6332 -995
741i95m278J0750l864p885R390N43r641O645M570j0303L234Q160r126j063R867
$$ -995 -5273 5477 1613 -6272 3118 3661 -5980 665 5235 -5068 -1834 6326 -2800 -3863 6004
756F004o478m769J0129l027q054Q748J303r434N829M960r667K445Q164q403j770
$$ 6004 -474 -5243 4886 1859 -6195 2553 3856 -5578 251 5211 -4456 -2011 6153 -2250 -4020
771d020R600n798n033R721k545p968Q255J648r175N474M949r263K090Q071q058
$$ -4020 5580 -218 -5251 4470 1925 -6043 2212 3860 -5315 159 5108 -4155 -2065 6006 -2052
786b052k059R427n413n287R474k060p938P862K176r152M875N372q835J222Q221
$$ -2052 -4111 5316 -97 -5384 4090 2030 -5908 1954 4130 -5022 -147 5225 -3610 -2388 5833
801E833p384k869R222m379n894R087j103q309P395K835r138M248N800q701P11
$$ 5833 -1551 -4420 4802 423 -5471 3616 2513 -5796 1599 4434 -4704 -456 5344 -3357 -2646
816b646Q209o899l353R287l858o155Q691n29q206O844L161q818L464N918q097
$$ -2646 5563 -1336 -4689 4598 740 -5415 3276 2747 -5459 1385 4546 -4272 -808 5110 -2987
831b987Q5P989o084l530Q599l049o005P899Jp903O005L421q409K849N796p331
$$ -2987 -2902 5087 -997 -4527 4072 1023 -4982 2917 2918 -4985 1020 4441 -3968 -1119 4677 -2654
847b654l94P810n485l809Q416k434o333P489N83q040N572L708q254K366O158p081
$$ -2654 -3048 4762 -723 -4532 3884 1450 -4883 2606 3189 -4851 721 4429 -3825 -1459 4699 -2382
863b382p24P694n018l954Q103k010o370O907R88p861M967M024p965J934O197o527
$$ -2382 -3106 4588 -430 -4384 3719 1709 -4661 2246 3234 -4627 340 4364 -3601 -1667 4530 -1997
879a997j290P718m414m466P875j351o755O428J683p882M260M685p891J305O688
$$ -1997 -3287 4431 17 -4449 3426 2075 -4680 1748 3431 -4451 -191 4494 -3397 -2092 4596
894D596o154j858P662l781m864P422p20o805N814K082p592L758M615p111R18O391
$$ 4596 -1558 -3416 4246 465 -4399 3023 2303 -4502 1312 3394 -4198 -440 4175 -2936 -2018 4373
910D373n608j957P129l386m677O792m24o596N414K259p228L290M922o870L84O477
$$ 4373 -1235 -3192 3937 551 -4126 2666 2242 -4354 1060 3319 -3909 -619 4303 -2567 -2183 4294
926D294n173k408O996k945m928O495j9o598M995K724p076K883N051o596N8O441
$$ 4294 -879 -3287 3709 764 -4164 2331 2312 -4286 709 3433 -3643 -760 4291 -2305 -2247 4194
942D194m916k678O867k699m988O345L16o562M690K977o918K499N198o438l75O534
$$ 4194 -722 -3400 3467 768 -4220 2125 2441 -4121 569 3546 -3372 -873 4325 -2113 -2488 4046
958D046m519l090O682k045n265N944Q96o439M002L462o618J762N396o013r43O485
$$ 4046 -473 -3563 3119 1074 -4191 1753 2649 -3790 212 3674 -2944 -1182 4214 -1799 -2742 3743
974C743m000l262O383j589n264N592J165o305L677L614o531J421N319n539j201
$$ 3743 -257 -3519 2864 1275 -3989 1603 2768 -3537 140 3754 -2777 -1356 3963 -1576 -2777
989b777O255l640l359O128j260n053N084J430o040L054L763o047Q64N324n135
$$ -2777 3478 -162 -3521 2607 1347 -3706 1378 2808 -3232 -178 3585 -2462 -1598 3726 -1409
1004a409j438O094l151l593N970r01n145M873J530n988K884L844n910N29N482
$$ -1409 -2847 3247 96 -3497 2473 1572 -3573 1300 2830 -3158 -274 3570 -2340 -1811 3671
1019C671m934j692O210k931l863N889n16n393M547K016o082K490M091n679M3N658
$$ 3671 -1263 -2955 3255 324 -3539 2350 1834 -3559 988 3004 -3078 -588 3503 -2176 -2133 3525
1035C525m420k150O210k459m143N565q8n405M003K293n821K004M260n303j96N562
$$ 3525 -895 -3045 3165 706 -3437 2128 2040 -3365 638 2931 -2890 -886 3374 -1929 -2125 3437
1051C437l961k460N978k018m365N218K43n412L756K446n663J701M378m912n36
$$ 3437 -524 -2984 2994 976 -3389 1829 2072 -3340 416 2862 -2801 -1100 3278 -1634 -2170
1066b170N463l474k768N636j613m390M816N50n215L311K662n320J451M299m585
$$ -2170 3293 -181 -2949 2687 1074 -3316 1500 2050 -3165 146 2808 -2512 -1061 3238 -1347
1081a347q30N438l299k939N465j336m499M690P88n216L092K937n222J014M618
$$ -1347 -2177 3261 -38 -2977 2488 1152 -3347 1343 2131 -3085 7 2944 -2278 -1264 3354
1096C354m415j279N424k847l312N292q68m749M476J199n211K796L164n084O98
$$ 3354 -1061 -2340 3084 237 -3075 2217 1349 -3400 1076 2275 -2936 -140 3024 -2060 -1362
1111a362M577m108j536N339k584l550N147m83m752M221J551n250K427L418m895
$$ -1362 3215 -893 -2429 2910 326 -3224 1923 1440 -3312 909 2460 -2790 -363 3055 -1840
1126a840K96M727l855j859N135k091l682M867r1m745L802J917n127K122L429m610
$$ -1840 -1544 3183 -672 -2531 2604 513 -3169 1698 1607 -3138 664 2581 -2546 -424 3005 -1605
1142a605N1M494l467k057M932j725l646M616J32m675L567K027n039J797L641m509
$$ -1605 -1554 2940 -527 -2584 2348 623 -3023 1593 1725 -2950 617 2644 -2395 -598 3043 -1466
1158a466l07M570l235k161M812j383l780M367M84m696L130K388n025J458L751
$$ -1466 -1773 2797 -438 -2599 2213 830 -2950 1417 1901 -2795 335 2723 -2302 -844 2907
1173B907m319m76M555k969k371M879j167l905M228O88m763K922K544m986J126
$$ 2907 -1412 -1888 2667 -302 -2673 2206 1039 -2866 1362 2050 -2713 209 2753 -2233 -1107
1188a107M041m224p56M700k702k667M820r10l968L901J050m820K535K753m677
$$ -1107 2934 -1290 -2046 2654 -48 -2715 2105 1195 -2773 1128 2178 -2642 -107 2646 -2031
1203b031Q42L919l782j048M626k416k637M382m79m005L545J204m626K238K798
$$ -2031 -1189 2730 -1052 -2100 2526 110 -2527 1855 1376 -2629 916 2120 -2506 -268 2530
1218B530m456O56M029l613j150M541k180k798M083k66m088L336J516m578J894
$$ 2530 -1926 -1270 2759 -854 -2004 2537 357 -2441 1642 1376 -2712 624 2140 -2438 -544
1233e44L085m236L28M060l417j342M353j823k980M074j51m047L139J686m495J693
$$ -544 2541 -1695 -1367 2693 -724 -2066 2287 464 -2516 1558 1407 -2640 499 2185 -2310 -617
1249f17L299m195LM289l279j611M420j727l274M104J28m195L044J865m429J463
$$ -617 2682 -1513 -1510 2779 -500 -2111 2309 582 -2692 1412 1540 -2655 389 2254 -2175 -712
1265g12L441l988l18M247k966j986M334j404l286L919K76m064K737K092m257J145
$$ -712 2729 -1259 -1577 2670 -296 -2282 2052 648 -2638 1281 1557 -2507 230 2322 -1935 -790
1281g90L491l838n50M161k687k117M218j136l375L733N34m026K472K205m115Q99
$$ -790 2701 -1137 -1687 2474 -213 -2330 1888 752 -2623 1110 1644 -2382 90 2295 -1820 -921
1297i21L518l542q78M104k339k344M113q93l333L441P94l883K138K343l933O72
$$ -921 2597 -945 -1823 2281 -58 -2402 1711 818 -2515 926 1720 -2163 -25 2318 -1615 -943
1313i43L500l436j026M128k173k467M136p04l531L427J055m064J985K461l904
$$ -943 2557 -879 -1905 2223 50 -2417 1719 1015 -2516 911 1966 -2098 -113 2348 -1556
1328a556L60L636l104j321M124k024k512M026m69l617L174J203l967J799K512
$$ -1556 -1196 2440 -664 -1985 2139 115 -2397 1629 1160 -2457 717 1920 -2047 -248 2264
1343B264l773J90L724l074j414M150j729k765L976k37l677L018J425m100J585
$$ 2264 -1509 -1319 2405 -669 -2083 2067 338 -2427 1549 1312 -2365 653 2078 -2022 -437
1358d37K676l584q1L713k697j657M088j431k877L642J35l768K638J598l900J408
$$ -437 2239 -1345 -1426 2287 -410 -2067 2021 590 -2287 1355 1490 -2278 360 1958 -1942 -534
1374e34K691l339k68L669k542j682L892j170l014L579J88l765K531J753l863J186
$$ -534 2157 -1182 -1450 2219 -323 -2005 1887 717 -2297 1282 1470 -2295 236 1989 -1874 -688
1390f88K920l373l82L797k375j973L904j054l110L378N26l868K410J922l768R49
$$ -688 2232 -1141 -1523 2274 -101 -2074 1830 776 -2334 1044 1570 -2298 112 2034 -1734 -785
1406g85L066l246n09L673k170k108L756p92l193L130P62l847K281K113l770P81
$$ -785 2281 -965 -1474 2199 29 -2079 1677 885 -2308 822 1584 -2263 18 2131 -1639 -858
1422h58L235l193p12L717k051k273L677n37l383L054R82l821K050K319l685M86
$$ -858 2377 -816 -1528 2189 138 -2135 1542 1005 -2378 676 1658 -2163 -113 2206 -1479 -993
1438i93L254k894r96L590j775k341L547l57l301K867J058l705J873K428l655L77
$$ -993 2261 -633 -1629 1961 186 -2155 1392 1035 -2266 601 1659 -2046 -173 2255 -1400 -1023
1454a023L263k857j072L590j685k463L483j64l288K688J379l769J686K427l427
$$ -1023 2240 -617 -1689 1901 216 -2247 1236 1072 -2216 472 1851 -1918 -232 2195 -1232
1469a232M6L303k561j444L673j397k608L394J08l475K630J491l742J398K687l430
$$ -1232 -1186 2117 -444 -1888 1785 388 -2220 1174 1282 -2193 437 1928 -1814 -416 2271 -1159
1485a159j55L407k496j510L697j283k728L326L07l529K367J778l765J144K878
$$ -1159 -1314 2093 -403 -1913 1784 501 -2227 1099 1406 -2123 244 2022 -1743 -599 2279
1500B279l430k82L438k222j682L483r25k800L108M95l516K238J786l598R41K805
$$ 2279 -1151 -1433 2005 -217 -1899 1584 659 -2141 967 1462 -2054 184 1970 -1628 -687 2118
1516B118l141m80L525k182j779L531q86k765K958N72l419J968J902l504O69L048
$$ 2118 -1023 -1503 2022 -160 -1939 1592 706 -2059 899 1471 -1948 20 1922 -1582 -913 2135
1532B135l051o49L528j949j865L355o99k816K812P89l543J873J952l401O16L062
$$ 2135 -916 -1565 1963 14 -1851 1504 805 -2011 801 1590 -1953 -80 1872 -1529 -913 2149
1548B149k919q37L604j827k163L496o01k974K755Q88l513J649K255l425M87L148
$$ 2149 -770 -1607 1997 170 -1993 1503 902 -2072 683 1571 -1942 -293 1962 -1463 -976 2172
1564B172k728j081L547j662k244L364l98l095K681J016l355J472K381l333J95
$$ 2172 -556 -1637 1910 248 -1996 1368 970 -2125 556 1572 -1783 -311 2070 -1263 -1068
1579a068L184k593j192L505j475k334L230j72l216K596J294l495J336K470l142
$$ -1068 2116 -477 -1669 1836 361 -1973 1257 1085 -2131 465 1759 -1736 -400 2070 -1072
1594a072m3L208k425j388L427j293k464L111Q1l124K366J323l310J116K475k925
$$ -1072 -1115 2093 -332 -1720 1707 414 -2050 1061 1142 -1982 384 1707 -1603 -487 1988 -937
1610i37k04L093k286j492L446j174k502L065J17l128K278J461l271J030K529k912
$$ -937 -1141 1952 -334 -1826 1620 446 -2056 1009 1126 -2002 276 1737 -1534 -504 2025 -887
1626h87m21L248k156j733L462q82k699K993L95l182K091J656l278P71K624k876
$$ -887 -1308 1940 -216 -1949 1513 631 -2068 925 1320 -1862 229 1885 -1393 -622 2002 -874
1642h74n00L254k074j702L319p34k717K984M87l260J957J745l296O17K819k766
$$ -874 -1374 1880 -194 -1896 1423 689 -2028 956 1443 -1817 140 1885 -1411 -794 2025 -741
1658g41p10L256j772j945L316n94k845K788P61l242J741J849l215M66K800k569
$$ -741 -1451 1805 33 -1912 1404 810 -2035 753 1514 -1728 13 1862 -1353 -887 1913 -656
1674f56q61L271j581k067L240l47k938K584P96l199J697J884l167L99K846k521
$$ -656 -1517 1754 173 -1894 1346 999 -1939 645 1441 -1758 -61 1823 -1344 -945 1901 -620
1690f20q67L198j506k056L071j97l007K570R56l285J577J907l040L10K842k347
$$ -620 -1487 1711 205 -1851 1220 1023 -1984 586 1542 -1743 -166 1741 -1299 -989 1853 -494
1706d94j042L226j346k219L090j30l043K388J067l192J366K221l044J70K868k297
$$ -494 -1536 1690 344 -1875 1215 1085 -1958 430 1497 -1695 -329 1892 -1152 -982 1886 -411
1722d11j176L203j246k257K999J0l107K253J399l299J171K442k991n2K978k090
$$ -411 -1587 1616 370 -1887 1112 1122 -1985 268 1667 -1632 -461 1981 -1010 -1062 1916 -174
1738a74j396L110j020k412K768K98l065K118J431l213J088K379k796k03K932k030
$$ -174 -1570 1540 520 -1892 876 1174 -1891 227 1658 -1555 -467 1912 -884 -1087 1845 -185
1754a85j411K976q65k431K681M42l003J900J617l120Q20K474k687m18K955j834
$$ -185 -1596 1380 515 -1916 765 1207 -1796 104 1721 -1399 -579 1895 -792 -1210 1745 -89
1770h9j591L046p81k416K606N37l053J817J674l125O78K586k641n18K991j829
$$ -89 -1680 1366 585 -1831 775 1312 -1741 76 1750 -1375 -697 1889 -752 -1270 1721 -108
1786a08j596K970o15k560K572P07l039J617J886l032L98K674k563p05L035j574
$$ -108 -1704 1266 651 -1909 663 1370 -1669 -52 1834 -1198 -800 1874 -689 -1394 1641 67
1802F7j812K937m17k635K484Q56l018J390J937k957K69K762k417r31L151j465
$$ 67 -1745 1192 775 -1860 624 1480 -1538 -148 1789 -1168 -899 1863 -554 -1485 1666 201
1818B01j928K912k26k654K257R59l141J390K063k895P1K739k223j005L058j281
$$ 201 -1727 1185 959 -1695 562 1521 -1620 -230 1833 -1062 -991 1748 -475 -1480 1578 297
1834B97j999K760j05k641K080J053k953J118K078k728n2K846k173j100L075j182
$$ 297 -1702 1058 953 -1688 392 1445 -1508 -390 1688 -1040 -1092 1754 -419 -1519 1556 374
1850C74k057K735m2k720K005J208k946R48K182k672q4K801j981j241K972r55k191
$$ 374 -1683 1052 1010 -1710 295 1503 -1443 -495 1687 -985 -1069 1732 -249 -1490 1482 527 -1664
1867a664K554K29k800J887J257k899R63K228k591k59K774j856j357K911q72k260
$$ -1664 890 1119 -1681 206 1463 -1436 -473 1755 -836 -1095 1679 -177 -1534 1377 505 -1755
1883a755K627K47k802J766J435k889P23K408k503m35K801j659j489K750n86k377
$$ -1755 872 1119 -1683 83 1518 -1371 -648 1760 -743 -1178 1623 -36 -1525 1225 639 -1738
1899a738K370M97k709J597J438k620N36K345k298o21K763j488j669K767n60k403
$$ -1738 632 1129 -1580 17 1455 -1165 -629 1716 -582 -1203 1560 72 -1597 1170 610 -1793
1915a793K384N81k694J495J502k557L99K470k229p71K711j325j798K700l20k482
$$ -1793 591 1172 -1522 -27 1475 -1082 -683 1787 -442 -1213 1498 173 -1625 1075 755 -1727
1931a727K304O97k701J376J676k618K37K441k075r50K656j178j777K636j94k481
$$ -1727 577 1274 -1427 -51 1625 -993 -756 1685 -390 -1340 1316 138 -1639 997 803 -1678
1947a678K149Q01k693J280J772k634K03K425k091r17K769j130j863K562j15k383
$$ -1678 471 1272 -1421 -141 1631 -1003 -800 1625 -466 -1383 1386 256 -1607 955 840 -1543
1963a543J954R28k628J003J845k468j3K448j818j061K587r27j840K471K7k475
$$ -1543 411 1339 -1289 -286 1559 -909 -922 1526 -292 -1353 1234 307 -1533 938 965 -1510
1979a510J829J049k643R56J832k376q2K428j710j108K566q47j877K306K16k521
$$ -1510 319 1368 -1275 -319 1513 -863 -945 1483 -227 -1335 1231 384 -1493 813 1029 -1492
1995a492J679J199k581P15J991k320j83K455j581j249K568o90k060K320K85k535
$$ -1492 187 1386 -1195 -480 1511 -809 -992 1463 -118 -1367 1201 511 -1549 771 1056 -1479
2011a479J615J202k521O80K058k309k53K448j477j359K515n43j979K039M29k461
$$ -1479 136 1338 -1183 -503 1555 -754 -1007 1441 -36 -1395 1120 577 -1402 637 1066 -1395
2027a395J391J430k583N86K071k131m07K473j449j352K397l46k129K013N72k532
$$ -1395 -4 1426 -1157 -571 1500 -631 -1038 1435 -14 -1366 1031 685 -1444 569 1141 -1391
2043a391J315J457k413M39K049j965n08K404j294j449K340l50k079J882O04k402
$$ -1391 -76 1381 -1032 -593 1456 -509 -1017 1387 93 -1356 984 634 -1445 437 1041 -1361
2059a361J246J505k278J82K174j950o02K386j141j530K220k07k092J794P07k373
$$ -1361 -115 1390 -888 -706 1468 -482 -1084 1302 161 -1369 851 644 -1448 346 1053 -1320
2075a320J192J549k279J63K106j845p01K405j099j518K211j47k124J690Q87k288
$$ -1320 -128 1421 -858 -695 1411 -434 -1135 1270 171 -1347 864 717 -1407 283 1170 -1118
2091a118R90J612k301Q0K127j722q60K310r34j615K135N2k151J651R90k372Q63
$$ -1118 -128 1484 -817 -737 1390 -332 -1192 1118 184 -1431 704 756 -1395 256 1246 -1126 -263
2108b63J653k062j02K138j683r16K394r33j661K179M0k099J614R10k257O72J691
$$ -263 1390 -672 -774 1364 -319 -1235 1159 226 -1435 744 784 -1315 299 1209 -1048 -376 1315
2125A315k009j40K116j434j053K310p55j658J899K18k015J331J101k194N32J741
$$ 1315 -694 -834 1282 -152 -1205 1105 350 -1308 591 809 -1206 125 1226 -968 -436 1305
2141A305j921k54K123j410j073K292o69j683K008J55k108J349J013k151N69J742
$$ 1305 -616 -870 1253 -157 -1230 1062 393 -1290 718 873 -1235 114 1127 -1024 -455 1287
2157A287j943k11K111j338j038K150n73j715J856L60k146J203J160k155L53J921
$$ 1287 -656 -867 1244 -94 -1132 1018 445 -1270 586 946 -1200 3 1163 -992 -639 1282
2173A282j774n07K219j221j204K145m03j881J790M59k145J232J205k121L47J832
$$ 1282 -492 -999 1220 -1 -1205 940 537 -1344 446 905 -1240 -8 1197 -924 -577 1255
2189A255j662n69K190j138j315K099k61j868J617N87k108J054J262j985K67J852
$$ 1255 -407 -976 1214 76 -1239 860 599 -1269 348 935 -1173 -119 1143 -842 -575 1277
2205A277j636n68K029q90j376J964k25j779J539O06k029R42J285j840J01J788
$$ 1277 -359 -927 1102 212 -1164 800 575 -1204 335 941 -1088 -146 1139 -701 -600 1188
2221A188j391q32K159r76j311J838k9j873J476P01j978Q00J436j815l7J912j504
$$ 1188 -203 -1035 1124 148 -1163 675 646 -1227 249 950 -1028 -228 1208 -607 -644 1268 -236
2238b36p74K007p96j455J892k3j806J457P40j945P80J398j810j48J807j316q62
$$ -236 -1010 997 201 -1254 638 615 -1191 266 1006 -939 -159 1239 -571 -719 1088 -228 -1090
2255a090K017n81j496J774Q8j889J390Q89j909M63J532j708l00J862j129j023
$$ -1090 927 346 -1150 624 712 -1177 213 1102 -807 -344 1188 -520 -820 1042 -87 -1110
2271a110J956n32j440J658K36j779J106R68j860M67J418j618k55J836j179r16
$$ -1110 846 314 -1126 532 768 -1011 95 1063 -797 -330 1088 -530 -785 1051 -128 -1044
2287a044J883n04j544J706L46j912J100J073j937L89J517j553l18J827j058j004
$$ -1044 839 335 -1209 497 843 -1069 31 1104 -833 -444 1073 -480 -798 1029 -29 -1033
2303a033J750k74j486J440M35j836R80J075j870L66J558j508m24J777q94j073
$$ -1033 717 443 -1043 397 832 -1004 -24 1051 -819 -453 1105 -403 -827 950 56 -1017
2319a017J832l39j553J511M49j844Q45J165j773K52J515j340n05J823q51j179
$$ -1017 815 476 -1077 434 883 -961 -116 1049 -724 -472 1043 -297 -802 1021 170 -1009
2335a009J705j07j690J419N05j805Q47J130j639O0J647j295n29J707p84j150J629
$$ -1009 696 589 -1101 318 823 -982 -135 995 -644 -584 1063 -232 -761 946 162 -988 641
2352F41p5j627J268N86j701P11J202j608P8J557j206o73J656n30j252J531L2j547
$$ 641 566 -1061 207 793 -908 -197 1005 -603 -525 1032 -174 -847 809 279 -973 558 590 -957
2370i57J104O98j653O43J217j498j29J587j093q18J794o96j155J428J11j636J159
$$ -957 147 845 -808 -165 1052 -446 -575 1012 -81 -899 895 199 -956 472 583 -1053 106
2387A06Q00j671M57J365j522j98J676j130p32J657n09j364J459K00j539R99Q67
$$ 106 906 -765 -308 1057 -465 -663 1013 -117 -849 808 299 -1065 394 594 -945 54 921
2404I21j666L96J306j394j70J574j082q20J676n23j242J425K33j596J008Q60j634
$$ 921 -745 -349 957 -437 -607 967 -115 -935 741 218 -1024 401 634 -962 46 906 -728
2421g28L59J382j373k88J560r18r30J611l12j300J344K92j546Q42R05j498K52
$$ -728 -369 1013 -360 -648 912 -6 -936 675 363 -937 407 699 -847 -5 900 -598 -346
2438c46J295j302l20J535q97q82J569k90j223J212L16j504Q29Q82j480J28J338
$$ -346 949 -353 -673 862 -35 -917 652 362 -861 351 667 -837 -8 874 -606 -478 860
2455H60j210l63J559q28r02J512j92j361J195M25j503O59J058j479J12J455j287
$$ 860 -350 -713 846 18 -884 628 436 -925 270 695 -808 -149 909 -570 -458 997 -290
2472b90m90J643p40j027J484j00j375J173M43j452N72J022j415J05J358j109n35
$$ -290 -780 863 123 -904 580 480 -895 278 721 -731 -159 863 -552 -447 911 -198 -733
2489g33J509n59j118J379N0j393J052N37j492N22J145j380l9J417j028o44J565
$$ -733 776 217 -901 478 528 -865 187 724 -768 -246 899 -481 -520 897 -131 -775 790
2506G90o00j053J279M9j358J012O33j499N39J059j233j75J376q72o21J396m58
$$ 790 190 -863 416 465 -893 119 752 -747 -208 851 -382 -557 819 -53 -674 722 264
2523B64j130J302Q7j366Q88P03j458M27J136j184j70J352q04p75J353l80j135
$$ 264 -866 436 523 -843 45 748 -710 -283 853 -331 -501 851 47 -728 625 245 -890
2540h90J238K47j377Q28P18j352K99J193j210k39J393q42q09J350j73j305J210
$$ -890 348 595 -782 46 764 -588 -289 904 -306 -545 848 6 -803 547 374 -931 279
2557B79L10j354P44P60j259K10J140j138l72J366o13q83J325j38j187J025L86
$$ 279 589 -765 -21 739 -520 -310 830 -308 -680 686 73 -810 515 377 -810 215 601
2574F01j296O45P39j215J39J105q73n07J325n75q69J289p7j229J000N08j363N92
$$ 601 -695 -50 689 -526 -387 718 -155 -662 663 88 -781 508 431 -798 202 710 -653 -61
2592f1Q95j302J14J187j077l97J208m02r76J273n8j138Q83N15j315N25R43j181
$$ -61 834 -468 -354 833 -244 -641 567 165 -811 462 404 -734 149 664 -651 -126 817 -364
2610c64p2J158q71n04J323n18r01J099J53j276Q60N73j304M45R38j169lJ156q16
$$ -364 -436 722 -149 -653 670 152 -749 350 503 -773 87 660 -644 -199 739 -430 -433 723 -93
2629i3n99J299l75r76J148J59j270P59O45j322L59R76j101j13J224q04n16J219
$$ -93 -692 607 232 -744 404 563 -707 52 697 -625 -266 710 -391 -504 720 -84 -600 619
2647F19k66j072J098Q4j192P38O62j247L42R83j002j80J150p28o66J282l47r58
$$ 619 353 -719 379 463 -729 9 671 -576 -234 749 -253 -433 717 -11 -677 605 258 -700
2665g00R54K63j159O55N68j080J53J057r55k79J159o09o07J056k03r72Q89L08
$$ -700 254 517 -642 13 581 -499 -346 711 -244 -523 636 27 -580 476 273 -699 190 498
2683D98j189O28O69j127J61J035r46k80J155n52o75J083j40j055R48L47j157N07
$$ 498 -691 -63 606 -521 -360 675 -271 -551 604 52 -623 460 320 -735 213 560 -597 -90
2701i0P32j033N7J047q24m32J174n55p35J018qj029P99M74j150M47Q47j149O3
$$ -90 642 -391 -334 713 -111 -543 631 76 -659 359 351 -678 121 595 -555 -108 739 -410 -347
2720c47J071q80m21J135m07p89R96lr47O70N31j130L60P99r25j14R90p59m61J135
$$ -347 724 -156 -577 558 151 -638 358 355 -592 78 609 -521 -161 638 -287 -401 589 -170 -631 504
2740E04m23p52R89M7r27O93M40j092L67P95r13j63J080o94n52J117l17q43R60
$$ 504 81 -671 318 365 -562 131 571 -521 -154 641 -272 -435 645 -49 -601 516 199 -644 316
2759C16J45j056O74M69j067K92Q54r32j47R86n88m59R52k13q74R21K38j100O08
$$ 316 461 -595 79 548 -519 -227 627 -305 -452 534 -54 -513 439 226 -648 273 511 -589 19
2778A9N82j115K47R27r44j89J010n99n05J081k11r27P99K72j057N06O46r29N2
$$ 19 601 -514 -267 660 -284 -473 537 -62 -567 514 303 -624 175 447 -610 -104 542 -387 -335
2797c35Q84p94k46J007m83n65R50j00r62Q33K41r49M34O23r71J35Q61p08k96J030
$$ -335 549 -245 -491 516 33 -532 418 318 -644 189 430 -519 -85 538 -433 -298 563 -145 -441 589
2817E89n49o19R47l0r37O78L30r79N06N64q60P1Q84o74l45R34l95o61R15k7r52
$$ 589 40 -579 368 338 -599 79 409 -570 -64 500 -360 -289 595 -79 -424 510 115 -546 369 342 -610
2838f10P00M16j065M41O13q10j7Q59n87m27R02k94p26P83J84r36O25M00r41L06
$$ -610 90 506 -559 -118 495 -315 -332 527 -60 -487 415 121 -605 178 362 -574 51 451 -490 -184
2858a84P46p69j36Q83o04l80R02l17p25Q68Q3r47O46M44r02K57P11p51j46Q78
$$ -184 562 -207 -343 540 -64 -444 458 141 -584 284 367 -580 66 510 -392 -135 576 -175 -321 557
2878E57n59m55Q62k35o74O98K21q23L51N32q38J75P93p62k13Q85m74n36Q05j57
$$ 557 -2 -457 405 170 -504 194 415 -408 -57 475 -363 -188 605 -157 -370 515 41 -495 310 153
2898A53o51O60K24q33M18N53q45J09O93o60j90Q01m59m88Q63r3p69O63K62q63
$$ 153 -498 162 386 -447 -29 524 -321 -212 481 -179 -369 432 -27 -515 348 255 -514 149 411 -452
2918d52L77N59p95M0Q49p48k53Q77m20n63P88K9p07N25L42q74L80N34q12N2P77
$$ -452 -75 484 -311 -271 578 -170 -423 454 34 -529 259 288 -419 106 448 -426 -46 488 -324 -272 505
2939E05n98l46Q52l12n35P47l8p17N26K68p78K96O84q09q4Q00n52l29P76k71n66
$$ 505 -93 -439 413 101 -434 313 275 -442 84 352 -426 -130 554 -255 -339 461 -91 -420 356 85 -481
2960d81Q36j02p09N43L09p86K06O42p31k6Q26n82l15P44k14n73O14J57p68M34
$$ -481 355 253 -456 87 396 -390 -184 458 -273 -299 527 -55 -370 374 160 -413 201 358 -410 24
2980B4M20q10K24O13p22o4P74m48m31Q50k55o61O78J19p35M59L31p11J99N94o39
$$ 24 444 -366 -142 471 -251 -315 459 11 -420 430 175 -486 192 311 -424 35 366 -345 -146 448 -191
3001a91o8P26m23m66P38j44o10O44N8o40L58M41q18J90O93o00k27P44l63n21P97
$$ -191 -259 467 44 -422 316 172 -438 206 264 -376 -18 423 -395 -205 488 -112 -339 405 42 -479 318
3022C18j36o64O11J89p27M01M34p02K0O93n31k30P13l70m26O56j10o56P13K07
$$ 318 182 -482 129 318 -409 -8 426 -276 -256 437 -94 -324 389 19 -407 249 139 -517 196 403
3042D03p74L30M66o46N5N80m93k37O49l05m92P19L0p53O05K10o60K78M08o35Q7
$$ 403 -371 -41 425 -221 -166 414 -79 -316 333 28 -464 255 285 -468 137 347 -313 -35 373 -262 -175
3063a75N84m68l73P33k13n48O93j0o51N26K56o73L36L97o36pO10n25k36O83k51
$$ -175 409 -59 -432 301 88 -460 233 223 -428 98 354 -319 17 414 -222 -229 381 -144 -380 303 52
3084E2m82O97j4o22M25K85n71J30M74n04j34O43m44l21O98j79n28N85M1n76K99
$$ 52 -430 267 253 -369 56 341 -230 -100 374 -130 -264 379 -65 -386 312 133 -395 190 231 -345 -46
3105d6M56p13K11M43n88j4O19l48l87P37k16n57M86J96o82M20L42o84J59M63n37
$$ -46 410 -303 -92 351 -237 -251 368 20 -367 370 154 -403 83 279 -403 17 359 -325 -166 297 -240
3126b40j6O03l86k87O09j13o08N33K20p08L64L85o93J87N65n79j49O97l25l69
$$ -240 -256 347 -39 -326 283 170 -438 95 315 -393 -29 356 -337 -150 415 -164 -313 384 59 -310
3146c10N37p0n48M88J20n92L37L40n41P7N22m65j83N58j86m07N51l8n78M89J58
$$ -310 227 157 -391 97 217 -375 -38 302 -239 -162 360 -105 -288 270 84 -323 228 190 -388 101 259
3167B59n72K85L90n94J9N54m29k59O60k08m83N41Rm62K66L44o50K90M00n18p6
$$ 259 -313 -28 362 -232 -213 341 -88 -347 313 105 -378 163 172 -290 -24 320 -330 -40 360 -158 -234
3188b34N80l98j97M64k26l23M96N6n79M74J93n72J48N03n03l6M97l40l01N93k49
$$ -234 346 -52 -249 215 -11 -334 162 218 -361 113 306 -266 -118 385 -118 -154 343 3 -298 295 46
3209D6l66M73Q2n31L22K71n46J27N06m80o9M81m07k27N38j22m33N11K4n26L18
$$ 46 -320 153 235 -296 26 297 -249 -122 384 -96 -165 316 -91 -318 220 98 -335 176 200 -326 -8
3230hL38n71J05M65n17j01O11l38l42N65j39l53M35P5n28K69K96m26m4N51m13
$$ -8 330 -241 -136 329 -188 -289 322 -16 -358 207 68 -285 150 225 -303 -34 262 -164 -208 343 -70
3251g0j50M87k99k14M40j6n16N07Q2m97K66K48m19M7M40m65j31N68k95k51L98
$$ -70 -220 267 -32 -246 194 178 -338 169 251 -246 20 268 -151 -104 336 -129 -260 308 13 -238 160
3272A60j07l29L79J05n09L04K42m30O1L99l10k17M48j03l85M72q4m16M57J08m44
$$ 160 53 -276 103 208 -301 3 245 -185 -124 275 -35 -252 196 93 -292 180 96 -320 137 245 -199
3293a99J10L50m94O8M02k99j57M61k15l00M57n0m24L44K31n09J60L40l80j00N34
$$ -199 -89 261 -233 -165 237 -62 -219 242 27 -273 184 134 -290 54 285 -224 -64 276 -104 -204 330
3314C30l17k25M32q7m45M75J8m93L71K47n73J89L31l89r1N20l29k38M62j13l58
$$ 330 13 -212 220 133 -312 163 181 -312 59 306 -267 -78 253 -136 -227 293 -36 -274 188 75 -283
3335b83L60J57n06K38K52m10J56K86l45l9L81k24l20M69p6m19M31R1m78K81L08
$$ -283 77 234 -272 -34 218 -192 -36 250 -95 -134 247 23 -297 172 96 -323 108 199 -279 2 310
3356C10m95J37L50l45j22M09k57k39M34q3m04L97J14m16K22K76m89J24L71l29
$$ 310 -185 -48 302 -43 -165 244 -13 -252 182 99 -305 92 206 -210 12 288 -201 -77 294 -35
3376c5j77M99k56k93L68k6l90L18K14m47K03K86l75j2M26l46k25M24j29k98L70
$$ -35 -212 287 31 -262 106 80 -310 8 222 -225 -22 264 -111 -123 303 -43 -268 156 27 -271 99
3397I9L4l71L08J99m55J34K96l76Q9J98k23j44M98j43l49L25O6m39L07J38l63
$$ 99 133 -238 70 269 -186 -52 244 -132 -43 155 -68 -212 286 143 -206 119 185 -254 53 191 -172
3418a72J07L83m21n5M16k85j60L90j13l72M05O9l81K47J62l76Q4K86l93K1M04
$$ -172 -65 318 -103 -158 258 -27 -187 203 90 -282 123 192 -189 58 220 -156 -72 214 -179 -158 246
3439B46k30k50L92r2k77K76J11m15K98J59m23J50K50l28o5M23k00k43L67j38k63
$$ 246 16 -234 158 66 -211 65 176 -239 59 218 -205 -55 195 -133 -198 225 25 -218 149 11 -252
3460b52L35M5m44K44K78l91R6K43k55m4L45k10k77M67q5l16L13N7l90K49K26l51
$$ -252 83 128 -316 -72 206 -185 -89 154 -101 -145 200 -10 -287 180 95 -221 92 149 -241 8 234 -117
3482a17K5L12l09l2L78j68k61L48n4l82K81J67m19K13K48l66M4L05k52j85L85
$$ -117 -92 220 -89 -121 257 89 -172 176 122 -260 21 188 -231 -18 230 -136 -92 213 -39 -224 161
3503A61j40k32L90j66k37K31J25k46J4K71k53r7L49k19j35L47j32k06K21K6l67
$$ 161 21 -211 179 13 -224 7 132 -114 -100 171 -82 -179 170 -49 -184 163 31 -175 46 72 -295
3524b95L40J52l88J46K60k93n3L10k25j70L86j45k15L09N3l93K20K69l89J23K81
$$ -295 45 197 -191 -45 215 -78 -131 179 -46 -216 170 25 -190 119 172 -221 -1 268 -121 2 283
3545B83l25j06L98k31j66L12p0l45L73K4l38J78K02k96M5K70k63j11L81k26k29
$$ 283 -42 -148 250 19 -147 165 95 -250 123 147 -191 -13 189 -107 -62 208 -55 -166 215 -11 -240
3566b40L65m6k47J98Q6l31J75K10k65jK20k09r1K94j02k01L27n5l00K82O0l45
$$ -240 125 79 -168 30 116 -215 -40 170 -95 -96 124 -85 -176 118 16 -185 142 87 -213 69 129 -216
3588b16J90J76k25N9K09k50q6M02k18k08K99J3k59J60J45m20K54K07l26j8L68
$$ -216 -26 150 -75 -16 193 -57 -143 259 41 -167 132 145 -114 46 191 -229 25 232 -94 -112 256
3609B56l04j08L64j50l02L54M5l76K47P3k10mL23l12k4K77r7j80K40l4k32K00
$$ 256 -48 -156 208 58 -244 110 155 -221 26 99 -111 -115 208 -104 -128 149 52 -128 112 78 -154 46
3631D6Q2l77J63K38k74O2K25l01J6K86j32j92L23p3k51K40R6l76K62K8k23R3J76
$$ 46 128 -249 -86 152 -122 -60 165 -136 -120 166 34 -158 165 92 -159 81 177 -199 63 91 -132 -39 137
3654A37k05o7L22j12j46K31m4j90J29L0k56K07J18l25N4K70j78j47L09p3k62K95
$$ 137 -68 -135 187 75 -71 160 116 -74 55 85 -171 36 154 -171 -117 153 -25 -172 137 64 -198 97
3676I7J3l47K50Q1k65J04K02k59J9K50j72j27L69j80k35L10l2k68K59Q6k45N7
$$ 97 110 -237 13 94 -171 -67 135 -124 -105 145 -27 -154 215 35 -200 110 78 -190 69 155 -90 -33
3698c3K62k48p8K67k44n3K63j07j69K01N8k36J52O6j43k4K10k22J8K28j83j22
$$ -33 229 -19 -97 170 -74 -127 136 29 -140 61 119 -117 35 101 -42 -66 144 -78 -60 168 -15 -137
3720a37K54j3k75K23Q2k29J61J33k38p1K70k76K6K10j31q1K48j31j56J19J28k44
$$ -137 117 104 -171 52 134 -95 66 199 -39 -110 160 -116 -90 120 -11 -92 156 25 -131 -12 116 -128
3742a28O4J90k76P9K19j92r0L45k00j22K33q5k35K46M4k52K26N8j95mL10l20R
$$ -128 -64 126 -150 -71 148 -44 -134 211 11 -111 122 37 -198 48 92 -160 66 124 -71 -75 235 -85 -76
3765g6K03r3j14J99Ol06K22R9k43N5K17k72N8J80j74q9K87j19j72J40L2j65J50
$$ -76 127 34 -80 119 125 -181 41 140 -103 -48 169 -103 -45 135 -39 -128 159 40 -132 8 40 -125 25
3788B5Q7j87M5J06k11P5J17j11k4J67o5j37J76l0j96J61J18k38O2J71j60m0K41
$$ 25 112 -75 -30 76 -135 -60 57 -54 -78 89 24 -113 63 33 -163 -2 116 -122 -60 111 -49 -89 152
3811A52j84l7K06j58r8K55rk52J57M5j64J52J01k24k1K23j20j57K01K4k45J56
$$ 152 -32 -69 137 -21 -119 136 127 -125 32 77 -87 65 166 -58 -79 144 24 -133 68 92 -153 3
3833CQ0k49J68N4j90O7J82j40J3J08r9r9K14p2j91K32L3k11K9K03j75m1J57j07
$$ 3 83 -166 2 56 -134 -67 115 -25 -12 96 -3 -102 112 40 -151 81 114 -97 -68 135 -40 -81 76 -31
3857c1o8K10q6j27J47k3j70J99M7j59O3Q4r2j4J58j21r1J33m9j28K08l5j43O5
$$ -31 -99 111 25 -102 45 22 -148 51 98 -61 2 86 -6 -20 138 17 -74 59 10 -118 90 55 -88 -23
3881b3J27j26P9P0j75j4J48k2j84K17o6k12K26l1j74K07L8j61J27L7j28o8J76
$$ -23 104 -22 57 127 -48 -62 86 64 -120 97 31 -181 45 14 -160 47 85 -76 51 88 -40 -108 68
3904F8j10n0J64m9j35J84j1j91J54O7j66P0J16j89JK18j14j58J83nj28J79l7j63
$$ 68 -42 -92 72 23 -112 72 61 -130 24 91 -75 -5 111 -78 -77 141 27 -131 52 47 -81 98 61 -102
3928a02Q0J25j35l3K42k32m7J53lj65J75j8j37J29O2k39J12O6p5k8J19p9q1J66
$$ -102 -22 103 -32 -65 177 -55 -102 51 48 -117 58 40 -97 32 94 -145 -33 33 -42 -70 49 -30 -111 55
3952E5l8q3J16l0j06Q5K3j06O1R4j04j6J70j40q8J83j10l9J31m5j25O2J19j11
$$ 55 17 -66 50 20 -86 -1 22 -84 -23 71 -33 -49 121 -19 -107 76 -34 -73 58 13 -112 -50 69 -42
3976d2j7J47j57qK08j34r4J51O8k39J98l1r0O5J02j42J4J59j93m6J59l9j22J10
$$ -42 -59 88 -69 -77 131 -3 -97 54 122 -117 81 50 -40 25 127 -15 -1 158 -35 -81 78 39 -83 27
4000B7J05j69M2L1j50J15Q2k07N1J86j02q0J56m8j39J13P6k07J32K3j02M8J27
$$ 27 132 -37 5 36 -114 1 83 -124 -73 113 11 -69 87 39 -100 13 89 -118 14 37 -65 -17 110
4023A10j44p9J60o5k5J18r1j06K04%j51J32mj26M4J11j18r4K40j10j20K20q9j01
$$ 110 -34 -113 47 -18 -43 75 -16 -122 82 82 -69 63 59 -67 -23 88 -30 -124 116 6 -114 106 17 -84
4047h4J48J4j52J30P4j65o0K33j12n2Q8l9j25J86l6j64J42P2k46J73Q5j76K8O9
$$ -84 64 78 -74 56 130 -35 -95 138 26 -26 62 23 -102 84 48 -116 26 98 -148 25 110 -66 -38 31
4071C1r5j1J61q5r1J05L7j99J17N7j07RJ88j36m5J49j25p5J43pj06R8O4j38Q4
$$ 31 -64 -75 86 1 -90 15 52 -147 -30 27 -80 -71 117 -19 -64 85 -40 -115 28 21 -85 13 77 -61 23
4096B3K8j50O6J23n1j03J38n5j18J90j05j15J39M4p7N3Q6j53N7M1j84M0J15jq8
$$ 23 51 -99 -33 90 39 -64 74 19 -99 91 -14 -129 10 54 -23 30 116 -37 20 61 -123 -83 32 31 -57
4121e7P9jq4J05O3j82R7Kq0O7K2p5m7J27r8K2J31l2j88J42L9j64J42R2k17Q3R2
$$ -57 22 21 -63 42 105 -77 20 22 -58 9 31 -44 -91 36 -62 -40 91 59 -129 13 52 -112 30 122 -95 -12 80
4148H0r5j2O9n1m8J38j3j10J16O9k02K7P3l2r7K26j49j3J48j42n7J20J4j09L3
$$ 80 -15 -27 42 -9 -57 81 68 -42 74 143 -59 -32 41 9 -88 138 -11 -24 124 -18 -75 45 59 -50 -17
4173a7J20k60J24P3p8j0J35j38p0J84rj15P6J6j57J42P7j39k3J49j52mJ73j18
$$ -17 103 -157 -33 40 -38 -48 87 -51 -121 63 54 -61 15 31 -126 16 93 -46 -69 80 -72 -76 97 -21
4197b1j12J65l5o6J51lj59Q4P1j54M1J53j61r6K46o5j31J34n0j11J71M0j50Q4
$$ -21 -133 32 -3 -69 82 79 -80 4 75 -79 -38 115 -46 -142 104 39 -92 42 -8 -119 52 92 -58 26
4221B6M9j14J9J61j79J5Q6m1r5J59j5j58P2M5j33P0J00j66J09R3j03n1J38j03
$$ 26 75 -39 -20 141 -38 -23 63 22 -73 86 71 -87 -15 30 -103 -33 67 -99 10 103 0 -51 87 -16
4245a6j03J30N9j50J41P7k20N4J37j68QJ68r4p2Q6oj45J84K1j33L6O4j12k0K35
$$ -16 -119 11 70 -80 61 138 -82 -28 109 -59 -51 117 23 -49 37 31 -114 70 91 -42 -6 58 -54 -74 161
4270A61j89NJ21j18m7R1J8j41O1O5j60J29J05j94M7R5m8j18J75q9k1R0J9j79J78
$$ 161 -28 -23 98 -20 -67 24 42 -99 -38 27 -133 -4 101 -93 -46 49 1 -117 58 -31 -52 38 57 -122 56
4295E6J2j38Q4J00j78J0J77j21o6P8j2j44K06m2j92J39J74k27J12Q8k03L7J65
$$ 56 68 -70 14 114 -64 -54 123 2 -64 14 2 -142 64 22 -170 -31 143 -84 28 116 -87 -50 115
4318A15j06p5K17j40k11L08j3j27L9Q7k24P3J52j04M6K6n0r9J86k4j52J32mj53
$$ 115 9 -66 151 11 -200 108 95 -32 7 94 -130 -57 95 -9 37 63 13 -86 100 76 -76 56 52 -101
4342a01J17J2q7M6R6j81R0J08o3j46K01k5j82J50K5j50J15P3j94Q6J48j98k7J75
$$ -101 16 28 -59 -13 83 -98 -8 100 37 -109 92 67 -115 35 60 -90 25 98 -96 -10 138 -60 -87 88
4366H8m7j20J80k7j37J63Pk71K19J01k29N5J68j84j5J78j39j26K09K2k32J76n
$$ 88 41 -79 101 74 -63 100 107 -164 55 156 -73 -18 150 -34 -49 129 -10 -136 73 95 -137 39 34
4389C4j48P1J75j73%J67j01j17J71j02r2J75lk02J73N7j85jJ76j85K8J04q3N9
$$ 34 -114 -43 132 -41 -41 126 25 -92 79 -23 -115 60 57 -145 28 85 -100 -101 75 -110 -82 22 -61 -2
4413bJ37r0r6J20k6k08J74J16k23M1K10j94j8J67j74J7J78r0j86K57n3j44J47
$$ -2 135 45 -51 69 43 -165 9 125 -98 -57 153 -41 -59 108 -66 -49 129 39 -147 110 57 -87 60
4436F0J05k43M1J62j90j3K77j94j48K80p3k44K49M6k25J44K9j23QJ71j79n6K74
$$ 60 165 -78 -37 125 -65 -78 199 5 -143 137 64 -180 69 115 -110 34 63 -60 -52 119 -60 -116 158
4459A58j99j09K50nk26K23k4j81J30J56k54L0J73j67j5K61j74r0J88j17n4J12
$$ 158 -41 -150 100 95 -131 92 68 -113 17 173 -81 -51 122 -45 -60 201 27 -63 125 8 -46 66
4481F6K3j51J05N8j91N6J90j75j05K17lj73J65m2j55J73K5j60J19Q0j92JJ65j19
$$ 66 89 -62 43 101 -90 -34 156 -19 -124 93 90 -83 82 40 -115 58 83 -77 42 122 -70 -69 96 -23
4505b3j13K08o2p8J02M4j96J57J56k68N9J39k23LJ66j23kJ04L2k13J74J1k17J62
$$ -23 -136 72 10 -68 34 78 -118 39 195 -73 -14 125 -98 -95 71 -52 -54 50 82 -131 43 54 -163 -1
4529aJ34k09N1J10q0r9K06j72l4J51r7n8K02L2k55J53J20k30L6K01k22j6K29j72
$$ -1 133 -76 -25 85 5 -94 112 -60 -94 57 -40 -98 104 136 -119 34 154 -76 -40 161 -61 -77 152 -20
4553b0p3K03j0j73J31j0j67J48L1k16N9K12j63o8K53j54j22K44l1j06P5J1j87
$$ -20 -93 110 100 -73 58 48 -119 29 60 -156 -97 115 -48 -116 137 -17 -139 105 74 -32 43 54 -133
4576a33J25O3j35k6K13j22j09K38r9j67J92N1k18J20J30k00Q8J37k19O5J07j45
$$ -133 -8 55 -80 -106 107 -15 -124 114 15 -152 40 91 -127 -7 123 -77 11 148 -71 -6 101 -44
4598d4o8K85j94j09K09n2j22J67L4j46O2Q5j76k6K05j50n5K15r7j28J96l6j85
$$ -44 -112 173 -21 -130 79 27 -95 72 106 -40 22 107 -69 -95 110 -40 -95 120 23 -105 91 55 -130
4621a30J19J15k31J12J17j68l5K50j91p7K48j07j52J51N3j98R5J16j40L8O9r1
$$ -130 -11 104 -127 -15 102 -66 -101 149 -42 -119 129 22 -130 21 74 -124 -29 87 -53 -15 54 -37
4643c7o0J98j20j03K08l2k06K32R1k82J52N6j62n0K41j68oJ08o0m6J18n5j81K30
$$ -37 -97 101 -19 -122 86 54 -152 80 171 -111 41 97 -65 -115 126 -42 -48 60 0 -46 72 17 -164 66
4667F6K4j64R6J39k51pK10j94k6J68j05p8J91n2j62J80P8k67P3K25k03l6K30k08
$$ 66 90 -74 22 161 -90 -97 113 -81 -107 61 -44 -122 69 17 -145 35 113 -154 -81 144 -59 -95 135 -73
4691g3j5K47j11j47J18M1k54K19N2j64P8J28k03l6K88k49m7K64j42j37K50n3j33
$$ -73 -88 159 48 -99 19 60 -194 25 77 -87 -9 119 -84 -120 168 -81 -128 136 -6 -143 107 54 -79
4714g9P4J42k67M9K23k74N7K46k28n4K27o6j96L03q7j63J37O3k07L0K34k55K6
$$ -79 -5 137 -130 -81 142 -132 -75 171 -57 -111 116 50 -146 157 70 -93 44 107 -100 -70 164 -91 -65
4737f5J69r4j66K53l6k78K35Q4k51J39J60k80P8J80j78j16K86j25j49K21L0k56
$$ -65 104 10 -156 97 61 -217 18 102 -149 -10 150 -130 -52 128 -50 -166 120 -5 -154 67 97 -159
4759a59J17J48j56R0J01k01O1J78k39n9K39r3j75K13l3k13K01J34k62J03J12j81
$$ -159 -42 106 -50 40 141 -60 1 179 -60 -119 120 27 -148 65 32 -181 20 154 -108 -5 107 -74
4781g4k1K68k26p1K78j39j35K30j2j79J42N2k35O4J91k06LK56k26k9J47o7j53
$$ -74 -95 173 -53 -124 154 15 -120 110 98 -81 61 113 -122 -58 133 -73 -70 186 -40 -69 78 11 -142
4804a42J87J07k45J35O9k02J12J42k95Q2K06k17rJ36l2k09K46L7k89K74M7k29
$$ -142 45 152 -93 42 111 -91 21 163 -132 -50 156 -61 -70 66 34 -175 71 108 -181 93 140 -89
4826h9P6J64k18M4K50j67j96K55j21j44K65n0j47Q8J63k56N1K37l50J9K82j51
$$ -89 -13 151 -67 -23 227 60 -136 119 -2 -146 119 69 -78 10 173 -83 -32 205 -145 -126 156 5
4848Ej86L22q5k47J75M5j56J66J16k28j2K51k28o1K36j22p6J92j7k49K31Q9k34
$$ 5 -181 141 56 -191 -16 29 -127 39 155 -73 -85 166 -62 -123 113 -9 -85 107 90 -159 72 161 -73
4871g3R1J52k77%K67j98j28L13j48m5J62o4j57K01Q1k80N6K24k89J02J19j01j05
$$ -73 18 170 -107 -107 160 -38 -166 147 -1 -46 116 52 -105 96 177 -103 -47 177 -112 -10 109 8 -97
4894i7J95q9j56J65O8k64J71J43k75J35J56k15%J42j61j9K07q3j42J53N1k54K25
$$ -97 98 9 -147 18 86 -178 -7 136 -139 -4 152 -63 -63 79 -82 -101 106 23 -119 34 85 -169 56
4917E6K7k24O9K63k78n4K74k14n1K60o2j52K06m4j88R5J39k21J37J52k77l3L06
$$ 56 83 -141 -72 191 -87 -141 133 -81 -132 128 66 -86 120 76 -112 -17 122 -99 38 190 -87 -120 186
4940A86j84j14K86r8k62K83K7k84J51R6j86Q3J25j52q2K53j47m7J80r2k01K02
$$ 186 2 -112 174 76 -186 97 124 -160 -9 87 -99 -16 109 -43 -125 128 -19 -66 114 22 -179 23
4962B3P6k91J76Q1j86N8K38k54j1K23j75p9K03l2k10K20M0k45J53J51l08N1K78
$$ 23 99 -192 -16 65 -121 -63 175 -79 -90 133 -42 -121 82 50 -160 60 100 -145 8 159 -149 -98 180
4985A80k27m0K36j33n0J84m6l25K47J96k54RK17k52lK77l13j8K68o7k25K23K7
$$ 180 -47 -87 149 16 -34 150 104 -221 26 222 -32 -23 194 -58 -61 216 -97 -115 153 86 -139 84 111
5008A11k89J90M0j36M5J36k32L1L07j83j97L19j52j83K72J2k47J94N9j99K6K59
$$ 111 -178 12 52 -84 -39 97 -135 -104 203 20 -177 142 -10 -193 79 91 -156 38 97 -102 -76 183
5030A83k78j5L28k38j22L10q5k03K44p8j70J46J73l08O9K45k55m4K68j91j44K90
$$ 183 -95 -110 218 -20 -142 168 83 -120 124 46 -124 22 195 -113 -44 201 -54 -98 170 -21 -165 125
5052A25q0q8J63l9k13J18J73k20L6J89j98q1K71j60j53K08Ok64K61M7l37K28J44
$$ 125 45 -43 120 81 -132 -14 159 -61 -25 164 -34 -115 156 -4 -157 51 57 -207 54 101 -236 -8 136
5075A36k59Q6K24k99p1K91j35j28K87k9l22K57P7k15Q3J11k15J16J35j72r1K69
$$ 136 -123 -37 187 -112 -183 108 -27 -155 132 103 -219 38 115 -100 -17 94 -121 -5 130 -42 -133 136
5097A36q6k35K61K7l00K46J57l37J66J62k56OK20j80n4J76j06j38J78M2k61K00
$$ 136 50 -185 76 103 -197 49 206 -131 35 197 -59 -53 167 -13 -67 109 3 -135 43 85 -176 24
5119B4J13k96J69J87l08LK42j42r8K19j00k06K36N5k35J40J12k78J17J46j85k9
$$ 24 137 -159 10 197 -111 -108 134 -8 -106 113 13 -193 43 98 -137 3 115 -163 -46 100 -85 -114
5141a14K56j87j57L04o5k48K63J14l88K41J37l01N3K58j86r9L06j94o8K17j20
$$ -114 142 -45 -202 102 37 -211 52 166 -222 19 156 -145 -92 166 -20 -119 187 -7 -75 142 22
5162B2j03J16O7k26Q5J82k30P1J51k04q4L01k19r9K78j01k26K42J15l17J69J98
$$ 22 -81 35 102 -124 -39 143 -87 -16 135 -69 -153 148 -71 -170 108 7 -219 23 138 -179 -10 188
5184A88l11P1K69l19p1K88j68o7K48l7k18J81M5k48J28J79k73L6K51k64p0L18
$$ 188 -123 -52 217 -102 -173 115 -53 -120 128 91 -127 54 99 -149 -21 158 -115 -79 172 -92 -162 156
5206A56j34j72L24r1k55K57N1k01N0K07l14M0K30j54r2K66j58j55K50lk42J93
$$ 156 22 -150 174 83 -172 85 136 -65 -15 192 -122 -82 148 -6 -98 168 10 -145 105 102 -140 53
5228E3O7k14N7J92k95l0L48k26r5K89j06k09K67rj66Q3J10k86J36J74k69oK69
$$ 53 120 -94 -37 155 -140 -170 178 -48 -143 146 40 -169 98 89 -77 6 116 -170 -34 140 -129 -135 134
5251A34k30p6J90M1k37K32O9l36J94J41k34P1K02k29k9L11k16r9K70l5k94K60
$$ 134 -96 -172 18 59 -178 54 123 -213 -19 122 -112 -41 161 -68 -97 214 -2 -101 169 134 -160 100
5273A00K8k80J39J97l04R0K41k65m5K87j52k61L04q7j32K37K1l15J56J88j57r1
$$ 100 128 -152 -13 184 -120 -30 211 -54 -99 188 36 -225 79 -8 -140 97 118 -197 -41 147 -10 -101
5295a01K24j67j12L26j43k01K82l2k90K99K6k79J33J86l25N3L76k62j30L28j00
$$ -101 123 -44 -156 170 27 -174 108 76 -214 85 111 -168 -35 151 -174 -121 255 -7 -137 191 91
5316I1l22L89p8k27J80J10k64J39J75k53pK01j43j39K48p1k53L23K7k38K82m7
$$ 91 -231 158 80 -147 33 143 -121 18 193 -60 -67 134 -9 -148 100 29 -224 99 126 -112 170 123
5338A23k82Q5K00j91PK13j94j03K82j50j44K28k7k09K16J13l05J24J51k64K7K68
$$ 123 -159 -74 126 -65 -58 155 -39 -142 140 -10 -154 74 47 -162 54 167 -138 -14 137 -127 -100 168
5360A68j90q6K81j04k74K53J01l69K31J74k95O3K34k30q3L06j48j86L12l5k88
$$ 168 -22 -108 173 69 -205 48 149 -220 11 185 -110 -47 187 -43 -126 180 32 -154 158 123 -165
5381a65K03J04k95J84K29m61J72K61l17K3J95j45j48K43jj92J38J09k52P4J28
$$ -165 38 142 -153 31 260 -201 -29 232 -85 -62 133 -12 -160 83 82 -110 28 137 -115 -41 87
5402H7k15P4K41l09JK62j45j14K43j5k85K12J02l22J60J92l06J0K77j63j11K42
$$ 87 -128 -54 187 -122 -121 141 -4 -118 125 110 -175 37 139 -183 -23 169 -137 -127 150 -13 -124 118
5424A18j35j72L65j22k45K46J07l43J76J68k74K6K28j28j48K75r9k19L29j1l42
$$ 118 -17 -189 176 54 -191 55 162 -181 -5 163 -111 -85 143 15 -133 142 43 -176 153 142 -200
5445b00K32R4k43J09K01k88oK71k70o3K88j23j77K27M2k66K48M5k22P9J70k63
$$ -200 32 126 -117 -8 193 -95 -101 170 -100 -163 125 2 -175 52 94 -172 76 121 -101 -22 148 -115
5467a15J8K27j81j05K94j07j97K72K2l74K45J63l21J15K86l21lK17j21k21L65
$$ -115 -97 130 -51 -156 138 31 -166 106 128 -246 -1 162 -159 -44 242 -79 -82 135 14 -207 158
5488A58j23j46K10P5l66J58K39k72P1J71k54n6L17j57j60K71j13k05K51L6k54
$$ 158 35 -111 99 174 -192 -34 205 -67 4 175 -79 -135 182 25 -135 136 23 -182 69 105 -149
5509a49J56R3k33Q8J98j80r0K40j41j66L28p6k83K41J11l58K53J21l04P4K60k36
$$ -149 7 100 -133 -45 153 -27 -117 123 -18 -184 144 68 -215 26 137 -221 32 153 -151 -77 183 -53
5531e3n1K44r5k28L35j5l33K34J02l49J55K17k65J0K76k50j21K83p8j69L02p4
$$ -53 -104 140 45 -183 152 137 -196 38 140 -209 -54 163 -102 -92 184 -66 -187 96 18 -151 151 77
5553G7k48L08m5j87Q9J95k80N7K32k33q6K28p6j80K41oj73J68J9k20J08K53l53
$$ 77 -171 137 92 -95 -6 189 -91 -34 198 -35 -121 107 31 -149 92 86 -87 81 100 -120 -12 241 -112
5576a12o0L70k48n9K50j66j43K38O3l18K31J12l51J24K84k55j11L85k61j78L19
$$ -112 -172 198 -50 -109 141 -25 -168 70 133 -185 46 158 -193 -69 215 -40 -151 234 -27 -205 114
5597A14j9j93J71R8k87J93J09l11R4K19k54lK31j78j85L45k2l11L09k4k33J48
$$ 114 95 -98 73 171 -116 77 186 -125 -31 188 -66 -69 162 -16 -201 144 122 -189 120 96 -137 11
5619A1K11l42R2K35l03k6K60j42k07L69r7k92K91M7k84K11J39k79L1K15k22l5
$$ 11 222 -120 -28 207 -96 -122 138 -4 -211 158 61 -231 60 107 -177 34 173 -106 -75 140 -82 -117
5641a17L04k22j68L83j01k18K13N9k87J21K50l25K1L01k59l3K85k42j67L58j05
$$ -117 187 -35 -203 180 79 -139 74 133 -154 -33 217 -108 -87 214 -45 -78 207 -35 -202 156 51
5662E1k19K45J52l35P0K44l24J05K08k63p7K84r3j71K72l1l15K54J09l14J25J68
$$ 51 -168 77 229 -106 -36 208 -116 -11 197 -66 -143 141 48 -123 149 118 -197 57 166 -148 -23 145
5684A45l17P5L42k79j26L23j86j04K39q6k51K16J40k31M2K38k68m1L06k18q6L11
$$ 145 -172 -97 245 -34 -160 163 -23 -127 112 26 -225 -9 131 -100 -58 180 -88 -129 177 -41 -127 184
5706A84j37k54L50J5l15K44R6l12J12J61k35m1L25j89j80L42j05k13K11L2k64
$$ 184 47 -207 143 158 -157 87 183 -129 -17 144 -91 -132 193 4 -176 166 61 -152 59 91 -173
5727a73K00J73l24Q0J32j91K5K79l06m5K87r2k40L02qk72J80K03l57J04K43k40
$$ -173 27 200 -124 -44 88 -103 -78 201 -105 -150 137 45 -195 107 99 -173 7 210 -147 -43 200 -40
5749d0n5K74k09j13K73n8k68J94J58l48J47J94k70J29K31l39%K93j80j90K51J9
$$ -40 -95 179 -30 -143 130 72 -196 -2 156 -192 -45 149 -121 8 239 -100 -100 193 13 -177 74 93
5771I3k97K24J33l39K43Q3k07n7K92k50k4K98j95j97L23p3k19K00N9k55J55J60
$$ 93 -204 20 153 -186 57 140 -67 -124 168 -82 -106 192 -3 -200 123 50 -169 31 90 -165 -10 150
5793A50k96k6L32j82j25K94j46j47K77p4k19J59Q2k87J75K51l92M9K79k15j00
$$ 150 -146 -172 160 -22 -147 147 1 -146 131 57 -162 -3 79 -208 -33 218 -174 -125 154 -61 -161
5814a61K98r2k55L03K2k77J76J14k86J69K18l35K0K44j46j77L03j28j85K81L1
$$ -161 137 45 -210 93 115 -162 14 128 -158 11 229 -106 -86 158 12 -165 138 10 -175 106 137
5835A37l00K29R2k66J14J80l06JL02k24j36L38j43k10K93K5l31J78J30k78J12
$$ 137 -163 66 158 -108 6 186 -120 -119 183 -41 -177 161 18 -192 101 126 -205 -27 103 -175 -63
5856f3J85k27qK38j04j67K50o9k14K32J32l36J74J33k82R1J71j78p9K75j41k41
$$ -63 122 -105 -113 125 21 -146 104 35 -179 53 185 -151 23 156 -126 -35 136 -42 -121 154 13 -228
5878b28L81o2k78L01ql19K41J23k64L9K74k58o1L13k09j62K94n3k07K53L1k71
$$ -228 153 91 -187 114 106 -213 28 151 -113 -74 200 -58 -119 194 -15 -177 117 64 -143 110 141 -130
5900a30J68J05k45KK27j38j26K66j09j22J79l6j74J12J58l41J73J41k35J7K76
$$ -130 38 143 -102 -100 127 -11 -137 129 20 -102 77 41 -133 -21 137 -204 -31 110 -125 -108 168
5921A68l06M0K58j21j95K29P5k70J10R9k26J69J39k64P4K29k57j05L48j87j82
$$ 168 -138 -98 160 39 -156 73 148 -122 -12 87 -139 30 169 -95 -21 208 -49 -154 194 7 -175
5942a75K55mk28J91J02k71J61J78l50L1K91k19j10K94j26j73K88M4l62K06J17
$$ -175 80 76 -152 39 141 -130 31 209 -141 -110 181 -38 -148 146 20 -153 135 179 -183 23 140
5963A40l29J68J60j78o5L16k39j40L92k12k21K57J08l90K28J96l30J9K92k73p6
$$ 140 -189 -21 139 -39 -104 212 -27 -167 225 13 -208 49 157 -233 -5 191 -139 -120 172 -101 -177
5984a77L38k02j34L07j15k15L17L2l29J63J32k85J38K37j94r1K72k25p3K09j7
$$ -177 161 -41 -175 132 17 -198 119 151 -178 -15 117 -168 -30 207 13 -78 194 -31 -104 105 88
6005H8k84L34n2k21J02K33k95K3K53k20j02L20j83j55K57Rl04K92P1l32J55J91
$$ 88 -196 138 86 -135 -33 200 -95 -72 181 -39 -141 179 -4 -159 98 107 -197 95 166 -166 -11 180
6027A80l04P9K52k71j11L90j94j90L19Ol36K31J09l23K27J32l07M9K42k53n5K81
$$ 180 -124 -45 207 -64 -175 215 21 -169 150 156 -180 51 160 -163 64 196 -111 -62 180 -73 -128 153
6049A53j62k22L50k0k67J82J16l11J83J75k44j4K75j69j56L21j62j74K30Jk13
$$ 153 -9 -231 119 99 -168 14 130 -181 2 177 -67 -81 194 25 -131 190 28 -146 84 85 -128
6070a28J53J42l22R4K06k61J3K49k78l0L03j20j92K78J8k92K25M4k13O8K16k57
$$ -128 25 167 -155 -61 145 -116 -103 146 -132 -162 141 21 -171 107 125 -167 58 102 -111 -43 173 -84
6092h4o0L06k07j25L51q9l19L16M5k48J00J56l01O1K04j47r3L88k98j38L51m9
$$ -84 -144 162 -45 -170 181 92 -227 89 134 -114 -14 142 -159 -98 106 -41 -134 254 -44 -182 169 120
6114A20l64L39P1l45K05K33l80k4L16k55j06L48j53j79L39j39j41K17Kk87J98
$$ 120 -244 95 166 -179 26 259 -121 -145 171 -84 -190 158 5 -174 165 26 -115 102 104 -183 15
6135A5J20k62O3L27l40k1K73j83j27L00j16k17J70J57k49P0K43k66pJ98k02r2
$$ 15 135 -127 -64 263 -77 -98 175 -8 -135 165 49 -168 2 159 -90 -20 223 -43 -50 148 -54 -146
6157a46L40j84k11L47k4k95K29P5k95J33K11k73jK79j91j28L14j84j44K36k1k28
$$ -146 194 10 -201 146 122 -173 56 131 -164 -31 180 -93 -94 185 -6 -134 180 -4 -148 88 67 -161
6179a61K23M4k08N9J99k59J2K66k20p9K26o8j96K50j0k27K25qk42P0K69k78j7
$$ -161 62 106 -102 -43 156 -103 -91 175 -45 -124 102 34 -162 88 78 -149 76 68 -174 -104 165 -113 -130
6202a30K54j87r7L06k6k79K41Lk32J55J00k83P9K74k27r5L27k13j32K61p6k03
$$ -130 124 -63 -160 146 120 -159 82 85 -147 8 108 -175 -96 178 -49 -144 183 -30 -162 99 23 -180
6224a80K70O0l25K13J17k74K6K40k28r6L70k01j60K34K6k71K21P5l16K30J56l66
$$ -180 90 150 -175 38 155 -119 -93 147 -81 -177 193 -8 -168 66 92 -179 42 117 -199 31 187 -179
6246a79J30K18k92P3J97j45j87L48k8k95K16P6k62J34J56l06R3K26k03o1K94k14
$$ -179 -49 169 -123 -50 147 2 -185 163 135 -160 56 132 -130 4 160 -146 -53 173 -30 -91 203 -11
6268a1j95M17j85k41K58J09l00J48J98l66P1L31k92j01K69j18k29L82jl34K58
$$ -11 -206 211 26 -215 43 152 -148 0 198 -168 -97 234 -58 -159 110 -8 -237 145 144 -190 68
6289F8Q6k87J28K72l33j4K36k20p7K91j64k58L72K6l29K41N1k39J25K03k29o3
$$ 68 154 -133 -5 267 -66 -80 156 -64 -141 150 -14 -272 100 126 -203 38 89 -150 -25 178 -51 -114
6311a14L21k17j03K55j26k22K43N8k85K57Q8l21O3L21l05o4M49l34o0K06k3k91
$$ -114 207 -10 -113 142 16 -206 37 95 -190 67 155 -166 -103 218 -87 -151 298 -36 -96 110 87 -204
6333b04K48J12k65J06J32k78J03K64l33O3J74j55j94M38j30k13J89L5k24J00K55
$$ -204 44 156 -109 -3 129 -149 -46 218 -115 -52 122 -33 -227 211 81 -132 57 92 -132 -32 223
6354B23l05L1K41k55n9K36j17j80L43q7k32K03J36k80J48J44k75m3K92j95n4K52
$$ 223 -82 -51 190 -65 -124 112 -5 -185 158 71 -161 42 178 -102 46 190 -85 -128 164 -31 -85 167
6376A67j20k10K76L7l13J96J05k71J08K11k73J2L15k52j84M39k24k02L59o5k72
$$ 167 47 -163 113 150 -163 33 138 -133 -25 186 -87 -75 240 -12 -196 243 19 -183 176 111 -161
6397a61K57O3l08Q1K47k71n7K75j94p4K97j33j90L15n8k44K09R2l32J53K54l21
$$ -161 96 159 -149 -68 179 -92 -149 126 -68 -142 155 22 -168 147 89 -155 54 146 -186 -33 221 -100
6419a00J9K23j92r4K95j45j29K04M7k55J85J08l60J19K63k73j6K53k18p6L15j95
$$ -100 -81 142 -50 -144 151 6 -123 81 128 -127 58 166 -194 -75 188 -85 -101 152 -66 -142 173 -22
6441b2j62K95j0j76J22J12k95J26J74k42o6L25j81j40J86L7l33L22J08l88K27
$$ -22 -184 111 101 -75 47 159 -136 -10 164 -78 -144 181 0 -140 46 83 -250 72 180 -208 19
6462A9J48k93J13J64k31jK71j84j48K79o4k43J99M7k29J69R7k33L5K38k28k0K49
$$ 19 167 -126 -13 151 -80 -81 190 6 -142 137 73 -170 29 76 -153 16 113 -120 -85 153 -75 -95 154
6485A54j19j89K76o3k25K58k5k46K03P4k26J17J56k45N4J95j26j33K24o5k17K41
$$ 154 35 -154 122 59 -166 92 67 -179 24 98 -128 -11 145 -100 -46 149 23 -110 114 49 -168 73
6507G3M1l20K53J21k56J5K12j63j30K81j07k14K61N9k79J99J45k76N9J77k79N5
$$ 73 114 -206 47 168 -88 -73 139 -24 -154 127 20 -194 67 126 -153 46 191 -85 -26 151 -128 -73
6529g3J73j68o2K95j34k15K35Nk63K10J35l34J84J58k72J5L19k92k7K38q6j67
$$ -73 100 -68 -130 165 31 -184 51 56 -207 3 138 -196 -12 146 -126 -111 208 -84 -111 127 41 -126
6551a26K12L7k97J43J94l37J36K43l09J5K22j25j65L82j14k37J74J7k40K03J47
$$ -126 86 123 -174 -31 163 -174 -38 205 -104 -89 133 8 -157 225 111 -126 48 65 -175 28 175
6572A75l28J05K19k31o0K32j39j31K58j6k18J77%k38K14J57l34N4K63k25M9J71
$$ 175 -153 -48 171 -60 -120 112 -27 -158 100 84 -134 43 43 -195 19 176 -158 -104 159 -66 -17 154
6594A54j57r3K22p4k13K79Rl12J86J42k83O6K17k12k4K50k22j12L15mk88K29N0
$$ 154 -3 -96 126 52 -161 118 127 -185 1 143 -140 -74 143 -69 -93 157 -65 -177 138 134 -154 75 125
6617A25l00J70K10l77Q2K80k81l9L11k10j15K20qk47K29J30m12K26J94l69Q3K73
$$ 125 -175 -5 205 -172 -90 190 -91 -130 181 -29 -144 76 68 -179 50 180 -232 -6 188 -181 -98 175
6639A75j84j53L20k24o1K79o2k83J81O8j78J66J22k37m0K79j46j95K97m1k34K84
$$ 175 -9 -162 158 -66 -127 152 90 -193 -12 56 -122 44 166 -71 -111 168 22 -173 124 83 -151 133
6661A33j22j04J49J18k76L9K08k48L7K63j84j33K34j69j08K72K6k61J72R3k63
$$ 133 11 -93 56 174 -102 -63 145 -103 -66 197 13 -120 114 -55 -163 109 135 -126 46 139 -124
6682a24K7K62l09mK94j55j03K75q2k19J65N8k43J41J67l01J39J47j84j07L14j80
$$ -124 -97 165 -144 -148 146 -9 -112 163 81 -138 27 85 -158 -17 150 -151 -12 135 -49 -156 158 -22
6704b2j48K42k5k01K03L5k43J42J32j62M6J82k16q9K73j16j58K89m2k38J94K7
$$ -22 -170 72 47 -154 49 84 -159 -17 115 -47 -1 181 -35 -124 149 33 -125 164 122 -116 78 105
6726A05k74J88J29k27N9J62j50j24K87j51o0J75kl01J97J17k65J27J88k72O4K06
$$ 105 -169 19 148 -79 -20 142 -8 -132 155 4 -56 119 117 -184 13 130 -135 -8 180 -92 -28 178
6748A78k95o9L62j05k26J61Rj44K16M0l32J85J61k20K3K23j61j30K38p5j54K14
$$ 178 -117 -186 176 71 -155 6 15 -129 87 127 -205 -20 141 -79 -56 167 6 -124 114 39 -115 99
6770I9jk44J94P0k71J20K30k46o8K73j72j26K85j40j78K47k5j91J69R7k65P5K25
$$ 99 98 -146 48 118 -153 -33 197 -49 -117 156 -16 -142 143 3 -175 72 47 -144 25 122 -143 -68 157
6793A57k81L3K56k58oK05n1k33K53Rk46K05J35k36PK45k87mK60j85p1J91k8k14
$$ 157 -124 -91 165 -93 -99 106 55 -178 75 84 -162 43 178 -58 -51 194 -93 -97 163 -22 -93 98 70 -144
6817a44K25J3k54K51O1k61N8K47l01r2L80j72j33K34K7k57J80R7l10J72J59l15
$$ -144 81 94 -160 91 152 -109 -51 196 -105 -197 183 11 -122 112 139 -118 62 159 -151 21 180 -135
6839a35R3K37k64p0K58m3k93L03jk23K49Ok48Q3J72k51M2K22k48m1K69p6k45L56
$$ -135 -42 195 -69 -139 119 76 -217 86 85 -138 111 117 -131 -48 124 -127 -85 137 -111 -152 117 41 -204 152
6863A52n3k91K19R3k58N5K13k37OK09j68q0K88j66p0K07k0j88J46J08k98R1J98
$$ 152 99 -192 27 120 -138 -83 130 -107 -101 108 -60 -140 148 -18 -88 119 99 -89 57 165 -133 -42 156
6886A56k71L2K52k57k4K22o4j83K44mk10Q1R5k32J39J60j91o9L11k82j6K31q1
$$ 156 -115 -83 169 -88 -112 110 46 -137 107 103 -107 -26 69 -163 -24 136 -55 -124 187 -95 -111 120 39
6909C9k15K40o5j76J82J45k80O0K28k09o3K39j38j88L21j8k75K61l1k34J94J71
$$ 39 -176 64 -1 -177 5 150 -130 -70 158 -51 -114 125 -13 -201 120 102 -173 88 57 -177 17 188
6931A88k05J3J51k19J0K63k05j59L32o5j76K46o1j91J01O7k17J23K24k74r2L64
$$ 188 -17 -4 147 -72 -62 201 -4 -163 169 104 -72 174 113 -78 23 90 -127 -4 220 -54 -146 218
6953B18k84n4K47m7k66K92Rk36J03J61k50KL28l01j59L63j36j54K31N1l42K45
$$ 218 -66 -120 127 80 -186 106 115 -121 -18 143 -107 -105 223 -78 -237 126 -10 -164 67 118 -224 21
6975B1J46l13P6K13k36L5J60k04l0J91pk66K61K1j84J34J45k89Q6J76k34R5K07
$$ 21 167 -146 -70 143 -93 -58 102 -102 -132 59 52 -214 47 68 -116 18 163 -126 -40 136 -98 -3 204
6998B04k64r6L02o6k35L04n5k59K01N2k35R1J83k25k2K69j55j30L13q6k47K83
$$ 204 -60 -156 146 80 -155 149 94 -165 36 88 -147 -56 127 -98 -120 149 -6 -136 177 91 -156 127
7020A27k5k89K49J14k87J03J68l04J18J43j70m8K33q8r5J03N7k50J29J11j96O3
$$ 127 102 -187 62 176 -111 -8 160 -144 -26 117 -53 -101 132 44 -51 52 109 -141 -12 99 -97 -34
7042c4J69k58J5J77l1k11L14j47j75K26M5k37J75J49l52J30K33k37jK35j37j67
$$ -34 135 -123 -108 69 38 -173 141 -6 -181 45 90 -147 28 177 -175 -45 188 -49 -50 185 48 -119
7064a19K51p6k24J69J31k68J38J49k93J34J44k08J3J53j17r1J21Q7l37K82L7j85
$$ -119 132 56 -168 1 132 -136 2 151 -142 -8 136 -72 -59 94 -23 -114 7 94 -243 39 76 -109
7086a09J54M8k16N7K23j92r8K66j43j69K69l2k25K54O7k93J15J61k39P7J87j82
$$ -109 45 93 -123 -66 157 -35 -133 133 -10 -179 90 58 -167 87 154 -139 -24 137 -102 -25 162 -20
7108b0j05K27l9k19K28Jk03J47J78k64N0K33l02%K57k20j22K82p0k17J89N6j93
$$ -20 -125 102 63 -156 72 73 -130 17 195 -69 -19 214 -88 -88 169 -51 -173 109 39 -178 11 67 -126
7131a26J46J21l18J41K24k77mK26j54r7K77o2k41K17M0k81J68K04l31P7J41j64
$$ -126 20 141 -177 -36 188 -89 -93 133 -21 -118 159 97 -144 73 113 -168 0 204 -127 -50 91 -73
7153g3nK12j47n8K05o4k81L20J1k50J34J20k06K0J69j53m2K76k26q7K59Nk70J94
$$ -73 -78 134 -13 -71 134 70 -211 109 120 -130 4 124 -82 -62 107 -46 -88 188 -38 -125 134 139 -131 63
7177F3L0k07Q7J43k26P9J85k49NJ95j05j59K74n6k67K70k3k41J55K00k70R2J71
$$ 63 93 -114 -27 116 -110 -31 154 -95 -90 105 0 -159 115 59 -208 62 39 -202 -47 153 -117 -25 146
7200A46k16m1K34j14j61K66m6j72J89M1k33J52P0k72J34J65j69j25K86p8j91K52
$$ 146 -70 -111 123 9 -152 114 68 -104 85 126 -107 45 115 -157 -23 142 -27 -152 134 56 -135 117
7222A17m5k55K36M5k74R5K22k62L4K30j88j9J95j01j44J62L1k86J69J77k68J58
$$ 117 72 -183 53 98 -176 -81 141 -121 -87 143 -45 -64 131 30 -114 48 79 -207 -38 139 -129 29
7244B9P8k09j5K36k20p5K86j07j38J75O1k46J19J33j43J7J16j25r1L08j97j43
$$ 29 107 -102 -117 119 -101 -176 110 3 -135 40 101 -145 -26 107 -36 -19 97 -28 -119 189 -8 -151
7266a51K41q2j34J31R1k43J28J66l07J06J76k47L0K67k37n6K52j82j8J16Nk12
$$ -151 90 8 -126 5 96 -147 -19 147 -160 -54 122 -125 -95 172 -65 -121 131 -51 -69 47 52 -160
7288a60J83M4j76P5K41k24q1K32j27j94K90j7k90K14N7k30J33J61k36J31J16k34
$$ -160 23 67 -109 -34 207 -17 -98 134 7 -187 103 86 -204 10 67 -163 -30 131 -105 26 142 -92
7310i2JK45j25j46J67J1k51K81ok09J35P4k06L7J96j30q3K33j02j42J84j1j77
$$ -92 -91 154 29 -117 50 61 -190 91 85 -124 11 85 -121 -84 112 -18 -101 132 30 -112 72 61 -116
7333a16J32J08k57J58J47j84o9K24j48j08K99j61j01K16n0k00J28J33k53N3J84
$$ -116 16 124 -133 25 172 -12 -81 143 -5 -113 186 25 -76 140 90 -110 18 151 -102 -49 135
7354A35k42R0Q0o2j49K89j61j52J72K5j68J60O3k37N4K35k33K7K35j88k8J48J1
$$ 135 -107 -17 63 1 -148 141 -20 -172 0 25 -143 17 80 -157 -103 132 -101 -74 161 -27 -55 93 104
7377A04k28J67j5j41R9J17j67J3K08j89q3K05j48LJ89n7k10J78J2j28P0R4j73
$$ 104 -124 43 28 -113 -14 103 -64 -51 157 -32 -115 90 -58 -55 134 77 -133 45 57 -71 -1 93 -80
7400h0J04Q9j38r8K88j87j60L00r5j86K27Ok03J24J69k55N8J67j49q6K74j26j49
$$ -80 24 113 -25 -123 165 -22 -182 118 23 -163 64 70 -133 -9 160 -95 -37 130 -19 -105 169 43 -106
7423a06K39j05j73J30J16j92Q2J40k70O6J82j29j09K67j43p5K10o1j98K09J6k15
$$ -106 133 28 -145 -15 101 -91 -9 131 -139 -73 109 -20 -129 138 -5 -80 130 69 -129 80 96 -119
7445a19J44N6j87R2J71j86j3J33r3j28J95L7k40K07J9r9j2J03j53LJ54j11r5J88
$$ -119 25 81 -106 -14 157 -29 -42 91 -2 -130 65 102 -138 69 88 -11 -23 80 -73 -70 84 -27 -122 66
7469F6J3k64K54m0j59J64Q9k17L5J52j81qK24j89j44L55o9j67J89k8k08J36J09
$$ 66 79 -185 69 29 -130 34 123 -94 -59 93 -88 -96 128 -61 -205 150 81 -86 103 75 -133 3 112
7492A12k27P6J72k20NK25j53r0K68j46j29K15L4k59P9J63k33oK90k48J7J10p0
$$ 112 -115 -39 133 -87 -82 143 -10 -100 168 22 -107 108 142 -117 -38 125 -108 -114 176 -72 -55 55 -15
7515a5o1J57n5j98J78J41k45J59L6j50l0K23j81l2K26j68q2J70j2k13K41M1l15
$$ -15 -76 81 26 -172 6 147 -98 61 97 -53 -83 140 -41 -73 153 -15 -97 73 61 -152 89 130 -185
7538a85K01R2k29N8J87j25j22K77j64j18J93k9j66K11nj64J01R8j50m0K06j05
$$ -185 16 108 -121 -63 124 -1 -123 154 -10 -128 65 36 -130 81 76 -88 13 111 -39 -79 127 22
7560B2j12K25m6k19K02Pj71J50K0j32J04N7k01N3J79k03l2J42oj41K19j12j27
$$ 22 -90 135 89 -130 72 79 -92 58 78 -54 50 107 -94 -41 138 -65 -97 45 39 -102 117 5 -122
7583a22J49Q2k73Q7J87j36n9K20j58r4K39o5k25K05j5j17J46N8j75K8J97k01q1
$$ -122 27 109 -164 -77 110 -26 -85 135 -23 -117 122 57 -168 37 22 -95 51 109 -66 -38 159 -42 -123
7606a23K02q1r4K36j42j06J64P9k41J27P0j24J5J91k78L9J62j19m9J84m6j78J80
$$ -123 79 -2 -96 140 -2 -108 56 135 -106 21 91 -33 -18 173 -105 -66 96 -23 -72 112 66 -112 68
7629F8P3k59J44R8k10P1J05j56PJ68p9j75K48m6j49J39Rj91J42Q2k21J55R9j77
$$ 68 141 -118 26 124 -86 -15 90 -66 -59 109 30 -145 103 57 -92 47 56 -135 7 89 -132 23 122 -55
7653e5m9K45j14j19J07m1jJ35Qk59J86N9j58MK05j45j34K83j05j16J66p8j22J86
$$ -55 -104 141 27 -92 15 -26 -27 108 116 -143 43 102 -56 -52 153 8 -126 157 52 -64 102 24 -98 88
7677H8N0k19Q3Q3j50oK64j96j26J82r4o5J94m4k11J55O2j68J09J12j97N2J15j40
$$ 88 138 -81 2 85 -65 -71 193 -3 -129 53 -41 -106 88 44 -167 -12 50 -118 -9 103 -94 -42 73 -67
7701f7rK35j49j27K55q3j59J28J00k41J34J22k24L5K28k08l5J96j15p9J36M1k18
$$ -67 -76 159 10 -117 138 55 -104 24 124 -117 17 139 -85 -50 178 -30 -65 131 16 -63 73 114 -104
7724a04J80P0k62K2K50k00K5J25j13j01K16n0j76J57l2j34J78M1k25L8J69j28
$$ -104 76 146 -116 -94 156 -44 -19 106 -7 -108 108 58 -118 39 7 -127 51 92 -133 -95 74 -54
7746e4k0J69j38r3J96n2j25K10o4j03R5O3j45L9J55k44M6J74j27j44K69j5k32
$$ -54 -74 95 -43 -136 60 8 -117 93 29 -74 21 84 -61 -22 133 -111 -65 109 -18 -162 107 92 -140
7769a40K31o2j66J80J12k39jK21j92l0J98j37p8K15o7k38K53P8k33J10J31k07
$$ -140 91 29 -137 43 155 -84 -85 136 -56 -86 112 -25 -103 112 45 -193 60 138 -95 15 146 -61
7791f1J7J83j75l8K06j19j45J94j16l4R0R4j93O7J36j88j4K27j60k4J52o6j22
$$ -61 -44 139 -36 -74 132 13 -132 62 -54 -88 2 96 -97 -30 106 -82 -96 131 -29 -53 99 33 -89
7814h9J05J1j84K02R4k51J07P2j71K4J59j17k2J46j34k1J66k7j87J68O5k10J06
$$ -89 16 27 -157 45 139 -112 -5 67 -104 -80 79 -38 -60 86 -48 -69 97 70 -117 51 116 -94 12
7837A2J47k27k7J87j01j03J95o3q8R6N0k13K01J3j04j04J98j07l3J57n9q9R6q0
$$ 12 159 -68 -95 92 -9 -112 83 20 -68 28 78 -135 66 79 -25 -129 69 -38 -71 86 27 -62 34 -46
7861d6o9J33K5j40O7P0r9JJ57k15mK00o2p6J54n6k23K32O3k24Q6J37k23R0J29
$$ -46 -115 18 43 -97 -30 40 -59 -58 99 -116 -120 80 18 -58 96 40 -183 49 112 -112 -26 111 -112 -22 107
7886A07j40p8K50j31k4Q7j22p8J48N7j57P6J15j35L0J64j92j29K48j29o9J95l4
$$ 107 -33 -111 139 8 -16 71 -51 -129 19 76 -81 -5 110 -25 5 169 -23 -152 96 -33 -102 93 59
7909E9j89R1J18k25R9J88k29k6K35j30j03K23p5j79K06k4j22J33P7k47R0O7j02
$$ 59 -130 -39 79 -146 -47 141 -88 -114 121 -9 -112 111 36 -143 63 39 -83 50 127 -120 -30 37 -65
7932f5M6J25j82LK02j45q5J58K2k44K69K5j83P6J57k23K7J64j99j8J46J1j84J72
$$ -65 -19 106 -76 -73 129 -16 -101 57 79 -165 104 129 -54 22 179 -44 -17 147 -52 -70 76 87 -97 75
7956G5M3j76J06J1r0J1J49j91k1J63j14o1J59k4j56K21j04j75J78R5k36R6J21
$$ 75 118 -58 48 59 -31 -20 129 -62 -83 80 -34 -95 64 40 -116 105 1 -174 4 99 -137 -41 80
7979H0j45L6J79p5j62J72l0j83J26L5j27R0Q2j55M4J95j75l5J75p9p8J18O1l12
$$ 80 -65 -29 150 75 -87 85 55 -128 -2 33 -94 -4 78 -77 -33 162 -13 -48 127 48 -30 88 149 -163
8003a63K28P1j93K5J41j83k9K23j18k5J65j63o0J94q8l6L6L5j22N5M4j62J30J52
$$ -163 65 136 -57 -32 109 -74 -103 120 2 -23 142 -21 -81 113 25 -11 25 60 -62 -7 37 -125 5 157
8027A57j43j46K41j73k3J47n5j20J72K4j75J01J6l0p2K38j73j58K94r8p2L8O6
$$ 157 14 -132 109 -64 -87 60 5 -115 57 81 -94 7 23 -7 -79 159 -14 -172 122 24 -48 -10 56
8050E6j52Q6J07j42KJ75j24l2J08l6j58J86r6n4J61Lj84J26J24l01J34P2p9nJ16
$$ 56 -96 -10 97 -45 -43 132 8 -24 84 48 -110 76 -20 -74 87 90 -94 32 156 -145 -11 61 -18 -23 93
8075I3j9j60J84n6j69J64Qj65Q8J03j25L6Q4j02l3K44k50nJ91m5j55O7Q7j08M1
$$ 93 74 -86 98 42 -127 37 45 -120 -32 71 -54 -18 66 -36 -69 175 -75 -80 111 66 -89 -22 65 -43 -2
8100bL4j45K9K05j63m8J63q9n8O1R8j36P4J43k52J25Q4k05J6J75j37q1K27j10
$$ -2 32 -113 -84 121 -42 -90 73 -16 -74 -13 85 -51 23 166 -86 39 123 -82 -66 109 -28 -109 118 8
8124Hj07J65n7p0J11j8j51J11J20j57PJ59j46n3J45q8p3J60n8r8Q7O8j35J28O5
$$ 8 -99 66 9 -61 50 32 -119 -8 112 -45 -38 121 -25 -78 67 -21 -94 66 8 -90 -3 65 -70 58 123
8149A23k99O8K32j65pJ08l5j57J76L3j74J23K4j35O9J09j45p3J86n8o1J56k7j90
$$ 123 -176 -108 124 -41 -48 60 25 -132 44 77 -97 26 50 -85 -16 93 -52 -125 61 3 -58 98 71 -119
8173a19J54Mj46J08R4k57R7J71j49o8K22j80MJ78l9j88J08M4
$$ -119 35 39 -107 1 95 -162 -65 106 -43 -111 111 -69 -65 113 74 -114 -6 38
8191C8
$$ Imaginary data points
##PAGE= N=2
##DATA TABLE= (X++(I..I)), XYDATA
0@%%%%%%%%%%%%%Qj6J6j6J6j6K3l1L2l2M0m8N5o3P0p8Q8j02J11j22J37j53J72
$$ 0 0 0 0 0 0 0 0 0 0 0 0 0 0 8 -8 8 -8 8 -8 15 -16 16 -16 24 -24 31 -32 38 -40 48 -54 57 -65 72 -81 91
36I1j93K15k38K62k89L20l56L95m37M85n40O02o72P54q52R70j115J298j537J867
$$ 91 -102 113 -125 137 -152 168 -188 207 -230 255 -285 317 -355 399 -453 517 -598 700 -837 1030
56A030k345L106m498P782k6697j7903Q0871m2410k8512O4162k9553n3938P2594
$$ 1030 -1315 1791 -2707 5075 -21622 -39525 41346 -1064 -29576 34586 5033 -48905 23689
69B3689R268o9698L7608L1252o4846K5573N1586o6101j0990O8616l5579k9452
$$ 23689 32957 -36741 867 32119 -32727 -7154 44432 -21669 -32659 35957 378 -29074
81b9074N9937k3677n0663O1681J3399o3252L1245K9679n9961J9487N3038n7074
$$ -29074 30863 7186 -43477 18204 31603 -31649 -404 29275 -30686 -11199 41839 -15235
93a5235j4156O1992l2908l0293N9664j7665n0691N4578J2852n9673L0814L0016
$$ -15235 -29391 32601 -307 -30600 29064 11399 -39292 15286 28138 -31535 -721 29295
105B9295n7376J6190N0807n2345j3339N7649l1475k9132N7223j4762m9085M8680
$$ 29295 -28081 -11891 38916 -13429 -26768 30881 -594 -29726 27497 12735 -36350 12330
117A2330J2505n5323K9434L1325n4548J0415M9574m6622j5631N6520k7182l3581
$$ 12330 24835 -30488 -1054 30271 -24277 -13862 35712 -10910 -26541 29979 2797 -30784
129c0784N4443q525n0492M3998J7177n4364K5250L4874n2854M442N0278m1009
$$ -30784 23659 15134 -35358 8640 25817 -28547 -3297 31577 -21277 -16835 33443 -7566
141g566j8132N4404k4359l5840N1011l895m7691L9631J7237n1076K1716L4014
$$ -7566 -25698 28706 4347 -31493 19518 15623 -32068 7563 24800 -26276 -4560 29454
153B9454m7141J774M6073l5654j8423M8700j9938l4306M5447m9m3723L3216J7508
$$ 29454 -17687 -15913 30160 -5494 -23917 24783 4845 -29461 15986 15937 -27786 5430 22938
166B2938m6360J7541L3727m1556j936M2407l1190j9175M5749j6103l3678M1805
$$ 22938 -23422 -5881 27846 -13710 -15646 26761 -4429 -23604 22145 6042 -27636 14169
178A4169J644m2121L0910J7921m4529J6398L2829m0298k703M0915k9596j8621
$$ 14169 15813 -26308 4602 22523 -22006 -5608 27221 -13077 -15780 25135 -4461 -23082
190b3082M4540j4885l3362L9723K867m0763K8867J8717m2842J3588L2305l7557
$$ -23082 21458 6573 -26789 12934 15801 -24962 3905 22622 -20220 -6632 25673 -11884
202a1884m636L9826k5827j9755M1685j1473l3580L6425N975l9421K5019J9809
$$ -11884 -16520 23306 -2521 -22276 19409 7936 -25644 10781 16756 -22665 2354 22163
214B2163m0786J0394L2602l4468o635L8459k2744k0773L9302q741l2682L3325
$$ 22163 -18623 -8229 24373 -10095 -16730 21729 -1015 -21788 17514 8773 -23909 9416
226I416P293l7462K1617J9695l7307Q180L0684l0334p307L4649j9307j9440L4965
$$ 9416 16709 -20753 864 20559 -16748 -8568 22116 -8218 -15525 19124 -183 -19623 15342
239A5342o424k9961K8665P635l3943J8525J8835l3563O474K8653k7311p677L2568
$$ 15342 8918 -21043 7622 15257 -18686 -161 18674 -14889 -8415 20238 -7073 -14750 17818
252A7818j7125j9163L2766n177k9403K6771Q408l3082J7284J9481l2618N144K8750
$$ 17818 693 -18470 14296 9119 -20284 6487 14895 -18187 -903 18578 -14040 -8896 19854
265A9854k6066q400L2151j5958j9754L1313l920k8911K5205R353l2161J5499J9991
$$ 19854 -6212 -14612 17539 1581 -18173 13140 9220 -19691 5514 14867 -17294 -1795 18196
278A8196l1003L739K8382k4381r343L1028j4322k0232K9566k010k8506K3140J0712
$$ 18196 -12807 -9068 19314 -5067 -14410 16618 2296 -17936 11630 9620 -18886 4254 14966
291A4966l1156J3332K0946k9148J590K7933k2282j0627K9518j1987k0359K7178
$$ 14966 -16190 -2858 18088 -11060 -9470 18463 -3819 -14446 15072 3085 -17274 9904
303I904m60k6972K0610J1161k8753J1401K0065k6500O52K5732k0231j0203K7328
$$ 9904 9444 -17528 3082 14243 -14510 -3109 16956 -9544 -8892 16840 -3391 -13594 13734
316A3734j0937j8865K5007j58k4880J9045J0703k6835J0210J9120k4964J14K4578
$$ 13734 2797 -16068 8939 8781 -16099 2946 13649 -13186 -2976 16144 -8820 -8706 15872
329A5872j9032j0203K6154r812j8557K3807O75k4269J8018J0949k6131R212J9076
$$ 15872 -3160 -13363 12791 2979 -15578 8229 8904 -15365 2653 13602 -12529 -3317 15759
342A5759k4015q33K4376j8082j0697K5780q869j8744K3182J519k4166J6915J1598
$$ 15759 -8256 -9089 15287 -2795 -13492 12288 3419 -15325 7857 9376 -14790 2125 13723
355A3723k5724P839J9657k3089k219K4350j6387j1691K5033p073j9186K1606L007
$$ 13723 -12001 -4162 15495 -7594 -9813 14537 -1850 -13541 11492 4419 -14767 6839 9846
368I846k3462J4691J2260k4097N872J9308k0907l398K3256j4391j1746K3239n706
$$ 9846 -13616 1075 13335 -10762 -4890 14418 -6489 -9887 13369 -1022 -12768 10471 4765
381D765j8347J9725L404k2155J3097J2004k2545M909J8585j9157l745K2016j2900
$$ 4765 -13582 6143 9547 -12608 489 12493 -10052 -5143 13442 -5715 -9460 12556 -344
394c44j1745K1929m928j7803J8285L725k1059J1873J1914k1198M128J8047j7858
$$ -344 -12089 9840 4912 -12891 5394 9119 -11940 -67 11847 -9351 -5223 12824 -5034
407e034m273K1481j2093j1892K1228m392j7740J7583M208k1019J1476J2285k0832
$$ -5034 -9307 12174 81 -11811 9417 5025 -12715 4868 9076 -11943 -467 11818 -9014
420i014L520J8465j7321n143K1505j1200j2860K0889l365j8253J6797N218k0682
$$ -9014 -5494 12971 -4350 -9493 12012 812 -12048 8841 5476 -12777 4020 9238 -11444
433a1444J0297J3001j9828K174J8451j6039o152K0741r856j3221J9715k163j8033
$$ -11444 -1147 11854 -7974 -5800 12651 -3388 -9540 11201 1345 -11876 7839 5676 -12357
446a2357J5655N902j9794R125J2880j8513J343J7722j4742o499J9556q645j3080
$$ -12357 3298 9200 -10594 -1469 11411 -7102 -5759 11963 -2779 -9278 10278 1633 -11447
459a1447J8355j286j7211J4207O346j8512P856J2633j7126M55J6670j3152o863
$$ -11447 6908 5622 -11589 2618 8964 -9548 -1692 10941 -6185 -5730 10940 -2212 -9075
472i075J8374p578j2710J7193m96j6543J3169O512j7759P216J2438j6606j0J6422
$$ -9075 9299 1721 -10989 6204 5708 -10835 2334 8846 -8913 -1697 10741 -5865 -5875 10547
486A0547j2511p247J8002o620j3131J6812M90j6925J2544P294j7839O325J2915
$$ 10547 -1964 -9211 8791 2171 -10960 5852 6342 -10583 1961 9255 -8584 -2259 10656
499A0656j6041j128J6650j1475q083J7535n305j3492J5861J561j6766J1400P955
$$ 10656 -5385 -6513 10137 -1338 -9421 8114 2809 -10683 5178 6739 -10027 1373 9328
512I328j7271N072J3158j5115k023J6374j0332q542J6939m189j3651J4932K412
$$ 9328 -7943 -2871 10287 -4828 -6851 9523 -809 -9351 7588 3399 -10252 4680 7092
525G092j6505J0080Q379j6452M007J3085j3896k622J5675r007q605J5689l265
$$ 7092 -9413 667 9046 -7406 -3399 9686 -4210 -6832 8843 -164 -8769 6920 3655
538C655j3097J3509K759j5573Q932Q307j5351L419J2470j2833k686J4935q304
$$ 3655 -9442 4067 6826 -8747 185 8492 -6859 -3440 9030 -3803 -6489 8446 142
551A42q511J4968k823j2903J2766L122j5419Q391Q776j5102K862J2829j2528l199
$$ 142 -8369 6599 3776 -9127 3639 6761 -8658 -267 8509 -6593 -3731 9098 -3430 -6629
565f629J4981p736q956J4519k110j3261J2166L856j5282P644R262j4585K167J3033
$$ -6629 8352 616 -8340 6179 4069 -9192 2974 6830 -8452 -808 8454 -6131 -3964 9069
579I069j1905l864J4818p097r467J4017j327j3224J1344M574j5025O797R840j3867
$$ 9069 -2836 -6700 8118 1021 -8446 5571 4244 -8980 2364 6938 -8087 -1290 8550 -5317
593e317J014J3045j0874m642J4247n910r773J2926l23j2809J0138N166j4081N523
$$ -5317 -4303 8742 -2132 -6774 7473 1563 -8210 4716 4393 -8416 1722 6888 -7193 -1670
607a670R976j2911L05J2512r905m867J3466n376r509J2113K45j2327R360N409
$$ -1670 8306 -4605 -4300 8212 -1693 -6560 6906 1530 -7979 4134 4379 -7948 1412 6821
621F821j3472M942R779j2169k60J2129r278n176J2964m552r633J1569Q59j1971
$$ 6821 -6651 -1709 8070 -4099 -4359 7770 -1508 -6684 6280 1728 -7905 3664 4523 -7448
635g448Q612N728j3030M072J0039j1588j082J2146q550n809J2914l913r920J1291
$$ -7448 1164 6892 -6138 -2066 7973 -3615 -4697 7449 -1101 -6910 6004 2091 -7829 3462
649C462J493j2178P991O341j2918L298J0529j1364j823J2299p780o370J2698l069
$$ 3462 4955 -7223 768 7109 -5809 -2511 8018 -3346 -5169 7130 -650 -7020 5678 2609
663B609j0140J0526K361j2049O922O732j2265K407J0330j0248k590J1923o689
$$ 2609 -7531 2995 5356 -6693 229 6961 -5304 -2897 7433 -2815 -5405 6518 -171
676a71o573J1909k307r963R686K695j1433N896O908j1618J719J0317r463l044
$$ -171 -6744 5165 2858 -7105 2581 5276 -6157 -261 6647 -4971 -3252 7065 -2398 -5442
690e442J1648n939o801J1352j670r967R040L092j1167N302O853j0863J235J0107
$$ -5442 6206 267 -6534 4818 3148 -6819 2221 5313 -5854 -552 6301 -4562 -3327 6780
704F780q647l478J1268n281o902J0759j195r907Q459L350j0830M765P046j0350
$$ 6780 -1867 -5345 5923 642 -6260 4499 3304 -6603 1856 5206 -5624 -859 6187 -4163
718d163N77J0272q126m063J1216m530p489J0423m13j0425P922M220j0872M045
$$ -4163 -3586 6686 -1440 -5503 5713 1183 -6306 4117 3704 -6721 1201 5421 -5451 -1406
732a406P668r881j95J0385p440m678J0935l831p824R848J49j0138P219M495j0261
$$ -1406 6262 -3619 -3814 6571 -869 -5547 5388 1557 -6267 3581 3730 -6408 811 5306 -4955
747d955L307P744r115p35R939o583n056J0262k947p896Q871Q79r691O302N078
$$ -4955 -1648 6096 -3019 -3754 6185 -398 -5454 4808 1861 -6035 2836 3715 -5976 326 5404
762E404r760K444P750q324j385R641n780n441R641k166p986Q393J320r560O024
$$ 5404 -4356 -1912 5838 -2486 -3871 5770 -10 -5451 4190 2024 -5962 2431 3751 -5809 215
777B15N152r391K059P703q018j544R331n507n464R394j772q008Q107J714r425
$$ 215 5367 -4024 -1965 5738 -2280 -3824 5507 0 -5464 3930 2158 -5850 2257 3971 -5454
792e454N430N515r128J392P910p469k307R137m621o014Q970p64q178P337K523
$$ -5454 -24 5491 -3637 -2245 5665 -1804 -4111 5026 405 -5609 3361 2597 -5581 1756 4279
807D279r329M710N876q893O81Q115o958k815R109m117o210Q725l38q247O888L034
$$ 4279 -5050 -340 5536 -3357 -2676 5439 -1519 -4334 4775 658 -5552 3173 2835 -5412 1476 4510
823D510r203M008O136q486J27Q045o359l122Q622l338o111P884M17p955N849L307
$$ 4510 -4693 -685 5451 -3035 -2908 5137 -1222 -4344 4278 940 -5171 2713 3130 -4825 1024 4331
839D331q514L126O135p797k46P566n482l350Q168k632o265P493P28q010N427L667
$$ 4331 -4183 -1057 5078 -2719 -2965 4601 -881 -4231 3937 1305 -4960 2533 3261 -4749 678 4345
855D345q383K736O308p541o93P816n150l646Q033k325o322P082J122p888M837
$$ 4345 -4038 -1302 5006 -2535 -3228 4588 -562 -4208 3825 1500 -4822 2260 3382 -4506 331
870C31M009q129K179O477p074j146P702m480m032P704j634o624O566J669p889
$$ 331 4340 -3789 -1610 4867 -2207 -3353 4349 -131 -4163 3541 1907 -4717 1849 3518 -4371
885d371M163M555p889J555O821o586j859P948l990m548P411j136o773O155K109
$$ -4371 -208 4347 -3542 -1987 4834 -1752 -3611 4337 347 -4201 3210 2074 -4699 1456 3565
900C565p721L607M828p331R29O699n915k124P477l505m549O854q58o302N429K328
$$ 3565 -4156 -549 4279 -3052 -2123 4576 -1339 -3463 4014 509 -4040 2814 1956 -4346 1083 3411
916C411p227L134M828o807N67O573n493k439P243l134m726O512l38o360N000K701
$$ 3411 -3816 -682 4146 -2661 -2094 4479 -1014 -3453 3790 656 -4070 2442 2104 -4256 744 3445
932C445p032K662N148o576J13O599n207k691P037k685m931O293K5o308M779K873
$$ 3445 -3587 -925 4223 -2353 -2240 4359 -848 -3539 3498 813 -4118 2175 2200 -4108 671 3544
948C544o927K456N124o222l84O604m793l109P018k298n194O107N75o474M351L321
$$ 3544 -3383 -927 4197 -2025 -2409 4195 -598 -3707 3311 1013 -4181 1926 2501 -3973 378 3699
964C699o664J767N317n858r51O621m247l488O719j666n209N659Q98o277L895L477
$$ 3699 -2965 -1198 4119 -1739 -2690 3931 -316 -3804 2915 1249 -3960 1699 2597 -3680 215 3692
980C692o457J418N219n471j163O336l810l506O521j361n257N370J191o132L476
$$ 3692 -2765 -1347 3872 -1599 -2762 3574 -236 -3742 2779 1418 -3839 1531 2722 -3410 66
995F6L506o002Q18N397n027j586O145l156l721N972p37n244M861J508n987L054
$$ 66 3572 -2430 -1612 3785 -1242 -2828 3317 161 -3560 2412 1675 -3569 1292 2800 -3187 -133
1011a33L599n895O99N273m683j782O074k844l941O113o40n516M839J739o062K730
$$ -133 3466 -2429 -1730 3543 -1140 -2922 3152 308 -3633 2480 1840 -3676 1163 2902 -3160 -430
1027d30L907n792K95N534m405k176O158k401m241N674k0n596M245K161n908K232
$$ -430 3477 -2315 -2020 3514 -891 -3067 3091 690 -3551 2123 2103 -3493 752 2913 -2995 -763
1043g63M053n285o2N413l824k431N855k061m331N337L00n681L988K429n759J862
$$ -763 3290 -1995 -2057 3356 -468 -2899 2956 895 -3436 1901 2201 -3480 508 2937 -2822 -960
1059i60M306n037m40N412l452k689N513j474m634N000O08n442L539K656n465J532
$$ -960 3346 -1691 -2131 3281 -171 -2860 2653 1179 -3455 1545 2153 -3289 250 2906 -2559 -1027
1075a027M268m686o23N191l193k753N295j257m584M736Q28n381L213K933n426
$$ -1027 3241 -1445 -2068 3123 -70 -2823 2472 1215 -3369 1367 2195 -3186 27 2960 -2466
1090b466J331M445m481j058N281k904l196N317r49m703M486J262n503K965L255
$$ -2466 -1135 3310 -1171 -2229 3052 148 -3048 2269 1320 -3383 1103 2365 -3138 -173 3082
1105C082n263R49M529m303j313N204k637l300N064n07m798M165J609n326K631
$$ 3082 -2181 -1232 3297 -1006 -2319 2885 248 -3052 2012 1505 -3293 872 2481 -2845 -214
1120b14L416n137M55M666l954j699N138k227l545M869j44m754L767K002n218K072
$$ -214 3202 -1935 -1480 3186 -768 -2467 2671 444 -3101 1768 1624 -3130 637 2639 -2579 -507
1136e07L582m806Q4M708l745j844M901j834l604M649J07m609L529K056n013J835
$$ -507 3075 -1731 -1647 3061 -684 -2528 2373 539 -3065 1584 1691 -2918 611 2667 -2346 -511
1152e11L587m697j61M707l444k108M988j735l540M304N00m601L117K318m960J422
$$ -511 3076 -1621 -1782 2925 -519 -2627 2361 626 -2914 1390 1890 -2711 406 2724 -2236 -814
1168h14L819m500m87M733l132k240M853j407l714M195O88m707K935K569m934J142
$$ -814 3005 -1495 -1982 2751 -381 -2621 2232 825 -2889 1306 1994 -2713 222 2791 -2143 -1001
1184a001L917m271o40M734k870k503M794j022l950M004R17m658K528K806m862
$$ -1001 2916 -1355 -1995 2739 -131 -2634 2160 1138 -2812 1192 2109 -2549 -21 2785 -2077
1199b077Q32M115m007r64M727k552k722M629p29l973L684J127m561K259K852m461
$$ -2077 -1245 2870 -1137 -2101 2626 74 -2648 1981 1252 -2721 963 2090 -2471 -212 2640 -1821
1215a821N10M090l674j176M639k297k802M393n08m003L349J431m473J914L013
$$ -1821 -1311 2779 -895 -2071 2568 271 -2531 1862 1354 -2649 700 2131 -2342 -428 2585
1230B585m307K59M180l360j462M551k020k987M230l17l943L129J507m362J786
$$ 2585 -1722 -1463 2717 -643 -2105 2446 426 -2561 1669 1352 -2591 538 2045 -2317 -531
1245e31L077m055R2M148l213j729M612j900l150M106k8m065L052J859m460J513
$$ -531 2546 -1509 -1417 2731 -482 -2211 2401 501 -2649 1457 1429 -2636 416 2275 -2185 -672
1261f72L293l902k99M228k889k074M515j525l330L961K31m049K722K027m184J169
$$ -672 2621 -1281 -1580 2648 -241 -2315 2200 675 -2655 1306 1537 -2512 210 2237 -1947 -778
1277g78L406l771m96M193k712k197M318j200l423L737N40m087K684K115m113J000
$$ -778 2628 -1143 -1639 2554 -158 -2355 1963 763 -2660 1077 1617 -2470 214 2329 -1784 -784
1293g84L369l540p91M056k300k413M132q58l468L621P53m036K368K191l975P80
$$ -784 2585 -955 -1746 2310 10 -2403 1729 871 -2597 1024 1777 -2259 109 2300 -1675 -895
1309h95L347l352q98M032k250k380M048o70l541L501R55m079K267K342m028O27
$$ -895 2452 -900 -1798 2234 -16 -2396 1652 982 -2559 942 1897 -2182 85 2427 -1601 -974
1325i74L429l230j177M078j966k596L946l06l623L160J243m107J968K507l830
$$ -974 2455 -775 -1952 2126 160 -2436 1510 1204 -2419 741 1984 -2123 -155 2352 -1478
1340a478J90L612k987j302M037j696k783L912j73l666K987J432m204J702K802
$$ -1478 -1288 2324 -663 -1965 2072 376 -2407 1505 1332 -2334 653 2085 -2119 -417 2385
1355B385l914J22L668k726j576M059j408k993L715J67l755K677J562l989J435
$$ 2385 -1529 -1407 2261 -465 -2041 2018 610 -2383 1332 1499 -2256 421 1983 -2006 -571
1370e71K842l501j48L597k489j677L866j244l013L522L50l717K488J677l952J323
$$ -571 2271 -1230 -1378 2219 -270 -1947 1919 675 -2338 1184 1534 -2183 305 1982 -1970 -647
1386f47K954l457l01L723k409j812L822j049l133L424M53l812K331K019l986J082
$$ -647 2307 -1150 -1451 2272 -137 -1949 1873 824 -2309 1115 1568 -2244 87 2106 -1880 -798
1402g98L141l389m38L687k326j899L692q33l190L208O95l730K201K115l872Q70
$$ -798 2343 -1046 -1484 2203 -123 -2022 1670 837 -2353 855 1550 -2180 21 2136 -1736 -866
1418h66L234l223p68L825k116k130L602o16l383L131J078l893J931K424l706N68
$$ -866 2368 -855 -1623 2202 86 -2044 1558 942 -2441 690 1768 -2125 -194 2230 -1476 -908
1434i08L255l066r61L764j909k318L562m04l315K892J165l707J696K513l669M04
$$ -908 2347 -719 -1680 2084 175 -2143 1419 1015 -2300 592 1757 -1950 -254 2259 -1410 -1006
1450a006L294k897j157L672j690k357L447k64l300K815J217l640J563K521l489
$$ -1006 2288 -609 -1766 1906 216 -2141 1306 1042 -2258 557 1774 -1866 -303 2218 -1271
1465a271J85L377k754j409L718j519k484L357q5l235K587J459l731J392K630l420
$$ -1271 -1086 2291 -463 -1872 1846 327 -2157 1200 1115 -2120 467 1926 -1805 -413 2217 -1203
1481a203pL467k752j462L742j358k621L385J53l496K534J584l624J029K849l301
$$ -1203 -1210 2257 -495 -1957 1785 427 -2194 1191 1344 -2152 382 1966 -1658 -629 2220 -1081
1497a081l83L617k500j635L718j129k703L187L07l389K252J713l560Q20K922l119
$$ -1081 -1464 2153 -347 -1982 1736 607 -2096 1091 1398 -1991 261 1974 -1586 -766 2156 -963
1513i63n57L569k265j835L695r05k848L159L74l377K035J868l555P33L013k997
$$ -963 -1520 2049 -216 -2051 1644 739 -2109 1050 1424 -1953 82 1950 -1605 -872 2141 -856
1529h56o78L532k033j971L655p54k958K902O01l368J879K014l443M97L071k827
$$ -856 -1534 1998 -35 -2006 1649 895 -2063 839 1440 -1928 -49 1965 -1478 -981 2090 -737
1545g37p90L532j862k079L521o03l075K843P52l391J785K055l357M27L089k711
$$ -737 -1527 2005 143 -1936 1585 982 -2093 750 1502 -1889 -104 1951 -1406 -979 2110 -601
1561f01j026L583j738k240L405l13l134K616J097l554J652K168l221K01L209k569
$$ -601 -1627 1956 218 -2022 1383 1070 -2064 552 1649 -1905 -253 1915 -1306 -1105 2104 -465
1577d65j159L449j500k413L366k03l262K619J211l513J612K284l225P8L246k424
$$ -465 -1624 1825 325 -2088 1278 1075 -2187 432 1643 -1870 -258 2026 -1199 -1121 2125 -299
1593b99j362L362j275k461L139R6l272K407J372l372J279K377k991j01L145k302
$$ -299 -1661 1701 426 -2035 1104 1200 -2072 335 1707 -1665 -386 1991 -1000 -1101 2044 -258
1609b58j508L327j055k553L036K12l224K272J528l337J126K520l084k47L135k116
$$ -258 -1766 1561 506 -2047 989 1201 -2023 249 1777 -1560 -434 2086 -998 -1245 1890 -226
1625b26j610L325r43k652L005M68l290K153J660l393Q99K628k910m61L271k081
$$ -226 -1836 1489 546 -2106 899 1367 -1923 230 1890 -1503 -604 2024 -886 -1347 1924 -157
1641a57j731L323p82k641K929N11l363K087J670l326P80K706k906n92L274j804
$$ -157 -1888 1435 653 -1988 941 1452 -1911 176 1846 -1480 -700 2006 -900 -1492 1782 -22
1657b2j851L245o05k796K833P45l295J757J903l298O25K672k613q07L275j630
$$ -22 -1873 1372 767 -2029 804 1549 -1746 11 1914 -1384 -759 1913 -700 -1507 1768 138
1673A38j905L101m20k841K620P74l218J632J966l114L25K846k586q18L187j485
$$ 138 -1767 1334 914 -1927 693 1467 -1751 -119 1847 -1267 -942 1904 -682 -1500 1687 202
1689B02j993L036l30k830K487R58l308J534K060l069K51K875k404r75L240j450
$$ 202 -1791 1245 915 -1915 572 1530 -1778 -244 1816 -1253 -1002 1873 -531 -1506 1734 284
1705B84k069K970j48k938K337J098l278J386K212l000J41L001k379j138L168j281
$$ 284 -1785 1185 1037 -1901 436 1534 -1744 -358 1854 -1146 -1005 1996 -383 -1521 1647 366
1721C66k213K939jk991K202J352l326J183K459k994r2L087k273j263L190j085
$$ 366 -1847 1092 1091 -1900 302 1654 -1672 -489 1970 -1024 -1116 1971 -302 -1565 1625 540
1737E40k418K792J96k964K048J393l025R03K490k780l57L084k128j422L066j000
$$ 540 -1878 914 1110 -1854 194 1587 -1438 -535 1955 -825 -1182 1902 -226 -1648 1418 418
1753D18k308K737L26l005J899J595l100Q43K639k837m44L076j992j569L158q97
$$ 418 -1890 847 1173 -1832 67 1662 -1438 -595 2044 -793 -1237 1839 -153 -1722 1436 539
1769E39k382K635L92k933J808J648k942O21K560k716m98L041j825j749L188p44
$$ 539 -1843 792 1184 -1749 59 1707 -1235 -614 1946 -770 -1268 1773 -52 -1801 1387 643
1785F43k524K676N02k984J727J816l113N14K665k519p76L027j669j819L032m10
$$ 643 -1881 795 1297 -1687 40 1856 -1257 -743 1922 -597 -1373 1654 -15 -1834 1198 788
1801G88k602K477P11k955J458J863k884L23K698k514q45L078j454j912K945k65
$$ 788 -1814 663 1374 -1581 -123 1740 -1144 -821 1877 -637 -1482 1596 142 -1770 1175 910
1817I10k751K389R04k996J307J971k752L9K775k243j063L076j332j948K831j70
$$ 910 -1841 548 1452 -1544 -237 1734 -1018 -979 1796 -447 -1510 1566 234 -1714 1117 947
1833I47k632K143R91k965J132K117k719j9K709k085j129L105j194k125K854r2
$$ 947 -1685 458 1449 -1516 -384 1733 -986 -1005 1704 -381 -1510 1595 401 -1724 1130 1038
1849A038k777K065J109k923J058K088k647o7K795j977j302L000r76k217K666K23
$$ 1038 -1739 326 1435 -1488 -430 1658 -989 -1056 1739 -238 -1540 1460 484 -1733 933 1156
1865A156k947K021J206k844R19K180k535l00K826j804j371K859q21k355K575L45
$$ 1156 -1791 230 1436 -1408 -489 1691 -844 -1144 1682 -122 -1493 1366 545 -1810 765 1110
1881A110k785J705J410k859Q80K297k486m34K817j688j530K877o80k404K533L24
$$ 1110 -1675 30 1440 -1419 -539 1758 -728 -1162 1655 -33 -1563 1314 634 -1770 763 1087
1897A087k737J717J482k798O78K303k298n70K752j546j708K848n34k447K377N93
$$ 1087 -1650 67 1549 -1249 -571 1732 -566 -1136 1616 70 -1638 1210 676 -1771 606 1199
1913A199k887J727J514k657M26K403k249o70K642j409j620K665l30k429K208P58
$$ 1199 -1688 39 1553 -1104 -678 1725 -524 -1194 1448 39 -1581 1084 754 -1675 533 1291
1929A291k758J377J705k653L61K345k158p60K665j253j733K571k14k430K147P63
$$ 1291 -1467 -90 1615 -1038 -677 1668 -490 -1250 1415 162 -1571 1000 786 -1644 503 1266
1945A266k670J320J685k599K44K355k056q44K703j250j794K603n8k480J896J025
$$ 1266 -1404 -84 1601 -998 -754 1601 -455 -1299 1404 154 -1640 963 905 -1575 321 1346
1961A346k688J108J878k495r1K476j942r43K623r87j880K453J59k534J778J077
$$ 1346 -1342 -234 1644 -851 -942 1534 -408 -1351 1272 285 -1595 858 1017 -1517 261 1338
1977A338k636R52J931k415j12K408j750j069K616q93j835K286K00k489J687J111
$$ 1338 -1298 -346 1585 -830 -942 1466 -284 -1353 1263 370 -1465 821 1021 -1468 219 1330
1993A330k604R01J920k331k06K476j657j090K512p20j993K247J99k431J584J229
$$ 1330 -1274 -373 1547 -784 -990 1486 -171 -1261 1251 531 -1462 785 984 -1447 137 1366
2009A366k530P06J963k269k37K499j652j146K455o16k023K156L55k472J520J275
$$ 1366 -1164 -458 1505 -764 -1001 1498 -154 -1300 1155 539 -1484 672 1027 -1445 75 1350
2025A350k483N30K118k159m17K453j389j366K449n37k066K032N33k432J266J531
$$ 1350 -1133 -603 1515 -644 -1061 1392 3 -1363 1086 549 -1517 515 1048 -1384 -118 1413
2041A413k455M01K171j958o01K445j338j389K349m46k066J980N89k476J273J486
$$ 1413 -1042 -641 1530 -428 -1029 1416 78 -1311 1038 592 -1474 506 1095 -1381 -108 1378
2057A378k369L37K164j899o82K444j270j442K312l69k108J887O51k313J082J578
$$ 1378 -991 -654 1510 -389 -1071 1373 103 -1339 973 604 -1504 383 1034 -1279 -197 1381
2073A381k267K29K173j905p14K423j195j489K218k01k049J727P54k320J068J621
$$ 1381 -886 -657 1516 -389 -1103 1320 125 -1364 854 653 -1396 331 1085 -1235 -167 1454
2089A454k293J05K142j794q26K476j108j648K289o6k204J783R58k457J024J562
$$ 1454 -839 -734 1408 -386 -1212 1264 156 -1492 797 731 -1473 310 1268 -1189 -165 1397
2105A397k061j23K181j686r00K323q45j675K190N4k139J567R14k256P44J691k097
$$ 1397 -664 -787 1394 -292 -1192 1131 286 -1389 801 855 -1284 283 1197 -1059 -315 1376 -721
2122g21r7K137j506j088K335p23j721K019J90k059J402R52k144N77J835j984k97
$$ -721 -818 1319 -187 -1275 1060 337 -1384 635 825 -1234 168 1120 -1024 -447 1388 -596 -893
2139h93K128j352j119K299o43j770K089N0k058J456J020k254O61J716j944k69
$$ -893 1235 -117 -1236 1063 420 -1350 739 789 -1269 187 1207 -1047 -386 1330 -614 -883
2155h83K139j368j087K187m72j816J934K20k112J293J112k050M31J757j776m51
$$ -883 1256 -112 -1199 988 516 -1300 634 854 -1258 35 1147 -903 -472 1285 -491 -942
2171i42K121j132j192K108m25j844J840L50k042J144J176k096M19J819j703o25
$$ -942 1179 47 -1145 963 538 -1306 534 884 -1158 -14 1162 -934 -515 1304 -399 -1024
2187a024K206j012j374K097l47j836J702N34k166J047J326k019L04J775j588n90
$$ -1024 1182 170 -1204 893 546 -1290 412 946 -1220 -173 1153 -866 -562 1213 -375 -965
2203i65K070r90j357J999j84j894J670O90k092R42J306j974K96J690j527o57K046
$$ -965 1105 115 -1242 757 573 -1321 349 1039 -1053 -111 1195 -779 -483 1207 -320 -977 1069
2220A069q96j397J938j11j831J509P26k074Q97J444j970M5J889j489p59K020q20
$$ 1069 173 -1224 714 603 -1228 281 1007 -1067 -170 1274 -696 -651 1238 -251 -1010 1010 190
2237A90j433J911j4j860J398Q85k058P38J461j878j0J893j458q17K052p68j468
$$ 190 -1243 668 654 -1206 192 1077 -981 -243 1218 -660 -670 1223 -235 -1052 1000 232 -1236
2254a236J816J78j915J339Q89k001O25J569j815j39J795j238r12J895n49j385
$$ -1236 580 758 -1157 182 1071 -930 -305 1264 -551 -690 1105 -133 -1045 850 301 -1084
2270a084J606K72j888J220R09j904N53J407j624k46J866j188q55J790m67j490
$$ -1084 522 794 -1094 126 1035 -869 -316 1091 -533 -779 1087 -101 -956 834 367 -1123
2286a123J638K73j784J043J018j874M26J515j633k88J807r93r89J706l39j474
$$ -1123 515 788 -996 47 1065 -809 -383 1132 -501 -789 1018 25 -964 742 403 -1071
2302a071J457M05j837J023J052j802K88J570j500m51J890r66j053J744l63j474
$$ -1071 386 791 -1046 -23 1029 -773 -485 1085 -415 -866 1024 58 -995 749 386 -1088
2318a088J483M37j866R95J058j759K15J634j414n31J877r33j080J718k35j557
$$ -1088 395 832 -1034 -39 1019 -740 -525 1109 -305 -836 1041 108 -972 746 511 -1046
2334a046J394M41j768Q14J119j662J29J632j355n87J862q19j167J721j38j545
$$ -1046 348 789 -979 -165 954 -708 -579 1053 -302 -889 973 154 -1013 708 570 -975
2350i75J258M94j648N92J256j576N4J562j208o78J808p80j115J584n4j556J172
$$ -975 283 777 -871 -279 977 -599 -545 1017 -191 -869 939 159 -956 628 574 -982 190
2367A90N97j716O43J284j505m9J576j245n94J773p02j270J593k7j536J138P26
$$ 190 787 -929 -286 998 -507 -556 1020 -225 -819 954 252 -1018 575 548 -988 150 876
2384H76j688O53J229j499k09J659j114p54J662n26j377J601M5j520J055P70j641
$$ 876 -812 -159 1070 -429 -638 1021 -93 -847 815 289 -1088 513 558 -962 93 863 -778
2401g78M52J360j432k44J583j024q17J529l28j403J528K27j571R86Q11j608M16
$$ -778 -326 1034 -398 -642 941 -83 -900 629 301 -1102 426 653 -918 68 879 -729 -313
$$ [...]
8191e8
##END NTUPLES=NMR FID
##END=
