##TITLE=1H_17BFPH2506
 CDCl3, 8 sc, 
 26.6.2019
##JCAMPDX= 6.0         $$ Bruker NMR JCAMP-DX V2.0
##DATA TYPE= NMR FID
##DATA CLASS= NTUPLES
##ORIGIN= UXNMR, Bruker Analytische Messtechnik GmbH
##OWNER= root
$$ XWIN-NMR		Version 3.5
$$ Wed Jun 26 15:52:05 2019 Russian Standard Time (UT+4h)  she@DPX200
##.OBSERVE FREQUENCY= 200.13155
##.OBSERVE NUCLEUS= ^1H
##.DELAY= (6, 6)
##.ACQUISITION MODE= SIMULTANEOUS
##.ACQUISITION SCHEME= undefined
##.AVERAGES= 8
##.DIGITISER RES= 18
##SPECTROMETER/DATA SYSTEM= spect
##.PULSE SEQUENCE= zg30
##.SOLVENT NAME= CDCl3
##.SHIFT REFERENCE= (INTERNAL, CDCl3, 0, 15.7039)
##AUDIT TRAIL= $$ (NUMBER, WHEN, WHO, WHERE, WHAT)
$$ ##TITLE= Audit trail, XWIN-NMR		Version 3.5
$$ ##JCAMPDX= 5.01
$$ ##ORIGIN= Bruker BioSpin GmbH
$$ ##OWNER= she
$$ F:/spectra/data/she/nmr/H-F/1/audita.txt
$$ ##AUDIT TRAIL=  $$ (NUMBER, WHEN, WHO, WHERE, WHAT)
(   1,<2019-06-26 15:50:22.64 +0400>,<she>,<DPX200>,
      <created by zg, POWCHK disabled, PULCHK disabled
       configuration hash MD5:
       00 E9 B6 7A A2 85 ED C7 34 08 36 98 17 FE 4E 26
       data hash MD5: 16K
       AF B0 86 8E 4B B3 3F 5E 9A 55 98 3B A8 69 C8 C1>)
$$ ##END=
$$ 
$$ hash MD5
$$ 56 EA 89 51 4C AC 9E F5 AB 3F 1F B7 38 8B 6A C7
##$RELAX= 
##$RELAX= 
##$RELAX= 
##$RELAX= 
##$RELAX= 
##$RELAX= 
$$ Bruker specific parameters
$$ --------------------------
##$DU= <F:/spectra>
##$EXPNO= 1
##$NAME= <H-F>
##$PROCNO= 1
##$TYPE= <nmr>
##$USER= <she>
##$AMP= (0..31)
100 100 100 100 100 100 100 100 100 100 100 100 100 100 100 100 100 100 
100 100 100 100 100 100 100 100 100 100 100 100 100 100 
##$AQSEQ= 0
##$AQ_mod= 1
##$AUNM= <au_zg>
##$AUTOPOS= <>
##$BF1= 200.13
##$BF2= 200.13
##$BF3= 200.13
##$BF4= 200.13
##$BF5= 200.13
##$BF6= 200.13
##$BF7= 200.13
##$BF8= 200.13
##$BYTORDA= 1
##$CFDGTYP= 0
##$CFRGTYP= 5
##$CHEMSTR= <none>
##$CNST= (0..31)
1 1 145 1 1 1 1 1 1 1 1 1 1 1 1 1 1 1 1 1 1 1 1 1 1 1 1 1 1 1 1 1 
##$CPDPRG= <>
##$CPDPRG1= <>
##$CPDPRG2= <>
##$CPDPRG3= <>
##$CPDPRG4= <mlev>
##$CPDPRG5= <mlev>
##$CPDPRG6= <mlev>
##$CPDPRG7= <mlev>
##$CPDPRG8= <mlev>
##$CPDPRGB= <>
##$CPDPRGT= <>
##$D= (0..31)
0 1.2 0 0 0 0 0 0 0 0 0 0.03 0 0 0 0 0 0 0 0 0 0 0 0 0 0 0 0 0 0 0 0 
##$DATE= 1561549822
##$DBL= (0..7)
120 120 120 120 120 120 120 120 
##$DBP= (0..7)
150 150 150 150 150 150 150 150 
##$DBP07= 0
##$DBPNAM0= <>
##$DBPNAM1= <>
##$DBPNAM2= <>
##$DBPNAM3= <>
##$DBPNAM4= <>
##$DBPNAM5= <>
##$DBPNAM6= <>
##$DBPNAM7= <>
##$DBPOAL= (0..7)
0.5 0.5 0.5 0.5 0.5 0.5 0.5 0.5 
##$DBPOFFS= (0..7)
0 0 0 0 0 0 0 0 
##$DE= 6
##$DECBNUC= <off>
##$DECIM= 24
##$DECNUC= <off>
##$DECSTAT= 4
##$DIGMOD= 1
##$DIGTYP= 9
##$DL= (0..7)
0 120 120 120 120 120 120 120 
##$DP= (0..7)
150 150 150 150 150 150 150 150 
##$DP07= 0
##$DPNAME0= <>
##$DPNAME1= <>
##$DPNAME2= <>
##$DPNAME3= <>
##$DPNAME4= <>
##$DPNAME5= <>
##$DPNAME6= <>
##$DPNAME7= <>
##$DPOAL= (0..7)
0.5 0.5 0.5 0.5 0.5 0.5 0.5 0.5 
##$DPOFFS= (0..7)
0 0 0 0 0 0 0 0 
##$DQDMODE= 0
##$DR= 18
##$DS= 0
##$DSLIST= <SSSSSSSSSSSSSSS>
##$DSPFIRM= 0
$$ [...]
##$SUBNAM2= <"">
##$SUBNAM3= <"">
##$SUBNAM4= <"">
##$SUBNAM5= <"">
##$SUBNAM6= <"">
##$SUBNAM7= <"">
##$SUBNAM8= <"">
##$SUBNAM9= <"">
##$SW= 24.9336996594482
##$SWIBOX= (0..15)
0 0 2 0 0 0 0 0 0 0 0 0 0 0 0 0 
##$SW_h= 4990.01996007984
##$TD= 16384
##$TD0= 1
##$TE= 0
##$TE2= 300
##$TE3= 300
##$TEG= 300
##$TL= (0..7)
0 120 120 120 120 120 120 120 
##$TP= (0..7)
150 150 150 150 150 150 150 150 
##$TP07= 0
##$TPNAME0= <>
##$TPNAME1= <>
##$TPNAME2= <>
##$TPNAME3= <>
##$TPNAME4= <>
##$TPNAME5= <>
##$TPNAME6= <>
##$TPNAME7= <>
##$TPOAL= (0..7)
0.5 0.5 0.5 0.5 0.5 0.5 0.5 0.5 
##$TPOFFS= (0..7)
0 0 0 0 0 0 0 0 
##$TUNHIN= 0
##$TUNHOUT= 0
##$TUNXOUT= 0
##$USERA1= <user>
##$USERA2= <user>
##$USERA3= <user>
##$USERA4= <user>
##$USERA5= <user>
##$V9= 5
##$VALIST= <valist>
##$VCLIST= <CCCCCCCCCCCCCCC>
##$VD= 0
##$VDLIST= <DDDDDDDDDDDDDDD>
##$VPLIST= <PPPPPPPPPPPPPPP>
##$VTLIST= <TTTTTTTTTTTTTTT>
##$WBST= 1024
##$WBSW= 4
##$XGAIN= (0..3)
0 0 0 0 
##$XL= 0
##$YL= 0
##$YMAX_a= 26464
##$YMIN_a= -41027
##$ZGOPTNS= <>
##$ZL1= 120
##$ZL2= 120
##$ZL3= 120
##$ZL4= 120
##$ABSF1= 10
##$ABSF2= 0
##$ABSG= 5
##$ABSL= 3
##$ALPHA= 0
##$AQORDER= 0
##$ASSFAC= 0
##$ASSFACI= 0
##$ASSFACX= 0
##$ASSWID= 0
##$AUNMP= <proc_1d>
##$AZFE= 0.1
##$AZFW= 0.1
##$BCFW= 1
##$BC_mod= 2
##$BYTORDP= 1
##$COROFFS= 0
##$CY= 11.3945322036743
##$DATMOD= 1
##$DC= 2
##$DFILT= <>
##$DTYPP= 0
##$F1P= 18.9103706918063
##$F2P= -1.10871071338519
##$FCOR= 0.5
##$FTSIZE= 0
##$FT_mod= 4
##$GAMMA= 1
##$GB= 0.15
##$INTBC= 1
##$INTSCL= 1
##$ISEN= 128
##$LB= 0.24
##$LEV0= 0
##$LPBIN= 0
##$MAXI= 10000
##$MC2= 0
##$MEAN= 0
##$ME_mod= 0
##$MI= 1.114404
##$NCOEF= 0
##$NC_proc= 0
##$NLEV= 6
##$NOISF1= 3.799351
##$NOISF2= 2.8
##$NSP= 1
##$NTH_PI= 0
##$NZP= 0
##$OFFSET= 15.70392
##$PC= 1
##$PHC0= -8658.28
##$PHC1= 15.60098
##$PH_mod= 1
##$PKNL= yes
##$PPARMOD= 0
##$PSCAL= 0
##$PSIGN= 0
##$REVERSE= no
##$SF= 200.130013532006
##$SI= 16384
##$SIGF1= 3
##$SIGF2= 2
##$SINO= 400
##$SIOLD= 16384
##$SREGLST= <1H.CDCl3>
##$SSB= 0
##$STSI= 0
##$STSR= 0
##$SW_p= 3612.71676300578
##$SYMM= 0
##$S_DEV= 0
##$TDeff= 0
##$TDoff= 0
##$TI= <>
##$TILT= no
##$TM1= 0
##$TM2= 0
##$TOPLEV= 0
##$USERP1= <user>
##$USERP2= <user>
##$USERP3= <user>
##$USERP4= <user>
##$USERP5= <user>
##$WDW= 1
##$XDIM= 8192
##$YMAX_p= 0
##$YMIN_p= 0
$$ End of Bruker specific parameters
$$ ---------------------------------
##NTUPLES= NMR FID
##VAR_NAME=  TIME,          FID/REAL,        FID/IMAG
##SYMBOL=    X,             R,               I
##VAR_TYPE=  INDEPENDENT,   DEPENDENT,       DEPENDENT
##VAR_FORM=  AFFN,          ASDF,            ASDF
##VAR_DIM=   8192,          8192,            8192
##UNITS=     SECONDS,       ARBITRARY UNITS, ARBITRARY UNITS
##FACTOR=    0.0002004,     1,               1
##FIRST=     0,             0,               0
##LAST=      1.6414764,     0,               0
##MIN=       0,             -41027,          0
##MAX=       1.6414764,     26464,           0
$$ Real data points
##PAGE= N=1
##DATA TABLE= (X++(R..R)), XYDATA
0 0 0 0 0 0 0 0 0 0 0 0 0 0 0 8 -8 8 -8 8 -8 14 -16 16 -17 24 -24 32 -32 40 -42 48 -56 64 -71 79 -88 96
36 96 -107 120 -132 147 -163 180 -199 220 -245 271 -301 335 -375 421 -475 540 -619 720 -853 1031
56 1031 -1297 1722 -2525 4588 -22195 -41027 -20304 -27704 -29105 -24924 -19275 -26215 -23238 -13678 -10332
71 -10332 -17495 -15061 -9018 -9884 -12269 -1248 7661 2499 -4861 1028 6967 4455 4207 11880 12903
86 12903 6092 6139 14560 15975 11869 13264 15470 8148 1199 5653 11312 6740 1656 4014 4495 -945
102 -945 -922 5530 5359 -2246 -4305 -1011 -2366 -4805 -8 4534 -399 -5804 -2287 1826 -690 -1649
118 -1649 2423 2062 -3732 -2748 5016 7546 5159 7173 10481 7260 4371 9480 14206 10252 6268 8548
134 8548 9227 5481 6355 11959 10904 4128 2804 5817 3968 972 3658 5882 492 -3793 -167 2613
150 2613 -930 -2586 -263 -2519 -8816 -8528 -3544 -4173 -8030 -6660 -3976 -6618 -8009 -2862 534 -3263
166 -3263 -5514 -2251 -1034 -3523 -1582 3417 2499 -1945 -600 3492 2596 748 3445 5054 823 -1306
182 -1306 3093 5633 2973 2474 5053 3780 -434 660 4450 2546 -1726 -1451 -131 -3110 -4652 -1211
198 -1211 285 -3872 -6072 -3679 -3256 -5967 -5232 -1995 -3449 -7151 -5794 -2189 -2826 -4662 -2434 -1066
214 -1066 -4265 -5763 -2295 -311 -2637 -3021 -52 104 -2182 -474 3272 2520 -486 315 2276 667
230 667 -825 1756 3152 157 -1440 933 1720 -714 -940 1109 22 -2999 -2281 439 -147 -1912
246 -1912 -830 458 -1520 -2816 -582 561 -1572 -2518 -735 -285 -1783 -814 1829 1599 -329 383
262 383 2121 1530 596 2224 3417 1922 1125 2898 3808 2626 2434 3535 3036 1239 1494 2916 2388
279 2388 1019 1474 2066 849 -50 863 1084 -453 -1196 -572 -768 -1834 -1699 -801 -1269 -2357 -2085 -1307
297 -1307 -1823 -2215 -1478 -991 -1532 -1537 -444 53 -185 -5 846 868 528 1210 2065 1980 1802 2415 2902 2524 2593
318 2593 3259 3277 2675 2530 2946 2735 2152 2226 2380 1699 981 970 982 284 -303 -137 -378 -1149 -1423 -1198 -1438
339 -1438 -2055 -2153 -2075 -2569 -3024 -2883 -2658 -2859 -2958 -2565 -2329 -2423 -2201 -1616 -1413 -1482 -1157 -524 -396 -305 119 692
361 692 666 770 1166 1450 1359 1419 1732 1844 1733 1857 2155 2134 1827 1760 1893 1638 1102 1043 873 430 25 -85
383 -85 -194 -555 -889 -923 -1087 -1522 -1818 -1714 -1814 -2045 -1974 -1817 -1894 -1945 -1801 -1600 -1637 -1591 -1464 -1264 -1179 -1094 -855
406 -855 -574 -365 -287 66 317 413 546 764 1040 1047 1164 1365 1354 1269 1091 1227 1075 831 788 778 671 509 526
429 526 556 371 266 272 64 -123 -150 -133 -288 -426 -485 -436 -565 -776 -785 -711 -760 -815 -587 -323 -228 -34 193 320 413
454 413 507 599 607 626 696 775 833 875 1099 997 1048 1001 898 800 607 590 544 435 404 441 395 168 151 138 -247 -585 -661
481 -661 -735 -974 -1071 -852 -857 -1070 -1086 -674 -692 -990 -862 -554 -750 -978 -493 -11 -215 -226 240 419 56 35 598
504 598 600 -12 220 879 834 652 1131 1784 1376 845 1219 1494 825 553 1029 1057 169 157 1020 929 108 123 655
527 655 -18 -777 -325 400 -400 -1051 -287 152 -739 -864 76 17 -1257 -1454 -526 -694 -1431 -869 137 -469
547 -469 -1246 -281 581 -215 -857 -78 17 -1139 -1230 203 363 -700 -490 484 -111 -1174 -444 383 -714
566 -714 -1806 -990 -101 -974 -1055 274 451 -1129 -1333 -71 -190 -1439 -900 255 -589 -1648 -253 1065
584 1065 190 -588 511 826 -621 -701 1163 1375 -112 154 1644 1303 226 1353 2540 1004 -413
601 -413 670 1500 323 39 1718 1761 -192 -203 1501 1262 -445 -127 822 -644 -2068 -512 1006 -473
619 -473 -1560 -202 39 -1674 -1734 174 -72 -2136 -1903 -188 -479 -1532 -19 1486 -171 -1472 148
636 148 1363 -41 -217 1656 1728 -103 403 2855 2851 1162 1715 2934 1508 273 2126 3527 1847
653 1847 791 2294 2635 913 1020 2994 2236 -367 -270 1435 534 -964 585 1584 -654 -2116 -328
670 -328 665 -1243 -1773 -113 -739 -3124 -2452 108 -426 -2423 -1444 -106 -1706 -2820 -378 996 -1257
687 -1257 -2222 -39 471 -1349 -660 2053 1335 -1344 -490 1864 959 -653 1147 2484 33 -1229 1380
704 1380 2615 335 -219 1833 1261 -1482 -789 1933 943 -1692 -768 922 -763 -2213 167 1478
720 1478 -1343 -2768 -582 29 -2166 -1946 663 -159 -2887 -1953 738 -133 -1884 -289 1141 -1149
736 -1149 -2421 229 1749 -422 -971 1287 1204 -1089 -300 2526 1637 -927 45 1928 486 -771 1551
753 1551 2837 187 -1132 1175 1825 -577 -493 1727 812 -1900 -853 1598 576 -1399 -77 1168
769 1168 -1046 -2272 243 1205 -1099 -1702 459 340 -1650 -711 1668 641 -1622 -527 1363 222
785 222 -829 1200 2197 -68 -952 1552 2188 261 316 2206 1408 -688 454 2797 1680 -136 1056
802 1056 2045 269 -593 1647 2323 -68 -794 1132 1063 -796 5 1894 658 -1559 -437 1162 -134
819 -134 -1221 504 1122 -1102 -1700 517 996 -832 -860 811 94 -1632 -410 1557 298 -1262 -5
836 -5 971 -650 -1193 934 1318 -869 -1209 660 607 -874 -194 1323 105 -1801 -559 919 -309 -1299
854 -1299 293 629 -1275 -1609 430 688 -1147 -1075 392 -289 -1703 -394 1300 190 -1266 33 982
871 982 -446 -805 1063 1338 -555 -649 1243 1187 -57 682 1968 844 -609 446 1671 591 -372
888 -372 890 1419 -180 -437 1237 1212 -502 -643 584 -87 -1470 -610 636 -424 -1685 -734 10 -1170
906 -1170 -1654 -415 -289 -1860 -1924 -450 -393 -1437 -954 182 -575 -1528 -641 399 -369 -1123 60 634
924 634 -304 -231 1151 1417 176 261 1302 1038 82 711 1669 1011 185 1082 1637 814 366 1164 1180 50
944 50 -178 798 623 -323 -80 541 -5 -846 -364 132 -647 -1301 -687 -432 -1145 -1252 -427 -389 -1095 -1050 -353
965 -353 -538 -1100 -648 -35 -478 -811 -103 331 -164 -222 447 519 -28 28 765 688 169 450 959 687 335 735
987 735 1058 622 253 676 767 228 163 585 390 -178 -160 189 -36 -430 -255 -1 -381 -623 -264 -197 -534 -690
1009 -690 -292 -251 -657 -730 -197 -257 -622 -394 -58 -162 -354 -36 279 22 -4 376 518 270 301 667 633 376
1031 376 558 745 625 353 561 725 480 301 483 599 294 132 331 227 -42 -94 51 -16 -239 -226 -123
1052 -123 -248 -444 -392 -320 -524 -564 -460 -448 -546 -435 -260 -243 -392 -297 -203 -202 -258 -187 -84 -99 -73 67 264 83 84
1077 84 136 235 130 118 275 280 280 247 361 388 277 326 249 202 92 87 120 34 8 30 -11 -27 -71 -24 -54 -93 -151 -112 -83
1106 -83 -104 -188 -156 -150 -125 -164 -118 -198 -231 -117 -102 -60 -18 -40 8 15 -37 -21 -41 40 -12 -12 -8 -3 -4 -51 -107 2 -116 -135 -116 -56
1138 -56 -136 -109 -108 -80 -86 -114 -123 -83 -50 -130 -60 1 -35 -50 90 91 48 -41 113 89 -3 13 187 227 142 205 310 251 140 220
1168 220 203 141 114 201 211 98 99 258 245 23 -93 108 52 -123 -149 61 -65 -264 -37 15 -180 -356 -175 -156
1192 -156 -434 -442 -154 -135 -305 -242 16 -52 -165 43 215 57 -103 171 367 149 89 398 494 286 278 663 552
1215 552 233 359 696 507 175 379 664 408 199 513 584 185 -20 377 287 -208 -168 264 31 -404 -255
1236 -255 9 -290 -650 -325 -120 -601 -809 -361 -295 -771 -725 -192 -275 -797 -671 -161 -413 -727 -328 115 -303
1257 -303 -532 68 353 -177 -162 462 397 -76 100 722 600 60 422 901 368 70 515 840 296 -20 674
1278 674 767 -26 -7 627 500 -282 -122 466 34 -531 -110 272 -286 -761 -162 43 -663 -754 -119 -171 -981
1299 -981 -736 -16 -309 -988 -514 142 -439 -933 -190 291 -501 -619 216 342 -480 -212 629 424 -362 -17
1319 -17 800 300 -225 466 1036 170 -94 640 996 17 4 862 699 -279 48 960 466 -372 217 782 -43
1340 -43 -571 278 658 -335 -665 316 338 -597 -466 510 123 -789 -349 544 -129 -885 20 635 -383 -757
1360 -757 321 627 -416 -390 663 415 -677 -178 935 387 -500 224 1021 107 -398 605 995 -154
1378 -154 -469 673 633 -503 -207 962 509 -659 -176 909 85 -780 152 729 -422 -959 265 537
1396 537 -694 -722 431 199 -1099 -584 541 -141 -1100 -323 511 -476 -1061 138 606 -666 -974 216
1414 216 298 -981 -635 577 179 -991 -363 665 -19 -856 127 718 -480 -1034 324 642 -578 -470
1432 -470 749 536 -784 -230 1016 319 -777 10 841 -182 -619 568 1022 -250 -567 658 618 -507
1450 -507 -275 949 413 -859 -125 948 208 -692 339 889 -451 -948 359 678 -642 -650 518 179
1468 179 -943 -349 843 26 -1017 -300 476 -477 -984 257 682 -613 -847 456 419 -643 -297 793
1486 793 287 -888 -217 949 285 -392 520 1031 -73 -387 830 1124 -23 -96 1020 764 -251 395
1504 395 1426 740 -308 504 1092 239 -311 744 1036 -242 -439 558 588 -457 -171 696 31 -1019
1522 -1019 -383 484 -354 -965 -158 162 -894 -1090 133 212 -942 -845 69 -237 -1144 -499 521 -263 -1051
1541 -1051 -309 481 -355 -597 370 557 -496 -592 541 598 -354 10 886 391 -467 163 1043 322 -363 396
1561 396 676 -182 -363 685 764 -332 -361 440 101 -737 -256 505 -239 -1064 -486 123 -574 -835 12 78
1581 78 -841 -996 -73 -135 -883 -622 76 -297 -899 -349 475 -113 -534 8 404 -281 -437 490 664 -182 -69
1602 -69 701 522 -67 359 963 447 -122 305 865 344 29 689 750 15 -46 601 523 -161 -112 460 57 -484
1624 -484 2 396 25 -453 -62 155 -386 -621 93 34 -612 -537 18 -51 -561 -133 214 -131 -558 -114 305
1645 305 -127 -270 289 402 -133 -64 455 393 -60 169 475 339 -92 296 649 240 9 376 479 63 -51
1666 -51 389 275 -162 -110 264 200 -211 -51 270 -87 -363 -112 102 -225 -428 -79 -98 -408 -340 26 -64 -404
1688 -404 -333 -93 -142 -348 -230 104 -155 -286 -18 149 -210 -189 98 81 -205 -21 241 94 -119 105 267
1709 267 128 -34 72 216 -20 -95 122 181 -36 -54 156 157 -92 -28 120 -61 -103 -4 158 -22 -96 43 30
1732 30 -76 -118 20 15 -107 -92 116 21 -74 36 192 73 -30 72 119 -3 -65 92 118 19 25 187 110 -51 -74
1757 -74 -12 -42 -134 -52 -20 -88 -122 -136 -70 -112 -176 -179 -70 -123 -175 -46 -13 -5 7 -49 3 -19 -32 -12 -27 10 28 46 37 156
1787 156 135 129 87 99 143 107 57 112 111 114 110 84 119 59 22 -25 19 10 -96 -116 -80 -104 -104 -162 -196 -245 -200 -237 -268 -260 -244 -206 -205
1820 -205 -133 -222 -132 -156 -88 -123 -79 -114 18 96 56 130 259 239 180 228 303 348 285 380 410 451 380 369 427 302 382 324
1848 324 237 247 188 210 225 118 133 125 27 -125 -63 -78 -199 -238 -338 -168 -280 -325 -277 -231 -295 -326 -215 -243 -391 -345
1874 -345 -235 -259 -255 -49 -2 19 -86 163 197 71 140 272 234 102 241 428 416 298 336 372 311 250 316 335 208
1899 208 139 272 273 41 29 156 40 -149 -206 -68 -189 -316 -189 -232 -304 -457 -347 -269 -403 -442 -296 -328 -435
1922 -435 -394 -142 -193 -374 -209 0 -125 -273 -52 158 -67 -92 244 266 17 111 431 253 11 238 374 256
1944 256 144 234 429 194 -38 285 406 81 -12 237 115 -156 -95 211 -13 -304 -158 -9 -282 -409 -50
1965 -50 128 -349 -484 -121 -154 -402 -379 88 -51 -379 -271 87 -14 -228 146 311 -49 -155 184 344 -7
1986 -7 60 363 288 -42 137 622 411 -33 223 475 136 -76 378 525 48 -148 301 302 -193 -88 366 113
2008 113 -437 -206 305 17 -285 30 262 -283 -433 131 200 -284 -337 103 -19 -385 -121 430 73 -415 -135
2029 -135 318 -135 -268 185 437 -223 -364 179 282 -208 -94 427 75 -513 -209 442 137 -304 86 300
2049 300 -271 -471 267 416 -321 -400 202 115 -422 -68 560 114 -491 -105 368 -83 -348 269 428 -266 -453
2070 -453 301 374 -130 -82 471 81 -552 -44 602 118 -468 100 294 -322 -405 418 486 -370 -488 171 -48
2091 -48 -558 -188 436 -179 -736 -313 242 -235 -571 113 258 -624 -665 188 319 -402 -188 370 29 -596 32
2112 32 686 202 -369 129 505 -149 -195 674 784 -178 -198 534 472 -231 176 847 266 -530 48 670 113
2133 113 -284 364 401 -378 -621 301 361 -432 -406 176 -145 -767 -252 461 -152 -784 -254 72 -511 -599 228
2154 228 296 -663 -634 146 113 -399 -41 521 -11 -565 88 611 174 -144 422 591 -174 -110 773 748 -44 25
2176 25 678 242 -265 278 856 189 -339 158 470 -184 -195 449 369 -543 -528 237 83 -554 -158 270 -340
2197 -340 -920 -220 350 -268 -605 -112 23 -683 -600 300 203 -564 -448 261 -36 -546 92 563 70 -424 121
2218 121 570 33 -33 609 578 -211 -83 757 586 -39 274 706 257 -255 313 774 52 -219 310 355 -292
2239 -292 -237 482 333 -479 -343 238 -90 -562 -24 282 -265 -728 -132 138 -312 -424 99 17 -587 -438 259
2260 259 182 -364 -150 289 -135 -407 48 495 -19 -326 249 329 -211 -27 502 399 -225 -4 495 211 -139
2281 -139 198 551 8 -314 197 427 -8 -198 268 237 -373 -197 288 174 -364 -113 133 -185 -458 -84
2301 -84 241 -236 -508 -1 127 -358 -299 211 70 -440 -286 177 -1 -298 -46 173 -178 -396 95 241 -138
2322 -138 -196 87 170 -273 -188 296 149 -272 -6 195 6 -182 119 299 -38 -110 86 184 -93 -53 289 91
2344 91 -183 -76 264 147 -167 82 172 -57 -159 117 214 -60 -163 98 155 -199 -89 208 83 -253 -109
2365 -109 150 -50 -132 -41 125 -162 -182 43 90 -87 -150 133 5 -267 -57 98 -9 -216 -36 62 -119 -142
2387 -142 86 177 -50 -73 146 155 -56 61 301 217 52 121 296 115 28 231 250 65 -28 215 253 73 78 283
2411 283 180 8 44 166 117 -96 67 78 -10 -136 6 40 -122 -215 -95 -105 -234 -166 -45 -139 -188 -190 -152 -152 -178
2436 -178 -90 -80 -209 -152 -31 -13 -69 -75 11 -55 -75 -12 79 94 3 39 140 78 117 185 163 139 122 177 201 114 109 144 140 38
2466 38 70 98 62 -60 -61 -15 -80 -117 -11 -89 -118 -169 -168 -195 -283 -262 -182 -253 -276 -247 -218 -239 -243 -178 -145 -207 -159 -76 -132 -161 -133
2497 -133 -17 24 -72 7 69 56 57 99 139 148 207 141 185 187 196 209 152 185 122 172 115 69 96 129 86 34 -1 68 -21 -84 -117
2528 -117 -85 -108 -193 -120 -195 -246 -217 -139 -200 -225 -219 -256 -242 -200 -238 -180 -142 -135 -107 -103 -118 -84 45 -44 -10 44 147 132 110 208
2558 208 206 174 214 193 248 192 224 228 223 179 218 291 162 177 166 189 68 15 184 67 31 -9 15 -6 -111 -72 -29 -151
2586 -151 -150 -81 -73 -131 -143 -69 -127 -197 -133 -72 -97 -154 -90 -72 -94 -152 -40 37 -82 -109 6 98 -73 13 77 85 6 74 131
2615 131 53 19 64 161 114 -8 133 161 -72 -74 95 99 -94 -84 83 -48 -195 -83 -3 -90 -216 -45 14 -177 -291
2640 -291 -41 -28 -274 -254 -103 -52 -279 -149 77 -141 -284 -126 -78 -168 -269 -128 23 -175 -181 37 6 -201 -152
2663 -152 111 -46 -266 -112 129 -71 -251 64 121 -67 -139 136 185 -66 -156 133 65 -106 -27 207 5 -101
2685 -101 24 205 -5 -170 120 203 -90 -100 234 210 -108 -65 148 21 -162 -8 196 -13 -191 45 180
2706 180 -94 -156 134 113 -180 -133 145 124 -231 -27 241 -42 -224 4 294 26 -224 174 206 -141 -104 308
2728 308 338 -31 -38 294 168 -98 123 413 99 -179 200 338 89 -59 348 249 -124 -81 372 209 -60 8
2750 8 340 50 -268 83 276 -101 -268 34 80 -250 -320 206 12 -405 -355 67 -123 -389 -122 189 -161 -534
2772 -534 -95 144 -225 -322 36 43 -369 -289 177 148 -257 -64 285 25 -228 155 418 48 -239 141 291 -57
2794 -57 -61 358 280 -242 -81 384 189 -148 107 406 -83 -378 99 286 -110 -204 86 56 -417 -292 215 25
2816 25 -397 -268 93 -223 -484 -135 172 -250 -489 -92 20 -285 -275 156 47 -454 -277 202 78 -256 85
2837 85 309 -97 -389 161 443 -18 -118 201 240 -222 -23 487 388 -92 52 338 90 -134 230 480 -35
2858 -35 -266 129 277 -95 -153 337 110 -301 -185 281 97 -360 -52 210 -219 -463 92 308 -160 -263 107
2879 107 -10 -383 -138 291 57 -304 -86 253 51 -270 143 333 -108 -271 237 338 -51 -60 397 292 -135
2900 -135 -3 472 208 -178 206 301 84 -125 337 393 7 -95 395 228 -168 4 393 151 -209 -86 290
2921 290 -6 -197 146 251 -251 -299 96 200 -161 -157 205 52 -302 -160 221 -52 -306 -95 151 -191 -242
2942 -242 119 299 -221 -251 137 127 -309 -66 292 116 -288 3 319 39 -192 108 262 -59 -181 184 341
2963 341 -53 -84 199 142 -259 -1 311 98 -210 33 166 -146 -182 112 186 -233 -290 63 57 -297 -169 142
2985 142 -15 -392 -148 91 -138 -327 -23 99 -229 -323 24 48 -218 -180 25 -3 -316 -89 100 -38 -229
3006 -229 27 210 -89 -125 64 301 -35 -77 158 144 -75 -44 264 86 -130 -5 252 82 -70 104 229
3027 229 -38 -79 194 137 -109 -87 109 73 -141 -90 116 -28 -204 -40 91 -83 -196 28 10 -242 -206 44
3049 44 5 -147 -166 60 -46 -244 -13 126 -80 -81 70 180 -21 -65 123 178 -70 -39 197 101 -20 74 193
3072 193 81 31 113 295 104 -7 166 140 57 51 158 123 -6 28 145 74 -25 39 128 -26 -36 67 12 -36 -45 57
3098 57 -12 -199 -102 8 5 -147 -44 10 -93 -116 -73 -21 -121 -70 -29 64 -51 -52 46 -23 -81 -86 47 -5 -137 94 107
3125 107 -33 6 11 64 28 25 108 124 7 11 63 66 28 29 56 17 -35 67 26 -72 -64 14 -84 -91 -63 -4 -117 -83 -84 -29 -93 -185
3157 -185 -144 -37 -64 -85 -14 -97 -77 -131 -70 -31 -116 -43 -34 -58 -64 42 16 6 -2 -22 -22 -28 13 95 40 11 48 30 29 -48 52
3188 52 133 45 26 55 55 -3 54 59 2 19 42 81 44 1 -12 -2 1 -69 -44 8 1 -64 -28 27 -45 -60 -47 -53 -41 -36 -16 4 -57
3221 -57 -5 3 -12 -31 -12 39 -30 27 -5 57 110 89 80 104 55 45 127 138 97 119 130 85 28 149 134 90 85 107 93 63 37
3252 37 122 33 -6 8 16 2 37 75 -13 -28 -29 -35 20 -41 -79 -55 -53 -88 -101 -96 -91 -85 -116 -26 -84 -87 -98 -57 -102 -147 27 9 -143
3285 -143 -27 -24 -9 -45 -19 4 14 -39 66 -1 41 -81 2 113 6 7 109 121 -46 46 100 31 -75 34 93 45
3311 45 -19 41 14 12 -35 -13 32 -54 -68 49 -89 -37 -84 20 -81 -137 -22 45 -130 -140 -27 -32 -138 -55 -42 -22 -122
3338 -122 -66 38 -48 -83 -24 50 -48 20 29 107 27 20 93 74 50 113 196 114 -81 82 120 84 -4 88 149 40 -3 77 167
3367 167 -24 -21 131 36 -37 13 45 -59 -159 -10 76 -24 -193 -11 48 -207 -163 22 -65 -220 -112 37 -68
3390 -68 -127 -9 86 -76 -177 13 31 -60 -95 33 64 -23 -51 124 74 -74 89 225 -4 -23 85 231 37 -27
3414 -27 182 219 -24 -24 157 94 -142 -47 195 61 -122 81 218 -37 -130 18 91 -125 -190 41 -38 -275 -95
3437 -95 61 -81 -223 -83 32 -127 -249 -87 113 -136 -226 18 91 -122 -136 134 16 -119 -79 236 21 -163
3459 -163 36 201 -2 -54 166 201 45 28 218 170 26 9 318 110 -98 45 269 72 -110 144 233 -35
3481 -35 -172 101 104 -90 -64 145 57 -147 -85 159 -51 -155 -32 95 -129 -236 8 79 -92 -98 87 40 -252
3504 -252 -79 214 11 -255 -22 166 6 -169 95 256 -64 -95 154 228 -107 -58 221 134 -154 31 294
3525 294 55 -128 114 192 -29 -162 141 178 -24 -183 156 114 -136 -43 175 68 -228 -28 70 -140 -245 35
3547 35 111 -188 -253 34 49 -255 -124 57 -18 -304 -114 170 -37 -237 -32 162 -130 -168 84 164 -141 -98 155
3570 155 168 -132 -128 273 79 -167 63 279 11 -89 141 216 35 -72 254 190 -57 45 240 74 -147 8
3592 8 238 12 -150 21 249 -66 -148 116 155 -109 -102 39 75 -182 -115 152 -17 -254 -65 149 -89 -223 29
3615 29 92 -139 -193 104 139 -250 -138 127 25 -167 -5 162 -51 -111 53 186 2 -69 169 155 -94 -5 151
3638 151 145 -43 -22 215 116 -66 71 197 27 -117 155 170 -83 -81 146 119 -201 -84 85 -15 -200 -85 37
3661 37 -87 -250 9 67 -151 -180 41 -33 -160 -147 89 0 -137 -72 94 -18 -264 -28 169 -30 -188 32
3683 32 115 -28 -77 181 144 -120 -43 170 113 -55 -13 187 70 -35 72 240 27 -31 135 133 -59 -52 147 60
3707 60 -95 5 97 -29 -166 7 78 -84 -224 -27 58 -131 -197 21 -31 -118 -186 -26 3 -170 -91 35 -125
3730 -125 -147 -6 40 -159 -56 9 -29 -83 -94 143 2 -94 24 131 27 -47 0 105 11 -60 71 153 11 27
3754 27 101 63 13 45 178 108 -68 -22 181 -7 -71 -9 55 -23 -153 23 53 -120 -87 17 -38 -188 -77 21 -45
3779 -45 -141 -58 -1 -92 -47 -66 -35 -65 -61 52 59 -93 -55 24 71 -66 -64 81 -8 -32 93 97 64 36 81 131 54 66 112 102
3809 102 24 15 133 44 39 26 88 78 -5 51 89 -59 7 27 49 -2 -78 -6 -40 -53 -26 13 -68 -72 -40 61 -50 -152 -39
3838 -39 -43 -77 -8 -7 -59 -86 -35 -28 -36 -67 1 74 -33 -45 26 70 25 17 84 110 51 35 5 44 0 60 56 86 17 32 123 65 21
3871 21 89 53 -6 26 15 7 -17 -29 38 -39 -74 -13 -15 -48 -92 -75 -53 -71 -88 -7 -79 -58 -27 -48 -81 -60 -35 -109 -63 -29 -62
3902 -62 3 -38 55 31 33 65 -3 22 11 64 47 14 54 18 30 4 71 65 52 49 7 82 31 59 -9 68 19 57 -4 -16 -37 -60
3934 -60 -8 52 -31 -72 -63 -61 40 -74 -33 -59 3 -129 -90 -12 -100 -6 -49 -100 -38 -61 -34 4 -63 -77 -65 -27 21 34 -4 -26
3964 -26 -88 28 -13 41 6 63 10 -36 -12 12 111 0 -44 98 76 46 45 102 67 28 48 71 13 12 15 26 -10 -29 35 -8
3994 -8 -65 13 54 8 -73 21 -3 -68 -93 -28 -43 -71 -90 -10 -84 -140 -46 -24 -74 -78 -24 -3 -45 -63 36 34 0 -1 78 69 25 -18 61
4027 61 47 -50 28 161 -21 -23 102 123 38 16 81 75 35 -16 81 39 -30 -2 52 21 57 32 18 -23 -92 -61 -34 -111 16
4056 16 -31 7 -21 -14 32 -65 -139 -12 44 6 -43 -41 16 21 -111 7 30 -38 -17 8 13 -24 28 79 55 -33 64 91 -41 4
4086 4 25 79 2 -23 81 36 -28 -12 124 83 -52 7 65 3 -66 58 53 -9 -70 25 52 -48 -27 61 14 -110 -69 90
4114 90 -6 -129 -51 56 -77 -82 -4 21 -97 -53 87 43 -108 -54 51 61 -86 -19 3 13 -38 -5 69 -60 -91 22
4140 22 62 -7 -11 87 63 -3 59 154 37 -46 25 121 -85 -96 85 116 -72 -63 58 64 -86 -74 53 -34 -135 14 51
4167 51 -101 -128 -29 71 -97 -117 -2 41 -113 -65 -37 -44 -227 -79 104 -7 -133 -8 79 -100 -125 11 102 -124
4191 -124 -69 134 84 -80 46 153 83 -69 -10 138 -11 -12 138 140 -27 -40 119 188 -18 -32 129 63 -96 -12
4215 -12 173 -10 -36 64 78 -23 -76 67 35 -177 -181 115 -21 -191 -71 44 -46 -197 -64 114 -71 -81 31
4238 31 25 -121 -135 67 58 -110 -77 92 -33 -118 64 156 -11 -81 58 182 -34 -23 82 155 -74 -76 148 86 -80
4263 -80 22 196 -2 -36 60 194 70 -86 37 94 -53 -73 33 87 -102 -68 108 -17 -156 -55 82 -132
4285 -132 -224 -18 35 -116 -160 47 0 -131 -145 92 58 -134 -38 127 -17 -149 -5 154 2 -88 93 96 -64
4308 -64 -7 133 61 -33 -34 117 79 -41 15 147 14 -107 74 221 -18 -63 60 53 -142 -14 35 41 -101 -7 5
4333 5 -98 -131 -44 72 -114 -156 64 38 -102 -67 32 87 -138 -101 76 -3 -81 21 128 -35 -81 -35 84 14 -59
4358 -59 108 66 -36 -6 180 41 -80 21 84 -20 -134 15 109 -46 -56 111 151 12 -21 63 78 -51 -82 107
4382 107 37 -122 11 97 -15 -117 5 70 23 -98 13 -4 -137 -56 57 -7 -124 -19 69 -65 -77 -72 23 -10
4406 -10 -38 59 86 -66 -48 76 -3 -75 -44 41 21 -70 41 138 20 -61 39 142 -65 -39 74 62 -25 -5 121 99
4432 99 -67 56 93 18 -48 22 94 28 -58 -1 35 -19 -15 38 35 -27 -62 -28 8 -75 -24 40 -48 -77 -49 -39 -65 -97 10 -36
4462 -36 -150 -112 30 -71 -74 -90 75 -46 -100 -12 29 -14 -56 2 12 12 60 113 69 -17 37 58 33 17 84 98 23 -21 134
4491 134 88 2 11 72 40 -48 -93 33 62 -31 -10 21 -30 -20 16 34 -98 -128 2 -21 -73 -163 -40 -17 -106 -37 -8 -28
4519 -28 -50 -100 41 -78 -35 -6 -5 -8 -41 40 12 23 68 7 -3 0 -1 25 66 30 67 81 69 31 61 64 47 44 31 13 63 62 28
4552 28 50 -31 4 9 -30 -48 17 29 11 -4 -22 -13 -47 -54 -78 -66 30 -33 -70 -17 -70 -19 -19 -93 -136 -51 -34 -3 -71 35 27 -16
4584 -16 2 -7 54 25 -18 41 21 -29 51 15 54 -1 65 58 111 6 30 -23 51 41 35 37 31 -9 31 54 4 -5 -49 37 -69 10
4616 10 -49 -62 -4 -6 -14 -73 -13 -45 -32 -94 -95 -52 -77 -54 -55 -36 -50 -66 -56 -99 -15 -42 -7 44 -46 64 82 38 -5 -9 -30 -34 29
4649 29 11 12 26 88 88 8 36 69 54 40 5 15 48 -8 53 83 49 -36 -9 68 7 -13 16 9 -17 -41 -31 4 -80 -38 -43 -86
4681 -86 -1 -71 -64 -31 -109 -30 19 -18 -72 -2 -16 -77 0 -27 53 -28 -31 65 12 9 -41 19 42 23 20 -17 63 20 33 62 14 39
4713 39 28 36 27 44 133 -19 30 -49 46 -50 -48 -62 7 -61 -7 20 -18 -44 -47 23 -65 -20 -42 26 -60 -12 7 -14 -148 -79 -20
4744 -20 -23 -82 -44 68 -17 -26 -30 38 9 -53 14 -18 8 0 28 79 -82 -16 72 95 45 16 84 13 -16 53 88 78 96 72 58
4775 58 45 9 117 32 -17 -59 39 75 -23 33 67 14 -12 -10 -8 -13 -98 -60 11 -32 -21 -38 0 -68 -65 33 -109 -53 2 59 -3
4806 -3 -79 -40 36 35 -2 114 35 -41 -69 100 52 -39 41 72 -41 -11 -8 133 28 -27 65 29 32 -32 115 40 -132 25
4834 25 67 31 3 28 50 -20 -97 -58 94 -26 -155 -43 -59 -134 -54 4 -21 -21 -74 -27 -77 -34 3 41 -17 -89 -38 33 -62
4863 -62 -72 37 -9 -71 -22 39 7 -13 -23 110 57 -70 -18 126 -3 -68 90 52 89 2 81 103 -20 21 72 41 -61
4890 -61 4 37 -30 -63 52 61 -77 -111 20 26 -98 -64 29 -23 -78 -62 42 -21 -73 -40 48 -69 -95 25 -11 -108 -21 83
4918 83 -9 19 -90 79 32 -98 41 39 8 -113 78 65 40 -33 100 122 -20 -25 24 63 -46 23 46 32 -87 53
4944 53 76 -36 -103 38 45 -69 40 4 22 -154 -61 31 48 -76 -5 45 -50 -117 -38 21 -119 -69 18 29 -82 -54 -6
4971 -6 6 -121 -35 70 -85 -78 67 88 -62 -59 63 56 5 -53 84 65 31 -8 142 29 -32 47 54 -23 -63 64 143 3
4999 3 -23 94 0 -74 -27 97 26 -118 -6 43 -40 -34 -49 10 -28 -86 68 45 -50 -64 -18 16 -94 -44 1 -11 -35 -75
5027 -75 75 -61 -73 68 46 -104 -89 33 11 -139 -60 103 75 -145 -13 78 11 -32 95 110 68 38 69 78 -44
5052 -44 -101 43 60 -62 36 72 -29 -90 38 43 35 -37 16 40 -66 -28 39 -36 -40 -53 47 2 -76 -43 -44 -48 -60 -15 7 -48
5082 -48 -66 16 -6 -124 -25 -28 -21 -57 29 28 33 -59 49 30 8 -42 69 25 -21 -10 72 66 -33 37 84 -17 -50 58 53 19 35
5113 35 93 82 -28 -29 16 41 -14 -78 88 -53 -42 -5 39 -96 -86 16 -4 -20 -151 -38 37 -42 -62 24 -21 -44 -24
5140 -24 15 -13 -84 -52 7 -16 -55 -7 38 -43 -51 75 98 -38 -11 29 61 18 -73 26 57 21 31 36 2 -21 -3 79 28 -25
5170 -25 59 44 13 24 95 -29 -91 37 22 26 -34 12 4 7 -64 28 -47 -33 1 15 -41 -19 28 -25 -25 -122 32 -13 -11 -33 11
5201 11 -32 -24 25 34 -8 -31 10 12 -16 -31 32 95 30 29 49 75 -7 15 37 53 3 14 61 39 62 73 21 -22 5 24 -2 -5 13
5234 13 -43 14 -78 -38 -7 -10 -33 -35 -29 -58 -19 -14 9 -18 -49 -42 14 -24 -71 -30 58 -40 -63 16 47 0 17 44 7 -38 -42 24 74
5267 74 7 2 -1 27 16 50 67 24 -17 99 19 19 39 58 78 52 -44 2 5 -11 -38 0 21 -31 20 -25 -29 -24 14 -60 -7 -32 75
5300 75 -55 -37 -54 -12 -23 -34 -12 36 -16 -7 -68 -10 13 -61 9 21 -48 -6 68 -42 25 47 42 24 38 105 16 -24 12 109
5330 109 84 3 51 19 14 -9 6 16 37 20 36 38 58 23 33 12 10 37 7 32 -35 -40 -28 -93 0 -45 -8 -20 -68 1 -30 -41
5362 -41 -54 -64 -31 -12 -30 -37 -40 -4 -29 -25 -13 84 -54 -91 62 -16 -25 -57 -16 57 30 -13 24 91 29 58 36 68 21 -16 31
5393 31 50 -34 42 -5 16 25 -24 -37 -35 -7 -36 -84 -45 -8 -57 12 -36 6 5 -28 -10 -95 -46 -35 -34 -106 15 -13 -54 -47 19 -51
5425 -51 -66 -12 -50 -8 19 14 -3 -10 24 3 9 -19 -37 50 73 21 10 58 70 -34 75 40 76 -65 0 59 -5 -29 -1 9
5455 9 -26 -13 3 -1 -20 -33 -66 -33 -45 -40 6 -93 -50 -27 9 21 -62 -36 -64 -80 -9 -11 45 -33 34 -16 -11 -28 94 -19 -68 -15
5487 -15 -29 81 -10 84 68 -51 -3 39 86 63 0 40 37 56 6 -1 46 -60 -1 14 72 -5 11 60 -13 -4 -60 -40 -34 -22 -29
5518 -29 -18 -55 -57 9 0 -20 -73 47 -50 -73 -35 29 -87 -61 12 41 -46 -53 -14 -28 -50 -41 41 26 -79 -41 59 43 -22 55
5548 55 47 6 0 29 43 -34 -57 19 16 -31 13 68 -30 5 49 -17 6 -88 -50 22 13 -49 56 10 -18 -63 -40 53 -96 12 1
5579 1 -6 -31 -36 -21 -40 -124 74 -27 -87 -38 24 -32 -2 -33 22 -5 -75 -15 34 -48 -18 9 54 -8 -44 18 74 1 54 64 64
5610 64 14 -22 35 5 0 74 60 18 -81 29 93 62 -24 79 -5 -36 10 15 -6 -52 24 9 -41 -6 -16 7 26 -52 7 11 -74
5641 -74 -11 53 63 -45 -13 -18 -60 -91 -7 -9 -8 -83 34 15 -97 11 37 6 17 31 139 31 -29 59 57 50 21 114 107 -25
5671 -25 8 73 36 -11 -21 47 38 -83 0 88 14 -77 3 58 -2 -34 58 -5 -39 -36 5 2 -133 -3 49 -90 -182 -57 -38
5700 -38 -48 -31 34 -15 -115 -70 26 11 -65 -23 56 -51 -83 -55 -6 50 -57 48 96 -49 7 63 65 -84 26 40 -3
5727 -3 -4 -15 8 -15 -9 45 43 12 -64 32 26 -3 -35 7 -30 40 -35 84 51 3 21 14 -42 -124 -10 -14 -84 -71 -33 -63 -15 -45 16
5760 16 30 -12 -6 49 -23 -5 12 62 56 -63 -15 120 -11 -33 -3 54 -24 -44 53 67 59 68 57 -23 -43 16 -17 41 -30 55 -24
5791 -24 -30 -45 -34 -20 -1 2 -8 -10 -87 -2 11 -28 -66 -45 18 -23 -37 -21 30 -39 -30 19 -27 -79 -70 -9 -28 -99 71 -3 -34 29
5823 29 25 80 7 -25 34 30 -66 -14 11 55 -9 -8 103 33 2 108 -17 1 70 25 -20 -15 45 96 47 -39 -15 40 2 23 59
5854 59 -34 -37 -38 17 62 -35 -54 -1 29 -60 -14 -65 -11 -5 24 -13 -48 -40 51 -64 -37 -33 24 13 12 54 34 14 -10 32 20 14 -4
5887 -4 19 66 -1 -22 83 29 -35 22 57 97 13 28 87 -8 -26 16 21 29 19 28 32 2 -67 5 91 2 -45 1 -14 -30 -81 25
5919 25 -77 -8 -33 -26 -80 -24 -47 64 -83 -42 -16 -29 -10 -48 59 -1 -65 -11 27 -40 -29 46 23 9 -27 15 -63 35 29
5948 29 1 -27 3 66 20 -47 -47 -55 69 -5 10 38 -30 -65 -19 76 44 -5 15 -25 47 32 -27 -6 26 -106 -35 -21 -46 -46 -2
5979 -2 40 -83 -90 -45 -78 -7 14 -60 -81 -49 7 -9 -78 -31 42 6 -12 19 19 18 32 -28 23 3 57 63 -53 13 -20 79 11 -18
6011 -18 46 -25 35 23 48 -7 36 -5 17 3 42 -20 39 81 15 42 -1 8 -70 -17 -44 10 18 -4 22 -67 -10 -10 -8 -58 -11 22
6043 22 5 -46 50 -8 -52 -13 -10 43 -16 -39 21 50 11 25 63 -21 8 18 0 56 56 74 32 23 37 44 -65 -30 -17 4 45 36
6075 36 22 -4 28 23 -17 16 -32 36 -81 -26 18 -70 -57 35 -53 14 -23 -30 -30 -17 -7 9 -39 0 10 -41 -49 -11 -35 29 6 32
6107 32 -1 -41 -32 -35 45 11 10 15 31 -43 -26 -4 -10 53 62 52 -20 -48 -9 22 20 -38 52 66 -30 -83 68 -74 9 20 36 -10 -53
6140 -53 -19 -18 -25 12 -25 -43 2 -21 31 -59 -26 -26 19 -26 -70 43 44 49 -74 36 0 -22 9 -5 0 33 77 18 11 -25 27 50
6172 50 54 -7 44 29 -11 -23 56 44 47 40 21 41 5 -3 20 -16 -61 -8 -27 -31 -53 16 3 17 -53 17 -2 -33 -44 6 10 -89 12
6205 12 -30 -45 -67 7 10 -6 -8 17 -3 -64 -17 15 1 -2 21 -23 16 -14 59 74 -15 35 25 75 -24 6 -8 -1 -9 -20 59 -28 -27
6238 -27 15 57 -37 2 32 -18 13 -24 23 9 -22 -48 39 -23 -73 11 26 1 -13 -33 -61 -56 -48 45 -38 -40 25 -53 20 -70 -44 28
6270 28 -58 26 -11 35 -90 -55 -10 85 -80 -1 102 30 -16 -30 54 -35 -6 20 34 69 29 44 58 -33 23 -44 56 -14
6298 -14 -77 10 -1 -22 12 59 18 -3 -8 29 -52 -37 20 19 -66 0 48 25 -79 -15 59 8 -7 -20 -79 -3 25 19 -11 -97 -10
6329 -10 31 42 -5 43 -16 -2 4 -32 86 -4 -27 54 84 93 -37 17 47 -59 -19 30 21 -45 23 68 -16 -43 59 37 -14 -37
6359 -37 17 -30 25 -57 50 -26 -66 -33 -9 -21 -115 -25 -28 -19 -47 -63 -18 27 4 -11 81 -46 -32 25 -14 -40 -32 -29 -5 -77 33
6390 33 -14 -34 -34 2 34 49 3 52 38 -2 -4 116 27 -10 3 50 -7 5 26 23 16 53 71 58 -83 -91 15 40 -36 -32 -10 -79
6422 -79 -10 -66 33 -37 -9 31 6 -10 -81 -10 31 -83 4 42 -10 17 -43 17 -29 26 12 10 69 -37 -29 57 36 -15 45 48 12
6453 12 19 24 43 -59 59 93 18 -31 42 50 -17 -2 18 92 -49 -13 47 -31 9 -6 -4 -28 -1 -16 21 13 -4 -11 -23 -43 -120 44
6485 44 -2 -69 5 43 -41 -22 -18 -31 12 -28 -28 51 1 -24 -21 -4 -12 9 61 19 31 40 -4 -66 49 19 43 39 71 30 0 1 -16
6518 -16 19 21 -29 -6 29 42 36 -13 7 -15 -42 -53 -23 -33 21 0 2 -6 -14 -37 -39 -14 2 42 -15 -50 7 -14 -29 -6 -20 6 6 -39
6552 -39 -13 -3 -64 -52 -25 -44 29 60 49 -23 37 -5 -41 -1 27 14 36 -8 36 -23 2 -9 3 53 69 15 63 16 117 65
6582 65 -15 10 -74 7 27 10 -2 22 -63 -30 35 -14 27 6 -70 68 -17 -41 -45 -47 -24 12 -99 -37 -57 58 13 4 -13 31
6612 31 -30 -5 -34 30 46 -25 -12 7 39 12 -8 -8 59 43 -34 -32 77 13 53 19 31 29 76 29 28 6 81 -19 -4 -23 -42
6643 -42 25 -37 -29 -9 -9 28 -79 -33 -15 -23 -9 -30 35 -30 -9 27 -25 21 -34 40 -41 29 -32 44 15 -32 -6 -16 49 -8 -9 -5
6675 -5 71 -5 26 0 50 -4 92 20 8 62 32 56 32 19 59 29 20 62 18 4 71 32 -29 -15 -9 30 -3 24 43 -75 -39
6706 -39 -26 35 2 -25 -50 -25 -89 -37 -63 -23 17 4 14 30 -32 5 -8 -63 12 39 6 -13 -9 -40 0 64 25 37 40 58 35
6737 35 43 50 25 -17 85 -13 26 79 11 95 -43 41 -33 36 -27 3 43 4 37 6 33 -69 -19 -8 24 -20 -21 25 21 9 -19
6768 -19 30 -12 17 10 -80 -15 -40 39 -15 13 -1 -26 -22 3 -11 -21 -16 -78 14 126 60 60 6 -17 9 -20 -45 13 4 38 56 -36
6800 -36 -10 29 -23 -25 -15 49 -12 42 -12 -10 -21 7 23 51 -69 -16 -34 20 -41 11 -5 -7 50 -73 -24 35 -3 -20 34 6 -33
6831 -33 -60 -12 56 -88 -37 33 33 45 -25 -32 4 -67 -14 -5 5 32 -44 20 -28 -38 87 30 -26 36 31 38 6 39 13 25 -2 65
6863 65 62 42 65 18 -21 -7 4 -4 25 9 29 -14 -15 -19 -16 6 30 42 17 -5 18 -61 6 -49 10 -15 -3 -14 -15 -16 -27 -14 -9 42
6897 42 -58 -31 -52 -40 18 -7 -37 74 1 42 -49 27 54 -7 5 30 7 -27 51 -20 13 8 71 -15 -24 -3 33 -24 -50 -28
6927 -28 24 -69 -24 9 -60 -9 -26 -20 -25 -17 -25 -47 -28 -5 -45 -39 -29 21 5 -81 2 33 17 -44 -4 10 44 -33 9 19 57 -29 31
6960 31 33 -7 21 8 25 -66 28 54 20 -1 -55 50 83 39 6 9 -17 33 49 -2 -2 -5 -55 45 -45 -62 -46 10 -50 -50 4 -23
6992 -23 -42 -85 33 -23 -3 6 -15 -25 5 28 23 -51 -93 13 34 -40 -61 16 11 10 20 62 -20 -48 24 66 23 17 1 28 30 -1
7024 -1 -12 -20 -7 45 17 -18 39 36 13 -83 -42 64 20 -33 -51 -83 -58 -1 -62 39 1 -46 6 -41 -42 -76 -18 30 6 -35 34
7055 34 -12 -40 -21 -56 38 -43 14 -3 -20 -31 -6 7 -31 -6 -18 -26 15 -18 47 21 43 20 33 -31 22 -19 39 29 9 -9 33
7086 33 6 25 -10 28 -52 19 62 4 -14 39 48 -54 9 -93 63 -6 -51 5 32 -70 -16 14 -13 -27 -22 -29 8 -23 61 32
7116 32 24 15 34 -36 -14 22 -45 23 -22 -45 -27 -9 -30 45 32 2 14 -6 60 64 -48 74 -8 47 21 30 -23 -50 20 5 46
7147 46 -3 21 -21 -36 -42 -45 -42 33 12 16 4 -40 48 23 -41 -24 -53 2 -55 40 47 3 -6 -23 -1 -23 28 8 15 12 -14 -9 10 51 -2
7182 -2 31 44 22 -33 25 41 22 11 -51 -1 28 18 45 49 3 17 35 -3 5 26 44 5 -34 21 -50 -34 15 5 4 -33 -65 19
7214 19 42 22 -41 -24 -1 -4 -18 -4 7 -14 2 65 -41 -36 -29 -87 24 -20 41 9 -39 24 20 -69 -13 3 68 -56 -64 38 6
7245 6 20 36 -9 -52 -43 -38 58 10 10 2 -15 10 -16 58 -41 -49 10 50 3 -22 30 12 39 11 -65 29 -37 -18 44 55 -35 9 10 -48
7279 -48 -15 -56 -25 -28 -22 -62 49 3 6 33 40 31 21 7 -20 28 22 12 75 -49 147 52 -6 -15 -40 33 60 60 8 53 -55 -4
7311 -4 22 -29 51 -5 11 -25 -18 -96 -40 -56 -74 -27 26 -3 -27 -46 -57 -5 -29 8 -15 -20 -16 45 -16 -25 42 18 13 -42 2 -17 38
7344 38 15 1 -37 36 30 10 69 -46 28 -15 16 -32 30 5 25 37 -34 20 -7 1 27 -9 8 -9 -49 34 9 -54 3 8 41
7375 41 -25 21 20 -76 6 14 25 33 -85 -61 -2 -35 -20 -20 -18 -65 -23 16 -81 -5 1 -8 -24 -75 -11 -8 1 1 0 14 -10 7 -29 -23 54 38
7411 38 17 54 -59 41 -13 -14 76 18 12 -18 81 17 88 2 22 25 -59 5 -2 57 24 13 7 -40 -74 -45 -32 14 -49 -9 -67 0
7443 0 -35 2 -51 -18 26 -63 -29 -75 18 8 -62 23 -76 -21 12 -28 -14 9 -37 58 -42 18 72 18 -11 -9 32 80 -20 -3
7473 -3 -32 24 91 -58 -8 50 -1 1 62 14 23 -42 4 8 33 41 1 3 -42 49 63 -82 -31 -52 -15 -58 -1 -18 3 -64 2 -32
7505 -32 -21 -34 -41 0 -5 41 28 -7 -18 14 -8 -28 -2 26 34 15 44 120 85 30 63 -21 20 -62 -46 65 34 87 -7 64 8
7536 8 -41 30 -72 7 24 41 -41 -12 -43 -4 35 -112 -18 53 -13 -32 -27 42 41 -49 -16 -3 -1 -38 53 24 -45 -24 -20 -40 -3 -15
7568 -15 36 -6 -46 60 -27 -7 -17 -31 6 15 47 30 -43 65 5 -30 46 -41 -25 23 55 -42 9 42 4 12 -30 -11 -40 11
7598 11 37 40 -60 -50 -7 37 -59 -17 -10 9 57 4 -9 -26 -30 -20 -13 -49 25 -6 15 -23 11 -25 -58 -57 22 3 27 -5 15 11 9
7631 9 -39 3 27 -16 19 8 -12 57 108 3 14 5 -1 -25 81 -3 43 9 -51 -20 -5 -12 22 26 17 18 8 12 -49 -4 -39 8 25
7664 25 -20 -9 23 -44 -17 -57 -44 -75 -27 43 -22 21 -34 33 -58 -15 -5 10 -36 -59 -26 34 31 -71 52 -75 14 49 63
7693 63 33 57 21 13 4 5 32 8 -23 22 1 41 -22 -2 -3 -4 52 -12 -5 51 -28 43 -7 27 22 -40 -28 -38 1 3 -56 -8 -46 1
7727 1 35 -53 -49 50 -15 -72 17 -51 -43 -89 -3 21 33 -14 -43 36 63 16 7 1 -54 6 -25 -32 -71 -5 -12 20 22 31 16 -21 27 -41 24
7762 24 -23 -8 57 0 -7 -21 -7 56 -53 -10 46 41 18 30 14 -37 85 -103 8 -2 -117 -55 -27 -11 -27 35 -17 -3 -37
7791 -37 -10 19 23 -29 2 31 -5 -28 -22 -22 -73 38 0 -14 25 -46 20 -28 -20 35 -26 -2 -5 4 -19 7 -5 37 43 22 -11 -38 -88
7824 -88 -20 69 37 16 31 49 -6 -11 18 41 -37 -71 -35 -68 -24 6 -32 -27 -3 7 -3 -53 21 -8 -38 3 -57 -32 -11 -43 14
7855 14 -31 21 -20 40 7 41 -32 -2 -71 13 -4 56 -15 -33 23 -1 78 -30 -13 -9 0 -30 -10 -3 -3 -15 -27 -25 25 27 37 -41 -17
7888 -17 12 11 -63 22 42 15 -17 19 -33 -23 -26 -20 35 -44 25 -60 -8 1 16 -68 22 -58 23 -15 55 -53 -42 21 -16 -6 -66 5
7920 5 48 -29 34 32 32 -27 70 -12 12 -1 -2 -25 -36 -83 61 35 -32 -23 16 -37 -32 -14 37 17 -24 15 14 22 -71 -23 -50 -18 -16 -9 -36
7955 -36 -74 38 22 43 -16 21 19 -64 -13 12 11 7 -56 40 31 -2 12 43 15 -27 -17 -36 -33 17 -27 23 -27 11 8 -7 -14 44 3
7988 3 26 43 1 -3 6 -14 -6 -9 -23 81 -58 32 -18 -78 4 -6 -6 -8 -15 -16 -11 -25 56 -39 9 -25 -19 -9 -23 -5 -48 6 35 1 30
8023 30 -64 -11 28 -39 -29 29 -4 -40 18 4 8 -4 -29 -6 16 -14 30 -28 -48 68 -35 -36 37 -38 2 0 41 -17 11 -12 3
8054 3 29 -4 -13 -4 -48 -45 10 64 -2 -17 3 -22 -12 0 -45 -42 -24 43 -74 -15 11 -55 -60 -21 -8 4 11 15 31 1 -37 25 2 -21
8088 -21 10 57 -15 22 2 28 -33 -27 69 -22 50 8 -18 -33 -8 34 18 -37 28 36 23 40 -6 7 -19 7 -4 -17 -8 17 -18 -28
8120 -28 -21 -37 -9 -109 -31 -13 -75 -14 -15 -48 7 0 -35 -54 -6 -56 -36 47 -32 -10 -37 -19 -9 -29 30 45 90 -15 -12 19 4
8151 4 -43 60 -21 -12 20 21 -30 -17 27 36 12 -49 -36 -57 25 8 -46 -18 -20 47 -27 19 -36 -18 2 -42 2 -34 -7 2 10 -52 -52 57
8185 57 93 -12 -49 -44 -3 22
8191B2
$$ Imaginary data points
##PAGE= N=2
##DATA TABLE= (X++(I..I)), XYDATA
0 0 0 0 0 0 0 0 0 0 0 0 0 0 0 0 0 0 0 0 0 0 0 0 0 0 0 0 0 0 1 -5 5 -6 6 -6 6 -6 6 -9 9 -12 13 -14 15 -15 18 -19 21
47 21 -25 28 -30 34 -42 48 -56 67 -86 114 -161 264 -564 2423 17869 13225 5986 11663 16797 11899
67 11899 12100 21068 21946 13507 13254 20091 19136 15392 21559 26464 17097 7275 11831 17949 13178 9244
83 9244 13272 12403 3764 2191 8668 8095 56 -2113 -1057 -7243 -12828 -7253 -1005 -5828 -11599 -8406
99 -8406 -5432 -9021 -8639 -2304 -2340 -9415 -10156 -3976 -2445 -4105 -29 3990 -630 -5293 -398 5219
115 5219 3112 1321 4994 5679 1558 3369 11138 12640 7572 6749 8786 5542 2041 5804 8999 3651
131 3651 -1703 651 2456 -846 -990 3143 1280 -5934 -6790 -2312 -2658 -5626 -3479 -1173 -5499 -8892
147 -8892 -4238 -539 -4026 -6340 -3718 -4160 -8202 -6242 305 661 -3250 -1774 2062 769 -611 3956
163 3956 6658 2107 -802 2769 4841 2109 2587 6114 4300 -842 -98 3943 2580 -767 525 1681
179 1681 -2406 -4387 -229 1933 -1959 -4149 -2269 -3372 -7353 -6444 -2867 -4796 -9291 -8463 -5595 -6855
195 -6855 -7940 -4286 -2510 -6177 -7954 -4327 -2446 -4428 -3839 -371 -1159 -4213 -2307 2011 1521 -891
211 -891 741 2462 -71 -1176 2661 4766 2259 1234 4002 4287 1861 2610 5476 3955 288 773
227 773 3091 1708 -39 2022 3209 317 -1478 1042 2203 -195 -728 1307 808 -1658 -479 2703
243 2703 2216 84 1006 2520 960 -196 1986 3399 1298 290 2408 3223 1839 2388 4565 3867
259 3867 1561 1933 3706 2925 1604 2633 3425 1555 322 1730 2370 620 -325 511 -41 -1830 -1476
276 -1476 -26 -585 -2055 -1757 -958 -1956 -2793 -1780 -1355 -2614 -3133 -2048 -1475 -2097 -1699 -472 -541 -1281
294 -1281 -638 547 409 80 924 1615 1100 1121 2232 2589 2035 1987 2579 2512 1896 2165 2660 2253 1528 1663
314 1663 1826 1019 466 755 424 -628 -993 -834 -1105 -1768 -1898 -1749 -2356 -2975 -2914 -2712 -3176 -3403 -3107 -2947
334 -2947 -3288 -3256 -2637 -2513 -2828 -2601 -2057 -2032 -1975 -1321 -649 -660 -563 103 535 479 737 1297 1433 1285 1413 1965
356 1965 1958 1792 1985 2159 1817 1425 1442 1420 970 628 713 668 278 8 95 -160 -725 -958 -1012 -1337 -1821 -1872 -1811
379 -1811 -2142 -2337 -2174 -2004 -2171 -2219 -1922 -1794 -1825 -1553 -1169 -837 -720 -479 -154 87 -6 247 550 668 685
400 685 987 1271 1356 1381 1663 1837 1848 1803 1880 1910 1817 1677 1666 1589 1354 1181 1077 844 527 433 357 203 -10 -112
424 -112 -106 -160 -365 -359 -333 -524 -547 -516 -479 -538 -505 -283 -311 -271 -183 -104 14 -7 113 349 490 581 769 1072 1126 1269
450 1269 1216 1298 1297 1239 1232 1032 909 927 909 684 677 623 497 295 183 127 -69 -140 -147 -160 -292 -344 -265 -333 -551 -618 -655
477 -655 -853 -1054 -861 -635 -657 -561 -159 16 -147 6 364 312 80 179 469 335 223 665 1025 767 489 771
499 771 890 328 271 665 609 32 38 670 540 71 240 549 -115 -844 -578 -342 -1005 -1364 -841 -713 -1448 -1450
521 -1450 -648 -746 -1567 -1732 -1097 -1451 -2080 -1362 -511 -1042 -1540 -827 -202 -818 -1095 -128 -164 -1245 -1172 -59
541 -59 156 -517 95 1015 504 -248 563 1379 485 -275 508 856 -88 -55 1297 1479 189 104 1199 727
561 727 -298 323 1350 401 -525 548 1673 939 519 1661 1711 117 -92 1390 1416 152 631 1799
579 1799 1216 348 1510 2784 1613 430 1266 1671 363 192 1783 1901 164 157 1546 1145 -223 394
597 394 1203 -391 -1885 -738 524 -660 -1295 37 13 -1899 -2078 -234 -538 -2398 -2158 -904 -1724
614 -1724 -2837 -1256 286 -1077 -2274 -929 -304 -1682 -1764 253 378 -1563 -1112 1070 1058 -178 856
631 856 2163 636 -807 818 2133 871 187 1744 1944 59 326 2453 2142 -103 -46 1175 -47
648 -47 -1279 362 1563 -433 -1852 -410 179 -1538 -1776 -25 -628 -3176 -2817 -636 -1103 -2481 -1382
665 -1382 -185 -2065 -3353 -1205 116 -1780 -2344 -541 -422 -2321 -1444 1413 964 -1288 -530 1329
681 1329 163 -1036 1215 2601 267 -975 1348 2266 397 586 2717 1883 -881 -210 2264 1370
697 1370 -695 541 1734 -432 -1873 651 1829 -587 -1754 138 54 -2392 -1772 1025 89 -2621
713 -2621 -1784 486 -855 -2247 -105 1226 -1419 -2735 -155 1093 -853 -861 1596 1056 -1575 -649 2243
730 2243 1545 -624 616 2188 297 -1031 1740 3184 747 -434 1708 1976 -350 114 2596 1577
746 1577 -1243 -427 1728 541 -1036 844 1961 -680 -2056 333 1291 -1119 -1408 728 167 -2277
762 -2277 -1336 1359 385 -1858 -719 862 -920 -1976 480 1792 -610 -1431 897 1272 -709 -117
778 -117 2079 1067 -1369 -316 1988 876 -585 1108 2117 -158 -1127 1259 2019 -278 -735 1083
794 1083 491 -1580 -597 1601 482 -1696 -697 640 -934 -1881 212 882 -1457 -2216 -89 221 -1536
811 -1536 -1160 769 -275 -2448 -1157 848 -210 -1498 13 903 -1017 -1593 722 1348 -727 -1025
827 -1025 822 443 -1176 -80 1864 679 -1305 -122 1316 -75 -872 977 1495 -798 -1170 977
843 977 1022 -731 -333 1128 98 -1621 -370 1414 273 -977 393 1062 -711 -1109 1050 1302 -655
860 -655 -791 986 697 -730 395 2044 810 -767 375 1535 196 -459 1116 1345 -510 -642 1171
877 1171 1198 -450 -155 1052 11 -1516 -394 868 -338 -1385 -317 205 -1209 -1653 -52 -21 -1818
894 -1818 -1913 -481 -749 -1943 -1005 307 -646 -1722 -731 307 -606 -1227 19 473 -857 -825 906 1127
912 1127 -64 210 1451 920 -121 730 1900 1179 225 1248 1883 986 722 1807 1902 502 354 1320
930 1320 1115 78 469 1209 489 -428 193 895 -110 -771 -72 28 -1055 -1160 -160 -70 -1072 -903 -197
949 -197 -586 -1337 -836 -32 -744 -1273 -498 -7 -547 -515 353 464 -314 -102 686 575 -38 359 1013 586 166
970 166 785 1185 623 292 854 898 328 316 931 733 89 207 653 277 -198 132 269 -241 -645 -261 -131
991 -131 -609 -707 -336 -393 -972 -770 -347 -533 -920 -649 -297 -487 -806 -373 31 -363 -441 -7 142 -180 -129 393
1013 393 363 136 263 625 441 293 551 804 436 369 677 738 439 294 603 445 37 82 253 121 -200
1034 -200 -135 62 -196 -506 -276 -231 -388 -605 -414 -377 -626 -534 -386 -432 -541 -561 -345 -375 -553 -443 -270 -316 -365
1057 -365 -79 12 -19 -58 157 202 56 125 296 256 143 207 329 355 311 347 373 334 197 309 303 234 147 247 225 55
1083 55 77 84 41 -58 -137 -137 -233 -214 -190 -160 -210 -253 -198 -214 -202 -258 -361 -229 -176 -191 -184 -129 -52 -72 -71 -90 -78 -68 -18 -6 -4 -32
1115 -32 19 52 44 73 108 24 42 36 75 26 21 7 -46 -36 -8 -61 -30 -117 -29 -6 -33 19 41 50 68 95 118 46 -9 72 40 31 90
1148 90 203 183 68 104 211 117 78 138 141 96 139 129 249 68 93 101 74 -68 -64 28 -141 -179 -59 10 -165 -187 -31
1175 -31 -131 -349 -350 -144 -132 -328 -271 -50 -145 -256 -74 39 -99 -244 -115 37 -137 -109 161 282 126 162 418
1198 418 396 121 308 481 270 66 308 471 330 150 384 479 96 55 223 256 -175 -142 143 59 -290 -142
1220 -142 84 -292 -596 -346 -224 -639 -754 -433 -401 -809 -696 -292 -450 -802 -664 -289 -527 -805 -444 -161
1240 -161 -455 -669 -94 56 -368 -312 261 266 -253 8 511 407 29 405 839 433 159 553 932 355 210
1261 210 747 780 188 170 811 623 -45 179 601 187 -303 103 506 -197 -623 -64 103 -629 -638 18 -111
1282 -111 -814 -719 -105 -435 -966 -525 -55 -582 -995 -281 78 -640 -684 90 121 -586 -372 495 287 -353 109
1303 109 649 191 -234 427 923 283 -45 728 909 100 115 972 792 -115 194 945 567 -235 347 901
1323 901 52 -448 373 587 -317 -489 299 261 -695 -507 403 -12 -836 -391 279 -411 -976 -162 268 -605
1343 -605 -886 119 293 -726 -440 449 257 -826 -347 598 -39 -624 55 798 -17 -545 457 911 -230
1362 -230 -419 657 537 -512 -247 870 414 -618 -29 837 -43 -737 249 713 -408 -833 313 428
1380 428 -735 -613 523 184 -1044 -555 548 -181 -1106 -261 517 -581 -1112 159 500 -646 -822 302
1398 302 205 -987 -588 715 87 -991 -174 768 -137 -800 346 893 -344 -729 454 641 -459 -348
1416 -348 933 581 -699 -80 1087 369 -604 273 969 -121 -653 584 1081 -224 -286 867 698 -562
1434 -562 -207 985 377 -754 22 923 34 -658 499 1023 -312 -705 494 649 -614 -517 684 228
1452 228 -914 -384 893 89 -885 -22 611 -521 -1049 230 605 -668 -751 466 339 -776 -351 843
1470 843 192 -996 -259 775 -38 -633 501 998 -286 -604 704 939 -273 -77 963 588 -564
1487 -564 89 1234 653 -358 481 1029 -115 -467 685 1011 -286 -533 588 470 -600 -235 865
1504 865 105 -996 -402 368 -410 -967 -55 180 -959 -1235 -57 117 -978 -856 104 -429 -1431 -661
1522 -661 413 -321 -1019 -270 290 -628 -871 378 552 -619 -622 427 314 -505 37 1013 325 -531 255
1541 255 1037 294 -221 616 906 -265 -369 867 863 -164 -92 776 258 -584 -50 859 59 -761 -160 356
1561 356 -510 -740 257 305 -739 -866 81 -103 -904 -526 302 -318 -1107 -419 343 -225 -672 144 347 -471
1581 -471 -522 522 626 -237 -83 734 424 -245 407 1100 499 -87 502 941 258 80 911 977 93 62 789
1602 789 706 -33 169 708 162 -469 46 565 -21 -451 133 297 -459 -617 154 72 -650 -511 1 -217 -790
1623 -790 -251 222 -250 -728 -226 47 -396 -522 125 210 -473 -305 266 312 -237 16 486 89 -263 211 455
1644 455 207 -95 392 510 -85 -25 453 393 -207 -118 316 174 -280 85 311 -64 -391 -124 175 -341 -399
1665 -399 -43 -83 -420 -476 -101 -128 -477 -288 -23 -280 -536 -242 53 -218 -353 -47 62 -302 -237 148 93 -190
1687 -190 -110 188 113 -116 187 360 155 -108 208 319 58 -21 296 259 -93 17 277 217 6 74 282 143
1709 143 -207 114 166 53 -89 58 174 -35 -146 157 71 -256 -29 146 -5 -127 -29 107 49 -216 60
1730 60 91 -86 -49 91 155 -58 -39 85 102 -12 -24 109 70 -35 -37 97 -63 -118 -27 34 -140 -141 -34 -66 -237
1755 -237 -183 -114 -128 -206 -89 0 -88 -135 -72 -87 -125 -39 -97 6 -10 -25 36 44 41 108 87 83 54 67 134 111 89 108 113 68 41
1786 41 115 100 55 -46 9 7 -17 19 19 -6 -87 -44 -107 -110 -139 -143 -207 -196 -121 -70 -28 -96 -57 -93 -95 -98 6 33 3 1 165 185
1818 185 127 197 129 297 195 240 293 314 313 334 420 378 315 326 308 279 243 291 236 141 141 181 81 24 25 -27 -161 -152 -218 -222
1848 -222 -221 -301 -267 -267 -334 -346 -249 -367 -464 -374 -322 -392 -425 -298 -261 -240 -231 -115 -103 -172 -95 -1 37 56 13 230 261 189 187 307
1878 307 181 202 234 249 232 168 272 283 107 98 267 117 -95 -22 -7 -190 -252 -123 -98 -215 -295 -182 -249 -423 -470
1903 -470 -309 -329 -538 -526 -309 -355 -432 -279 -143 -263 -278 -100 -53 -77 -103 82 148 -62 37 340 262 123 217 401
1927 401 289 184 431 586 211 209 439 455 205 142 462 267 -39 72 273 160 -128 71 168 -151 -271 -18
1949 -18 -29 -283 -392 -108 -108 -472 -278 28 -124 -434 -284 -50 -117 -320 15 206 -148 -305 65 188 -99 -1
1971 -1 374 269 -103 74 479 331 12 198 433 122 -34 378 500 63 -88 279 276 -193 -3 364 136
1992 136 -329 -132 213 -121 -311 10 170 -366 -573 18 17 -397 -337 11 -157 -595 -259 163 -47 -429 -136
2013 -136 155 -294 -438 152 284 -279 -389 147 154 -253 -58 475 168 -489 -155 278 41 -251 193 371 -186
2034 -186 -324 310 385 -183 -228 300 38 -497 -142 523 147 -399 -6 343 -229 -482 243 388 -332 -411 233
2055 233 174 -298 -10 524 85 -536 -179 316 54 -303 163 320 -331 -461 374 455 -228 -246 307 -35 -641
2076 -641 -51 513 40 -544 -137 267 -278 -483 260 350 -447 -600 190 207 -362 -70 486 78 -638 -32 610
2097 610 129 -312 288 414 -263 -341 587 676 -75 -42 574 344 -306 217 900 267 -338 144 619 15 -214
2118 -214 521 630 -298 -470 342 289 -412 -204 396 -45 -749 -246 465 -147 -632 -85 82 -668 -698 170 311
2139 311 -561 -525 19 -59 -593 -132 502 -12 -666 -182 457 -54 -251 377 571 -367 -276 612 587 -83 87
2160 87 715 306 -260 240 857 364 -216 280 536 -170 -284 569 467 -341 -426 268 -39 -534 -75 428 -265
2181 -265 -839 -277 246 -423 -640 3 35 -780 -703 133 64 -570 -387 131 -197 -681 -3 477 -7 -504 190
2202 190 426 -86 -140 672 668 -189 -57 625 481 -67 433 900 295 -361 391 825 220 -3 521 525 -248 -247
2224 -247 569 406 -328 -125 371 -104 -556 3 417 -182 -616 -55 159 -486 -472 247 54 -678 -580 100 -40
2245 -40 -467 -158 308 -235 -658 53 373 -62 -322 215 221 -373 -167 482 413 -185 -4 507 201 -212 256
2266 256 654 73 -268 278 432 -113 -98 425 267 -344 -204 375 168 -300 -77 238 -166 -526 -38 230
2286 230 -263 -481 13 -47 -491 -388 147 30 -509 -327 55 -170 -479 -36 270 -223 -507 18 240 -241
2306 -241 -214 250 152 -344 -165 346 188 -172 46 272 43 -189 196 435 -57 -149 198 197 -137 4 407 231
2328 231 -170 -49 239 40 -140 90 330 -34 -221 134 228 -76 -113 207 135 -248 -99 262 157 -140 -13
2349 -13 200 -73 -252 62 165 -133 -180 51 19 -220 -72 200 20 -265 -128 79 -18 -171 71 127 -148 -247
2371 -247 88 158 -88 -104 131 140 -140 -29 289 202 -97 105 198 63 -56 189 283 -16 -18 208 189 -26 38 249
2395 249 142 -75 -32 203 35 -141 30 92 -86 -185 -35 42 -194 -156 -44 -117 -276 -257 -117 -214 -317 -188 -172
2418 -172 -256 -255 -153 -123 -280 -338 -160 -77 -201 -178 -45 -111 -133 -85 -7 -29 -23 73 59 45 -43 205 180 85 129 220 249 127
2446 127 54 263 119 69 93 213 87 3 153 86 62 -114 8 57 -37 -90 -64 -95 -171 -145 -70 -212 -278 -185 -200 -225
2472 -225 -204 -120 -79 -132 -161 -77 -136 -127 -93 -50 -50 -19 47 75 30 42 102 101 116 123 203 166 203 238 289 262 231 236 257 227 156 226
2504 226 223 234 141 209 181 108 54 77 21 43 -1 35 -56 -115 -88 -54 -144 -179 -144 -116 -179 -128 -85 -107 -169 -44 -80 -89 -155 -78
2534 -78 -28 8 -24 -19 61 49 107 92 197 181 190 200 217 186 238 204 268 213 266 237 232 180 192 176 123 83 194 97 75 47 -6
2565 -6 61 -84 -20 -2 -116 -166 -91 -65 -232 -236 -143 -115 -168 -203 -127 -153 -299 -229 -177 -156 -118 -58 -67 -156 -115 -49 16 -87 -110
2594 -110 26 -31 -96 -9 175 44 18 38 84 80 3 132 168 39 19 91 93 -29 -10 151 52 -38 25 57 -45 -123 -17
2621 -17 38 -105 -147 2 35 -169 -186 33 -40 -155 -116 11 -35 -200 -26 64 -82 -124 33 16 -68 -88 151 107 -101
2646 -101 -25 158 -1 -115 56 213 23 -63 123 187 -63 -63 146 150 -62 23 172 124 -20 -12 252 51 -84 60
2670 60 204 -1 -39 168 178 -63 -77 173 231 -70 16 239 65 -130 14 184 90 -149 72 141 -65 -77 143
2693 143 216 -173 -146 110 72 -166 31 246 -20 -279 -5 237 -67 -127 180 150 -202 -164 225 170 -98 17
2715 17 244 55 -172 56 291 36 -181 117 254 -52 -35 266 217 -155 -36 252 181 -147 54 342 -20
2736 -20 -287 38 252 -62 -261 131 125 -275 -268 175 163 -259 -191 88 -148 -448 -124 138 -214 -444 -111 49
2758 49 -267 -268 152 55 -395 -311 96 5 -260 -55 262 -67 -331 86 403 -39 -233 221 229 -194 -73 357 333
2781 333 -159 -47 338 102 -188 117 468 -5 -277 117 263 -106 -193 334 110 -305 -295 214 82 -361 -64
2802 -64 173 -172 -496 -59 255 -220 -337 2 67 -384 -261 216 101 -365 -261 230 -7 -286 86 374 -29
2823 -29 -279 142 291 23 -104 328 310 -152 -29 464 319 -133 190 434 133 -211 321 485 53 -193 235
2844 235 274 -199 -107 347 200 -309 -139 275 4 -344 3 237 -228 -434 70 229 -172 -225 110 38 -463
2865 -463 -222 252 140 -339 -117 213 -116 -301 157 410 -91 -257 187 200 -155 -115 455 206 -266 -26 394
2886 394 171 -176 175 429 15 -232 230 387 -24 -138 244 239 -255 -105 390 109 -294 -41 182 -84 -305
2907 -305 141 251 -230 -390 37 89 -283 -172 103 -4 -468 -198 132 -157 -357 -124 128 -253 -335 116 95
2928 95 -274 -236 90 55 -321 -88 285 84 -362 -74 206 -35 -270 197 283 -132 -190 170 274 -123 -98 202
2950 202 100 -282 -29 275 84 -123 53 236 -173 -247 123 189 -201 -251 115 52 -330 -161 206 -9 -305
2971 -305 -106 119 -55 -265 -66 104 -141 -305 138 104 -228 -143 92 22 -294 -104 216 54 -265 24 211
2992 211 -108 -202 135 226 -46 -109 243 123 -65 41 286 163 -108 40 320 99 -60 141 251 37 -90
3013 -90 197 230 -51 -37 187 37 -122 -20 176 31 -191 -33 147 -98 -238 76 67 -209 -177 68 -27 -163
3035 -163 -104 180 -26 -258 -61 133 -26 -141 54 123 -32 -60 160 206 -55 26 213 143 -44 86 252 62
3057 62 33 140 221 122 22 177 231 48 35 245 120 -19 44 161 -29 -146 47 119 -86 -131 59 20 -118
3080 -118 -97 22 -16 -192 -127 16 -55 -228 -116 -3 -150 -150 -104 -29 -196 -206 -34 19 -128 -110 44 21 -126 -80
3104 -80 10 -30 -21 19 98 -16 -51 53 106 18 -32 103 127 42 1 92 69 89 19 121 95 -103 64 70 -31 -26 -2 25
3132 25 -43 -93 36 -37 -83 -55 11 -63 -62 -46 16 -64 -102 -75 -36 -41 -100 72 0 -106 -66 5 -11 20 3 -1 90 63 37 111
3162 111 72 35 129 115 62 37 100 147 103 35 142 140 76 143 162 93 85 103 51 54 15 90 73 75 25 15 37 11 47 3 15
3193 15 -39 33 23 -79 -60 -2 -60 -120 -10 -5 -11 -71 3 -4 -5 0 27 -11 56 38 54 69 15 53 39 64 69 76 72 81 -5 87 47 112
3227 112 33 99 54 63 50 89 25 24 -14 57 -7 -16 18 1 -8 -20 -36 -41 -14 -92 -87 -27 -132 -30 -94 -160 -126 -130 -57 -182 -123 -140
3259 -140 -67 -123 -108 -145 -19 -154 -123 -28 -10 -100 -95 13 -10 -74 -7 -9 -10 -65 -23 23 58 70 113 86 -2 8 114 112 -24
3288 -24 33 15 -40 -44 20 95 24 41 58 35 32 54 -17 78 -14 -9 6 -15 -114 8 30 -57 -139 -42 -68 -86 -95 37 -32 -157 -51
3319 -51 -23 -20 -131 -74 45 -20 -29 29 40 17 -94 2 115 -9 -3 97 84 25 34 145 50 53 105 123 137 -23 97 111
3347 111 45 51 187 139 -17 73 185 129 40 -7 79 1 -136 -53 35 -27 -50 -29 37 -122 -103 -7 -50 -156 -110 -33 -79
3374 -79 -172 -51 21 -116 -147 -34 -28 -137 -106 59 1 -109 -136 107 -15 -54 17 176 70 -90 74 123 114 1 245
3399 245 158 10 52 210 181 -8 91 207 54 -40 79 167 -50 -118 95 80 -78 -126 75 -35 -181 -89 38
3422 38 -40 -229 -98 -5 -100 -257 -118 -2 -179 -222 -39 -53 -254 -222 49 35 -86 -72 125 11 -183 82 160
3445 160 -6 -92 202 217 88 13 200 193 -56 22 311 169 -12 88 321 71 -95 120 235 -55 -62 179 64
3468 64 -107 -97 157 115 -127 -61 128 -28 -220 -3 128 -76 -157 15 81 -190 -220 71 41 -198 -155 133 -46
3491 -46 -265 -33 164 -44 -137 79 224 -93 -191 112 193 -103 -44 247 127 -146 -13 242 42 -150 142 172
3513 172 -3 -97 101 163 -99 -116 181 95 -172 -61 202 11 -113 -60 196 -83 -268 -30 82 -138 -215 7
3535 7 38 -166 -176 152 28 -235 -73 90 -63 -264 -54 108 -142 -192 92 172 -63 -107 105 102 -195 -22 193
3558 193 55 -125 41 214 3 -210 178 170 18 -72 201 185 -83 16 216 140 -157 113 261 0 -144 89
3580 89 207 -37 -184 74 135 -147 -100 74 24 -135 -68 96 -22 -203 -6 107 -69 -208 33 168 -188 -205
3602 -205 143 -21 -198 -103 160 30 -218 -42 179 -16 -198 88 191 -101 -112 150 133 -92 -70 203 62
3623 62 -177 -32 242 21 -84 68 248 7 -124 123 180 -76 -135 196 74 -172 -26 217 13 -172 -88
3644 -88 99 -65 -257 3 103 -132 -284 26 52 -244 -164 89 -45 -157 -113 44 0 -263 -55 108 -120 -205
3666 -205 7 122 -112 -150 69 129 -117 -5 160 92 -88 67 227 -17 -79 112 189 -44 -75 162 142 -63
3688 -63 -3 187 49 -19 -23 139 26 -124 29 96 -99 -101 86 36 -109 -184 91 30 -99 -97 50 -5 -139 -95 -4
3713 -4 -186 -207 13 24 -133 -168 -17 52 -145 -124 61 -40 -90 -43 95 46 -70 5 136 42 -44 81 130 0 -36
3738 -36 198 147 -107 77 182 78 -41 -17 81 -55 -88 -2 39 -42 -85 41 30 -120 -82 24 -22 -119 -42 22 -30
3763 -30 -171 -56 -3 -83 -137 -8 -18 -136 -77 -1 14 -150 3 31 15 -89 26 49 15 -48 -11 137 -35 -34 75
3788 75 103 -42 41 64 49 15 17 139 64 21 55 64 70 20 71 86 -70 63 19 46 -23 -89 -4 1 -57 -36 21 9 -80 -70
3818 -70 -18 -135 -91 -1 -18 -124 -66 -8 -71 -67 -6 -33 -68 -48 -43 39 -44 -62 -40 1 -22 8 33 28 -16 53 65 46 20 47 20
3849 20 -30 -37 32 95 2 14 31 62 13 3 -14 7 -17 35 49 19 -35 -40 -57 -20 -33 -57 -49 -99 -49 -19 1 -58 -37 -58 21 -4
3881 -4 -100 -63 -77 -47 -37 22 -2 5 7 -2 -44 -5 69 13 -73 -5 24 -9 34 129 81 126 65 81 86 89 92 82 19 57 2 42 50 4
3915 4 44 20 -8 24 -33 48 -20 -4 -4 -39 -8 -108 -58 -11 -38 -109 -89 -65 -118 -86 -51 -57 -16 -73 -135 -46 -34 -39 -43 -20 -24 -6 -2
3948 -2 -29 -11 59 -4 -22 42 36 35 32 103 12 13 72 21 95 49 131 25 92 44 59 57 -1 12 14 26 5 73 33 -32 0 22 -29
3981 -29 -26 -56 -32 -1 -23 -69 -26 -71 -55 -53 -24 -54 -62 -65 -49 -43 -22 17 1 -23 -3 34 -50 -3 -27 72 53 -48 -12 68 61 15 48
4014 48 85 6 46 45 91 93 24 170 72 69 50 144 65 13 -80 44 -32 -58 70 66 -57 -91 15 7 -60 -89 1 -15 -97 -161
4044 -161 30 -16 -96 -66 -47 -30 -134 -43 5 -150 -70 3 -1 -6 -22 87 -44 -44 0 54 -21 -23 51 130 44 77 164 152 72
4073 72 22 162 42 -19 1 127 -5 38 92 79 -7 -38 45 41 -43 -45 83 12 -125 -6 16 -38 -111 -105 111 -42 -100
4100 -100 -46 58 -122 -118 -39 50 -63 -137 32 49 -79 -64 34 -31 -85 -23 92 -2 -151 94 71 -72 -7 52 46 -50
4126 -50 40 126 65 -61 42 201 13 -51 131 102 -78 5 77 130 -87 -67 100 23 -115 -32 28 -10 -112 13 31
4151 31 -94 -89 -29 90 -83 -110 48 23 -60 -69 67 -59 -137 -66 43 -8 -64 -25 84 -88 -178 103 132 -73 -66 103
4177 103 84 -124 28 153 93 -115 59 148 39 -5 111 214 -52 27 161 172 -54 22 215 115 -142 -47 146
4200 146 59 23 -33 132 -70 -118 80 43 -138 -119 47 -5 -139 28 162 -66 -139 5 51 -127 -189 37 50 -90
4224 -90 -154 42 43 -91 -21 64 7 -106 53 165 11 -50 100 145 -29 -49 135 148 -77 4 201 66 -60 98
4248 98 222 100 6 33 84 1 -45 102 150 -45 -79 61 26 -159 -10 102 -21 -149 -8 118 -124 -193 -30
4271 -30 42 -215 -174 30 40 -169 -186 36 50 -193 -34 27 -35 -214 -20 111 -60 -82 63 134 -70 -72 151 84
4295 84 -54 70 201 28 -28 112 155 63 -48 144 125 -26 -11 124 83 -1 -81 109 88 -92 -3 134 -78 -136
4319 -136 -11 52 -43 -209 -34 -49 -138 -152 -40 40 -158 -48 29 -88 -149 -16 76 -50 -153 -17 80 -69 -73 77
4343 77 111 -107 -51 130 63 -74 58 239 49 -65 51 168 77 -4 138 135 -8 5 126 115 -76 39 160
4366 160 23 -105 43 158 -38 -31 76 91 -21 -70 73 37 -141 -13 10 26 -192 -94 13 -68 -156 5 66 -38
4390 -38 -89 2 45 -122 -37 102 65 -109 -70 65 -37 -83 -17 143 -55 -81 23 55 31 -26 149 56 -78 -20 126
4415 126 62 -63 -14 111 -28 -34 99 60 10 -10 18 69 20 -63 36 29 -97 -4 -15 -17 -54 -18 9 -60 -143 35 46 -66
4443 -66 -94 5 -8 -150 -95 -38 -27 -125 -56 24 -57 -120 -5 32 -83 -66 77 -65 -70 25 46 20 44 10 96 52 -38 57
4471 57 109 9 15 140 99 63 -23 106 32 -48 79 75 83 -12 31 29 -12 -54 57 68 -29 -17 75 7 -42 -93 36 -36 -75
4500 -75 -68 -37 -106 -168 -28 -35 -70 -82 -33 10 -78 -85 3 54 -2 1 25 -25 40 48 52 35 -28 118 49 -41 -50 78 62 64 54 -32 44
4533 44 3 30 108 50 22 61 -1 62 -57 38 53 -4 -79 -29 -50 -87 -40 -78 -4 -21 -71 -10 -89 -67 -43 -19 -59 -86 -54 -38
4563 -38 -69 -164 -64 3 -36 -56 -22 21 -14 27 43 49 10 -26 23 13 80 -6 113 19 86 0 -4 41 12 17 39 82 72 82 25
4594 25 7 30 43 -1 -60 -15 37 -26 -21 45 -37 -65 3 12 -87 -27 -64 -25 -67 -23 -60 -20 -37 18 -40 -47 -50 -8 -11 -64 -11 13 74
4627 74 -4 -38 18 75 -81 -18 11 102 71 71 84 23 39 62 84 61 19 95 33 43 14 55 61 35 -11 -2 4 -48 -5 32 7 -2
4659 -2 8 -19 5 -11 6 -38 5 -59 -33 -55 -32 39 24 -22 -80 5 6 -95 -73 -70 12 -27 -67 0 -18 19 -13 1 25 -13 37
4690 37 35 -1 8 64 44 -60 -3 129 76 60 116 62 29 -22 43 20 39 16 65 69 35 -11 -17 93 -56 -41 -28 25 7 48
4720 48 9 -47 -49 29 -61 -31 -49 -24 -4 -22 30 -38 -46 27 16 53 -20 -3 -61 16 -29 -79 -29 37 -38 -8 51 25 -28 -6 69
4751 69 104 4 -37 27 -4 23 51 35 18 -64 61 49 7 -37 31 11 -21 20 7 45 -88 6 74 47 26 -18 -45 -73 -73
4780 -73 43 -24 -59 -35 10 -68 -93 -10 12 -32 -86 -3 5 -89 -41 -8 48 -19 12 73 43 -7 16 105 -33 -65 -14 132 36
4809 36 27 114 89 -33 13 75 16 -49 -37 82 26 -47 -106 64 2 -28 -78 34 -39 -34 13 75 -86 -114 60 -18 -70 -47
4837 -47 -21 -43 -138 2 2 -40 -72 -2 92 -122 -153 65 30 -26 -21 56 -8 -38 65 116 64 -57 15 65 14 -9 75 58 28
4866 28 -94 40 68 49 -11 76 4 -64 -4 42 10 -41 -55 71 -46 -29 -4 15 28 -65 -39 19 -125 -28 10 -17 -165
4893 -165 32 2 -63 -36 67 22 -49 -65 26 96 -91 9 64 -32 -90 65 124 7 -85 68 61 9 50 153 39 -78
4919 -78 27 87 61 -15 46 111 -33 -83 33 72 -65 -44 29 42 -42 16 33 57 -57 -1 56 -64 -136 -29 68 -140
4945 -140 -71 42 37 -13 -82 11 -38 -46 -16 13 31 -83 -39 49 -43 -51 49 62 37 -31 33 119 -123 -12 171 89 -74 -10
4973 -10 89 9 -12 46 35 23 -52 24 46 -22 -37 82 81 -19 -46 57 -54 -95 17 20 -15 -132 -22 3 -59 -67 42 30
5001 30 -52 -46 136 11 -155 -61 65 -24 -102 35 -55 -9 -119 11 10 -33 -28 6 -22 -69 28 63 -18 -4 48 30 -47 -21
5029 -21 50 115 -14 -35 78 116 -15 -23 121 70 8 -23 61 28 17 46 50 -34 -14 57 38 -97 -4 43 -69 -59 -62 20 -41
5058 -41 -101 -55 51 -96 -108 -3 26 -91 -68 14 -11 -112 -67 3 -28 -58 7 33 25 -8 37 84 5 -29 30 71 33 -1
5086 -1 109 61 -32 -1 130 33 -4 4 83 38 -71 82 55 32 17 54 41 42 14 64 -46 -152 -48 44 -58 -73 1 -23
5114 -23 -28 -84 18 9 -83 12 -44 22 -122 -138 -9 -14 -21 -51 35 -27 -20 -7 74 -28 -15 33 6 -35 60 81 65 18 49 151
5144 151 16 -12 99 121 33 66 93 46 -5 20 82 37 12 79 5 -42 -14 59 28 3 7 84 -10 -20 -29 -27 26 -56 -33 -23
5174 -23 -20 -68 -12 -25 -60 -114 -72 26 -42 -46 25 -29 -78 43 87 5 -19 -14 51 1 64 78 53 50 48 43 36 28 29 51 69 29 -6 44
5208 44 61 28 5 57 -10 -26 66 62 17 -39 -35 1 1 -91 -70 17 -71 -44 10 -38 -9 -8 35 -74 -34 -24 -113 -45 -63 -66 -15 -69
5240 -69 -88 -10 2 -30 -30 15 -16 -1 -5 40 25 50 -52 48 78 4 65 12 11 39 -3 9 28 36 35 -20 41 53 10 35 47 34
5272 34 47 7 -13 30 29 -2 15 -14 -28 -41 -50 -25 -17 -65 -57 -59 -77 -33 -47 18 -51 -67 -19 -14 -36 -26 -13 25 -2 52 1 8 -20 11
5306 11 16 -3 8 -7 31 19 -16 84 73 15 -7 -6 -36 3 6 7 43 36 60 56 67 -23 113 -31 5 56 -1 -46 21 13 -36 -9
5338 -9 -19 -94 -19 -9 -59 -6 -23 -34 -4 -29 -74 -82 -59 -46 -15 -36 -27 -6 -74 -68 10 -22 -20 3 0 -3 -69 3 5 64 17 14 54 -17 22
5373 22 88 43 -40 15 93 44 56 -20 28 78 41 5 -3 32 -25 7 14 27 27 3 -20 -30 -45 -6 -57 -52 -91 -47 8 -75 49 -28
5405 -28 -7 -67 -40 -67 -31 -25 -12 -49 9 21 -23 -22 22 4 -15 -36 46 84 -43 38 -15 66 27 11 57 131 2 -10 70 26
5435 26 26 -5 44 62 -15 41 98 18 32 31 -43 -56 8 -3 14 -39 -51 -7 22 -10 -9 3 43 -83 -52 70 -25 -49 -10 7 -37
5466 -37 -47 -32 26 -31 -3 16 32 22 25 -15 -37 -28 -18 22 2 -36 50 15 65 19 104 -19 -35 32 48 34 0 10 74 80 -3
5497 -3 -3 24 -14 19 80 68 1 -2 8 13 -43 -24 13 76 -28 -31 -34 -17 -93 4 14 -51 -20 58 -42 -21 -57 3 -55 -111 29 34
5529 34 42 -51 9 8 -1 -39 17 45 -67 39 100 8 -80 -56 62 92 -76 79 112 15 34 54 -26 -7 -12 21 59 -25 -16 18
5559 18 24 2 20 83 -11 -22 -21 25 -58 -43 -32 109 -34 -61 39 -22 -67 26 57 -6 -90 6 39 -30 -9 -5 72 -50 -30 27
5589 27 39 -76 9 43 28 -55 -30 62 -26 -11 64 46 0 -30 77 27 28 -16 37 68 6 -22 28 49 -7 -27 45 0 8 -13
5619 -13 42 -80 -36 3 -18 -12 -48 22 -23 -34 38 48 0 -83 -25 14 -27 -11 39 44 7 -5 34 40 -69 -62 4 -45 -102 47 29
5650 29 -98 -89 84 6 28 -2 104 17 -13 20 59 41 -56 73 73 -15 -8 45 41 -52 8 -29 38 -11 -11 54 44 -72 -46 36
5680 36 -60 -72 15 37 -101 -20 77 -10 -178 -6 28 4 -19 -42 -3 -10 -74 15 43 51 -60 7 47 -31 -29 22 72 0 -6 -4 68
5711 68 -11 -46 81 -24 5 75 39 40 -1 48 27 -17 45 25 14 23 -44 82 44 -42 -37 -16 -25 -77 -5 33 -4 -63 -21 -13 -14 -45
5743 -45 11 -53 -39 -76 -3 -63 -18 -25 65 -77 -100 17 56 -42 10 38 -54 -3 34 75 11 -43 47 43 57 15 7 7 -21 22 83
5774 83 77 -1 -15 32 39 -85 -5 1 -29 -55 -11 34 -30 50 0 -35 13 -48 37 10 45 -19 22 42 -47 70 64 39 -45 47 27
5805 27 39 -3 10 31 57 -36 -10 22 19 99 13 25 -39 27 109 29 -31 39 69 -21 -13 33 34 -6 -13 40 9 -47 10 99 5 -109
5837 -109 36 20 29 49 -29 9 -9 -27 39 20 13 0 -1 -11 -46 -16 48 -18 -23 32 -11 -22 -33 96 -96 -63 -15 -1 13 -1
5867 -1 4 66 1 -26 -1 43 -45 44 18 22 29 -44 103 24 -41 0 -23 -33 45 12 24 -18 -15 -27 57 -17 0 -9 2 -16 -32 18 13
5900 13 -29 22 -32 4 1 -56 -66 -50 -65 -16 -21 -29 -23 -28 -45 -6 -21 -40 15 -37 16 9 19 7 56 -7 -65 25 -17 10 43 44 47 113
5934 113 7 -28 15 29 94 -48 30 51 20 78 14 10 13 25 -19 -15 -14 -53 -62 16 27 -45 -37 -3 -28 13 -18 -118 2 31 -41
5965 -41 -46 -51 7 7 10 -18 20 15 59 -5 -11 55 13 47 12 22 51 47 22 38 23 -15 -12 70 10 54 -2 31 -22 30 10 -17 18 -9
5999 -9 34 47 33 9 46 65 -57 36 -13 -28 -45 -27 -33 -1 -30 -30 8 -96 -72 -99 -68 -10 21 -1 -23 -29 -41 -35 -8 -32 -77 44
6031 44 -57 8 14 21 -22 -24 23 -5 95 -4 -1 2 7 52 63 63 34 87 35 -9 36 1 33 38 53 10 12 16 16 -48 6 -18 -13 -10 -5 21
6067 21 -35 28 -78 -10 -24 -10 -85 -77 -3 35 -31 -57 -6 -26 -75 -20 -21 14 12 -20 -35 46 -11 18 32 -63 -11 -17 60 80 33 33
6099 33 12 -10 61 4 -5 -38 0 40 29 -30 19 95 -10 93 40 14 -12 14 -8 -5 79 17 -45 -38 -24 23 -17 -12 9 19 -5
6130 -5 -29 -44 23 47 -66 -13 26 -49 -49 31 25 -13 32 17 -76 2 -26 -22 13 -34 33 59 16 12 55 19 46 66 22 11 2 66 88
6163 88 25 8 18 35 17 43 28 77 -3 -40 28 -5 57 -37 31 30 -57 -120 77 -34 -45 -39 -15 38 -112 -27 38 -59 -35 19
6193 19 -9 12 0 8 12 -8 23 -1 -20 -67 15 43 -12 35 -14 69 -36 -1 61 26 0 -29 21 6 -33 -21 118 11 21 30
6223 30 -25 -50 -16 -29 25 7 -25 22 -66 -5 -52 9 -63 1 -12 -28 11 -39 -12 -90 -46 -40 38 -32 -53 -44 -57 -8 -64 7 -72
6254 -72 -36 -72 -39 8 -25 -25 -65 20 15 19 34 -5 -62 10 -42 90 20 24 60 -6 8 6 50 -16 -19 12 17 46 16 5 -6 43 49 1
6288 1 -19 -30 45 49 4 -94 0 5 -40 -52 85 49 -42 -110 23 5 -32 -1 3 -23 -103 -34 -21 -33 -87 -19 -49 -37 -27 20 -28
6319 -28 -39 9 14 -24 -2 28 46 9 -20 46 55 56 19 67 22 38 36 21 43 79 -9 61 10 31 37 4 41 -53 49 42 -55 -47 -22
6352 -22 61 -60 -1 96 55 -50 25 -7 -43 -89 -24 23 -39 -102 56 -55 -37 10 55 -14 -18 40 2 21 -61 56 5 -52
6380 -52 -30 86 49 -25 49 47 18 12 55 103 56 31 86 26 -54 -11 52 8 -37 -1 16 -26 -30 42 69 55 7 52 -2 -58 -37
6411 -37 44 -79 46 -24 59 25 -91 -36 71 -20 -10 -30 -9 -54 -8 -33 -36 12 -23 14 -9 -36 32 24 -18 18 4 83 14
6440 14 17 -11 53 99 50 40 20 -3 -51 96 19 33 -13 49 -3 -2 35 74 16 8 5 -35 40 -44 38 23 -43 -43 0 0 -22 -84 1
6473 1 10 -62 23 -14 -103 -47 18 -9 -61 -33 -27 26 -25 -11 -12 -55 -12 -14 70 -29 -3 107 35 -28 -3 67 -1 -40 -13 43 6 11 22
6506 22 18 8 -35 28 19 41 12 18 38 42 52 -50 26 -49 -2 44 -25 28 -33 15 -32 -80 44 15 -29 -53 7 -28 -38 -50 -58 14
6538 14 -65 69 -10 -48 -57 -9 -8 15 19 -29 -14 -28 0 -16 23 -23 -30 -15 52 -17 54 80 -27 -1 -17 74 -23 45 7 -9 34
6569 34 -17 17 16 25 26 -37 43 49 -13 13 -23 -13 -13 -38 7 -27 -18 -2 -42 5 4 -6 3 4 -13 -16 -28 8 5 -11 -39 3 -62 31 21 28
6605 28 25 57 15 47 65 67 17 59 -22 -54 74 13 -11 -53 -20 49 -28 -53 -4 -40 -7 -2 32 -18 27 21 46 -30 -28 -9 -4 -33 -6
6638 -6 -24 -105 -79 15 -1 -19 -26 70 65 22 52 -14 0 -23 -7 14 31 -17 -10 -18 -28 7 -7 -39 12 7 2 -8 23 26 57 -16 16 58
6672 58 28 -42 -16 56 -58 -3 32 10 22 -53 -39 -54 -57 -2 -36 -20 -2 7 1 54 38 33 11 -6 29 -1 -32 -51 0 29 -57 -32
6704 -32 44 -5 14 -68 -6 -12 19 28 42 5 19 -45 -57 30 -39 -57 32 32 2 73 -47 13 21 46 30 3 22 61 45 -15 2 43
6736 43 32 23 29 94 -8 3 -89 -42 -63 -9 -52 8 -66 -8 -11 -73 -62 -7 38 -34 -28 -38 30 -65 0 -46 -41 -31 -17 -57 24 31 -6
6769 -6 48 30 33 2 7 13 -7 -54 -41 -25 28 -63 12 -36 -77 -29 -14 26 -31 18 103 -22 29 -8 69 38 -50 35 29 -20 -18 38 -7
6802 -7 10 -19 47 11 -22 -40 -4 45 44 -11 5 -7 -9 24 -12 109 -22 -21 21 -26 7 -46 38 2 -1 41 10 13 -17 11 44 13
6834 13 10 -37 29 -13 18 -10 -1 -40 -9 -8 29 23 5 -51 -68 -24 36 -38 -33 37 -31 11 6 -19 28 47 -12 -13 -48 43 24 -16 15 -27
6868 -27 21 -19 -47 -6 12 61 2 -14 24 49 -16 15 35 -30 71 -18 -16 2 65 18 -46 16 23 -38 18 10 53 45 25 8 17 25 -3
6901 -3 -19 43 62 17 -28 30 1 -12 8 26 -45 -50 -47 -20 -6 -24 -6 -25 -13 26 11 -31 -7 -3 33 14 -11 -29 -5 -26 -51 -37
6933 -37 24 3 -51 -6 -8 63 -53 49 -27 31 34 5 103 -27 -1 47 68 7 57 35 -4 27 65 -6 40 14 -36 -35 -6 44
6963 44 17 -20 -20 22 45 7 -68 -59 -15 -31 -19 14 10 -52 32 -50 -63 3 4 25 -53 8 -49 61 -35 -32 48 8 43 -8 74 -19
6995 -19 18 77 6 3 48 82 15 24 88 73 1 -19 -8 66 36 30 -7 92 -16 6 53 39 -34 20 0 39 -23 71 -1 16 11 -18
7027 -18 10 -17 10 37 -38 -37 -19 16 -1 -33 -32 40 -18 36 -45 -35 -21 37 5 13 -16 -85 3 0 30 48 -18 57 1 7 60 20 8
7060 8 38 67 51 19 32 42 -1 16 8 70 -27 19 6 82 -29 73 6 -20 -8 -51 16 -27 12 -39 40 -16 -33 -7 24 37
7090 37 -16 -37 -12 -31 6 43 40 -2 43 28 -12 -11 15 -8 41 74 57 -19 -12 3 4 24 14 -92 92 14 1 32 58 -10 21
7121 21 2 -49 51 23 78 25 -1 44 -13 74 -58 -8 43 -15 44 -61 -29 -17 -33 0 -12 -10 -3 28 -16 -2 -16 15 -25 -3
7151 -3 -6 25 -63 -9 42 7 36 -9 -7 -22 -39 52 26 -23 -61 15 36 -55 -1 46 71 18 -42 5 -13 -10 4 100 44 67 -7 55
7183 55 -49 -41 4 -23 63 37 7 39 26 4 -3 -3 18 23 -15 -3 0 -27 -7 11 -1 -15 14 -6 -24 5 -56 -15 -66 37 12 -26
7215 -26 49 16 -27 -49 -59 -8 -85 32 -8 45 23 17 53 -12 46 32 -49 70 50 90 104 19 8 -40 59 -22 6 32 63 91
7245 91 9 0 12 18 3 38 26 22 -55 72 -44 -107 -20 -53 -39 -46 5 18 -41 5 -34 -5 -30 -12 -30 -32 -48 13 36 17 -38 25
7277 25 -56 -37 8 -12 12 -33 40 4 33 -4 3 37 21 95 -15 18 49 -45 62 44 27 15 12 -26 38 -4 3 71 21 41 15
7308 15 -59 0 -8 -8 -46 6 27 -21 -14 -15 -33 -38 9 -18 -44 -6 -15 -52 16 -9 -43 -2 -41 -25 19 -8 89 -50 7 -8 -12 -22 38
7341 38 -50 -4 -47 -2 20 27 57 13 65 4 -4 23 34 34 20 61 5 26 60 10 19 24 30 54 14 -68 -22 -14 39 26 17 -11 -52 -44 32
7376 32 -66 -11 27 -7 8 -30 -63 54 -82 2 -22 -28 -10 -41 38 -17 12 8 23 -37 15 67 2 -22 -33 22 78 -25 52 -18
7406 -18 73 29 43 -5 108 -22 56 13 27 69 40 -35 57 1 -72 -50 5 30 24 -48 24 17 74 -29 -62 43 -19 28 -63
7435 -63 9 -15 -1 -17 -21 -1 -15 -32 13 -52 -43 -68 -38 3 -21 -82 -15 64 87 18 -46 18 65 -31 24 -61 -37 -6 -3 23 64 -6
7467 -6 36 98 19 -43 29 42 -53 71 -12 -8 11 35 -36 3 -19 6 -34 6 -16 -61 -8 -11 9 6 15 2 37 -41 -38 -25 -52 3 -23
7500 -23 -34 -37 -39 14 -59 18 49 33 -44 22 -12 24 -13 23 10 -3 -31 19 2 7 47 -24 -7 -16 -22 19 18 33 55 46 45 7 9 31 -15
7535 -15 5 24 -1 25 3 -30 42 0 1 15 -22 -46 18 -10 -33 -5 -30 -30 -99 -1 -19 -65 -24 -13 -50 0 -18 9 11 -22 7 -11
7567 -11 -24 -6 -45 17 71 89 6 6 10 -43 1 26 34 29 6 23 -29 35 3 34 36 18 16 14 9 29 -19 30 -65 24 10 -3 39 -13
7601 -13 7 42 -10 -7 38 35 57 -18 -22 22 18 32 -49 -44 -35 -33 20 -60 22 -60 -51 -68 2 -2 -18 -38 6 -18 18 33 -68 -28 73 -58
7635 -58 22 -14 -34 42 32 -53 -7 44 36 35 1 8 81 -59 12 23 6 -19 35 17 -38 25 -2 41 33 62 29 6 -16 20 -6 75
7667 75 12 14 1 2 80 -44 -23 -47 21 25 18 -36 -54 31 35 -81 -15 1 -1 -30 54 45 -12 -32 35 35 -23 -34 57 -43 -29 -12 -41
7700 -41 39 -5 25 16 2 -41 43 30 19 0 51 2 -17 -26 51 73 -49 -29 34 -17 19 5 46 6 -2 -38 30 -11 -27 12 91
7731 91 27 -51 52 14 -63 -16 -29 -17 -25 34 27 -27 52 8 42 34 -8 24 -60 0 29 -54 16 -24 -22 1 29 -9 -29 22 -4 -15
7763 -15 5 0 5 26 29 1 23 34 -27 -73 -53 9 96 8 -35 39 44 -23 -10 39 -31 20 30 16 -30 -7 47 39 28 22 1 1 19 -27
7797 -27 55 27 -7 -19 -13 42 62 -57 -2 -5 10 -20 24 -7 -40 32 6 39 -15 37 -15 -24 21 -65 40 61 38 -3 -33 -10 40
7828 40 16 -36 51 101 11 38 -38 24 65 1 42 9 16 -57 37 8 65 16 -10 28 -10 -10 -22 31 45 -13 19 38 63 27 56
7859 56 -14 34 12 1 -50 34 -3 37 -16 -14 49 -10 -28 -12 24 -2 -51 -33 22 -54 -28 36 -27 28 33 20 -4 -6 37 14 4 -40
7891 -40 64 9 27 -2 0 18 -37 -32 -3 13 -38 65 -14 23 -1 24 5 51 60 67 26 -54 -2 41 20 12 -18 -17 -27 -42 -22 -30 5
7924 5 31 -35 -6 0 -3 -40 38 -88 2 -53 -55 -34 -26 31 22 -11 25 -27 -44 39 -52 33 -57 4 34 -39 11 -34 39 115 -11 -27
7956 -27 11 28 8 19 83 -47 52 65 36 -15 53 60 29 -43 62 11 70 -40 19 -14 -13 -17 3 5 2 -4 -24 -7 9 -11 -14 -74
7988 -74 21 30 49 7 -40 30 -48 -27 -42 -70 9 -4 -9 -55 25 -1 -38 12 -55 45 56 19 63 -17 25 60 30 25 33 -26 25 -21
8020 -21 -20 10 0 19 -10 31 0 -57 3 -73 73 12 57 -4 42 36 -19 -15 10 0 16 -44 5 49 -34 -32 -46 -20 18 -5 11 -3
8052 -3 -17 -9 -23 -9 28 -46 -14 -21 -46 69 -20 10 4 67 -15 12 25 -49 43 46 48 4 -61 2 37 0 23 36 70 5 31 40 6
8085 6 -14 24 -5 51 28 17 4 -32 11 32 -12 28 -24 -60 -32 -15 -4 -20 -6 -49 -79 -12 14 18 -24 -19 -10 -28 -29 13 -38 -31 -7
8118 -7 17 22 10 69 6 44 8 -13 10 24 -41 23 38 6 61 31 3 17 46 10 70 14 53 39 29 47 56 -62 -28 29 -49
8149 -49 0 2 14 77 -2 -80 -10 7 27 9 -28 -16 32 6 -10 38 -37 10 43 -7 14 -20 18 -8 -51 -37 27 -24 7 30 -31
8180 -31 43 -14 4 -27 17 -10 91 64 52 4 64
8191F4
##END NTUPLES=NMR FID
##END=
