##TITLE=1H_11P63
 D2O
 8 sc, 
 18.5.2023
##JCAMPDX= 6.0         $$ Bruker NMR JCAMP-DX V2.0
##DATA TYPE= NMR FID
##DATA CLASS= NTUPLES
##ORIGIN= UXNMR, Bruker Analytische Messtechnik GmbH
##OWNER= root
$$ XWIN-NMR		Version 3.5
$$ Thu May 18 14:42:42 2023 Russian Standard Time (UT+4h)  she@DPX200
##.OBSERVE FREQUENCY= 200.13135
##.OBSERVE NUCLEUS= ^1H
##.DELAY= (6, 6)
##.ACQUISITION MODE= SIMULTANEOUS
##.ACQUISITION SCHEME= undefined
##.AVERAGES= 8
##.DIGITISER RES= 18
##SPECTROMETER/DATA SYSTEM= spect
##.PULSE SEQUENCE= zg30
##.SOLVENT NAME= CDCl3
##.SHIFT REFERENCE= (INTERNAL, CDCl3, 0, 15.7039)
##AUDIT TRAIL= $$ (NUMBER, WHEN, WHO, WHERE, WHAT)
$$ ##TITLE= Audit trail, XWIN-NMR		Version 3.5
$$ ##JCAMPDX= 5.01
$$ ##ORIGIN= Bruker BioSpin GmbH
$$ ##OWNER= she
$$ F:/spectra/data/she/nmr/H-F/1/audita.txt
$$ ##AUDIT TRAIL=  $$ (NUMBER, WHEN, WHO, WHERE, WHAT)
(   1,<2023-05-18 14:41:32.37 +0400>,<she>,<DPX200>,
      <created by zg, POWCHK disabled, PULCHK disabled
       configuration hash MD5:
       00 E9 B6 7A A2 85 ED C7 34 08 36 98 17 FE 4E 26
       data hash MD5: 16K
       34 2A BF C7 A5 43 6D 5E 32 13 1E F9 99 1E EA 07>)
$$ ##END=
$$ 
$$ hash MD5
$$ 83 20 0E C9 9C 55 7B C7 B7 06 23 B0 B1 EE C2 E1
##$RELAX= 
##$RELAX= 
##$RELAX= 
##$RELAX= 
##$RELAX= 
##$RELAX= 
$$ Bruker specific parameters
$$ --------------------------
##$DU= <F:/spectra>
##$EXPNO= 1
##$NAME= <H-F>
##$PROCNO= 1
##$TYPE= <nmr>
##$USER= <she>
##$AMP= (0..31)
100 100 100 100 100 100 100 100 100 100 100 100 100 100 100 100 100 100 
100 100 100 100 100 100 100 100 100 100 100 100 100 100 
##$AQSEQ= 0
##$AQ_mod= 1
##$AUNM= <au_zg>
##$AUTOPOS= <>
##$BF1= 200.13
##$BF2= 200.13
##$BF3= 200.13
##$BF4= 200.13
##$BF5= 200.13
##$BF6= 200.13
##$BF7= 200.13
##$BF8= 200.13
##$BYTORDA= 1
##$CFDGTYP= 0
##$CFRGTYP= 5
##$CHEMSTR= <none>
##$CNST= (0..31)
1 1 145 1 1 1 1 1 1 1 1 1 1 1 1 1 1 1 1 1 1 1 1 1 1 1 1 1 1 1 1 1 
##$CPDPRG= <>
##$CPDPRG1= <>
##$CPDPRG2= <>
##$CPDPRG3= <>
##$CPDPRG4= <mlev>
##$CPDPRG5= <mlev>
##$CPDPRG6= <mlev>
##$CPDPRG7= <mlev>
##$CPDPRG8= <mlev>
##$CPDPRGB= <>
##$CPDPRGT= <>
##$D= (0..31)
0 1.2 0 0 0 0 0 0 0 0.06 0 0.03 0 0 0 0 0.0002 0 0 0 0 0 0 0 0 0 0 0 0 
0 0 0 
##$DATE= 1684406491
##$DBL= (0..7)
120 120 120 120 120 120 120 120 
##$DBP= (0..7)
150 150 150 150 150 150 150 150 
##$DBP07= 0
##$DBPNAM0= <>
##$DBPNAM1= <>
##$DBPNAM2= <>
##$DBPNAM3= <>
##$DBPNAM4= <>
##$DBPNAM5= <>
##$DBPNAM6= <>
##$DBPNAM7= <>
##$DBPOAL= (0..7)
0.5 0.5 0.5 0.5 0.5 0.5 0.5 0.5 
##$DBPOFFS= (0..7)
0 0 0 0 0 0 0 0 
##$DE= 6
##$DECBNUC= <off>
##$DECIM= 32
##$DECNUC= <off>
##$DECSTAT= 4
##$DIGMOD= 1
##$DIGTYP= 9
##$DL= (0..7)
0 120 120 120 120 120 120 120 
##$DP= (0..7)
150 150 150 150 150 150 150 150 
##$DP07= 0
##$DPNAME0= <>
##$DPNAME1= <>
##$DPNAME2= <>
##$DPNAME3= <>
##$DPNAME4= <>
##$DPNAME5= <>
##$DPNAME6= <>
##$DPNAME7= <>
##$DPOAL= (0..7)
0.5 0.5 0.5 0.5 0.5 0.5 0.5 0.5 
##$DPOFFS= (0..7)
0 0 0 0 0 0 0 0 
##$DQDMODE= 0
##$DR= 18
##$DS= 0
##$DSLIST= <SSSSSSSSSSSSSSS>
##$DSPFIRM= 0
$$ [...]
##$SUBNAM2= <"">
##$SUBNAM3= <"">
##$SUBNAM4= <"">
##$SUBNAM5= <"">
##$SUBNAM6= <"">
##$SUBNAM7= <"">
##$SUBNAM8= <"">
##$SUBNAM9= <"">
##$SW= 16.0151230935494
##$SWIBOX= (0..15)
0 0 2 0 0 0 0 0 0 0 0 0 0 0 0 0 
##$SW_h= 3205.12820512821
##$TD= 16384
##$TD0= 1
##$TE= 0
##$TE2= 300
##$TE3= 300
##$TEG= 300
##$TL= (0..7)
0 120 120 120 120 120 120 120 
##$TP= (0..7)
150 150 150 150 150 150 150 150 
##$TP07= 0
##$TPNAME0= <>
##$TPNAME1= <>
##$TPNAME2= <>
##$TPNAME3= <>
##$TPNAME4= <>
##$TPNAME5= <>
##$TPNAME6= <>
##$TPNAME7= <>
##$TPOAL= (0..7)
0.5 0.5 0.5 0.5 0.5 0.5 0.5 0.5 
##$TPOFFS= (0..7)
0 0 0 0 0 0 0 0 
##$TUNHIN= 0
##$TUNHOUT= 0
##$TUNXOUT= 0
##$USERA1= <user>
##$USERA2= <user>
##$USERA3= <user>
##$USERA4= <user>
##$USERA5= <user>
##$V9= 5
##$VALIST= <valist>
##$VCLIST= <CCCCCCCCCCCCCCC>
##$VD= 0
##$VDLIST= <DDDDDDDDDDDDDDD>
##$VPLIST= <PPPPPPPPPPPPPPP>
##$VTLIST= <TTTTTTTTTTTTTTT>
##$WBST= 1024
##$WBSW= 4
##$XGAIN= (0..3)
0 0 0 0 
##$XL= 0
##$YL= 0
##$YMAX_a= 130969
##$YMIN_a= -132694
##$ZGOPTNS= <>
##$ZL1= 120
##$ZL2= 120
##$ZL3= 120
##$ZL4= 120
##$ABSF1= 10
##$ABSF2= 0
##$ABSG= 5
##$ABSL= 3
##$ALPHA= 0
##$AQORDER= 0
##$ASSFAC= 0
##$ASSFACI= 0
##$ASSFACX= 0
##$ASSWID= 0
##$AUNMP= <proc_1d>
##$AZFE= 0.1
##$AZFW= 0.1
##$BCFW= 1
##$BC_mod= 2
##$BYTORDP= 1
##$COROFFS= 0
##$CY= 11.3945322036743
##$DATMOD= 1
##$DC= 2
##$DFILT= <>
##$DTYPP= 0
##$F1P= 15.7292609196834
##$F2P= 12.9074282941183
##$FCOR= 0.5
##$FTSIZE= 0
##$FT_mod= 4
##$GAMMA= 1
##$GB= 0.15
##$INTBC= 1
##$INTSCL= 1
##$ISEN= 128
##$LB= 0.24
##$LEV0= 0
##$LPBIN= 0
##$MAXI= 10000
##$MC2= 0
##$MEAN= 0
##$ME_mod= 0
##$MI= 1.114404
##$NCOEF= 0
##$NC_proc= 0
##$NLEV= 6
##$NOISF1= 3.799351
##$NOISF2= 2.8
##$NSP= 1
##$NTH_PI= 0
##$NZP= 0
##$OFFSET= 15.70392
##$PC= 1
##$PHC0= -19903.67
##$PHC1= 10.45272
##$PH_mod= 1
##$PKNL= yes
##$PPARMOD= 0
##$PSCAL= 0
##$PSIGN= 0
##$REVERSE= no
##$SF= 200.130013532006
##$SI= 16384
##$SIGF1= 3
##$SIGF2= 2
##$SINO= 400
##$SIOLD= 16384
##$SREGLST= <1H.CDCl3>
##$SSB= 0
##$STSI= 0
##$STSR= 0
##$SW_p= 3612.71676300578
##$SYMM= 0
##$S_DEV= 0
##$TDeff= 0
##$TDoff= 0
##$TI= <>
##$TILT= no
##$TM1= 0
##$TM2= 0
##$TOPLEV= 0
##$USERP1= <user>
##$USERP2= <user>
##$USERP3= <user>
##$USERP4= <user>
##$USERP5= <user>
##$WDW= 1
##$XDIM= 8192
##$YMAX_p= 0
##$YMIN_p= 0
$$ End of Bruker specific parameters
$$ ---------------------------------
##NTUPLES= NMR FID
##VAR_NAME=  TIME,          FID/REAL,        FID/IMAG
##SYMBOL=    X,             R,               I
##VAR_TYPE=  INDEPENDENT,   DEPENDENT,       DEPENDENT
##VAR_FORM=  AFFN,          ASDF,            ASDF
##VAR_DIM=   8192,          8192,            8192
##UNITS=     SECONDS,       ARBITRARY UNITS, ARBITRARY UNITS
##FACTOR=    0.000312,      1,               1
##FIRST=     0,             0,               0
##LAST=      2.555592,      0,               0
##MIN=       0,             -132694,         0
##MAX=       2.555592,      130969,          0
$$ Real data points
##PAGE= N=1
##DATA TABLE= (X++(R..R)), XYDATA
0 0 0 0 0 0 0 0 0 0 0 0 0 0 0 0 0 0 0 0 0 0 0 0 0 0 2 -3 5 -8 8 -8 8 -8 9 -11 11 -13 15 -17 19 -21 22 -25 28 -31 33 -37
46 -37 41 -43 49 -55 60 -66 71 -81 91 -99 113 -126 143 -164 193 -226 275 -341 440 -601 896
67 896 -1549 3591 -21645 -132694 -105490 -37989 -4115 64365 125253 83631 -14787 -91062 -116178
80 -116178 -67282 25088 83617 94851 71898 -5454 -94240 -109490 -58953 12704 90838 113216
92 113216 43949 -29340 -60181 -94345 -86354 22808 115924 91133 26600 -14325 -65600 -101652
104 -101652 -62001 25210 92159 97773 38200 -36315 -72553 -79725 -55799 20842 93805 90259
116 90259 33825 -26856 -80646 -89758 -31320 35054 67255 81178 52380 -34798 -97984 -75074
128 -75074 -18046 28001 67798 80790 39484 -33600 -86414 -79874 -19066 42641 68010 66921
140 66921 36120 -31604 -86462 -74031 -16638 38504 72534 68640 20148 -38002 -71108 -68630
152 -68630 -25551 42527 81401 61319 10692 -36981 -67110 -64502 -20455 41677 78312 61807
164 61807 6920 -44586 -65700 -55809 -17199 39577 75904 59272 4943 -46252 -67001 -51642
176 -51642 -8493 41279 69384 55557 6045 -47613 -69297 -48020 -1558 43094 64149 50173
188 50173 4572 -47460 -69306 -45892 2926 45873 62343 45349 724 -45906 -65252 -44264
200 -44264 4567 49254 62362 38791 -3915 -45350 -63159 -41946 6732 49963 60662 36300
212 36300 -8297 -47191 -59160 -37074 8293 49930 60591 33167 -11249 -47653 -57349 -33332
224 -33332 11866 49219 57014 31280 -13099 -50159 -56248 -29004 14236 48749 54914 28321 -15287
237 -15287 -49745 -54040 -26292 17094 49786 53023 24738 -17550 -49401 -51846 -23813 18319 49977
250 49977 51316 21086 -20934 -49183 -48828 -20749 19829 50095 50188 19018 -23204 -49814 -46278
263 -46278 -16807 21758 48813 47560 17120 -24379 -50907 -45492 -13054 24650 47186 43536 15497
276 15497 -24719 -51257 -44177 -9919 27809 47593 40650 11918 -24853 -49485 -43357 -8975 30327
289 30327 48420 37346 7276 -26235 -47028 -40579 -8547 30611 50009 36626 2798 -29022
301 -29022 -44117 -36469 -7395 29923 50230 36573 217 -32529 -43939 -32408 -4355 29082
313 29082 47269 35895 -174 -34695 -45907 -28962 1146 29174 43646 34555 853 -35950
325 -35950 -47052 -27233 5191 30760 41050 30405 -8 -34324 -47303 -28368 8065 34502
337 34502 39307 25352 -2220 -32867 -45258 -27376 8184 36770 42004 21999 -8022 -31367
349 -31367 -39603 -27536 6028 39573 43296 17610 -12190 -31488 -37630 -24015 6964 37650 43174
362 43174 18814 -15181 -35186 -34310 -19173 7614 35901 41827 18133 -15386 -36772 -36456 -15384
375 -15384 13562 33172 35749 19519 -12911 -40549 -38067 -9932 17298 32018 33626 17483 -13147
388 -13147 -39448 -38311 -9906 21329 33851 29133 13369 -13009 -37802 -37620 -9841 21432 35686
401 35686 30053 9220 -16970 -34324 -32963 -11160 20135 39196 31004 4603 -20827 -32434 -28514
414 -28514 -10289 18300 39387 32493 2249 -24540 -32527 -25130 -7506 18111 37395 31880 3170
427 3170 -26118 -34936 -23049 -2394 18950 34212 29932 3161 -26276 -36540 -23883 913 23151
440 23151 31724 24285 3848 -23342 -38498 -24899 4951 25537 30235 22527 1424 -23789 -35064
453 -35064 -24293 2160 28390 33840 17324 -3934 -20723 -32603 -25237 3817 29347 32712 17657
466 17657 -5498 -25371 -29625 -18662 1221 26763 36984 17331 -11303 -24849 -27168 -19715 4124
479 4124 28544 31677 15796 -7012 -28418 -31745 -12842 8919 23495 30254 19007 -9469 -29736
492 -29736 -29139 -13091 9936 27365 26637 13145 -6157 -28381 -33712 -11149 15785 24495 23956 15673
506 15673 -9102 -30988 -28125 -8911 11618 27689 28047 9283 -12620 -26058 -27822 -11276 14487
519 14487 28443 24855 9227 -14149 -29230 -23515 -6914 10458 27947 29728 5840 -18752 -25085
532 -25085 -20984 -9960 13572 30764 24367 3875 -15533 -26958 -23354 -5365 15241 27378 24308
545 24308 4256 -18125 -26495 -20902 -5319 17028 29652 20192 1183 -15004 -26281 -23837 -2237
558 -2237 20447 25821 18637 3015 -17225 -28700 -20317 98 18179 26108 19147 395 -18183
571 -18183 -26743 -19354 1187 20053 25346 17358 753 -19094 -28237 -17141 3284 18703 24795
584 24795 17778 -1646 -20598 -25812 -15544 2951 20014 25495 15324 -3203 -20109 -24959 -15236
597 -15236 4302 21034 25164 13837 -5180 -20464 -23698 -13915 3958 21495 25513 12425 -7148
610 -7148 -20373 -22427 -12486 5364 21493 24610 11933 -7824 -21834 -22167 -10482 6208 20500
623 20500 23527 11474 -8697 -22829 -22220 -8591 8083 20084 21926 10826 -8519 -22928 -22104
636 -22104 -7337 10203 20573 20091 8882 -8430 -22284 -22399 -7339 11284 21837 18998 6391
649 6391 -9169 -20909 -21270 -7328 12371 23313 18398 4104 -10178 -19740 -19537 -7241 11555
662 11555 23490 18918 2522 -12628 -19534 -17109 -5822 11340 22781 19229 2638 -14162 -20747
675 -20747 -15526 -3004 11346 20920 18716 3245 -15141 -22172 -14811 -648 12150 19447 16389
688 16389 2961 -14257 -23080 -15490 1736 14797 18420 14473 2508 -13563 -22326 -15272 1599
701 1599 16285 19614 12188 -440 -12990 -20144 -16092 1003 17679 20520 10784 -2361 -13566
714 -13566 -18798 -13674 1109 16482 21534 11518 -4847 -15435 -17065 -11330 844 15461 21166
727 21166 11874 -5223 -17191 -17649 -9335 3135 14187 18967 12232 -4457 -18409 -18206 -7150 5103
741 5103 14331 17645 10803 -4684 -17780 -19090 -7687 7140 15966 15662 8272 -4090 -16364 -19171
755 -19171 -7955 8463 17242 15243 6264 -5133 -15498 -17561 -8126 7804 18516 15778 4383
768 4383 -7554 -14940 -16262 -7398 7623 18234 15962 4144 -9035 -16156 -14200 -4818 6963 16771
782 16771 16923 4441 -11056 -17120 -12514 -3538 7200 16153 15811 4201 -10518 -17584 -12956 -1358
796 -1358 9138 15393 14215 4104 -10438 -17804 -12545 -1286 9786 16141 12588 1425 -9535
809 -9535 -15913 -13792 -1785 12608 16393 10025 772 -8860 -15953 -13262 -667 12216 16609 10141
823 10141 -1098 -10291 -14440 -12344 -1041 12936 16516 9238 -1310 -10548 -15621 -11005 1451 11624
837 11624 14820 10262 -966 -13096 -15629 -8209 2287 10911 14608 10236 -1698 -13646 -15763 -7399
851 -7399 3596 10774 13622 9703 -2050 -14180 -15171 -6186 3777 11293 14177 8377 -3806 -13391
865 -13391 -13941 -6653 3760 12737 14248 6529 -4989 -12633 -12858 -7180 3735 13564 14623 5216 -5664
880 -5664 -11985 -12510 -6739 5009 14161 13611 4510 -6002 -12339 -12567 -5505 5556 13800 12745 3555
895 3555 -6147 -12571 -12702 -4676 7148 13630 11092 3771 -5877 -13294 -12445 -2895 7318 12635 11319
910 11319 3034 -7319 -13272 -11609 -3116 7881 13072 10408 2839 -7271 -13465 -10636 -1216 8076
924 8076 12543 11264 2445 -8628 -13171 -9310 -1253 7471 12968 9857 657 -8623 -13241 -9865 180
939 180 8721 12008 9114 1274 -8989 -13619 -8620 575 8784 12557 8743 -731 -8841 -12057 -9337
954 -9337 259 10455 12401 6987 -762 -8491 -12503 -8283 1251 9732 12556 7962 -2087 -9732 -11012
969 -11012 -7153 518 9905 13142 6775 -2958 -9851 -11316 -6268 1841 9392 11987 7191 -2996 -11233
984 -11233 -10867 -5118 2566 9161 11650 6516 -3318 -10843 -11519 -5149 3798 10136 10229 5530 -2754 -10823
1000 -10823 -11811 -4888 4573 10557 9970 4405 -3512 -10088 -10998 -4785 4993 11259 9607 3111 -3975
1015 -3975 -9749 -10538 -4271 5077 11322 10026 2569 -5335 -9955 -9236 -3684 4838 11159 10181 2364 -6276
1031 -6276 -10077 -8480 -2914 5268 10493 9786 2462 -6881 -10764 -8200 -1664 5256 9905 9189 2588
1046 2588 -6556 -11418 -8330 -578 6453 9437 8053 2094 -6152 -11229 -8606 110 7373 9665 7053
1061 7053 1229 -5685 -10623 -8232 420 7876 10032 6663 454 -6304 -9976 -7828 -1 7685 10708
1076 10708 6663 -1437 -7157 -9256 -6544 -280 7279 10882 6648 -1851 -8145 -8950 -5329 436 6921
1091 6921 10473 6815 -1893 -8568 -8986 -4585 1309 7207 9572 6052 -1776 -8430 -9639 -4625 2464
1106 2464 7816 8667 5286 -1510 -7743 -9793 -4982 3509 8335 8108 3893 -1976 -7503 -9661 -4873
1121 -4873 3472 8849 8178 3122 -2702 -7454 -8887 -4256 3290 9329 8322 2927 -3676 -7908 -8010
1136 -8010 -3390 3169 8447 8598 3060 -4616 -8526 -7159 -2584 3262 8139 8554 2887 -4305 -8636
1151 -8636 -6976 -1845 3937 8000 7688 2680 -4852 -9196 -7337 -1527 4435 8094 7207 2029 -4502
1166 -4502 -8595 -7483 -1277 5345 8284 6446 1397 -4442 -8378 -7214 -1171 5704 8172 6008 538
1181 538 -5249 -8131 -6600 -1030 5661 8493 5865 72 -5277 -7705 -5785 -356 5619 8253 5728
1196 5728 -213 -6070 -7876 -5292 182 5353 7953 5842 -705 -6082 -7694 -5086 280 5994 7861
1211 7861 5119 -615 -6212 -7878 -4552 1605 6086 7363 4890 -1018 -6440 -7684 -4181 1401 6530
1226 6530 7435 4041 -1522 -6101 -7226 -4366 1947 6593 7242 4032 -1901 -6844 -7422 -3239 2169 6088
1242 6088 7392 3470 -2882 -6546 -6769 -3095 2360 6830 7205 2934 -2376 -6591 -6840 -2867 2784 6384
1258 6384 6993 2603 -3099 -6526 -6381 -2829 2705 7215 6313 1605 -3060 -5930 -6705 -2446 3950 7120
1274 7120 5891 1754 -3264 -6722 -6089 -1662 3546 6977 5767 1061 -3718 -6636 -6102 -1405 3988
1289 3988 6489 5350 1478 -3675 -7467 -5375 -65 4038 6062 5453 1260 -4206 -7411 -5191 -75
1304 -75 4325 6199 4868 713 -4218 -6918 -4903 211 4181 6140 4863 298 -4935 -6309 -4418
1319 -4418 -86 4457 7125 4357 -678 -4746 -5811 -4252 -301 4938 6921 4274 -1598 -4941 -5535
1334 -5535 -3753 -9 4930 6819 3714 -1471 -4987 -5720 -3479 700 4725 6385 3736 -1380 -5474
1349 -5474 -6254 -3325 1486 5036 5609 3084 -664 -4985 -6487 -2889 2466 5280 5347 2628 -745 -5057
1365 -5057 -6426 -3107 2317 5486 5227 2197 -1587 -4909 -5837 -2974 2179 5730 5221 1996 -2301 -4977
1381 -4977 -5245 -2196 2120 5398 5699 1715 -3007 -5357 -4679 -1804 2032 5624 5600 1896 -2860 -5793
1397 -5793 -4425 -1197 2461 5280 5299 1927 -3270 -6032 -4610 -825 3040 4997 4404 1548 -2968 -5674
1413 -5674 -4869 -605 3383 4875 4241 1111 -2920 -5612 -4611 -745 3547 5570 3532 439 -2953
1428 -2953 -5143 -4492 -707 3768 5805 3661 -235 -3536 -5049 -3789 -755 3623 5645 3950 -420
1443 -420 -3647 -4823 -3493 -267 3642 5185 3889 -488 -4366 -5222 -2963 294 3449 4949 3606
1458 3606 -441 -4436 -5222 -2890 722 4117 4853 3201 -91 -4468 -5175 -3119 1175 3874 4637 3059
1474 3059 -843 -3944 -4897 -2711 925 4762 4565 2059 -1041 -3754 -4645 -2709 1398 4514 4695 2222
1490 2222 -1490 -4130 -4663 -2274 1354 4454 4614 1895 -1885 -4050 -4324 -2036 1784 4321 4307 2009
1506 2009 -2046 -4561 -4324 -1473 1786 3833 4189 1838 -2122 -4652 -4377 -1146 2354 3988 3676 1588
1522 1588 -2108 -4617 -3808 -1030 2152 4063 3868 1375 -2520 -4715 -3899 -1148 2087 4292 3758 664
1538 664 -2568 -4227 -3234 -870 2691 4566 3538 411 -2985 -4130 -3340 -769 2618 4522 3322 143
1554 143 -2705 -3944 -3307 -576 2997 4443 2771 -5 -2813 -4386 -3353 118 3358 4150 2751 155
1570 155 -2741 -4288 -3039 407 3166 3756 2652 -219 -2959 -4065 -2657 532 3159 3909 2637 -398
1586 -398 -3165 -4080 -2381 762 3040 3729 2621 -763 -3482 -4018 -1885 952 2910 4172 2384 -1130
1602 -1130 -3645 -3826 -1651 1013 3331 4072 1970 -1304 -3493 -3983 -1876 1195 3391 3647 1554 -1171
1618 -1171 -3189 -3598 -2165 1007 3556 3632 1180 -1436 -2988 -3448 -1811 1411 4044 3363 1285 -1431
1634 -1431 -3291 -3623 -1139 1655 3295 3314 1188 -1703 -3405 -3464 -1097 1864 3533 3264 1114 -1596
1650 -1596 -3909 -3151 -624 1874 3201 2946 1222 -1859 -4176 -2780 -117 1916 3319 3143 512 -1909
1666 -1909 -3566 -2734 -498 2223 3606 2553 595 -1874 -3459 -2989 -442 2102 3691 2662 178
1681 178 -2482 -3252 -2679 -430 2454 3924 2182 -157 -2291 -3270 -2457 -270 2483 3527 2573 -446
1697 -446 -2690 -3404 -2046 146 2424 3587 2399 -62 -2539 -3207 -1914 547 2767 3064 2100 -26
1713 -26 -2856 -3611 -1576 819 2439 3224 1899 -394 -2750 -3358 -1873 797 2819 3078 1329 -474
1729 -474 -2509 -3114 -1827 964 3034 3007 1331 -1134 -2710 -2908 -1522 1014 2924 2884 953 -1411 -2771
1746 -2771 -2925 -1255 955 2868 3077 1163 -1335 -2727 -2627 -864 1165 2755 2914 1156 -1305 -3379
1762 -3379 -2742 -746 1350 2483 2499 971 -1543 -3307 -2619 -445 1507 2792 2255 1130 -1406 -3122
1778 -3122 -2501 -372 1610 2781 2325 427 -1440 -3005 -2396 -582 1785 2935 2157 249 -1551 -2779
1794 -2779 -2070 -427 1662 2924 2147 -1 -1941 -2356 -2065 -485 1532 3056 2210 -56 -2232 -2475
1810 -2475 -1937 -76 1959 2902 2161 32 -2107 -2472 -1790 17 2079 2855 1688 60 -1891 -3026
1826 -3026 -1946 404 2117 2405 1612 -245 -2010 -2833 -1867 584 2358 2589 1371 -301 -1871 -2570
1842 -2570 -1608 533 2370 2414 1307 -423 -2131 -2465 -1346 739 2056 2455 1499 -789 -2083 -2408 -1164
1859 -1164 530 2143 2598 1350 -1213 -2515 -2494 -890 680 2089 2599 1283 -883 -2671 -1941 -576
1875 -576 789 2016 2689 1047 -1098 -2484 -2011 -878 966 2524 2163 542 -1352 -2334 -2151 -657
1891 -657 1095 2075 2171 572 -1262 -2148 -1998 -710 1217 2487 1985 428 -1301 -2005 -2157 -466 1372
1908 1372 2405 1845 373 -1471 -2385 -1763 -212 1489 2384 1696 153 -1412 -2398 -2017 -410 1360 2202
1925 2202 1720 401 -1506 -2395 -1441 98 1507 2055 1745 208 -1608 -2103 -1666 43 1911 2199 1465
1942 1465 -7 -1571 -2230 -1698 61 1448 2248 1459 -283 -1780 -2006 -1146 204 1553 2160 1278 -158
1959 -158 -1602 -2053 -1256 550 1616 2254 1325 -207 -1687 -2178 -1264 550 1708 1922 1099 -337 -1978
1976 -1978 -2115 -1323 374 2018 1835 879 -432 -1700 -2136 -1060 773 2095 2063 748 -916 -1682 -1934
1993 -1934 -790 344 2039 2255 800 -666 -1695 -1774 -714 861 1829 2282 739 -1014 -2015 -1579
2009 -1579 -592 1032 1640 1880 791 -919 -1905 -1964 -434 784 1684 1495 626 -961 -1972 -1649 -458
2026 -458 1258 1700 1396 601 -1154 -1919 -1792 -470 1041 1804 1500 253 -1138 -1625 -1588 -483 1283 1910
2044 1910 1659 -90 -1494 -1922 -1290 -322 1105 1931 1673 -58 -1555 -1654 -1261 -210 865 1843 1303 108
2062 108 -1392 -1783 -1064 103 1346 1701 1173 -121 -1234 -1842 -1037 87 1157 1685 795 107 -1283
2079 -1283 -1891 -1335 475 1731 1762 725 -114 -1279 -1831 -1193 385 1681 1587 735 -150 -1449 -2068 -929
2097 -929 285 1630 1673 965 -342 -1535 -1682 -742 330 1408 1755 1041 -705 -1391 -1639 -818 566 1526
2115 1526 1728 852 -758 -1591 -1401 -557 153 1384 1567 577 -630 -1583 -1280 -591 654 1401 1469 637 -338
2134 -338 -1748 -1620 -543 699 1453 1299 413 -514 -1312 -1302 -597 832 1643 1174 259 -908 -1389 -1640 -527
2153 -527 765 1575 1260 139 -890 -1476 -1192 -457 1041 1519 1098 107 -1100 -1442 -1152 -136 1147 1486
2171 1486 1175 415 -1227 -1521 -1250 37 975 1339 1033 190 -1067 -1595 -1009 -28 1190 1577 1079 13
2189 13 -998 -1555 -1074 34 1168 1543 782 70 -1052 -1533 -933 216 1285 1467 1024 -123 -1057 -1437
2207 -1437 -857 206 1163 1351 825 -330 -1019 -1263 -875 316 1122 1387 658 -454 -1234 -1117 -547 263
2225 263 1151 1331 462 -256 -1004 -1205 -536 327 1390 1261 651 -656 -1368 -1225 -583 428 1163 1275 706
2244 706 -629 -1378 -1366 -749 443 1207 1222 252 -700 -1129 -1224 -480 444 1387 773 104 -501 -1065 -1300 -623
2264 -623 653 1030 1134 387 -647 -1337 -1090 -216 645 1177 1092 174 -596 -1101 -1127 -300 837 1158 758 226
2284 226 -633 -1054 -832 -184 909 1189 1013 73 -667 -1333 -1053 -338 892 1088 1003 115 -861 -1241 -1065 -173
2304 -173 563 1150 980 235 -1024 -1143 -837 131 955 1040 773 4 -899 -1245 -748 380 938 1206 720 -211
2324 -211 -862 -1382 -669 343 986 1247 718 -257 -1053 -1225 -571 269 883 1224 555 -296 -1014 -999 -800 272
2344 272 1101 933 455 -414 -939 -1101 -656 324 1169 1114 436 -584 -875 -1114 -579 229 1028 1050 602 -400
2364 -400 -942 -1216 -453 89 846 662 351 -589 -1101 -890 -322 607 851 822 386 -466 -1002 -920 -280 623 813
2385 813 912 262 -390 -1055 -982 -326 495 1105 1021 175 -578 -1175 -897 -350 672 1187 916 419 -555 -928 -964
2406 -964 60 290 1127 977 -124 -594 -814 -904 -86 623 985 994 -65 -742 -958 -567 -15 789 1035 731
2426 731 168 -860 -813 -868 318 663 890 733 -94 -815 -893 -453 85 713 946 566 -1 -528 -1184 -811
2446 -811 -46 770 857 637 -85 -895 -761 -400 73 764 906 550 -154 -606 -857 -537 145 911 863 583 -183
2467 -183 -806 -1088 -640 -144 1044 930 539 -292 -846 -890 -544 210 756 695 323 -266 -775 -1013 -469 257
2487 257 804 736 214 -415 -935 -787 -271 178 863 813 215 -215 -672 -940 -286 339 1042 884 288 -334 -810
2508 -810 -805 -456 245 832 644 194 -420 -774 -737 -86 163 832 702 198 -653 -1022 -792 -138 317 782 750
2529 750 84 -414 -779 -508 -171 526 1006 640 252 -692 -815 -745 110 390 965 689 203 -427 -861 -594
2549 -594 56 631 961 720 204 -693 -814 -429 -14 461 841 675 43 -449 -740 -658 36 383 787 505
2569 505 -60 -601 -845 -559 -266 445 869 567 -263 -468 -719 -323 276 587 892 636 -81 -452 -646 -500
2589 -500 235 370 555 401 -490 -508 -821 -232 -136 615 633 339 -255 -684 -587 -290 80 487 622 294 -122
2610 -122 -577 -692 -200 347 655 484 459 -161 -597 -434 -273 344 629 684 277 -271 -728 -648 -199 291 782
2631 782 718 344 -350 -581 -555 -159 96 659 615 331 -319 -537 -622 -438 285 468 759 343 -587 -768 -467
2652 -467 -153 258 554 493 169 -509 -617 -561 50 418 476 577 40 -359 -576 -544 239 353 690 667 -17 -432
2674 -432 -667 -547 -252 389 593 488 170 -433 -562 -596 -35 365 671 716 79 -364 -659 -413 168 564 554
2695 554 355 14 -433 -587 -575 -131 640 625 394 -92 -504 -842 -356 55 576 561 346 -92 -442 -454 -246
2716 -246 281 171 457 350 -263 -434 -681 -399 150 664 798 521 -370 -476 -565 -337 81 538 714 526
2736 526 -22 -576 -461 -30 115 406 467 285 -190 -724 -708 -150 330 552 513 94 -131 -658 -678 -342 79
2757 79 663 265 288 -234 -266 -398 -155 436 541 366 83 -122 -744 -567 -117 378 516 575 326 -281 -580
2778 -580 -689 -270 253 445 439 -15 -387 -449 -275 -263 332 463 591 -75 -306 -504 -313 -290 636 641 531 85
2800 85 -466 -647 -442 -37 149 724 172 190 -189 -538 -312 159 595 449 426 2 -281 -427 -248 -127 228
2821 228 604 459 -147 -377 -384 -260 66 344 469 449 -30 -187 -532 -295 57 539 427 577 -87 -522 -171
2842 -171 -149 330 272 655 -22 -161 -341 -433 -623 195 617 502 552 153 -282 -180 -379 128 611 411 240
2863 240 -183 -446 -490 25 278 696 506 157 -309 -567 -455 -189 22 412 450 201 -299 -643 -371 -286 -19
2884 -19 343 528 232 -134 -610 -447 -355 245 318 506 124 -203 -484 -311 11 -8 413 591 150 -211 -650
2905 -650 -164 -54 313 364 418 248 -73 -537 -419 -104 107 331 537 -196 -236 -414 -446 -47 253 366 272 139
2927 139 -210 -350 -369 -77 264 565 255 246 -149 -440 -401 -107 406 248 265 -200 -399 -244 -390 46 90 426
2949 426 322 97 -65 -458 -217 154 237 378 589 103 -180 -266 -189 104 196 401 456 -119 -467 -273 -375 103
2971 103 234 325 114 64 -332 -320 -133 78 448 368 245 -179 -334 -391 -212 65 290 293 281 139 -327 -676 -454
2994 -454 282 459 285 59 29 -506 -395 -152 188 422 233 109 -203 -200 -445 -355 196 322 314 224 13 -251
3016 -251 -196 -198 163 349 373 -44 -249 -487 -121 -47 94 314 84 -155 -332 -358 -210 15 203 501 523 234
3038 234 90 -399 -188 -134 151 212 206 -126 -196 -287 -394 -25 331 403 189 20 -257 -323 -483 27 158 506 142
3061 142 -37 -252 -178 -247 -154 216 220 73 -7 -284 -381 -390 -4 306 275 194 -27 -24 -252 -215 -198 3 335 81 -34
3086 -34 -278 -460 -218 -11 186 531 278 -285 -369 -108 -65 -75 275 411 270 -174 -45 -330 -272 137 70 248
3108 248 275 70 -394 -292 -213 -78 277 272 135 -60 -154 -332 -102 7 409 297 48 -85 -111 -219 -179 199
3130 199 370 364 -57 -407 -384 -374 -318 34 149 323 176 -384 -254 -149 -15 118 141 359 101 -102 -176 -240 -181
3153 -181 -39 200 244 44 -225 -281 -271 -47 374 397 328 22 -290 -124 -243 -166 136 422 189 21 -232 -371
3175 -371 -218 79 237 281 259 184 -95 -481 -348 -92 228 -175 157 219 -317 -274 -57 148 179 160 215 91 -156
3198 -156 -82 -178 -143 146 155 76 -24 -271 -324 -112 74 131 116 138 -19 -149 -157 -287 -21 223 -87 -13 -67 -368 -349
3223 -349 -184 -16 17 184 -30 105 -33 -371 -50 162 141 171 167 -25 -99 -185 -35 128 224 107 -5 -33 -142
3246 -142 -270 -170 18 254 79 206 -107 -140 -463 -7 -214 64 83 156 11 -252 -228 57 26 162 269 176
3268 176 -120 -143 47 -10 83 154 10 187 -112 -9 47 -99 -43 92 170 68 -321 -188 -191 11 101 281 237 -49
3292 -49 109 -299 -157 -8 -14 31 216 -62 -131 -315 -70 -101 222 133 8 39 38 -239 -37 113 93 -45 211 52
3316 52 2 -155 -163 187 239 241 32 19 -152 -33 -275 -80 64 120 153 59 -262 -272 101 -148 138 -7 100 3
3340 3 -190 -41 -58 205 54 274 -20 -1 -165 -210 -250 -113 371 335 75 203 -266 -195 -62 59 40 498 36
3363 36 -275 -198 -265 -52 41 168 215 113 1 -15 -425 -109 51 127 342 -20 -75 -227 -166 -18 -191 319 393
3386 393 -152 -166 -300 -186 -68 -87 221 383 5 -164 -152 -103 24 -26 183 102 -92 -189 -55 -209 -115 -17 130
3409 130 222 -104 -22 -108 -168 39 167 199 219 271 -210 -270 -193 27 -69 174 252 -97 -23 -345 -120 29 388 195
3433 195 123 89 -180 -196 -183 -51 -67 -67 286 -24 94 43 -124 -225 224 395 298 86 -144 -226 -65 -60 64 230
3457 230 89 4 85 -65 14 81 172 218 186 126 -178 -175 58 -97 160 209 173 -84 -343 -132 -4 -66 342 270 173
3482 173 -101 -156 -196 -274 103 437 212 32 -3 -103 -179 -186 -79 -43 218 110 87 -109 -207 118 436 266 202 116
3506 116 -56 -366 -39 -171 -45 101 358 -51 -197 -209 -42 35 -53 276 202 115 -90 -306 -16 -365 150 348
3528 348 144 44 -114 -57 -147 110 -163 219 186 -162 -67 -194 72 -17 -160 239 284 -113 -72 -352 118 -98
3550 -98 -20 123 77 70 -147 -43 -330 -73 -29 259 41 -78 -185 -330 -157 64 135 156 187 259 38 -153 -59 -58
3574 -58 123 143 224 70 -188 -389 -133 160 87 180 275 -16 -113 -303 -179 -45 20 164 195 136 34 -11 -52 -25
3598 -25 38 214 150 50 43 -90 -77 -21 83 155 168 17 -50 -146 -154 -157 -51 378 84 -255 -228 -279 -249 -77 74 69 283
3625 283 18 -168 -304 -65 114 66 226 3 20 -282 -218 -119 328 76 157 106 47 -110 0 -50 120 -114 247
3648 247 306 -206 -43 -139 16 -20 288 126 41 -130 -60 -154 -104 -120 130 154 146 -41 -177 -132 -125 11 213 75 82
3673 82 -60 -296 -59 64 191 70 240 107 -147 24 -80 14 29 45 379 156 79 -143 -154 42 73 -25 -5
3696 -5 81 16 -80 -71 11 79 5 -36 -110 -210 -287 -125 188 -292 29 -9 159 -61 -315 -92 -64 -54 -5 -31 -94 -247
3722 -247 -67 -69 4 45 48 113 -42 -57 80 -107 81 263 51 184 206 -210 -78 5 6 188 182 125 -144 131 -88
3747 -88 -28 52 303 29 9 -47 57 153 -206 1 296 188 -12 136 -128 -62 -149 172 -7 164 41 -14 -55
3770 -55 -109 11 147 107 136 266 124 -151 -145 81 129 79 118 218 -102 -190 -87 -32 -152 27 279 128 82 -228
3794 -228 -245 -100 102 -61 298 -33 -192 -225 -240 191 79 44 59 123 -279 -137 -8 70 307 -42 26 78 -313
3817 -313 131 19 -61 86 64 74 20 -241 -342 14 134 -35 132 211 -6 -139 -183 -90 -162 -31 2 68 -12 174
3841 174 25 -109 22 109 27 79 61 -73 -114 152 100 43 98 279 -28 -109 -20 -184 -103 187 112 186 -108 -19 -54
3866 -54 30 -139 50 166 116 -88 -279 130 -22 108 313 6 62 -76 -311 -90 -39 4 180 171 -284 133 -42
3889 -42 -208 -210 -111 121 62 33 59 42 -327 -99 -262 164 91 -15 23 -114 -100 -87 -33 253 295 -50 28 -78 -117
3914 -117 23 93 305 188 -3 195 -88 -227 14 84 235 313 151 -226 -128 86 123 34 199 5 150 141 14
3937 14 -97 -60 43 167 124 -39 -137 -354 -231 -71 -56 195 30 8 56 -62 -66 86 215 40 -51 -165 -75 -50
3961 -50 -350 121 26 64 -1 9 -253 -311 -185 -74 45 -40 106 210 124 -41 -109 19 -101 10 65 38 56 -127
3985 -127 -13 210 41 134 -95 -96 -26 -165 56 -10 -7 224 -126 -248 178 -140 135 126 -168 209 -29 -76 -195
4008 -195 -91 -271 -257 345 -79 72 -244 222 48 -51 -121 81 -47 192 27 -18 160 -49 -8 337 84 207
4030 207 -303 -200 -218 -21 -69 92 -18 35 22 -101 -6 90 -89 42 16 -59 -73 -180 -223 -184 141 69 28 -76
4054 -76 15 -42 59 -244 268 -328 175 8 -274 -176 -335 -9 136 -166 1 -114 -261 -124 28 26 11 465
4076 465 0 -43 169 -238 -90 -95 181 99 107 38 -69 9 -224 -221 257 2 218 -99 -51 -120 -175 -3 98 92 -84
4101 -84 -23 1 -258 -74 7 -34 63 290 -29 -11 8 -76 80 -75 -134 -4 -196 136 -131 -74 -40 72 202 16
4125 16 -201 46 100 -244 -1 92 32 -13 153 159 -71 28 48 111 -27 -81 178 -3 -145 69 -89 67 219 -142
4149 -142 -38 8 38 -53 -70 301 159 4 -230 -166 -339 -40 195 227 359 75 -256 -370 -175 -190 11 10 -88
4172 -88 -102 21 -121 24 -14 -86 -76 40 49 19 -149 232 4 -52 275 -62 84 0 -54 -95 -29 157 61 36 79
4197 79 -304 -127 -87 -319 262 10 26 -96 5 -202 -154 -24 -121 230 126 -3 -38 -140 -58 141 -120 126
4219 126 170 149 -240 -258 142 -120 147 139 -16 96 -80 -8 52 -136 272 -9 -123 -76 -36 -167 -291 101 241
4242 241 157 -93 -223 -151 -40 -145 -227 -133 93 -52 59 100 -200 19 262 -117 117 56 -63 -251 -219 -125 87
4265 87 20 50 -100 153 -146 -16 13 -69 55 -59 105 -23 -203 -21 165 -125 81 187 34 -212 70 27
4287 27 -61 65 388 64 29 53 144 -194 84 17 0 130 -11 44 -179 -135 -65 -64 97 2 27 -293 64 20 25 143
4313 143 67 268 -77 -162 -88 79 -25 134 140 137 35 62 -95 -9 -91 34 59 186 17 69 -56 53 188 -86
4337 -86 26 69 72 86 -39 -34 -2 -78 105 71 40 3 175 73 60 73 88 35 4 -283 -184 294 105 87 99 12 98
4364 98 25 -172 -163 -80 57 -81 106 -186 -84 -162 -102 -53 212 185 -1 -32 -130 34 -100 -20 324 -33 116 41
4388 41 27 -78 -235 123 149 -180 20 18 -198 14 58 222 -5 97 355 127 -89 11 -80 275 35 147
4410 147 -144 -207 -185 115 -13 -41 -54 26 76 -3 18 -111 66 215 -47 -49 -57 34 -46 -35 -240 -98 355 108 -82
4435 -82 -90 -378 -201 41 -81 91 -5 6 91 12 -147 8 -51 95 173 12 -27 59 -267 -67 29 56 138 104 136
4460 136 45 -127 102 8 -17 7 149 173 -129 -116 -83 21 -4 -39 10 -25 20 18 -75 -10 158 105 -88 -40 -156 194
4486 194 -168 -10 228 92 23 -79 -143 -191 -48 -108 86 207 -39 33 -233 -107 -92 145 -39 120 -148 -40
4508 -40 -113 -1 12 -22 200 15 154 -390 -246 -152 82 -11 3 -64 137 -107 91 149 -5 4 -57 -15 12 121 42
4533 42 -87 -34 82 84 -88 357 -73 -50 -152 -55 72 204 280 68 -6 -30 -76 -288 -69 -51 191 204 10 112
4557 112 63 85 -29 249 164 -215 -268 -83 -21 111 113 -11 -83 -40 14 -8 -176 179 125 -127 1 -60 -245 34
4581 34 -11 -99 -85 46 8 131 -201 81 -115 -56 106 153 223 -146 2 7 -117 35 90 -236 -54 -171 -31 112
4605 112 80 21 55 73 5 -74 -50 120 -15 -161 -27 207 -163 -98 -115 -120 -36 116 -75 67 128 -232 -35 -149
4629 -149 63 178 81 -36 -167 155 95 -88 -176 67 -105 100 -31 -164 15 -148 90 45 286 201 31 -120
4651 -120 54 -12 215 80 338 -140 29 -12 31 -66 55 159 123 111 46 121 -77 216 -250 28 -115 290 132
4674 132 101 -151 229 77 192 59 -16 -182 -73 -112 132 -38 -58 223 79 6 -154 -54 -46 142 -12 -5 157
4697 157 44 42 -79 145 18 84 110 -114 4 -50 -126 50 151 -60 110 58 13 -293 -99 -218 33 -63 6
4720 6 -69 -19 -118 -184 -93 -73 145 -136 -10 25 -174 30 -58 -23 5 76 209 191 -30 131 9 41 -28 4 -149 -118
4746 -118 -36 91 156 26 222 208 270 -41 27 -250 -75 108 51 -98 41 -150 -16 -233 142 112 -153 -87 -99
4769 -99 -90 -68 -69 -244 43 39 31 -234 -83 22 -126 -68 154 -195 -20 57 124 3 12 194 23 -43 -34 80 149 174 -77
4796 -77 225 -170 238 -31 137 41 82 -1 22 74 114 224 -194 -103 -199 -63 -87 173 -154 -178 -96 81 -274 -283 75
4821 75 112 198 -127 130 25 -79 -126 180 17 111 93 18 -89 -257 -37 86 108 168 -44 -161 109 39 57 39
4845 39 83 50 133 58 -12 286 20 66 297 -13 30 54 -16 -13 28 263 -15 28 130 -60 -142 -214 -25 30 206 50
4871 50 16 -31 25 -101 -88 -3 108 78 99 -107 -248 -94 -19 -20 -80 44 -78 -109 -62 50 -54 -74 -13 -54 3 -34
4897 -34 164 -143 96 268 13 77 70 -44 -68 57 36 64 -143 153 121 44 117 3 93 54 153 -33 -42 -133 -21
4922 -21 -168 -96 1 -148 -76 252 62 3 27 -32 155 345 224 209 46 -79 23 -125 202 -5 103 67 -63
4945 -63 125 -196 5 -39 48 116 -221 -196 -168 55 -155 213 166 -69 21 -69 -231 -34 44 -171 -212 248 36 -102
4969 -102 144 -48 100 250 -226 151 -52 -74 -4 90 -40 -190 31 -72 -86 -176 -25 -127 127 45 -36 65
4991 65 -95 130 9 175 110 16 -131 61 42 -133 42 70 46 439 153 -123 80 -34 76 -56 148 37
5013 37 27 164 -116 -185 -140 158 -71 -66 76 -29 -213 0 85 -189 -84 -156 102 -159 76 -99 155 242 124
5036 124 -18 -102 -4 -106 -3 16 91 131 206 79 -107 37 77 -49 98 -3 94 20 -247 55 -142 -207 234
5059 234 8 -96 213 70 -224 -156 -28 -32 19 116 35 61 -36 -411 67 131 -88 143 188 5 -100 -43 19 70
5083 70 -85 -52 -81 -147 -31 -114 92 82 -194 149 16 -8 -73 1 60 -54 -166 -15 -7 232 90 -33 -173 15
5107 15 440 -107 283 -101 -17 -97 114 197 -36 289 84 -59 -44 8 205 33 -90 -70 232 -36 -133 22 93
5130 93 -38 161 73 106 88 6 90 114 127 1 72 -13 -41 12 -292 -232 117 42 176 -258 -72 118 -30 15 4
5155 4 189 -181 121 10 -172 -237 -3 98 107 38 -81 -16 142 -50 37 290 19 84 -107 -138 133 21 56 -17
5179 -17 -172 -88 49 15 -238 -49 -170 114 -83 -86 -137 -167 21 1 22 198 108 190 -82 62 -110 -33 320 28
5203 28 -92 236 59 141 -58 -79 -168 69 217 137 16 -58 -38 -5 72 -123 202 105 -183 272 46 236 -120
5226 -120 58 -43 -319 -118 -133 -57 122 1 -7 88 -100 87 -415 -67 32 179 158 138 -42 -85 0 -75 10 -84
5250 -84 30 43 87 -20 -232 -122 12 103 -125 105 -164 35 -186 -66 99 60 102 117 43 143 89 -44 22
5273 22 -39 -103 -114 -68 26 -160 -53 -32 288 214 103 -36 -32 236 -7 35 147 56 146 -28 -23 -118 123 -207 0
5298 0 107 89 -61 -122 115 -163 -174 0 128 123 -3 138 -106 -126 -25 32 23 -13 41 -9 -54 -230 0 -246 81
5323 81 35 -148 7 -76 102 157 243 95 -105 -35 -135 -126 -34 24 -77 55 61 -107 -130 185 60 29 192 9 125
5348 125 121 -177 155 -108 125 334 -96 145 -56 23 40 193 -90 -81 48 12 75 35 -94 -9 48 11 89 -11
5372 -11 150 46 -225 20 95 -14 -75 -229 -213 -21 -200 54 -151 -106 43 304 -114 -161 19 81 43 -5 174
5395 174 -141 -205 129 123 12 144 40 -160 -51 -151 19 59 65 204 -2 -152 49 110 150 -190 -70 -124 -170
5418 -170 -16 210 81 165 -51 -81 170 -156 85 158 -132 -209 7 102 136 -47 36 -242 134 -210 -192 207 173
5441 173 -30 -14 113 -5 -23 166 107 -42 117 -169 -143 3 -47 -78 -35 219 73 -70 53 -274 77 -108
5463 -108 103 -65 -46 -220 -11 -73 -70 53 -124 -30 -24 194 -14 -20 15 -12 -67 23 301 -182 -201 -60 -25 -205 -38
5488 -38 -127 97 -129 -230 -140 -205 163 61 159 -37 -253 111 -211 168 -109 71 56 238 166 37 62 149 10
5511 10 -157 -165 47 -30 -116 -130 -98 16 -72 -73 -143 64 -172 5 -167 58 28 -91 -34 -7 -179 -29 -233 -126 82
5536 82 -128 -100 69 -49 -40 -71 146 199 -59 -6 124 -118 119 -50 -45 -82 -103 -168 -100 -89 -55 -22 -36 -106 46 234
5562 234 -137 45 92 -179 -11 55 -89 -185 -36 -107 -100 -28 -184 181 -86 4 75 -93 -324 162 -30 -43 103
5585 103 -11 165 -243 -38 40 243 -115 259 136 -28 92 247 33 -188 -28 -125 40 -153 -174 -51 -10
5606 -10 -8 27 1 -29 -39 -1 120 20 89 -19 22 95 130 19 -19 256 -26 84 292 -64 53 -336 25 204
5630 204 -61 21 210 31 23 -143 -51 -43 120 47 114 -123 -104 95 119 139 -130 173 28 15 -232 -127 68 -140
5654 -140 -51 201 91 -103 -45 140 21 -91 80 49 165 51 -156 -32 51 40 51 -19 17 17 8 87 -96 -33 -84
5679 -84 116 21 -88 180 68 10 -59 -78 84 -192 169 84 33 -62 -91 -3 65 44 -196 92 47 82 143 156 50
5704 50 50 2 -109 33 47 118 198 269 59 12 -65 -21 -75 177 -92 52 -32 -10 -124 146 7 55 113 12 -126
5729 -126 8 -91 116 89 -272 52 80 -88 76 -146 155 7 -198 42 20 200 -98 -83 98 29 162 75
5751 75 -89 -3 -101 -43 -28 125 54 -151 -119 4 70 -62 32 -158 -289 -137 8 132 323 -54 -45 259 -83 58
5775 58 -41 -43 53 -17 -18 35 -60 58 50 -49 -60 129 100 48 103 -58 198 218 -20 -250 149 59 -15 -167 -167 -36 138
5802 138 -194 -120 21 -8 -37 156 -63 -62 -20 19 81 2 45 -44 81 198 -91 -165 -15 -9 -13 92 -113 11 -54 33
5828 33 -85 -109 141 -32 -99 44 -150 217 -112 1 4 -74 74 158 -155 -58 -42 263 -77 12 42 445 160 -74
5852 -74 -11 29 93 114 -68 -23 107 -146 121 59 80 171 60 -3 57 -79 -178 13 -74 161 17 -152 -265 75
5876 75 -175 2 211 33 5 -178 -102 -85 -90 60 20 -130 14 -115 -29 -24 -252 284 -134 -10 -173 88 81 -59
5900 -59 -133 -35 -64 22 -120 -208 57 -29 -97 -138 39 84 154 -65 53 10 -2 24 15 81 -59 57 -214 -73 -104 -54
5926 -54 -26 32 118 -11 222 120 32 107 -161 73 66 -43 65 278 318 -17 -54 138 25 -85 37 137 141 -146
5950 -146 -68 -174 -181 16 91 158 -180 255 -24 -137 12 -128 -52 140 62 -96 23 -33 -204 50 -84 155 -191
5973 -191 -33 132 81 -68 152 -90 110 -151 -21 50 106 259 70 11 107 -28 -59 -60 90 217 -7 130 72
5996 72 203 -127 -391 -205 -57 -52 181 -244 129 172 1 -187 -48 -73 -291 40 12 -9 -79 -203 22 -251 55
6019 55 5 51 111 -59 -182 -2 19 -36 73 84 -217 204 -87 106 -103 100 30 7 -69 -24 -5 -161 229 21
6043 21 -93 91 61 68 -34 -3 -81 -32 89 15 -222 -233 29 86 -144 65 -68 -35 149 -157 128 72 198 47
6067 47 111 -89 3 -30 -13 -132 -243 -57 62 91 204 27 217 54 8 145 -29 18 -289 -72 -136 -31 -9
6090 -9 131 88 168 57 91 -39 -143 3 -32 -194 -128 -100 97 -155 149 -128 -188 -19 79 57 -160 -62 -153 -7
6114 -7 -174 -69 112 -135 -86 22 69 110 42 69 65 -77 69 -166 61 -11 -24 -39 29 12 -38 -99 88 128 -44 160
6140 160 27 -319 46 -169 -107 -204 56 88 -138 -59 -17 -1 -82 253 105 -37 102 -57 146 15 32 139 -10
6163 -10 73 -68 250 94 149 -53 -110 29 55 32 -127 74 -60 49 8 161 37 127 -68 157 -226 58 114
6186 114 124 20 20 5 -164 -105 55 -89 -253 47 -96 -310 36 217 -23 46 23 -87 -18 -85 -29 175 -41
6209 -41 -98 -69 75 -49 -80 -211 91 -85 103 -168 107 -4 14 211 -47 -4 149 -10 -155 0 -18 14 49
6232 49 66 -156 17 -35 -1 94 98 251 -108 37 -89 -175 -103 -64 -35 50 244 -43 -74 -105 46 -52 -21 -104 -212 56
6258 56 -208 51 92 -112 -227 -33 -64 -167 -53 -11 123 -77 -45 93 12 -77 77 76 120 -20 -148 208 -27
6281 -27 76 -87 -11 -102 66 16 56 59 72 -32 2 40 -110 76 54 -1 -26 21 -12 -54 64 113 -29 248 123 81
6307 81 25 -9 -69 -17 162 202 0 77 -112 -15 142 416 33 -162 157 -127 21 29 -210 -120 -10 96 -8 -254
6331 -254 116 -28 176 246 -93 -67 130 -229 1 -94 211 -125 62 -1 -23 -2 13 -16 -77 131 -42 117 225
6354 225 -40 -223 -32 -121 -8 -8 -92 41 -155 -267 28 -71 -182 21 73 -16 -239 -52 68 53 154 47 -32
6377 -32 -35 -174 -188 36 -56 68 -157 102 -122 118 68 -110 -129 -3 -186 -84 86 -24 27 78 62 -239 -82
6400 -82 125 92 -18 -207 61 230 -186 244 157 83 -4 -81 81 -252 129 32 -207 66 -12 -249 142 17 112
6423 112 -155 -103 176 95 75 121 44 99 345 -164 -72 -193 110 32 -22 13 104 48 -60 28 67 166 -296 -275 -12
6448 -12 -44 -161 -7 -31 -78 -115 141 -64 95 -159 -38 -88 -175 -46 203 -31 -139 56 -85 -227 101 -18
6470 -18 56 89 76 10 -69 263 97 13 -6 -6 -3 9 -242 -79 -7 -85 -113 95 -67 -96 -17 -70 6 -206 103 -33 171
6497 171 151 -239 -4 -46 174 11 -44 -88 -52 -12 27 -36 7 62 -122 72 -32 -55 22 97 60 -30 394 1 41
6522 41 -26 -1 144 29 41 138 -58 59 71 173 -210 24 234 -41 60 -56 257 -54 -34 223 20 -198
6544 -198 152 68 92 -65 -12 -137 -42 18 169 134 -201 -190 -8 157 -151 11 -74 -40 -101 -55 47 71 99 -96
6568 -96 18 219 -190 147 -87 -71 48 -161 261 89 146 69 -140 -15 47 10 -92 218 -100 46 32 55 -34
6591 -34 97 -137 74 143 7 -15 -83 -138 101 -111 -105 -30 -53 -19 72 -133 65 -53 12 77 -41 81 -134 141
6615 141 -58 -270 -238 -113 -58 25 -48 -4 20 39 34 117 167 -5 -20 93 209 -78 -122 -12 -92 160 206 23 -19
6640 -19 -140 54 -98 -36 147 55 -174 46 292 248 -16 -198 241 -110 -135 105 -85 25 -28 -79 204 -108
6662 -108 23 -123 16 -88 -114 19 -82 -50 235 65 15 -207 13 87 42 -218 -53 -41 166 -22 67 170
6684 170 -2 108 66 187 -189 167 -136 246 234 81 70 189 -204 10 13 116 -50 -111 69 102 6 -22 87
6707 87 -136 193 -113 81 -27 -122 122 139 -75 -30 225 -25 -120 -174 -51 -200 -238 83 -100 -98 185 116 27 -31
6731 -31 -80 -110 -156 -62 -27 106 182 -87 63 -364 31 144 -125 11 -64 73 -131 17 -98 61 49 3 63 126
6755 126 19 33 15 238 -277 132 141 -49 186 90 125 102 -189 -53 21 135 41 -91 -28 30 -6 -10 169 3 218
6780 218 -15 63 39 -28 -45 -158 -74 -58 228 -57 31 111 -3 -179 -88 -60 187 94 344 137 20 93 -54 -56 18
6805 18 44 -114 131 -271 -112 -20 -133 65 -92 82 -129 -163 -115 -238 -167 -264 22 -174 -11 -6 -73 30 30 22 18
6830 18 -81 -34 -186 -80 197 -67 82 17 -21 34 142 16 16 -99 -59 36 2 -8 -253 41 63 49 41 -86 -149 206
6856 206 124 80 7 -32 47 39 336 -87 -64 51 -97 -352 95 65 -14 29 -104 -74 4 159 40 -45 -112 136 28
6881 28 76 -268 -1 130 208 12 -43 -207 8 171 -179 75 91 -54 34 -48 -143 -104 86 -150 139 228 13
6904 13 292 -210 39 90 -16 20 -65 -52 -6 121 67 -108 86 -67 97 16 188 -173 28 -52 -44 103 67 -107
6928 -107 -125 1 99 -60 82 128 -14 -77 -90 101 344 88 -214 -48 85 -36 -96 -11 -234 -77 -163 41 32
6951 32 -174 -33 -35 37 -102 96 10 85 107 -143 96 -262 174 -66 1 98 -233 42 11 94 66 63 -160 -218 -202
6976 -202 79 138 101 -43 -129 19 137 122 92 13 -87 -50 -63 46 117 307 -8 -70 -117 237 223 32 159 -262
7000 -262 278 -97 165 118 -30 -168 107 15 122 82 -155 161 -1 -144 -39 250 -49 -17 21 -97 43 45
7022 45 -287 141 -99 95 -375 193 89 187 149 -321 114 42 130 -200 122 97 -98 4 245 -176 -22 119
7044 119 -16 97 137 -52 156 -244 35 158 -110 20 46 -40 28 68 -44 370 -165 -40 80 -8 133 -90
7066 -90 -173 4 -145 -127 68 -34 -11 -200 -44 33 -233 148 -102 -103 101 29 94 51 -48 129 42 48 -61 203 -6
7091 -6 -84 23 -34 77 52 209 63 70 -46 -14 -22 118 -112 5 -9 -41 57 305 4 -86 183 112 161 -7 -83 67
7117 67 94 23 225 -127 8 44 16 -7 189 -25 -69 4 -65 -157 234 41 -142 18 160 21 -74 -74 -4 104 -222
7142 -222 16 -233 -42 -171 -190 -105 -62 28 -192 -46 7 -23 240 -13 158 -166 -130 12 -39 -10 -29 -89 51 70
7166 70 -228 49 -39 -305 -50 -201 87 -18 -27 -97 -142 -83 126 -82 -172 129 -90 -80 -59 27 -38 105 84 -57
7190 -57 17 -40 19 68 -66 84 135 -30 29 -110 -65 123 -199 153 120 -91 -154 -92 -37 -68 -131 128 23 89 196
7215 196 163 -27 -18 -129 -76 -42 -75 -139 -176 121 42 77 -168 62 -10 61 59 -4 -274 77 -98 1 -182 -7 104
7240 104 -104 119 73 74 -128 -110 44 38 -113 136 39 -156 35 -89 -5 -190 19 222 205 87 -122 -52 86
7263 86 197 -215 2 -27 -14 36 -46 -54 230 205 -168 214 -157 -40 -65 241 92 -245 -31 163 225 224 344 86
7287 86 -185 -33 -112 31 59 1 209 -3 37 -27 -25 14 25 106 -24 -138 31 -43 -150 171 -216 36 -226 -103
7311 -103 -110 -98 -146 -42 -54 -33 156 -145 -111 -212 -119 -24 -2 -225 -127 59 -207 -187 7 -145 70 -32 -14 28 58
7336 58 47 -131 -6 -169 98 145 251 83 -29 93 -75 52 159 166 76 -193 15 -105 -30 -43 109 110 -138
7359 -138 -140 -151 118 42 285 -39 -86 -60 -179 75 334 -127 16 127 40 -112 200 -52 -182 75 93 -112 -235
7382 -235 124 -35 -131 -183 181 156 -140 -21 -26 -39 50 -11 53 -269 -219 -104 85 -54 -44 -177 167 -72 93 -36
7406 -36 -97 -148 -98 103 79 -230 151 52 -150 -29 -158 6 154 224 -12 -255 36 313 39 156 -211 -245 -97
7429 -97 108 12 260 5 -28 -29 -121 130 -33 -38 2 35 -85 -122 171 -45 202 -94 138 114 -146 255 26 63
7453 63 -148 -49 62 82 225 -131 -31 96 159 117 -54 -87 60 161 -104 -213 -76 -63 80 -91 9 -82 106
7476 106 -60 25 -46 -46 -162 83 60 -143 -36 75 32 125 21 -87 67 -154 -124 129 -128 -128 87 -181 87
7499 87 216 167 -80 -16 4 -96 66 -163 -70 -150 15 116 -93 198 -89 -9 21 127 -250 230 9 -146 -30
7522 -30 -5 -41 272 -59 -25 -99 -66 -110 -52 85 -2 -80 -31 183 0 44 -149 124 -140 41 -100 17 -36 -24 43
7547 43 -157 -62 58 -179 102 -231 75 221 59 16 83 -274 60 -14 32 -130 134 -236 -127 69 -217 -23
7569 -23 65 -23 29 35 103 116 -62 124 80 23 -9 171 -62 -88 -234 70 -161 53 108 39 117 110 48 -153 -154 -131 121
7596 121 28 -51 198 243 -34 131 -232 -35 219 -105 -102 -93 118 -14 208 -116 -150 -52 -27 134 78 -171 122 -103
7620 -103 72 -69 -8 -105 237 -134 -133 310 46 -79 -48 9 30 197 -49 6 -85 -21 60 -58 38 97 -265 -174 -207
7645 -207 -42 -148 -74 55 175 57 74 175 -151 -130 -85 100 131 32 -241 -59 -42 148 240 144 -233 -159 -94 63
7669 63 -23 161 152 54 -2 84 -61 116 12 -129 5 -52 -24 99 -53 72 -60 14 -131 15 -60 -263 -23 -112
7693 -112 -208 -65 -222 47 -4 -149 -174 -56 -63 63 62 173 47 166 58 121 58 -29 -102 -20 -113 -69 94 -234 -10
7718 -10 -135 -135 -79 51 70 -95 80 173 119 7 175 -185 -22 42 267 108 -104 -178 -111 -3 50 -42 24 103 12
7743 12 -82 -27 -27 -123 144 -132 65 -279 -181 54 -42 179 -137 -73 226 28 -137 -74 -269 48 -60 121 106 57
7767 57 -4 -155 -75 75 -151 108 208 199 -86 -103 -77 -49 -26 73 135 -280 -98 -23 -189 5 -57 26 14 116 -161
7792 -161 -22 86 -104 -177 -38 -219 213 26 48 126 203 45 -151 157 -15 236 -257 54 81 66 202 -11
7814 -11 61 -124 220 34 111 227 53 143 -305 134 -25 -114 -105 -105 -12 129 -101 -55 -20 -25 81 156 48 104 -144
7839 -144 115 -144 104 11 48 -108 47 14 145 -163 -35 99 -41 -7 -4 305 12 -29 138 83 -277 265 91
7862 91 176 171 19 108 -167 -45 71 31 205 -37 -52 15 79 -20 -149 -64 75 18 -34 -43 -233 -29 -141 141 -93
7887 -93 125 -204 -125 279 -83 125 9 -35 -58 3 101 -82 75 -163 -179 17 111 143 9 -31 37 -135 -92 -61
7911 -61 -279 -197 -72 -3 80 -53 86 192 18 -94 -17 -71 -113 103 -123 -94 148 83 -23 51 36 61 -46 -69
7935 -69 137 -15 -85 -24 -40 -105 6 -88 -147 32 -127 107 -45 -8 -16 265 10 -163 -21 -205 -189 -156 -51 -134
7959 -134 106 21 -125 4 92 84 29 -183 62 -243 -36 -83 -28 -62 -217 -55 -18 97 145 -3 150 -32 -28 -5
7983 -5 138 115 -203 137 158 209 -315 -114 -219 -16 -181 -8 146 91 109 -90 -220 -70 -170 -253 -153 43 187
8006 187 -115 73 -12 -286 -38 28 -23 -77 180 165 -64 6 35 15 46 68 -85 -60 103 213 11 -69 30 61 163
8031 163 72 -59 -122 40 161 -59 112 38 110 228 -381 58 -101 144 131 25 88 308 47 80 -100 -7 179
8054 179 21 -125 -291 -156 -171 47 42 62 29 147 -47 -110 -44 -74 -82 -113 -298 -5 43 138 -161 -268 -48 97
8078 97 -71 33 252 -201 43 -151 -68 178 -54 -53 -270 -10 -174 -176 -56 16 176 -80 4 133 105 -212 36
8101 36 120 -23 -90 -45 -52 115 14 118 -129 -265 -49 202 -161 13 -274 -70 -151 29 171 134 154 -140 -86
8124 -86 200 0 0 -66 23 103 25 199 -222 -108 9 -22 128 -158 -155 32 47 143 177 -145 46 83 56 -1 161
8149 161 134 -82 -65 118 50 -8 -33 -216 266 96 -297 125 -110 -124 234 -130 14 187 -63 -123 -145 -118 37
8172 37 92 9 -185 227 -41 -20 52 147 198 59 84 -136 135 13 19 -83 -134 -219 117
8191A17
$$ Imaginary data points
##PAGE= N=2
##DATA TABLE= (X++(I..I)), XYDATA
0 0 0 0 0 0 0 0 0 0 0 0 0 0 0 0 8 -8 8 -8 9 -16 16 -24 24 -32 32 -40 48 -56 64 -72 81 -92 105 -121 135 -152
36 -152 170 -189 212 -237 264 -294 325 -360 399 -441 486 -537 591 -652 716 -790 872 -960
54 -960 1063 -1175 1306 -1454 1626 -1831 2077 -2375 2758 -3251 3930 -4918 6503 -9452 16868
69 16868 -79232 -89283 59423 67518 89022 82914 9976 -97734 -116398 -73151 16842 94595
81 94595 109577 52982 -8330 -75459 -113405 -72152 23034 84394 104946 67697 -27859 -97035
93 -97035 -81022 -49637 -7953 82519 130969 49758 -50769 -76353 -73537 -59020 8933 87797
105 87797 104119 50518 -33937 -91713 -82274 -35090 15386 73251 100835 47158 -38405 -82021
117 -82021 -81989 -43176 33231 86395 73757 34032 -15716 -81249 -99064 -30391 49363 74063 65644
130 65644 35900 -24304 -80553 -85350 -32291 43399 84191 65183 20058 -25614 -71293 -82287
142 -82287 -28176 45971 78441 64861 21876 -36978 -75517 -65407 -21417 33157 76832 72432
154 72432 14480 -47229 -70365 -57246 -18687 35113 74247 67479 14683 -47058 -74052 -53409
166 -53409 -9167 36108 68238 63113 12631 -48034 -73401 -52477 -5276 41780 66213 54335
178 54335 9215 -44197 -71615 -52311 -1334 46881 65558 47556 4652 -42726 -68021 -50828
190 -50828 210 49313 64402 42864 -509 -44492 -64516 -46089 1483 48679 65398 41180
202 41180 -6321 -46553 -59938 -41111 3125 48605 63793 38464 -9005 -48583 -59550 -36462
214 -36462 7411 47150 60625 36394 -11064 -50216 -57175 -32682 10565 48786 57982 32057
226 32057 -12251 -48981 -56885 -30440 14454 49481 54803 28394 -14537 -49548 -54967 -27234 16046
239 16046 49764 53707 25414 -17219 -49466 -51900 -24332 17872 49666 51848 23105 -19612 -50475
252 -50475 -50259 -20322 19913 48393 49464 20556 -21770 -51172 -48510 -16829 22938 48511 46776
265 46776 17870 -22176 -49895 -47343 -14919 25815 49282 43039 13496 -22905 -48571 -46246 -13853
278 -13853 27687 49975 41057 9945 -25392 -46679 -42377 -12080 27891 51103 40681 6156
290 6156 -28663 -45656 -38434 -9817 27365 49740 39952 4659 -32241 -46828 -34319 -5192 27064
303 27064 46758 39571 4322 -33727 -47662 -31705 -749 28699 44108 35640 3679 -32953
315 -32953 -48609 -32776 2345 32466 41937 30431 2814 -30685 -48369 -33008 5054 35776
327 35776 41957 26652 -751 -29897 -44692 -31692 4035 37163 43995 23359 -6120 -30462
339 -30462 -41766 -29686 4305 36961 43948 23868 -9149 -34630 -38468 -22354 4187 32848
351 32848 45561 25100 -13252 -37812 -36205 -19052 6396 32242 42281 23779 -12269 -39626
363 -39626 -38517 -15096 11397 31036 38728 22605 -12478 -39243 -38274 -15340 14481 35588 35241
376 35241 15882 -11222 -34985 -40652 -16791 19356 37821 31046 12068 -11648 -33625 -38662 -16458
389 -16458 19462 40199 32046 7738 -15048 -31372 -35557 -15624 19379 40022 32431 6874 -18759
402 -18759 -33659 -31190 -10989 16939 37004 34218 7733 -22832 -36321 -27132 -5982 16730 33891
415 33891 33474 9047 -24573 -38809 -25750 -2182 18369 31766 30320 7987 -23828 -39092 -26912
428 -26912 380 22782 31260 26246 6334 -22076 -38164 -27237 821 25464 33633 22650 480
441 480 -20655 -33797 -28238 -960 28728 34917 19260 -1631 -21224 -32999 -24700 583 25947
454 25947 36092 22454 -6240 -26086 -28698 -20400 -1618 25472 36802 20036 -7046 -26765
466 -26765 -31152 -17711 5028 23123 31877 23373 -6180 -31949 -30146 -12797 4278 23365 33463
479 33463 18638 -8577 -27260 -31153 -17202 9721 27926 26521 15010 -4534 -27847 -32902 -14052
492 -14052 11171 27477 29226 12463 -9851 -24430 -29070 -17986 11502 33011 25858 7530 -7700
505 -7700 -24720 -31653 -13092 14420 28033 26195 11428 -12802 -28367 -25097 -10293 11355 29163
518 29163 27385 8077 -13244 -27647 -27184 -7226 15306 24655 24636 11910 -15276 -32646 -22552
531 -22552 -3131 11841 25535 27488 7378 -17835 -27833 -22026 -5398 15638 27307 22715 5656
544 5656 -16114 -29446 -22093 -2437 15133 26762 24088 2658 -19205 -25389 -19819 -5337 17584
557 17584 30348 19911 -278 -16205 -25811 -21808 -1765 19552 26894 18732 863 -18530 -26469
570 -26469 -19202 -665 19418 27507 17487 -1350 -17704 -25523 -19425 1401 21453 25525 15442
583 15442 -1174 -18810 -26777 -17055 2922 20229 25053 15789 -3371 -20242 -24801 -15377 3671
596 3671 20614 25300 14732 -4407 -21026 -24330 -13325 4567 19874 24834 14363 -6196 -22394
609 -22394 -23485 -11452 5593 20056 23953 12895 -6541 -22104 -23596 -10534 7791 20444 22461
622 22461 11728 -6734 -22330 -23744 -9875 9040 21258 21017 9601 -7062 -21384 -23516 -9316
635 -9316 10246 22574 20070 7561 -8311 -20429 -21532 -9322 10280 23091 20254 5686 -10871
648 -10871 -20678 -19653 -8058 9722 22800 21172 4849 -12874 -20733 -17162 -6078 9482 22151
661 22151 21036 4869 -13596 -21973 -16818 -3518 10376 20503 19455 4741 -13866 -23013 -16946
674 -16946 -1401 12728 19285 16940 4606 -12441 -22990 -17282 -294 14754 19767 14643 2602
687 2602 -12084 -21672 -17562 -820 16216 20947 12601 127 -12105 -19852 -16848 -806 16185
700 16185 21779 13196 -2007 -14158 -18398 -13652 -1380 14990 22435 13368 -4248 -15950 -17740
713 -17740 -12228 212 14469 20617 13695 -3252 -17468 -19081 -9459 3110 13727 18996 13369
726 13369 -2898 -17643 -19713 -9460 4893 14910 17071 10839 -2232 -16483 -20411 -9747 6978
739 6978 16489 16040 8969 -3154 -15642 -19646 -9714 6732 17714 16837 6674 -5553 -14707 -17401
753 -17401 -9918 5878 18616 17362 5598 -7543 -15057 -15762 -7869 5742 17796 18002 5918 -9201
767 -9201 -16445 -14305 -5724 5963 16701 17462 5795 -9382 -17224 -14626 -4067 8130 15409 15145
781 15145 6258 -8521 -18632 -14812 -1988 9473 14825 14216 5312 -8734 -18136 -15217 -2103 10625
795 10625 15640 12081 3515 -8170 -17200 -14860 -1647 11075 15988 12460 1611 -10387 -15680 -12527
809 -12527 -2562 10160 18084 12658 -1064 -11064 -14279 -11964 -2540 10799 17557 12097 -882 -12356
823 -12356 -14984 -9746 -1010 10228 17314 11812 -2043 -12360 -14488 -9987 185 11783 15737 9590
837 9590 -1104 -11561 -16176 -9854 2921 12557 14019 9011 -765 -11807 -16174 -9387 3789 13178
851 13178 13388 7460 -1761 -11473 -16221 -9086 4897 13150 12879 7338 -2469 -12775 -15190 -7045 4487
866 4487 12491 13965 7498 -4373 -13518 -13640 -5948 4217 11914 13895 6988 -5769 -13944 -12410 -5024
881 -5024 4352 12522 14178 6048 -6182 -13385 -12050 -4572 4921 13087 13601 4641 -6809 -13208 -11461
896 -11461 -4891 5644 13644 12535 2965 -6842 -12518 -11992 -4395 7136 13697 11543 2849 -6774 -12981
911 -12981 -11459 -3078 7123 13555 11160 2194 -7764 -12814 -11261 -2502 8286 13125 9870 2299
925 2299 -7127 -13919 -10696 -622 8485 12347 10312 1744 -8577 -13279 -9671 -788 8881 13161 8827
940 8827 349 -8013 -12976 -10161 299 9706 12487 8596 260 -9005 -12476 -8141 -142 8927 13547
955 13547 8527 -2019 -9345 -11510 -8164 337 9566 12356 7724 -1433 -10104 -12143 -6314 1955 8695
970 8695 12060 8356 -2232 -10761 -11683 -6235 2287 9488 11190 6842 -1777 -10378 -12683 -5967 3953
985 3953 9683 10496 6327 -2377 -10557 -11852 -5861 3642 10653 10869 4640 -3269 -9597 -11251 -5945 3981
1001 3981 11025 10434 3965 -4280 -9859 -10264 -4785 3743 11170 11248 3347 -5317 -9829 -9032 -4335 4013
1017 4013 10954 10897 3461 -5863 -10693 -9020 -2855 4309 9884 10331 3528 -5972 -11218 -8809 -1823 5212
1033 5212 9770 9407 3344 -5623 -11280 -9041 -1165 6206 9716 8330 2226 -5486 -10903 -9492 -1387
1048 -1387 7291 10208 7617 1094 -5391 -10028 -8965 -1372 7529 11001 7193 34 -6195 -9090 -8256
1063 -8256 -1629 7282 11108 7132 -409 -6835 -9191 -7251 -500 7131 10493 7661 -469 -8053 -9775
1078 -9775 -5636 472 6510 9821 7376 -591 -8436 -10246 -5269 1511 7062 8836 6750 -278 -8331
1093 -8331 -10563 -5155 2445 7586 8990 5818 -852 -8051 -9819 -5309 2415 8227 8861 4520 -1787
1108 -1787 -7476 -9327 -5505 2276 8989 9247 3645 -3322 -7342 -8460 -5139 2328 9012 9425 3631
1123 3631 -3793 -7858 -7909 -4047 2288 8585 8992 3561 -3735 -8616 -7910 -3196 3344 7750 8469 3485
1139 3485 -3829 -8997 -8309 -2198 4137 7662 7773 3225 -3976 -9029 -7993 -1900 4411 7981 7233 2685
1155 2685 -3886 -8680 -7851 -1732 5186 8349 7146 1881 -4378 -8073 -7309 -1822 5035 8811 6607
1170 6607 893 -4978 -7693 -6748 -1673 5055 8901 6627 573 -5185 -7901 -6286 -926 5221 8372
1185 8372 6207 206 -5929 -8335 -5651 -517 5252 8233 5973 206 -5782 -8153 -5520 526 5837
1200 5837 7771 5390 138 -5995 -8415 -4869 835 5792 7675 5204 -1025 -6152 -7594 -5158 1029
1215 1029 6465 7769 4279 -738 -5979 -7821 -4596 1591 6474 7281 4336 -1817 -6612 -7241 -4266
1230 -4266 1321 6388 7742 3520 -2037 -5962 -7434 -4018 2398 6757 6631 3852 -2204 -6901 -7139
1245 -7139 -2732 2129 6307 7115 3073 -2844 -6666 -6573 -3187 2501 6586 6562 2632 -2725 -7037 -6426
1261 -6426 -2189 2761 6268 6796 2642 -3676 -6743 -5516 -2301 2688 6951 6606 1456 -3427 -6445
1276 -6445 -6033 -1841 3405 6694 6033 1976 -3715 -6578 -5569 -1410 3774 6847 5366 1096 -3583
1291 -3583 -6162 -6007 -1291 4664 6700 4411 877 -3494 -6663 -5877 -367 4757 6457 4664 788
1306 788 -3923 -6667 -5489 -482 4904 6759 4300 24 -4304 -6947 -4895 160 4362 6439 5138
1321 5138 63 -5265 -6433 -3614 190 3819 6447 4951 -257 -5746 -6488 -3616 756 4202 5935
1336 5935 4432 -637 -5554 -6486 -3245 1126 4555 6234 3775 -877 -5275 -6515 -3371 1430 5356
1351 5356 5886 2740 -1384 -4820 -6010 -3729 1483 5933 6049 2343 -1544 -4512 -5727 -3388 1649
1366 1649 6063 5902 2172 -2465 -4926 -5176 -2852 1554 5482 5862 2338 -2632 -5483 -5264 -2026 2244
1382 2244 5033 5374 2602 -2365 -5732 -5374 -1220 2486 5089 5124 2245 -2483 -6102 -5183 -1581 2977
1398 2977 4709 4566 1855 -2317 -5473 -5242 -1120 3360 5265 4251 1347 -2639 -5273 -4972 -1228 3559
1414 3559 5678 3935 607 -2826 -5265 -4689 -970 2989 5633 4409 171 -3463 -4825 -3745 -845
1429 -845 3319 5764 4333 120 -3930 -5378 -3652 -261 3063 5258 4283 440 -4440 -5296 -3189 -86
1445 -86 3121 5045 4005 132 -3842 -5403 -3593 724 3876 4503 3302 -8 -3986 -5252 -3289 630
1461 630 4062 4864 3141 -359 -3844 -5079 -3488 799 4381 5045 2536 -839 -4008 -5025 -2834 865
1477 865 4130 5046 2471 -1485 -4186 -4279 -2468 923 4427 5064 2392 -1520 -3911 -4451 -1932 1433
1493 1433 4120 4673 2487 -1839 -4648 -4196 -1946 1455 4081 4545 1879 -1670 -4086 -4542 -1707 2205
1509 2205 4332 4130 1648 -1646 -4399 -4606 -1502 2267 4241 3645 1355 -2138 -4355 -4197 -1434 2624
1525 2624 4661 3754 1209 -1822 -4310 -3986 -656 2444 4491 3676 1166 -2372 -4657 -3679 -893 2309
1541 2309 4534 3773 676 -2754 -4355 -3396 -81 2545 4478 3706 707 -2984 -4382 -2895 -248 2736
1557 2736 4533 3482 -102 -2916 -3943 -2852 -528 2822 4184 3233 -296 -2929 -3868 -2942 -104 2880
1573 2880 4323 2633 -386 -3053 -3971 -2899 412 3309 3885 2284 -441 -2965 -4059 -2795 752
1588 752 3225 3791 2524 -435 -3043 -4193 -2535 1002 3411 3574 2218 -600 -3683 -4102 -1908 1163
1604 1163 3340 3589 2205 -850 -3487 -3758 -1845 1173 3545 4102 1828 -1315 -3288 -3427 -1681 930
1620 930 3526 3738 1640 -1729 -3260 -3066 -1621 1004 3503 3692 1452 -1739 -3256 -3244 -1718 1445
1636 1445 3699 3376 1381 -1586 -3706 -3408 -1262 1686 3390 3137 1126 -1852 -3595 -3239 -938 2190
1652 2190 3721 2753 934 -1386 -3462 -3280 -632 2286 3516 2593 842 -1908 -3447 -2698 -611 2125
1668 2125 3667 2817 188 -2083 -3156 -2593 -369 2317 3657 2871 262 -2443 -3398 -2271 -98 2036
1684 2036 3665 2714 74 -2828 -3339 -2246 -287 2097 3548 2501 188 -2493 -3427 -2141 359 2090
1700 2090 2937 2465 -186 -2743 -3583 -2192 292 2672 3336 1956 32 -2087 -3513 -2230 469 2761
1716 2761 2915 1541 -313 -2525 -3134 -1871 338 2889 3411 1504 -1058 -2556 -2881 -1974 555 2843
1732 2843 3122 1694 -987 -3005 -3039 -1400 484 2639 3401 1648 -1416 -3079 -2757 -1123 1001 2783
1748 2783 2933 1307 -1110 -2949 -2838 -798 1289 2386 2582 1451 -1086 -2774 -2832 -891 1528 2999
1764 2999 2385 1021 -1075 -2945 -3064 -946 1718 2960 2246 691 -1308 -2673 -2611 -1051 1371 2930
1780 2930 2229 352 -1766 -2656 -2426 -481 1482 3127 2330 565 -1815 -2768 -2184 -326 1625 2860
1796 2860 2430 368 -2012 -2766 -2078 68 1418 2645 2173 376 -2065 -2982 -1799 -39 1630 2686
1812 2686 2150 120 -2028 -2742 -1970 59 2145 2497 1727 -160 -1684 -2665 -1861 82 2013 2823 1522
1829 1522 -482 -1912 -2471 -1804 322 2340 2606 1056 -386 -1797 -2548 -1690 380 2581 2930 1554
1845 1554 -566 -1876 -2426 -1627 448 2289 2683 1040 -446 -2024 -2664 -1159 809 2008 2359 1465
1861 1465 -779 -2323 -2636 -1007 737 1817 2092 887 -569 -2320 -2340 -882 921 2096 2039 1193 -910
1878 -910 -2473 -2278 -436 1048 2278 2389 755 -1289 -2446 -2293 -826 1135 2046 2134 657 -1177 -2368
1895 -2368 -2031 -594 928 2249 2421 513 -1324 -2041 -1765 -453 1166 2408 2122 277 -1307 -2256
1911 -2256 -2177 -504 1752 2302 1806 390 -1447 -2224 -1867 -261 1443 2458 1835 281 -1446 -2115 -1658
1928 -1658 -210 1697 2457 1521 47 -1478 -2366 -1462 -104 1455 2441 1652 -51 -1681 -1981 -1459 236
1945 236 1464 2231 1280 -149 -1715 -2208 -1142 334 1732 1988 1560 -134 -1762 -2216 -1266 340 1735
1962 1735 2194 1241 -317 -1428 -2109 -1305 583 1900 2167 1049 -179 -1799 -2208 -1046 462 1981
1978 1981 2031 991 -663 -1649 -2018 -1086 432 1618 1954 1119 -1087 -1917 -1902 -765 452 1682 2285 1047
1996 1047 -773 -2010 -1862 -712 865 1428 2069 879 -958 -2071 -1891 -556 943 1665 2047 771
2012 771 -842 -1651 -1901 -734 976 1923 1758 589 -1279 -1766 -1888 -611 1092 1707 1607 91 -972
2029 -972 -1752 -1755 -556 1099 1779 1527 333 -1040 -1843 -1391 -274 951 1764 1450 364 -1325 -1803 -1246
2047 -1246 -114 919 1653 1337 76 -1331 -2051 -1494 23 921 1712 1407 64 -1345 -2034 -1352 203
2064 203 1151 1748 1423 116 -1270 -1971 -1106 38 1451 1901 1036 12 -1446 -1631 -1248 132 1522
2081 1522 1805 985 -392 -1313 -1681 -1069 -14 1487 1887 943 -366 -1140 -1536 -1185 345 1426 1629 944
2099 944 -528 -1582 -1590 -853 489 1237 1697 810 -397 -1517 -1547 -644 585 1348 1363 761 -396 -1420 -1764
2118 -1764 -628 728 1302 1352 670 -635 -1500 -1567 -439 787 1291 1156 387 -830 -1542 -1195 -576 490
2136 490 1619 1491 375 -800 -1370 -1347 -410 795 1890 1582 209 -1060 -1381 -1079 -271 780 1592 1278
2154 1278 440 -854 -1564 -1126 -66 649 1518 1288 263 -1190 -1439 -1502 -251 1104 1344 1006 117 -881
2172 -881 -1564 -1155 -170 1014 1659 1086 -73 -884 -1529 -1000 -155 1327 1326 1193 15 -1173 -1631 -858 253
2191 253 1351 1247 1034 -21 -777 -1400 -866 138 1174 1264 1113 -256 -1073 -1283 -818 227 1011 1155
2209 1155 791 43 -1135 -1431 -821 99 1108 1270 675 -306 -1325 -1373 -704 145 1129 1403 552 -308 -1219
2228 -1219 -1498 -547 393 931 1503 487 -520 -1079 -1368 -493 501 1155 1241 447 -693 -1308 -1123 -666 449
2247 449 1186 1239 405 -611 -1273 -1227 -316 488 1312 1114 383 -573 -1159 -957 -223 754 1304 1030 402 -565
2267 -565 -1220 -976 -359 746 1255 1383 57 -727 -1086 -1118 -283 832 1236 1051 67 -851 -1217 -1012 -239
2286 -239 662 1224 1137 -93 -728 -1231 -890 -185 752 1091 1060 197 -783 -1094 -1098 -32 966 1457 763 102 -605
2307 -605 -1093 -905 10 883 938 864 -207 -747 -1107 -802 286 1099 1233 1045 240 -921 -1173 -710 96 766
2327 766 1119 688 -342 -938 -981 -763 296 921 1260 857 -74 -1034 -1188 -673 349 941 1202 715 -385
2346 -385 -1073 -1184 -531 316 957 889 607 -315 -1038 -964 -452 233 846 886 618 -193 -1122 -968 -396 389 926
2367 926 1063 257 -529 -835 -1142 -444 484 1107 838 497 -294 -1138 -808 -447 609 998 969 16 -345 -844
2387 -844 -1016 -517 415 1064 895 307 -299 -920 -903 -236 491 984 1019 477 -646 -941 -690 -244 406 998
2407 998 964 365 -645 -952 -629 -89 598 721 789 151 -453 -750 -659 -50 669 935 705 114 -696 -918 -657
2428 -657 -52 639 802 691 45 -587 -899 -767 126 749 1079 828 -54 -722 -1069 -730 49 721 1033 667
2448 667 -178 -836 -1122 -549 12 551 1077 624 76 -754 -1019 -290 233 654 967 727 -206 -775 -841 -488
2468 -488 307 761 936 488 -154 -906 -1047 -288 285 842 975 357 -334 -785 -844 -505 330 968 835 596
2488 596 -249 -683 -828 -324 444 1123 740 345 -324 -707 -850 -408 324 1134 834 351 -396 -831 -726 -255
2508 -255 323 992 867 10 -261 -806 -794 -209 575 938 834 135 -256 -968 -548 -199 421 876 756 69
2528 69 -653 -996 -805 -120 217 961 627 81 -332 -915 -730 -36 433 675 463 408 -474 -677 -601 -70 643
2549 643 721 492 198 -623 -548 -608 26 710 932 617 -148 -459 -962 -421 -229 459 746 521 -131 -408 -890
2570 -890 -529 76 643 689 529 -84 -671 -885 -364 99 789 598 277 -124 -589 -816 -200 74 769 764 354
2591 354 116 -492 -582 -378 204 678 764 339 -236 -545 -761 -457 98 811 531 414 -39 -623 -698 -409 188
2612 188 712 772 466 -127 -688 -614 -401 220 563 543 265 -280 -759 -584 -178 160 616 797 375 -254 -614
2633 -614 -382 -170 259 743 487 142 -359 -575 -517 -165 328 438 683 317 -538 -524 -574 43 216 722 681
2654 681 165 -508 -713 -885 -286 435 481 452 65 -466 -751 -543 11 303 496 423 124 -484 -635 -259 21
2675 21 410 734 373 23 -347 -658 -596 -281 262 795 488 140 -403 -423 -825 141 556 510 549 -174 -572 -595
2697 -595 -405 16 324 492 391 -12 -455 -644 -492 -59 391 805 649 -166 -324 -688 -393 -96 339 566
2717 566 118 -50 -319 -699 -322 301 630 697 389 -423 -608 -441 -264 258 852 684 215 -59 -455 -444 -353
2738 -353 35 496 459 195 -145 -388 -403 -230 311 480 476 131 -357 -353 -519 -234 271 356 369 218 -119 -528 -402
2761 -402 -68 111 432 522 322 -191 -491 -414 -99 434 458 488 395 -318 -358 -464 -233 387 574 465 229 -232
2783 -232 -478 -437 -57 324 639 304 194 -219 -271 -544 -159 547 352 514 271 -378 -478 -190 17 64 714
2804 714 389 135 -636 -604 -281 12 171 424 256 86 -255 -620 -326 -106 404 425 465 -365 -422 -405 -223 165
2826 165 446 448 247 -55 -575 -457 -409 116 331 498 155 65 -200 -679 -237 162 479 568 357 38 -428 -396
2848 -396 -409 -34 296 489 73 -224 -592 -731 -226 393 472 390 416 -536 -407 -316 8 200 407 477 212 -81
2870 -81 -506 -529 -136 285 509 401 113 -216 -385 -240 -160 -19 602 432 11 -143 -561 -241 -153 323 549
2891 549 607 230 -415 -239 -277 -124 219 336 579 2 -180 -355 -465 54 73 426 152 -9 -289 -285 -26 72
2913 72 332 318 169 193 -368 -292 -435 -51 308 488 346 76 -178 -295 -141 -90 147 323 587 63 -185 -270
2935 -270 -525 32 195 317 383 -156 -462 -355 -63 100 265 385 214 -185 -440 -313 -163 250 218 332 321
2956 321 -104 -534 -410 -126 -161 313 372 179 63 -189 -459 -47 -69 285 387 180 -119 -258 -394 -26 -98
2977 -98 90 220 89 45 -143 -411 -273 28 544 472 156 -207 -167 -377 -151 242 317 356 -26 42 -256 -207 -210
3000 -210 211 272 320 61 0 -394 -488 -239 -1 409 425 262 -48 -303 -233 -374 177 221 463 -74 -288 -282 -519
3023 -519 -23 106 106 203 270 -132 -391 -175 51 262 340 337 210 -189 -317 -327 -118 317 415 157 -43 -203 -614
3046 -614 -190 -227 246 413 56 -70 -153 -271 -96 -68 88 359 12 -112 -329 -355 -141 -281 151 337 254 1
3068 1 -179 -177 -189 225 149 483 236 -2 -198 -291 -405 -125 167 214 219 -114 -113 -385 -112 -48 225 526 -23 -119 -130
3093 -130 -293 -392 -15 181 250 331 -147 -18 -342 -167 7 473 295 341 12 -286 -154 -180 96 251 295 77
3115 77 -135 -162 -392 -212 87 351 93 -2 -94 -367 -310 -324 3 231 166 60 -171 -96 -144 -63 183 191 238 72
3139 72 -44 -216 -518 -111 209 348 392 -180 -300 -162 -81 -153 194 99 324 -4 -122 -295 -461 11 241 441
3161 441 188 24 -178 -153 -373 -327 312 353 179 -124 -114 -93 48 134 331 376 19 -109 -377 -78 -156 -130 288
3184 288 290 51 205 -232 -649 -338 71 226 73 409 -38 -281 -170 -396 -82 51 400 169 36 -362 33
3205 33 -322 101 224 389 129 121 -405 -344 -66 -201 251 379 280 -189 -100 -185 31 -118 190 230 365 27 -289
3228 -289 -204 -25 83 312 230 209 -116 -96 -31 -144 118 260 217 107 -354 -410 -285 -373 243 470 162 203 -162
3251 -162 -129 -127 -263 36 274 248 -29 -84 -254 -116 -158 7 261 165 223 -172 -70 -202 41 132 220 103 70 -171
3275 -171 -162 -162 -8 -29 184 354 40 108 -239 -447 -39 -199 253 183 147 -116 -228 -346 -70 171 226 197 240 -243
3299 -243 -307 -222 -93 346 506 -24 -159 -159 -246 -126 -169 58 125 262 -70 -143 -341 -108 236 -7 310 201 24
3322 24 -308 -244 -54 94 -11 98 -61 -36 -183 -206 -50 131 98 213 -102 -39 -115 -104 -66 30 -94 61 123 -141
3346 -141 -165 -229 -124 -64 142 121 185 -122 -72 -276 -174 -72 155 92 27 -10 -192 -225 -321 169 56 5 270 -57
3370 -57 -207 -155 -146 206 181 17 105 -322 -77 -306 -165 118 20 189 357 -122 -74 -203 -171 108 113 100 111 -180
3394 -180 -256 -90 -92 50 255 243 55 -1 -116 -114 -173 87 -185 276 26 -173 -223 -213 115 137 82 252 165 -355
3418 -355 -260 -197 -70 39 223 186 218 -467 -212 -115 17 -8 371 353 18 -137 -189 -46 82 266 201 13 9 -145
3442 -145 -177 -155 -51 -22 208 238 56 -62 -165 -36 206 110 256 74 120 -37 -127 -147 21 165 298 2 -92
3465 -92 -112 -170 -46 97 342 104 249 -134 -517 -201 42 221 158 185 46 -17 -52 -306 24 -72 248 347 213
3488 213 -65 59 -154 -175 53 257 295 -56 -5 -50 -148 127 -17 208 238 205 54 -110 -358 4 25 -24 206
3511 206 -115 -147 -336 -216 -92 227 157 219 75 103 -72 -28 105 169 50 183 26 5 -131 -202 -33 32 119
3534 119 294 27 47 154 -182 -110 -2 328 266 90 -223 -237 -292 -51 94 99 47 161 -150 -64 52 24 -77
3557 -77 -23 66 95 -32 -75 -60 23 220 137 277 -26 -200 -110 -311 54 -107 241 230 36 -142 -116 -98 -49 286
3581 286 103 -108 72 -179 -250 71 -28 -36 165 39 120 -170 -93 -160 17 -196 286 20 -36 -65 -193 -219 211
3604 211 270 39 106 52 -305 -239 -52 -136 106 181 197 -41 -126 -160 -132 -110 200 120 29 65 -217 -250 -162 -59 166
3629 166 109 -239 112 -97 -252 -143 -135 263 137 60 46 -81 -162 56 170 -136 293 197 -52 70 -60 40
3651 40 311 302 246 257 -204 -210 94 -127 19 144 44 4 -40 -249 -76 227 -22 166 149 230 62 -54 -270 -100
3675 -100 13 158 56 162 -227 -70 -40 1 18 322 283 -4 -163 -56 -51 -70 173 179 126 -71 -350 -190 -257 95
3699 95 -65 24 -109 233 58 6 -208 59 -33 46 177 -173 62 -396 -96 39 -149 61 104 14 241 -229
3721 -229 24 -202 -9 13 22 -46 16 -297 -288 24 -35 209 14 -42 -102 1 -153 -43 57 223 -62 173 -332
3744 -332 -81 -26 -12 174 375 208 -24 -319 -291 220 184 222 31 24 -110 -52 -308 -127 -47 157 372 247 -91
3767 -91 -17 -40 48 157 344 -145 138 295 -135 -298 52 -28 239 216 257 -188 -299 -29 -181 -42 171 106 113
3790 113 -176 47 -100 -135 -24 94 250 86 -68 -202 -132 -160 57 95 162 15 125 55 -169 -72 107 145 104
3813 104 -56 36 -194 -87 -75 46 15 157 203 -142 -107 -71 -206 -14 184 66 42 -105 -128 -54 -81 -33 -14 241
3837 241 372 -113 -410 79 -78 112 146 53 -84 -142 -16 -299 -72 -178 131 121 -115 35 -146 -230 -96 282
3859 282 -270 4 93 -152 -328 -71 12 99 410 -207 62 -152 3 -46 73 185 398 -411 60 -28 -192 -7
3881 -7 56 199 15 329 -83 -183 -281 -10 -142 342 104 79 -92 -221 -190 107 -32 -40 -82 -44 39 -97 -152 81
3905 81 12 123 198 -38 112 61 24 -6 203 123 145 -162 -16 -129 -168 -83 18 -7 92 146 -23 -245 -260 -89 -123
3930 -123 -37 3 79 -216 -9 -109 -56 -252 111 206 149 -24 83 -53 -181 -62 209 89 -141 -105 -56 -211 -167
3953 -167 2 -53 168 -11 -53 -48 41 66 38 215 186 -53 36 -66 -170 -34 65 171 70 182 43 -151 163
3976 163 -14 175 191 182 -123 -77 -14 -104 -28 97 276 186 -158 -171 0 49 -149 8 198 137 64 73 -110 -99 104
4001 104 3 -12 133 154 -118 -74 -203 107 208 -70 75 -85 -64 -1 -53 -32 116 195 -109 -15 72 -38 -44 291
4025 291 88 262 23 -238 -153 -40 -105 37 106 203 -28 -232 -148 -152 -228 -21 102 232 151 -6 -17 112 96 59
4049 59 330 226 148 -244 -221 49 -105 177 154 169 53 123 -256 -115 -111 292 100 120 -21 -86 -116 -54 127 -10
4073 -10 -59 236 153 5 -19 -113 27 264 99 67 7 95 8 -191 237 24 117 -173 214 4 50 103 -54 134
4097 134 176 -48 -45 52 -54 -87 68 100 337 305 -120 -282 -99 -98 -23 110 151 99 -135 11 -104 -119 74 -54
4121 -54 173 131 95 -157 -194 -65 -177 -24 49 -72 -162 -42 -93 -67 -144 39 -100 57 -98 -13 -6 -70 76 31 87
4146 87 23 -79 -276 65 -34 73 -46 84 103 -44 -73 -125 16 127 -5 48 -34 -151 -109 -65 -5 -187 133 -75
4170 -75 -44 -95 -282 -220 43 -96 -205 43 -80 -74 -109 142 70 -45 241 -4 -55 -189 70 -78 -121 205 123 -71
4194 -71 115 -59 47 52 -183 -225 -15 294 16 -92 69 19 80 242 105 185 170 113 -185 -34 -277 -198 287
4217 287 13 -43 -169 -136 -28 127 32 70 -49 31 -133 -179 87 -13 -80 169 90 36 37 -109 -283 -10 -181 68
4241 68 89 124 163 -311 -223 -138 -181 94 63 -15 88 9 60 47 7 145 -102 182 92 8 -147 -219 -84 79 -39
4266 -39 -28 -292 22 -26 -63 96 109 15 47 -16 -351 -205 40 -30 330 130 -250 -139 28 -287 193 15 198
4289 198 6 36 -251 107 3 72 72 -198 -18 232 -22 -108 -167 -1 64 23 115 -82 -37 -18 -155 -159 19 83 -59
4314 -59 -36 59 -85 121 5 -78 12 -79 16 86 -154 299 73 -4 -145 20 54 -182 -52 -98 100 225 -82 45
4338 45 -89 52 105 41 37 -41 -60 200 -109 -32 -149 -224 234 153 12 61 -70 39 149 -208 133 4 62 300
4362 300 -217 -335 -86 -119 144 72 204 51 -113 111 -138 3 -133 164 -13 29 -34 73 -169 195 198 162
4384 162 -71 180 -69 -71 -355 -57 63 -29 -142 -43 -110 -197 70 104 95 121 238 127 -64 73 134 13 -28 -136
4408 -136 117 -4 186 52 -15 101 98 -42 -78 172 -113 45 -246 -210 155 -48 87 -66 161 -231 -18 -82
4430 -82 60 94 138 -74 -69 2 -192 115 48 -68 -223 176 -142 41 28 86 42 116 157 12 -173 15 66 161 311
4455 311 310 64 60 -33 -6 26 128 180 -161 -25 65 157 -135 236 -13 202 -122 -54 -76 60 -17 -165 160 -11
4479 -11 16 74 -60 -154 -270 -129 100 256 -177 121 -171 -119 -109 -149 205 74 223 44 -168 45 24 -16 48
4502 48 -32 7 128 -26 -117 -9 71 91 32 117 6 -206 -28 56 24 -103 160 -116 66 -322 -200 9 29 201
4526 201 60 -48 16 -99 -59 -134 -96 13 -291 -113 -108 -131 -93 133 -76 -97 82 -18 -118 -214 -28 11 193 -130
4550 -130 25 -2 -81 -239 -148 -46 69 -19 -84 86 -55 -186 -220 77 -123 -223 35 87 -109 -18 -106 -321 -3
4573 -3 6 69 35 168 94 61 -281 154 -132 -65 0 148 77 145 -24 -56 29 -56 -142 58 -157 -97 -100 60 130 -132 93
4600 93 29 100 -25 -51 113 -83 -60 298 34 28 -157 -30 16 -107 -140 -55 73 57 -280 -52 168 -10 107 69
4624 69 -36 -33 184 -136 -101 -77 190 163 -134 -54 -176 -187 125 134 49 -141 9 -180 167 -89 141 321 21 -13
4648 -13 -15 -85 273 227 201 17 -144 112 -23 -215 48 -45 20 -16 164 -10 -115 -150 -149 -44 -25 43 165 -178 54
4673 54 -64 69 -53 23 -37 31 29 -121 -129 -201 196 52 115 -8 118 -148 -50 -96 -200 -57 64 148 -101 0
4697 0 36 65 95 52 243 -210 -89 64 60 -29 -216 -28 86 168 266 -338 -21 -46 9 163 -174 152 105 25 24 -15
4723 -15 48 -50 167 -63 -77 -151 122 -74 52 145 90 112 84 37 -28 0 117 140 120 -36 -40 109 -66 21 -79 -26
4749 -26 267 -44 -126 8 -37 27 164 124 -131 81 47 -118 222 -57 35 99 145 -115 -27 37 13 -3 65 86 84 -42
4775 -42 51 -8 -129 58 -48 96 -158 -43 30 -51 -85 -151 -104 49 -201 -45 -122 59 -103 254 19 -134 127
4798 127 -218 -205 -198 -72 -40 -57 -166 -10 -205 40 -1 -1 132 124 203 107 -123 170 111 -213 107 -2 46 52 14 -136
4824 -136 -211 36 133 143 165 75 -78 -111 -16 73 -165 -52 -38 40 -127 -156 60 47 96 -48 8 174 -148 67 -97
4849 -97 -170 -44 -25 230 -95 -99 -69 123 94 -13 -222 34 -135 -283 36 -153 -129 -179 -19 -120 142 21 17 -3
4873 -3 17 -167 55 55 137 39 -90 6 5 125 185 118 53 -87 182 158 110 83 435 49 99 -81 -92 -79 31 10 103
4900 103 -13 -164 -62 0 -45 -126 90 -137 -84 115 -95 6 190 -52 352 99 169 -135 12 115 -94 -146
4922 -146 150 302 7 13 -106 -160 -29 214 16 64 -22 225 -51 -52 -31 103 -32 -132 11 -78 -168 -182 -192 96
4946 96 -35 -129 17 144 2 96 27 18 -131 -60 67 101 114 -139 107 210 -42 127 -21 -33 -8 160 112 196
4970 196 13 119 116 -133 1 12 -61 -112 178 37 14 1 149 -47 -153 81 60 88 5 -215 7 164 -161
4993 -161 43 -42 225 -271 -108 -29 -127 35 -297 184 -77 -178 -107 -150 -149 177 89 193 119 253 -97 -171 -149 -219
5017 -219 42 -48 -24 20 -32 -16 85 38 59 91 -5 -101 -199 66 -236 -37 140 -41 -98 -43 -28 37 -70 183 -190
5042 -190 240 -147 -278 -160 -34 128 -156 123 -23 105 -127 181 142 -292 -91 117 99 -147 -167 141 13
5063 13 -35 -26 -293 -183 -1 173 169 -200 8 131 -15 -104 7 59 166 161 -52 -110 -164 58 49 -176 31 -154 71
5088 71 -85 118 86 67 -21 -120 -51 -104 134 -129 -161 -87 49 -103 76 -193 73 82 65 -75 -246 -57 11 -68 -240
5113 -240 -209 248 263 -311 -126 -55 48 106 72 8 98 -383 -83 237 -115 31 73 -6 -118 29 -111 -69 112
5136 112 2 179 -4 -55 -100 81 -28 -157 -11 -196 -226 37 -44 73 -185 85 -35 -31 -59 -255 57 -186
5158 -186 -72 134 -5 -95 50 -41 -179 125 -116 21 177 75 -5 -9 -19 -48 43 -61 251 -188 -194 -120 -73 -190
5182 -190 -91 -40 162 82 29 -199 -90 14 121 272 -7 -46 135 -9 -122 -232 41 189 70 300 -46 25
5204 25 123 -10 -36 -184 -151 88 42 71 -60 -29 49 -127 3 95 -242 131 104 -136 -103 -266 -73 68 -52 -51
5228 -51 -65 -169 17 229 -183 -78 19 -3 -108 -173 -175 -36 229 -12 82 43 114 -225 -214 63 169 351 168 -198
5252 -198 -74 -25 37 -20 123 28 -33 -159 8 186 121 -32 40 102 -97 23 -12 155 -156 -77 164 -45 -36 -152
5276 -152 -75 -31 143 46 30 78 -245 -31 -29 114 138 87 137 36 -268 -80 -56 -225 -64 -177 22 -135 68 44
5300 44 -40 75 -253 -84 172 47 -144 -136 201 153 -201 86 247 155 -141 -178 -59 38 132 184 66 -28 -240 -45
5324 -45 7 88 3 170 55 -44 -59 -39 -38 -165 -173 24 129 23 -44 130 -59 41 -109 181 -104 -58 -81 -82 -73 -200
5350 -200 -170 220 119 66 -33 -125 -34 32 146 272 41 -170 -104 -123 -25 -49 4 -138 -57 -99 52 53 -135 -26 -41
5375 -41 -5 -27 189 142 -93 286 -50 4 -76 66 -262 -183 -42 115 87 12 35 91 -104 43 -7 125 158 6
5399 6 30 -62 -60 -31 -31 35 -59 -99 -12 -107 300 62 14 39 67 -254 -46 92 157 -55 -272 91 167 -71 -48 31 168
5426 168 -101 4 98 -49 84 52 53 -160 -130 223 -219 -50 -190 -122 -57 -45 6 66 -72 -22 223 153 95 -9
5450 -9 -103 66 55 -167 -74 -111 -151 -78 -90 186 -68 136 135 101 161 -164 11 28 -4 -100 59 -41 -32 -22 -39 -96 24
5477 24 -44 127 122 97 -167 171 -65 -262 -139 304 70 22 68 27 60 101 82 -32 283 54 -54 -56 39 -41 8
5502 8 100 155 142 -122 -162 -298 -72 -42 -102 173 -35 -157 -132 -15 10 202 -126 -110 -68 -37 -236 -196 68 16 120
5527 120 -47 -52 122 -113 -54 34 65 -53 46 -170 -30 40 -20 -2 64 -69 180 26 166 87 -99 -41 -36 -6 -108
5552 -108 15 -25 -142 36 -85 139 191 60 -219 16 -246 -114 104 -54 160 285 124 -121 72 7 -38
5573 -38 146 94 -76 -39 -117 -113 100 -157 -142 153 -69 -166 -15 -334 75 113 -10 -8 -111 -70 -61 46 -141 -166 72
5598 72 -160 121 140 -65 -51 140 -123 -92 30 115 -118 -117 -113 19 -33 17 -65 -20 147 -39 69 164 -91 -12 158
5623 158 -90 88 7 124 11 290 -145 -224 -55 -451 -4 76 -113 50 2 215 -24 115 -97 -19 97 -69
5645 -69 271 -311 115 168 -161 -60 -41 -22 103 143 33 170 23 104 -254 -130 312 106 -155 8 -111 -92
5667 -92 199 31 126 132 -73 -278 89 -124 -35 26 53 -124 16 -152 -121 115 -16 120 62 -18 17 25 251 -45
5691 -45 -59 93 23 -193 -4 166 -143 -125 -42 -6 6 -130 -118 38 39 -103 -45 53 -73 85 -7 156 156 -32 -91
5716 -91 28 -124 125 145 8 -115 -42 -15 160 -259 -16 -169 -20 -150 -119 169 -97 217 -13 -244 38 -131
5738 -131 172 73 -37 -136 -147 -72 -38 -117 -19 -112 14 53 19 -2 -17 -78 -274 41 47 26 -43 -49 -143 -46 -68 -17 170 53
5766 53 140 -21 94 7 76 -239 241 -141 33 73 -121 -60 16 84 -29 244 66 -209 -8 19 -60 -81 82 -38
5790 -38 -34 -211 5 -110 70 280 -127 311 117 -65 321 16 180 -93 46 -95 125 36 22 -252 112 18
5812 18 -103 60 3 40 8 29 -141 -40 -353 -138 -24 -98 -87 35 -48 47 -18 -79 11 -111 76 -41 -131 79
5836 79 -2 -80 60 -55 5 -24 169 -115 -59 104 56 230 -240 281 108 -47 263 35 98 141 -69 169 30
5859 30 80 52 -109 220 -323 -14 -10 56 48 -15 78 149 -137 -151 273 180 90 107 75 -149 50 -97 -41 50 -177 -297
5885 -297 243 -146 72 -62 171 55 -108 -79 79 46 -49 -109 121 74 -14 -11 -27 -203 81 -32 -74 172 -79
5908 -79 -74 -7 -25 -157 138 94 9 89 297 -224 62 37 73 102 -15 -140 -142 -81 -114 19 70 -233 11 -83 -11 182
5934 182 -175 -98 -126 112 -257 -84 -145 -185 -90 62 169 -207 -55 -197 -66 41 64 341 -8 16 256 -25
5956 -25 34 250 -305 143 -293 55 189 16 -105 8 -165 97 -260 -7 143 188 389 13 -53 -1 81 24
5978 24 151 -75 75 -196 54 16 201 218 -58 63 -17 56 -73 22 -177 13 28 -3 129 -36 -127 -21 152
6001 152 -217 -13 173 -269 -56 -65 31 -101 -11 251 52 -67 135 86 -36 -68 -91 120 14 122 -105 -90 65
6024 65 98 65 -47 312 67 56 219 19 102 -132 -43 -51 32 -9 -151 42 -95 -164 -144 -154 -143 134 24 -255 241
6049 241 205 188 21 -98 -118 -191 49 -113 14 -51 -103 80 -61 -94 -216 128 92 -54 -21 -146 44 -87 -171
6072 -171 -162 -140 66 -277 -354 21 -21 -35 177 -115 108 84 30 173 69 30 119 -128 164 -229 -1 89 -205 -121
6096 -121 277 63 -140 -221 -121 19 -65 -51 -85 107 17 34 -19 99 81 -88 387 -75 -138 -37 280 23 192
6119 192 62 -106 81 -304 72 -115 -40 102 152 362 -135 -269 -147 133 30 59 -70 7 78 58 129 -150
6141 -150 137 26 -51 -237 163 26 28 -34 14 2 -88 4 -137 119 -22 -66 48 193 -81 73 -80 -59 -343
6164 -343 154 44 48 175 1 33 -2 106 -107 25 78 -92 -28 111 -354 -15 237 -166 18 41 25 150 10
6187 10 94 13 -260 -12 43 -274 -12 -253 -108 -33 53 -95 -57 1 98 -202 16 50 -301 94 10 101 -47 83
6211 83 -112 15 -74 86 -26 202 -126 -34 136 -30 105 46 -132 -56 -16 47 113 -214 -119 -86 117 -66 75
6234 75 -145 75 -235 92 -253 128 201 -205 155 -127 -45 32 69 44 31 141 -26 -187 -121 -81 -31 -48 43 11
6258 11 6 152 45 -29 9 -104 60 77 104 36 -147 -34 248 -197 25 -62 89 10 -164 136 -30 -24 -119 -127 79
6283 79 131 -113 -287 168 -108 124 -52 -140 -56 142 244 250 124 -41 -14 30 109 -251 -29 47 17 -285 -28 -11
6307 -11 -21 -123 125 -198 7 -18 -23 60 139 -260 -101 117 -189 60 73 54 188 -54 -237 28 -211 66 203
6330 203 162 15 69 -163 55 -105 127 167 32 -64 -119 -115 -68 -156 -53 130 -101 -115 -73 -188 -23 -104 -52 107
6354 107 -44 119 -16 -151 16 77 175 8 -115 -166 10 6 -43 -98 -35 94 6 70 -287 75 31 -59 120 257
6378 257 -5 77 -76 13 -4 -31 125 53 54 -189 323 -93 34 -41 37 78 17 -56 80 -36 3 99 170 -225 58
6403 58 167 -79 104 -112 105 119 82 172 -36 91 46 -239 -101 -43 97 -94 -72 -164 12 -130 -81 -34 -184
6426 -184 51 76 -218 106 64 165 87 -116 -169 52 -191 3 -77 -98 -256 -61 106 217 60 -311 -88 60
6448 60 -18 -7 -130 27 84 9 -6 45 -61 -125 -7 -116 56 -32 -70 39 231 104 14 -6 -75 133 -33 2 -5
6473 -5 21 118 -180 298 27 -43 -248 -142 87 77 -106 122 -19 -2 79 90 -108 282 -190 78 75 -60 -30 166
6497 166 51 60 52 78 -34 -162 -124 0 -138 -404 -86 -197 -212 -99 69 -26 -13 -262 -210 52 -168 52 74 127
6521 127 -62 90 55 17 53 83 -110 94 -191 -39 -151 -148 -152 40 2 -83 -147 -154 -34 267 18 -68 29 52 66 -42
6547 -42 104 45 -170 -198 58 -72 14 -10 -92 102 347 48 -25 -143 11 -46 87 95 -59 -41 1 -197 98 48
6571 48 -136 142 -16 -184 -135 195 -2 -310 148 154 8 62 -171 -161 200 -38 -222 -40 90 -70 44 137
6593 137 -51 -204 198 249 93 -13 -47 5 -4 100 -56 103 32 -34 -80 -77 -126 -51 61 19 -107 -143 -122 -51 -226
6618 -226 141 -34 7 26 -207 -89 -8 75 17 -100 -95 -19 -35 122 89 -49 16 66 -245 -123 -62 87 -56 164
6642 164 23 -80 12 249 -5 -24 7 12 -55 154 129 -37 188 92 138 35 -2 -88 -248 158 -20 -184 226 -38
6666 -38 47 -43 42 15 3 -127 213 126 -28 144 -74 218 -31 -3 36 22 66 43 -130 96 10 121 -148 -155 69
6691 69 -37 -48 95 28 207 23 14 -23 -46 -1 127 68 -106 1 -2 210 -102 36 92 20 -105 -203 -224 172 -163
6716 -163 35 -190 7 -79 -25 -180 6 -226 -261 33 -67 153 80 18 -26 -166 91 -91 -61 48 65 -126 170
6739 170 -22 117 -61 -373 -115 16 146 -39 180 -27 -101 -20 -7 3 22 116 53 191 -139 18 -132 -32
6761 -32 83 116 71 -135 -103 87 162 -24 68 12 108 -345 44 187 47 -321 81 20 22 116 -131 -214 115 -61
6785 -61 -61 273 77 -140 -37 20 -60 -26 -58 -95 -137 72 61 -187 -156 -163 -22 -237 -212 -6 49 16 89 219 257 103
6811 103 17 -34 150 -9 -35 -10 59 164 -231 -41 -10 175 50 235 -21 -58 249 104 74 -226 175 126 322
6834 322 69 178 19 -29 -43 -42 -33 -103 43 -56 63 -31 30 -248 -149 -64 17 -59 -146 113 -375 -89 147 96 -60
6859 -60 120 -94 184 -8 2 -361 91 -370 -176 130 -43 -108 -190 76 -150 -71 68 2 -25 111 150 31 84
6882 84 -66 -86 -24 166 79 210 54 -19 -43 -122 -36 -54 113 -106 -12 -84 -161 -113 80 142 96 -17 -108 -54 -179 -28
6908 -28 22 -132 -121 24 -56 -127 -185 -102 -146 87 -97 -152 24 -169 -20 125 208 -139 -1 40 103 52 54 2 286
6933 286 -17 -85 310 308 42 -78 -203 -302 189 126 194 147 -206 -149 180 108 -120 -2 192 -114 -159 2 -129
6956 -129 132 -11 141 -19 18 -58 4 -137 155 303 279 -161 41 86 173 81 -16 -197 -189 188 14 101 -108 -110
6980 -110 -245 142 -66 -44 11 -7 71 42 -17 49 53 -83 210 158 -288 -40 38 53 164 -143 26 -181 88 -125
7004 -125 57 -29 -18 51 -133 -71 73 87 42 7 -33 -193 29 107 -134 47 64 -17 13 -127 -169 117 2 243
7028 243 -193 -5 48 -83 -184 97 74 138 15 22 -77 216 8 195 -68 -82 -85 115 214 -118 -15 -35 -12 148
7052 148 -28 214 282 -30 -86 14 -14 135 23 -251 -64 -59 140 125 -98 -37 -175 -185 -37 -69 100 118 108 -54
7076 -54 48 109 50 12 21 -120 115 -106 111 -79 20 -174 94 133 254 258 -32 -59 19 47 96 100 -428 -91 -33 215
7102 215 -109 -79 -12 89 -99 -79 -10 -16 -129 -90 -18 -18 55 23 235 33 213 -81 -3 12 -20 75 -18 -42 48 -186
7128 -186 127 49 31 29 98 -268 -14 -97 88 35 80 33 5 -20 99 -62 118 20 -117 52 -45 79 210 -224
7152 -224 57 -55 -18 -65 185 55 -308 49 231 -29 82 21 -10 -148 8 -3 -246 30 -99 -136 -52 -2 -73
7175 -73 -56 -27 105 5 -45 198 182 -136 -91 74 -2 -72 120 -209 -35 21 5 10 94 93 157 -44 -73 -65 66 19 125
7202 125 250 52 71 188 -24 86 -56 76 -22 149 -102 -84 -72 39 56 -55 -102 166 52 -38 -17 -228 -74
7225 -74 5 -20 -63 140 -122 -61 130 97 108 30 -146 -190 178 27 135 -8 280 22 51 -33 212 105 73 -41
7249 -41 124 -82 -286 66 69 -31 154 -14 165 -24 88 40 108 1 -51 -67 -92 -15 -99 284 -183 -78 -42 -47
7273 -47 6 -94 84 168 -146 159 -135 -207 -176 -51 -143 -197 -179 -91 -17 -210 258 22 59 14 75 12 -198 5 -218
7298 -218 96 -257 66 21 -274 59 -109 16 -7 10 -18 -154 116 81 46 -21 -30 35 100 111 -71 -34 -198 34
7322 34 -53 213 60 100 -32 83 44 1 -93 -145 102 138 20 -10 134 -223 -102 -93 17 84 -4 -73 -50 -103 3
7347 3 -26 43 40 96 14 -54 242 4 -5 -172 -50 32 -20 85 131 -98 -150 -61 -59 180 71 -291 52 -73 -24 -26 151
7374 151 102 159 8 40 -34 -18 -36 260 88 58 112 52 158 -29 22 -8 207 4 200 -143 167 140 156 291
7398 291 53 129 159 49 -15 80 125 -58 7 -55 13 -364 62 126 33 157 -165 -72 -103 283 -178 -205 -44 -144
7422 -144 184 15 -90 -147 86 -26 102 -95 -52 -170 -4 85 15 -136 259 54 115 30 106 -55 -24 -67 6
7445 6 -18 -50 219 -218 138 30 -188 -66 55 85 67 102 -52 40 -53 -35 -175 -213 94 49 -19 21 33 -76 -127
7470 -127 -58 -7 -114 -39 -10 -37 107 170 37 200 -46 124 49 65 163 -80 -66 -103 -101 138 -160 82 12 118 114
7495 114 320 18 107 -121 58 174 227 13 -47 -98 -11 120 48 -76 123 -72 -95 -94 -125 64 96 63 -83 -70
7519 -70 -19 -47 144 199 127 100 -36 -10 -38 -191 114 -239 -101 -157 -136 58 -55 212 -112 13 -76 222 -69 -10
7543 -10 59 -95 -5 71 -178 -265 31 19 -78 -136 -343 9 -49 -40 -6 132 -87 -114 79 73 58 -72 -125 17 183 -97
7569 -97 55 0 -88 -121 145 56 -22 104 -60 312 -18 110 202 -72 -43 150 -21 -37 -41 -1 162 -125 89 -109
7593 -109 94 -255 -58 -97 65 72 118 29 67 42 266 -116 -13 22 99 63 60 -174 -34 7 -25 100 36 -82 121
7618 121 158 -195 -39 90 -239 -129 103 -118 -46 -171 -58 -4 -188 109 130 5 28 -172 -80 -57 190 -153
7640 -153 -56 -167 -105 57 -57 43 95 136 -127 -98 -83 -72 106 -18 170 31 209 -37 -112 182 -19 -147 -169
7663 -169 -68 127 29 -145 -153 -83 143 -144 -122 20 114 76 -80 -70 -213 351 34 108 -20 -124 -15 5 198
7686 198 116 43 -207 -136 -21 52 3 35 -30 77 -34 -3 144 5 61 71 36 85 -304 -118 106 96 -221 42
7710 42 6 96 -301 87 31 -104 274 -13 43 -129 -38 -65 -64 -276 -27 -77 0 48 115 184 28 131 325 6 54
7735 54 151 31 46 90 -100 91 -233 -25 101 28 -228 -99 -24 -43 58 163 138 19 -7 71 66 175 21 95
7759 95 -36 -63 97 -241 -103 8 90 -16 -179 120 -103 -32 63 -7 -109 -135 -35 -4 233 37 1 82 -17 -83
7783 -83 168 -232 32 114 -91 4 114 -56 -3 85 -70 133 -100 107 25 6 -35 -60 -99 -207 5 27 106 -67
7807 -67 -49 -23 113 -17 -206 185 20 -1 -249 -168 158 20 -86 -73 21 20 -29 -73 -256 113 50 -167 109 231
7831 231 -189 -72 -25 -10 -47 229 -228 -19 -210 -146 -39 -115 -187 142 1 -189 92 -77 -6 -51 85 48 -85
7854 -85 148 -28 -50 -86 -128 163 4 -61 20 -131 -38 -170 -115 5 49 -35 148 54 -109 -125 127 -80 125 -127
7878 -127 -58 -48 -68 -79 -196 -122 -7 172 -9 -34 -78 184 -12 -72 161 214 -142 191 -9 100 89 -29 -61 53
7902 53 -19 -43 105 128 -104 11 159 192 -78 79 218 -158 69 -98 -136 41 17 -12 97 -132 -134 144 -17
7925 -17 -121 20 178 6 101 54 96 -60 115 250 -8 -68 151 48 287 -111 -152 -135 -313 4 104 -42
7947 -42 47 51 73 150 -1 204 -15 -15 -14 155 139 210 -226 -149 -67 155 56 68 179 -2 -116 -80 -295 -135 28 34
7973 34 11 47 86 -124 56 -21 96 48 -75 -116 -25 113 -89 183 78 103 -189 23 -144 -186 67 237 5
7996 5 131 70 -67 -216 149 21 222 75 -46 -86 -296 -117 2 9 -47 -58 -44 55 -119 181 70 -114 133
8019 133 -44 -47 -209 -166 90 -162 -109 26 52 2 -65 -11 -51 -23 -70 14 -107 189 20 -26 -202 85 269 -145
8043 -145 -127 -138 223 -7 -45 224 68 -196 50 -316 -20 72 37 -277 39 -127 59 98 -63 -100 -82 187 -61
8066 -61 145 76 -83 312 196 79 112 64 -58 3 48 42 -78 174 50 -104 -49 -85 -209 54 -119 37 -12 214
8090 214 204 -100 37 13 80 -114 -34 38 -15 93 -133 -151 -63 3 -138 -14 -170 -135 89 -186 -16 -76 58 -49
8114 -49 99 -172 29 -173 -179 -39 122 -54 -30 130 113 -87 -49 1 97 -63 -158 48 -192 63 24 36 74 226
8138 226 172 -64 40 -29 -34 145 -126 -108 -48 -44 -94 -5 -210 35 -63 51 78 -78 -9 80 -130 -94 -21 207 275 182
8164 182 283 2 -13 -15 22 104 -32 47 13 97 -196 -130 -136 60 -163 25 211 -125 28 84 -70 143 -48 225
8188 225 -31 -57 -91
8191i1
##END NTUPLES=NMR FID
##END=
