##TITLE=1H_11P50
 D2O
 8 sc, 
 18.5.2023
##JCAMPDX= 6.0         $$ Bruker NMR JCAMP-DX V2.0
##DATA TYPE= NMR FID
##DATA CLASS= NTUPLES
##ORIGIN= UXNMR, Bruker Analytische Messtechnik GmbH
##OWNER= root
$$ XWIN-NMR		Version 3.5
$$ Thu May 18 14:52:49 2023 Russian Standard Time (UT+4h)  she@DPX200
##.OBSERVE FREQUENCY= 200.13135
##.OBSERVE NUCLEUS= ^1H
##.DELAY= (6, 6)
##.ACQUISITION MODE= SIMULTANEOUS
##.ACQUISITION SCHEME= undefined
##.AVERAGES= 8
##.DIGITISER RES= 18
##SPECTROMETER/DATA SYSTEM= spect
##.PULSE SEQUENCE= zg30
##.SOLVENT NAME= CDCl3
##.SHIFT REFERENCE= (INTERNAL, CDCl3, 0, 15.7039)
##AUDIT TRAIL= $$ (NUMBER, WHEN, WHO, WHERE, WHAT)
$$ ##TITLE= Audit trail, XWIN-NMR		Version 3.5
$$ ##JCAMPDX= 5.01
$$ ##ORIGIN= Bruker BioSpin GmbH
$$ ##OWNER= she
$$ F:/spectra/data/she/nmr/H-F/1/audita.txt
$$ ##AUDIT TRAIL=  $$ (NUMBER, WHEN, WHO, WHERE, WHAT)
(   1,<2023-05-18 14:51:55.64 +0400>,<she>,<DPX200>,
      <created by zg, POWCHK disabled, PULCHK disabled
       configuration hash MD5:
       00 E9 B6 7A A2 85 ED C7 34 08 36 98 17 FE 4E 26
       data hash MD5: 16K
       C8 BF 9C A6 2C CC F0 7F FD 30 B2 89 B4 EA E6 BE>)
$$ ##END=
$$ 
$$ hash MD5
$$ 1D A9 1A AD 1B 75 48 0C 01 AF 15 DC A7 3A A8 20
##$RELAX= 
##$RELAX= 
##$RELAX= 
##$RELAX= 
##$RELAX= 
##$RELAX= 
$$ Bruker specific parameters
$$ --------------------------
##$DU= <F:/spectra>
##$EXPNO= 1
##$NAME= <H-F>
##$PROCNO= 1
##$TYPE= <nmr>
##$USER= <she>
##$AMP= (0..31)
100 100 100 100 100 100 100 100 100 100 100 100 100 100 100 100 100 100 
100 100 100 100 100 100 100 100 100 100 100 100 100 100 
##$AQSEQ= 0
##$AQ_mod= 1
##$AUNM= <au_zg>
##$AUTOPOS= <>
##$BF1= 200.13
##$BF2= 200.13
##$BF3= 200.13
##$BF4= 200.13
##$BF5= 200.13
##$BF6= 200.13
##$BF7= 200.13
##$BF8= 200.13
##$BYTORDA= 1
##$CFDGTYP= 0
##$CFRGTYP= 5
##$CHEMSTR= <none>
##$CNST= (0..31)
1 1 145 1 1 1 1 1 1 1 1 1 1 1 1 1 1 1 1 1 1 1 1 1 1 1 1 1 1 1 1 1 
##$CPDPRG= <>
##$CPDPRG1= <>
##$CPDPRG2= <>
##$CPDPRG3= <>
##$CPDPRG4= <mlev>
##$CPDPRG5= <mlev>
##$CPDPRG6= <mlev>
##$CPDPRG7= <mlev>
##$CPDPRG8= <mlev>
##$CPDPRGB= <>
##$CPDPRGT= <>
##$D= (0..31)
0 1.2 0 0 0 0 0 0 0 0.06 0 0.03 0 0 0 0 0.0002 0 0 0 0 0 0 0 0 0 0 0 0 
0 0 0 
##$DATE= 1684407115
##$DBL= (0..7)
120 120 120 120 120 120 120 120 
##$DBP= (0..7)
150 150 150 150 150 150 150 150 
##$DBP07= 0
##$DBPNAM0= <>
##$DBPNAM1= <>
##$DBPNAM2= <>
##$DBPNAM3= <>
##$DBPNAM4= <>
##$DBPNAM5= <>
##$DBPNAM6= <>
##$DBPNAM7= <>
##$DBPOAL= (0..7)
0.5 0.5 0.5 0.5 0.5 0.5 0.5 0.5 
##$DBPOFFS= (0..7)
0 0 0 0 0 0 0 0 
##$DE= 6
##$DECBNUC= <off>
##$DECIM= 32
##$DECNUC= <off>
##$DECSTAT= 4
##$DIGMOD= 1
##$DIGTYP= 9
##$DL= (0..7)
0 120 120 120 120 120 120 120 
##$DP= (0..7)
150 150 150 150 150 150 150 150 
##$DP07= 0
##$DPNAME0= <>
##$DPNAME1= <>
##$DPNAME2= <>
##$DPNAME3= <>
##$DPNAME4= <>
##$DPNAME5= <>
##$DPNAME6= <>
##$DPNAME7= <>
##$DPOAL= (0..7)
0.5 0.5 0.5 0.5 0.5 0.5 0.5 0.5 
##$DPOFFS= (0..7)
0 0 0 0 0 0 0 0 
##$DQDMODE= 0
##$DR= 18
##$DS= 0
##$DSLIST= <SSSSSSSSSSSSSSS>
##$DSPFIRM= 0
$$ [...]
##$SUBNAM2= <"">
##$SUBNAM3= <"">
##$SUBNAM4= <"">
##$SUBNAM5= <"">
##$SUBNAM6= <"">
##$SUBNAM7= <"">
##$SUBNAM8= <"">
##$SUBNAM9= <"">
##$SW= 16.0151230935494
##$SWIBOX= (0..15)
0 0 2 0 0 0 0 0 0 0 0 0 0 0 0 0 
##$SW_h= 3205.12820512821
##$TD= 16384
##$TD0= 1
##$TE= 0
##$TE2= 300
##$TE3= 300
##$TEG= 300
##$TL= (0..7)
0 120 120 120 120 120 120 120 
##$TP= (0..7)
150 150 150 150 150 150 150 150 
##$TP07= 0
##$TPNAME0= <>
##$TPNAME1= <>
##$TPNAME2= <>
##$TPNAME3= <>
##$TPNAME4= <>
##$TPNAME5= <>
##$TPNAME6= <>
##$TPNAME7= <>
##$TPOAL= (0..7)
0.5 0.5 0.5 0.5 0.5 0.5 0.5 0.5 
##$TPOFFS= (0..7)
0 0 0 0 0 0 0 0 
##$TUNHIN= 0
##$TUNHOUT= 0
##$TUNXOUT= 0
##$USERA1= <user>
##$USERA2= <user>
##$USERA3= <user>
##$USERA4= <user>
##$USERA5= <user>
##$V9= 5
##$VALIST= <valist>
##$VCLIST= <CCCCCCCCCCCCCCC>
##$VD= 0
##$VDLIST= <DDDDDDDDDDDDDDD>
##$VPLIST= <PPPPPPPPPPPPPPP>
##$VTLIST= <TTTTTTTTTTTTTTT>
##$WBST= 1024
##$WBSW= 4
##$XGAIN= (0..3)
0 0 0 0 
##$XL= 0
##$YL= 0
##$YMAX_a= 710137
##$YMIN_a= -671927
##$ZGOPTNS= <>
##$ZL1= 120
##$ZL2= 120
##$ZL3= 120
##$ZL4= 120
##$ABSF1= 10
##$ABSF2= 0
##$ABSG= 5
##$ABSL= 3
##$ALPHA= 0
##$AQORDER= 0
##$ASSFAC= 0
##$ASSFACI= 0
##$ASSFACX= 0
##$ASSWID= 0
##$AUNMP= <proc_1d>
##$AZFE= 0.1
##$AZFW= 0.1
##$BCFW= 1
##$BC_mod= 2
##$BYTORDP= 1
##$COROFFS= 0
##$CY= 11.3945322036743
##$DATMOD= 1
##$DC= 2
##$DFILT= <>
##$DTYPP= 0
##$F1P= 15.7292609196834
##$F2P= 12.9074282941183
##$FCOR= 0.5
##$FTSIZE= 0
##$FT_mod= 4
##$GAMMA= 1
##$GB= 0.15
##$INTBC= 1
##$INTSCL= 1
##$ISEN= 128
##$LB= 0.24
##$LEV0= 0
##$LPBIN= 0
##$MAXI= 10000
##$MC2= 0
##$MEAN= 0
##$ME_mod= 0
##$MI= 1.114404
##$NCOEF= 0
##$NC_proc= 0
##$NLEV= 6
##$NOISF1= 3.799351
##$NOISF2= 2.8
##$NSP= 1
##$NTH_PI= 0
##$NZP= 0
##$OFFSET= 15.70392
##$PC= 1
##$PHC0= -19904.45
##$PHC1= 7.652719
##$PH_mod= 1
##$PKNL= yes
##$PPARMOD= 0
##$PSCAL= 0
##$PSIGN= 0
##$REVERSE= no
##$SF= 200.130013532006
##$SI= 16384
##$SIGF1= 3
##$SIGF2= 2
##$SINO= 400
##$SIOLD= 16384
##$SREGLST= <1H.CDCl3>
##$SSB= 0
##$STSI= 0
##$STSR= 0
##$SW_p= 3612.71676300578
##$SYMM= 0
##$S_DEV= 0
##$TDeff= 0
##$TDoff= 0
##$TI= <>
##$TILT= no
##$TM1= 0
##$TM2= 0
##$TOPLEV= 0
##$USERP1= <user>
##$USERP2= <user>
##$USERP3= <user>
##$USERP4= <user>
##$USERP5= <user>
##$WDW= 1
##$XDIM= 8192
##$YMAX_p= 0
##$YMIN_p= 0
$$ End of Bruker specific parameters
$$ ---------------------------------
##NTUPLES= NMR FID
##VAR_NAME=  TIME,          FID/REAL,        FID/IMAG
##SYMBOL=    X,             R,               I
##VAR_TYPE=  INDEPENDENT,   DEPENDENT,       DEPENDENT
##VAR_FORM=  AFFN,          ASDF,            ASDF
##VAR_DIM=   8192,          8192,            8192
##UNITS=     SECONDS,       ARBITRARY UNITS, ARBITRARY UNITS
##FACTOR=    0.000312,      1,               1
##FIRST=     0,             0,               0
##LAST=      2.555592,      0,               0
##MIN=       0,             -671927,         0
##MAX=       2.555592,      710137,          0
$$ Real data points
##PAGE= N=1
##DATA TABLE= (X++(R..R)), XYDATA
$$ plain form
0 0 0 0 0 0 0 0 0 0 0 0 0 0 0 -4 8 -3 8 -8 8 -16 12 -16 19 -21 27 -29 33 -40 43 -52 59 -64 76 -81 92 -104
36 -104 113 -130 142 -157 178 -194 215 -237 261 -288 316 -349 385 -424 468 -515 566 -629 696 -776
56 -776 866 -971 1101 -1255 1446 -1694 2016 -2464 3118 -4142 5951 -9751 20903 -121047
70 -121047 -592206 -566240 -455774 -5536 482131 599465 517282 53371 -429116 -609252
80 -609252 -529852 -71524 338980 573078 566641 139817 -278088 -581860 -580554 -155822 203533
91 203533 540601 590894 192570 -130891 -495728 -627288 -246890 123866 464959 571070
101 571070 296697 -32067 -431321 -580201 -347361 5957 422466 528720 358384 77028
111 77028 -368077 -529414 -405835 -114550 347990 497580 403648 160077 -280814 -474371
$$ packed form
0@%%%%%%%%%%%%%mJ2j1J1j6J6k4K8k8L5m0M8n6O2p3Q3r5J11j23J40j57J73j96
36a04K17k43K72k99L35l72M09m52M98n49O04o65P34q09Q92r83J081j195J325j472
56g76J642j837K072k356K701l140L710m480N582p260J0093j5702L0654j41950
70a21047m71159K5966J10466M50238M87667J17334q2183m63911m82487j80136
80f09252P9400M58328M10504K34098o437m26824m17905l03772J306M24732L59355
91B03533L37068N0293l98324l23461l64837j31560L80398L70756L41093J06111
101E71070k74373l28764l99254j48880K32840L53318M16509J06254j70336k81356
111G7028m45105j61337J23579K91285M62540J49590r3932k43571m40891j93557
$$ plain form
121 -474371 -443716 -198201 246418 452930 455622 217976 -194873 -404275 -467026 -261150 142532
132 142532 389948 488370 265595 -111312 -334398 -476909 -310688 50738 316673 486001
142 486001 319824 -21011 -282692 -458972 -336295 -48895 250809 469855 348993 77556
152 77556 -217465 -441866 -352119 -127044 174758 430349 371649 162358 -151762 -408328
162 -408328 -366398 -193760 104191 374364 382647 231289 -83094 -352721 -378788 -250815 47622
173 47622 308424 380249 290413 -17129 -288133 -375004 -299221 -10577 246922 365432 325277
184 325277 48258 -219945 -364464 -333080 -72389 182612 346259 341952 108801 -148370
194 -148370 -343091 -351121 -131388 116705 322774 350257 163715 -77112 -308093 -355730 -186755
$$ packed form
121d74371L0655K45515M44619K06512K692k37646m12849k09402o2751K05876M03682
132A42532K47416R8422k22775l76907k23086j42511J66221L61426K65935J69328
142D86001j66177l40835k61681j76280J22677K87400K99704K19046j20862k71437
152G7556k95021k24401Q9747K25075L01802K55591n8700k09291l14120k56566
162d08328M1930J72638K97951K70173Q283j51358l14383k69627k6067J27973K98437
173D7622K60802P1825q9836l07542k71004q6871P5783K88644K57499J18510m0155
184C25277k77019k68203j44519L1384K60691K55001J63647m307k33151k57171
194a48370j94721q030K19733K48093K06069K7483j86542k40827k30981m7637J68975
$$ plain form
205 -186755 49811 289215 349680 210086 -12347 -264490 -350474 -235371 -13064 242259
215 242259 338690 252801 42992 -216716 -330172 -273532 -72388 193398 320698 284225 97782
226 97782 -161204 -306734 -298251 -121289 134427 292726 308830 145077 -105483 -274505 -314058
237 -314058 -169821 75164 258941 315472 188257 -43048 -241387 -319005 -205149 12786
247 12786 217109 317851 223327 14328 -193622 -311090 -241252 -40853 176193 300685
257 300685 251801 74094 -150574 -295314 -261385 -96630 124752 282845 269848 117939
267 117939 -98612 -264894 -282474 -145535 79448 250611 278712 165958 -48263 -233115
277 -233115 -282715 -184916 22558 217498 285571 197858 1488 -189004 -280144 -220370 -28703
$$ packed form
205a86755K36566K39404O0465j39594k22433k52143q5984J15103K22307K55323
215B42259R6431q5889k09809k59708j13456N6640K01144K65786J27300l6473j86443
226I7782k58986j45530Q483J76962K55716J58299J6104j63753k50560j69022l9553
237c14058J44237K44985J83777N6531j27215k31305j98339p7618J13856K17935
247A2786K04323J00742r4524k08999k07950j17468O9838K00399K17046J24492
257C00685m8884j77707k24668j44740L3929J64755K21382J58093j2997j51909
267A17939k16551j66282j7580J36939K24983J71163K8101j12754k14221j84852
277b33115m9600R7799K07474J94940O8073q7713j96370j90492r1140N9774J91667
$$ plain form
288 -28703 173856 276515 228307 50178 -148991 -265491 -241278 -80520 125702 262396
298 262396 249258 96937 -103845 -245371 -251755 -122876 74773 238735 263821 137403 -57062
309 -57062 -218406 -259295 -157912 28635 202314 264656 177020 -11527 -191096 -257243 -184523
320 -184523 -19128 162838 260704 205433 33729 -149341 -250071 -212584 -55721 125322
330 125322 238248 228449 85821 -111705 -236745 -225898 -97441 81160 218439 237581 122462
341 122462 -62849 -213267 -241764 -133808 44001 190801 235831 157824 -14811 -185062
351 -185062 -244055 -163211 902 162456 235495 179868 27259 -143501 -238532 -194316 -38418
362 -38418 131121 223175 197566 67075 -105227 -222922 -213686 -82203 93012 210741 210133
$$ packed form
288b8703K02559J02659m8208j78129j99169j16500K4213J60758K06222J36694
298B62396j3138j52321k00782j41526o384J28879J97649J63962K5086j26418j94465
309e7062j61344m0889J01383J86547J73679O2342q7636j88547j79569o6147P2720
320a84523J65395J81966R7866n5271j71704j83070j00730L7487J56863J81043
330A25322J12926r799j42628j97526j25040J0847J28457J78601J37279J9142j15119
341A22462j85311j50418k8497J07956J77809J46800M5030p8007j72635j70251
351a85062n8993Q0844J64113J61554P3039n5627j52609j70760r5031M4216J55898
362c8418J69539R2054k5609j30491j72302j17695R236J31483J75215J17729o08
$$ plain form
373 210133 99579 -64210 -196960 -223917 -121850 54010 191585 217593 130944 -25667
383 -25667 -169776 -223011 -152591 8581 164490 223021 155462 7708 -138582 -216415 -177532
394 -177532 -32455 129735 218042 180326 42630 -108807 -203757 -190550 -69945 90533 206297
405 206297 200512 77973 -76378 -187214 -198033 -103503 51473 184908 208370 114835 -39457
416 -39457 -172030 -200727 -129022 9458 156362 210045 145381 -335 -147330 -200852 -151274
427 -151274 -24560 124393 201621 170526 40219 -115784 -196108 -170684 -53033 90324 184856
438 184856 188223 74164 -81539 -182062 -188719 -82986 59856 164125 194291 105727 -42917
449 -42917 -162833 -197920 -111462 27706 144519 193751 130671 -2136 -137985 -198767 -136291
$$ packed form
373B10133j10554j63789j32750k6957J02067J75860J37575K6008q6649j56611
383b5667j44109n3235P0420J61172J55909N8531o7559j47754j46290p7833L8883
394a77532J45077J62190Q8307l7716j37696j51437r4950J3207J20605J60478J15764
405B06297n785j22539j54351j10836j0819R4530J54976J33435K3462r3535j54292
416c9457j32573k8697P1705J38480J46904N3683o4664j45716j46995n3522M9578
427a51274J26714J48953P7228l1095j30307j56003q0324K5424J17651J43357R4532
438A84856L367j14059j55703j00523o657J05733J42842J04269L0166q8564j48644
449d2917j19916l5087Q6458J39168J16813M9232o3080j32807j35849o0782O2476
$$ plain form
460 -136291 -9142 123065 189745 146139 35667 -107518 -193290 -156627 -46179 96498 181383
471 181383 158183 66402 -75958 -177653 -171333 -79576 68206 167837 169364 93507 -46456
482 -46456 -154648 -178209 -109188 36937 147769 177242 116926 -18663 -128886 -179092 -134702
493 -134702 2909 122171 178456 137079 11436 -103120 -175414 -149440 -30705 90721 176756
504 176756 154222 40632 -74088 -165176 -159684 -61086 60038 165143 163936 71823 -45930
515 -45930 -154655 -163088 -88290 27171 147015 167901 100199 -18140 -137093 -162405 -113749
526 -113749 -801 126272 162993 125655 13167 -116980 -158412 -131724 -27356 100482 156837
537 156837 144100 39384 -88591 -151667 -149370 -50967 71359 144334 157039 63982 -58207
$$ packed form
460a36291J27149J32207O6680m3606j10472j43185q5772L6663J10448J42677Q4885
471A81383k3200r1781j42360j01695O320R1757J47782R9631J527p5857j39963
482d6456j08192k3561O9021J46125J10832K9473o0316j35589j10223n0206M4390
493a34702J37611J19262N6285m1377j25643j14556p2294K5974J18735J21426Q6035
504A76756k2534j13590j14720r1088N492R8598J21124J05105j207r2113j17753
515d5930j08725q433P4798J15461J19844K0886o7702j18339j18953k5312M8656
526a13749J12948J27073L6721l7338j12488j30147m1432K6688J04368J27838N6355
537A56837j2737j04716j27975o3076K297R8403J22326P2975J2705r3057j22189
$$ plain form
548 -58207 -140187 -161031 -73235 41288 130371 164090 85397 -25816 -123403 -165631 -94042 11797
560 11797 113858 163863 105467 5485 -105707 -162224 -112674 -20612 96096 158076 119035
571 119035 35669 -85353 -154675 -127008 -48992 74005 147420 132808 62675 -62433 -140164
582 -140164 -137304 -74229 49847 131991 142991 85388 -37153 -121532 -145903 -95225 24567
593 24567 110132 148006 105370 -12528 -101007 -147937 -112914 -1798 89165 147071 119559 15969
605 15969 -78347 -146091 -123877 -27756 66537 141824 128928 43698 -55081 -139306 -130686 -54858
617 -54858 43242 133131 131192 67756 -28748 -128637 -135553 -77522 19255 118268 133632 89084
629 89084 -5678 -109736 -135337 -99097 -3404 100354 132635 106602 15328 -85851 -130934
$$ packed form
548e8207q1980k0844Q7796J14523Q9083L3719p8693j11213r7587m2228P1589J05839
560A1797J02061N0005n8396r9982j11192n6517M9550R2062J16708O1980l9041
571A19035q3366j21022o9322K7667P8016J22997P3415j4612p0133j25108p7731
582a40164K860O3075J24076Q2144J1000n7603j22541q4379k4371N0678J19792
593B4567Q5565L7874m2636j17898q8479m6930L5023J11116R0963N7906k7512j03590
605A5969r4316o7744K2214R6121R4293P5287j2896q5230r8779q4225Q620P5828
617e4858R8100Q9889j939o3436r6504r9889o916N8031R6777R9013J5364m4548
629H9084r4762j04058k5601L6240R5693J03758L2281k6033r1274j01179m5083
$$ plain form
640 -130934 -117585 -24016 78415 125924 121257 35071 -64640 -121775 -128517 -47414 53739 119765
652 119765 130083 53081 -39857 -110311 -134162 -67115 28978 108993 134010 72815 -15447 -99813
664 -99813 -132215 -82262 -154 94530 135605 87638 7369 -83945 -128805 -97211 -22990 76066
676 76066 127940 103760 31672 -69089 -120694 -105825 -45238 55485 118628 114983 53063 -48797
688 -48797 -110929 -114510 -62001 34375 103005 121412 72733 -27176 -99034 -119725 -76712 12757
700 12757 86763 122536 87001 -2269 -82828 -123397 -88072 -6943 68512 120341 99276 19759
712 19759 -63013 -119587 -101023 -26641 53430 111623 105198 42857 -43940 -112916 -108731 -48180
724 -48180 35219 102964 108553 60158 -23277 -99046 -113602 -68671 18297 92229 108204 76086
$$ packed form
640a30934J3349R3569J02431M7509m667q6186r9711n7135o742Q1103J01153O6026
652A19765J0318p7002r2938p0454k3851O7047R6093Q0015K5017o1195q8262q4366
664i9813l2402M9953Q2108R4684M1075m7967q0269r1314m4860L1594P4221R9056
676G6066N1874k4180p2088j00761n1605J4869O0587J00723O3143l645o1920j01860
688d8797o2132l581N2509R6376O8630J8407m8679r9909p1858k0691M3013Q9469
700A2757P4006L5773l5535q9270q0559m0569L5325Q1129P5455N1829k1065p9517
712A9759q2772n6574J8564P4382Q0071N8193o425o2341q6797o8976M185O0551
724d8180Q3399O7745N589m8395q3435p5769j4556M4931Q6968P3932J5975l2118
$$ plain form
736 76086 -2098 -83786 -112732 -83711 -3287 77923 109097 86369 15322 -64272 -109342 -97311
748 -97311 -23382 59733 105535 96659 32058 -46521 -100878 -104131 -43752 39776 100015 103862 48070
761 48070 -27443 -90449 -106697 -60290 18288 89366 108799 63792 -10669 -79316 -105375 -74176
773 -74176 -3090 75227 108378 77219 7930 -66501 -102901 -83418 -21061 57392 104066 90420
785 90420 25972 -52091 -96836 -91130 -37099 40693 95347 98101 44187 -35256 -90468 -96588 -51224
798 -51224 22275 83544 101250 60575 -16768 -80550 -99271 -64325 5118 71497 99796 73251
810 73251 4219 -67603 -100432 -74347 -11140 56925 97028 82765 21704 -51772 -96360 -84849
822 -84849 -27223 43570 90275 87618 38559 -34801 -90288 -91982 -42652 27821 82317 92365
$$ packed form
736G6086p8184q1688k8946K9021Q0424Q1210L1174k2728p1047p9594m5070J2031
748i7311P3929Q3115M5802q876o4601p8579n4357l253O0379Q3528O0239L847n5792
761D8070p5513o3006j6248M6407P8578P1078J9433m5007p4461o8647k6059L1199
773g4176P1086P8317L3151l1159o9289p4431l6400J9483O2357P8453M6674j3646
785I0420o4448p8063m4745N706N4031P7792N4654K754n3914p9443n5212o120M5364
798e1224P3499O1269J7706m0675p7343o3782j8721L4946O9443O6379K8299k6545
810G3251o9032p1822l2829K6085O3207O8065M0103j4263o1061p3476m4588J1511
822h4849N7626P0793M6705k657m9059p3360n5487j694M9330P0473N4496J0048
$$ plain form
834 92365 51873 -17614 -77914 -95289 -58377 12034 72866 92804 63961 244 -65266 -95203
846 -95203 -70645 -6431 59958 92174 73770 15131 -50991 -90557 -80335 -23842 45869 88311
858 88311 80793 30547 -36022 -83863 -85286 -38994 30005 81564 86960 44391 -21349 -75146 -88161
871 -88161 -52241 12863 71987 89327 55975 -6230 -65318 -88513 -63136 -3027 59844 88885
883 88885 67844 9218 -53265 -85861 -71695 -17938 46606 84833 76134 24739 -39806 -81250
895 -81250 -78402 -32086 31992 77884 81850 38920 -25761 -74027 -82762 -45754 17407 69380 83444
908 83444 51639 -9852 -65355 -84118 -55607 1714 59018 84764 61601 5031 -53161 -83138
920 -83138 -65622 -12499 47480 81284 69048 20256 -40854 -79940 -72006 -27204 33156 77074
$$ packed form
834I2365m0492o9487o0300j7375L6912P0411O0832J9938k8843o3717o5510k9937
846i5203K4558O4214O6389L2216j8404n8639o6122l9566J0222N6493O9711M2442
858H8311p518n0246o6569m7841j423M6292O8999N1559N396m2569o5740n3797j3015
871h8161L5920O5104N9124J7340l3352o2205n9088k3195K5377O0109O2871K9041
883H8885k1041n8626o2483l2596J4166N3757O4544L8227q699n1395o4545m1444
895h1250K848M6316O4078M5892L966m2930o4681m8266q735L7008O3161N1973J4064
908H3444l1805o1491n5503j8763K8511N7321N7304K5746k3163n6570n8192k9977
920h3138J7516N3123N9979L3804j2236m8792o1110l9086P934M4802O0360M3918
$$ plain form
932 77074 75209 32810 -26925 -72441 -77416 -39851 20598 69117 78525 46414 -13316 -64647 -78140
945 -78140 -51237 5932 59408 79549 56317 -16 -54103 -78351 -60800 -7446 47576 77082
957 77082 65629 13663 -43055 -75423 -67538 -20415 35098 73304 71526 27323 -28810 -70906
969 -70906 -72702 -32190 22005 66758 74813 39467 -15355 -64103 -75325 -44000 8267 58981
981 58981 74813 49737 -531 -55486 -75814 -53773 -4534 49819 73247 58328 12919 -44224
993 -44224 -73100 -62263 -17109 39663 69441 64466 24513 -31894 -68146 -69263 -29256 27290
1005 27290 63587 69454 34769 -19642 -59810 -72806 -41008 14302 57337 72295 44043 -6082
1017 -6082 -51242 -73295 -49828 100 48499 72994 52077 6038 -41743 -70729 -57069 -14509
$$ packed form
932G7074j865m2399n9735m5516m975L7565O0449M8519R408l2111n9730n1331j3493
945g8140K6903N7169N3476K0141k3232n6333n4087k4248J7551N3354N5022K9506
957G7082j1453n1966n6718l2368P885M7123N5513L8206j778m4203n6133m2096
969g0906j796M0512N4195M4753Q055l5346n4822m8748j1222L1325N2267N0714
981E8981J5832k5076n0268n4955k0328K2041M9239N4353K3428j4919m5409n7143
993d4224k8876J0837M5154N6772K9778m975l9953n6407l6252j117M0007N6546
1005B7290L6297N867l4685n4411m0168j2996L1798N5310M3035J4958k8252n0125
1017f082m5160k2053K3467M9928M8399K4495k0917m6039m7781k8986J3660M2560
$$ plain form
1029 -14509 38230 71109 57747 18551 -32015 -67348 -61222 -26588 26502 66240 63935 30394
1041 30394 -22209 -60747 -63441 -37632 14978 58832 66878 41593 -11365 -53469 -65401 -46576
1053 -46576 3374 48022 67260 51788 229 -45090 -64972 -53395 -8023 37509 65875 58704
1065 58704 12964 -33718 -64233 -58604 -18163 26635 61516 62552 25606 -22181 -61633 -61984 -28165
1078 -28165 14549 56310 64284 35225 -9540 -54989 -64868 -38444 4880 49566 62838 44645
1090 44645 3259 -47025 -64383 -47066 -5968 41655 61183 51831 13344 -36481 -60735 -56051
1102 -56051 -17225 32891 57084 56200 23507 -25109 -56712 -61340 -27002 21524 53009 60903 31102
1115 31102 -13845 -49047 -63337 -36278 9990 48124 62967 37834 -2470 -41825 -63514 -43586
$$ packed form
1029a4509N2739L2879j3362l9196n0566l5333O126L4634N3090L9738k305l3541
1041C0394n2603l8538k694K5809N2610M3854Q046k5285n2958m2104j1932J8825
1053d6576M9950M4648J9238j5472n1559m5319j9882J1577M5372M5532K8366p171
1065E8704m5740m6682l0515N629M0441M4798L4881J036l6946m7787l9452l51L3819
1078b8165M2714M1761P974k9059m4765m5449r879K6424M3324M4686J3272j8193
1090D4645m1386n0284j7358J7317M1098M7623J9528r352l8487m9825k4254M684
1102e6051L8826N0116K4193q84l2693m8616l1603m628L4338M8526L1485P894k9801
1115C1102m4947l5202j4290K7059M6268L8134J4843k5133m0304l9355k1689J9928
$$ plain form
1127 -43586 -2365 40167 62426 44987 7298 -34781 -60573 -49326 -15240 31845 60601 50456
1139 50456 18498 -26243 -56226 -52779 -25358 21939 55553 55075 29046 -17945 -50964 -54957 -34129
1152 -34129 11171 48624 57744 37314 -7894 -44251 -56883 -40926 1191 39289 58167 45192
1164 45192 2306 -36134 -56756 -46274 -8143 30307 56624 50697 13179 -26992 -55047 -50979
1176 -50979 -17375 20649 52409 53273 23438 -17250 -51696 -53784 -26725 11717 47669 54182 32507
1189 32507 -6587 -45857 -54635 -35365 2642 41396 54091 39886 3522 -38049 -54064 -42422
1201 -42422 -6581 33967 52080 45307 11923 -29204 -51872 -48420 -15589 25021 49278 49651 20207
1214 20207 -19824 -47879 -51745 -23738 15990 45359 52472 27653 -10245 -42100 -53200 -31460
$$ packed form
1127d3586M1221M2532K2259j7439l7689m2079k5792J1247L4086M7085K8756j0145
1139E0456l1958m4741k9983L447K7421M7297L3614m78k6029m6991l3019l993K0828
1152c4129M5300L7453R120k0430m5208l6357j2632J5957M2117L8098J8878j2975
1164D5192m2886l8440k0622J0482L8131L8450K6317n927l7518m0171k8055M068
1176e0979L3604L8024L1760Q64k9835m0688l4446k088K7059L8442L5952O513k1675
1189C2507l9094l9270q778J9270L8007L8754J2695j4205l6364m1571j6015J1642
1201d2422L5841M0548J8113o773l3384m1127k2668L452L2831M0610K4257L73k9444
1214B0207m0031k8055l866K8007L9728K9369P113k4819l7898l1855j1100K1740
$$ plain form
1226 -31460 5638 40208 53134 34440 -534 -36281 -52990 -38095 -4414 33183 52297 40255
1238 40255 8562 -29044 -50663 -42973 -13698 25515 49772 44700 17771 -21038 -47015 -46553 -21774
1251 -21774 16926 45072 48214 25330 -12895 -42344 -49017 -28974 8461 39186 49105 32580
1263 32580 -3825 -36397 -49396 -35268 -627 32714 49474 38120 4891 -28983 -48125 -40481
1275 -40481 -9264 25685 47499 42368 13810 -21311 -45983 -44176 -17682 17415 44056 45184
1287 45184 21465 -13467 -41656 -46175 -25777 9349 39696 46705 28470 -5165 -36059 -46560
1299 -46560 -31959 1094 33622 47063 34881 3005 -30258 -45541 -37049 -7913 26300 45812
1311 45812 39249 10616 -22772 -43868 -41291 -15081 18500 42375 43130 18983 -15181 -40480 -42823
$$ packed form
1226c1460L7098L4570J2926j8694l4974l5747j6709J4895L3681L7597J9114j2042
1238D0255l1693l7606k1619P690K9275L9213K4257n072k6929l8809k5977M62K4779
1251b1774L8700K8146L142k2884l8225k9449o673K0043L7435L0725R919j6525
1263C2580l6405l2572j2999J4128L4641L3341J6760j1354l3229l3874j9142P644
1275d0481L1217L4949K1814n131k8558l5121k4672J807K6494L5097K6641J128
1287D5184k3719l4932k8189m519K0398L5126L0347P009j8235l3635l0894j0501
1299d6560J4601L3053L2528J3441j2182l1876l3263j5283Q492K9136L4213J9512
1311D5812o563k8633l3388k1096K577K6210L3581K3875P55k4147l4164k5299k343
$$ plain form
1324 -42823 -22174 10190 38354 45059 25879 -7112 -35869 -44601 -28765 2552 32530 44471
1336 44471 31896 1499 -30620 -44767 -33411 -5244 26141 43211 36897 9561 -23567 -42714
1348 -42714 -38081 -12328 19792 40820 39563 17283 -15792 -40140 -41306 -19046 12315 36638
1360 36638 41670 23410 -8296 -35250 -42967 -26430 5114 32554 41829 28775 267 -29474
1372 -29474 -43060 -31698 -2759 27202 41612 33238 6974 -22934 -41071 -35946 -10664 20799
1384 20799 39927 36137 13739 -16027 -38244 -38994 -17932 13261 36938 39144 19815 -9366 -33581
1397 -33581 -39968 -24391 5883 32836 40733 25855 -2461 -29132 -39865 -29237 -1806 26938
1409 26938 40310 30975 3910 -23844 -38470 -33134 -8918 20893 38776 34947 11239 -18120
$$ packed form
1324d2823K0649L2364K8164O705j9180l2991k8757q732J5836L1317K9978J1941
1336D4471j2575l0397l2119j4147J1356K8167L1385J7070o314k7336l3128j9147
1348d2714M633K5753L2120K1028j257k2280l3075k4348j166K2260L1361K4323
1360C6638N032j8260l1706k6954p717J6537L1544K7440R275j3054k8508k9741
1372b9474j3586J1362K8939K9961J4410q374k6264k9908j8137N125K5282L1463
1384B0799J9128l790k2398k9766k2217p50K1062L1193K3677K206j9329k9181k4215
1397c3581o387J5577L0274K6953P897j4878k8316k6671j0733J0628K7431K8744
1409B6938J3372r335k7065k7754j4626N336K4216K9811J7883l829k3708k9359
$$ plain form
1421 -18120 -36694 -35299 -14829 13844 35759 37841 17798 -11403 -33452 -37276 -20430 7117
1433 7117 31411 38631 23673 -4316 -30169 -38324 -25013 365 26303 38284 28786 2827 -24757
1446 -24757 -37864 -29560 -5823 21303 36320 32231 10313 -18849 -36261 -32951 -12130 15281
1458 15281 33917 34585 16392 -11777 -33264 -36153 -18227 9127 30232 35692 21522 -5509 -28990
1471 -28990 -36692 -23607 2896 26835 36147 25414 1415 -23355 -36556 -28238 -3823 21275
1483 21275 35358 29339 7537 -17902 -34811 -31739 -10828 15705 33875 31655 13263 -11725
1495 -11725 -32042 -33616 -16946 9456 30914 33930 18764 -6216 -28056 -33906 -22205 3245
1507 3245 26978 34340 23606 -636 -24280 -33441 -26218 -3233 21853 34034 27980 5032 -19171
$$ packed form
1421a8120j8574J395K0470K8673K1915K082k0043k9201k2049l824J6846K7547
1433G117K4294P220j4958k7989k5853q155J3311K5378K5938J1981r498k5959k7584
1446b4757j3107Q304K3737K7126J5017m089k1918k9162j7412L310K0821K7411
1458A5281J8636O68j8193k8169k1487k889J7926K7354K1105N460j4170k7031k3481
1471b8990p702J3085K6503K3939R312j0733k3999k4770j3201Q318K4415K5098
1483B1275J4083o019k1802k5439j6909L072K0911K6533J8170k220j8392k4988
1495a1725k0317j574J6670K6402K1458L016j5166k4980k1840n850J1701K5450
1507C245K3733P362j0734k4242k3644r161P223K2985K5086J2181o054k2948k4203
$$ plain form
1520 -19171 -32478 -29589 -8619 16087 32139 31156 11052 -13727 -30572 -31022 -13987 10048 29389
1533 29389 32800 16126 -7888 -27901 -32656 -18255 3953 25877 33380 20929 -1668 -24512
1545 -24512 -33016 -22220 -1581 21728 32761 24854 4478 -19559 -32180 -26146 -6915 17039
1557 17039 30862 27736 10166 -14898 -29940 -28910 -12447 12277 27914 29742 15111 -9676
1569 -9676 -27040 -30549 -17309 6650 24961 30927 19672 -3437 -22960 -31405 -21032 1012 21278
1582 21278 31146 23076 2038 -19030 -30944 -24487 -4737 16472 30145 25365 7493 -14141 -29593
1595 -29593 -26708 -10148 11825 28505 27419 12533 -9652 -26978 -28091 -14842 6873 25734
1607 25734 28449 17229 -4756 -23684 -28826 -19339 1774 21698 28762 21016 512 -20186 -28582
$$ packed form
1520a9171j3307K889K0970K4706J6052r83k0104k4779j6845m50J7035K4035J9341
1533B9389L411j6674k4014k0013m755J4401K2208K1924P503j2451k2597k2844
1545b4512q504J0796K0639K3309J1033p907k0376k4037j2621O034J9231K3954
1557A7039J3823l126j7570k5064j5042J030J6463K4724J5637J828j4631k4787
1569i676j7364l509J3240K3959J8311N966j1255k3109j9523q445J0373K2044K0266
1582B1278R868q070k1038k1068j1914O457J9750K1209J3673m780j7872k1634j5452
1595b9593K885J6560K1973J6680j086j4886k2185j7326j113J3249K1715J8861
1607B5734K715j1220k1985j8928n142R487K1113J9924P064p746k0504k0698q396
$$ plain form
1620 -28582 -23113 -2685 17516 28139 24293 5597 -15322 -27738 -25488 -7603 12899 26869
1632 26869 26551 10305 -10348 -25717 -27348 -12285 7954 24560 27563 14284 -5367 -23366 -28123
1645 -28123 -16454 2901 21727 27904 18246 -178 -19718 -27653 -20093 -2207 18491 27669 21476
1658 21476 4881 -16189 -26456 -23041 -7413 13909 25946 23829 8917 -11677 -24931 -25368 -11634
1671 -11634 9261 23769 26193 12792 -7483 -21679 -25941 -15482 4599 21038 26789 16638
1683 16638 -2494 -18897 -26520 -18158 -360 17214 26567 20033 1989 -15971 -25931 -20755 -5220
1696 -5220 13447 25680 21988 7262 -12140 -24822 -22607 -9036 9260 23524 24189 11813 -7734
1709 -7734 -22667 -23795 -13107 5347 20815 24289 15612 -3146 -19983 -24994 -16879 1310 17535
$$ packed form
1620b8582N469K0428K0201J0623l846j8696k0919j2416K250J7885K0502J3970
1632B6869l18j6246k0653j5369j631J5063K0239J6606L003j3279j9651j7999m757
1645b8123J1669J9355J8826O177r658j8424j9540p935P560J7886K0698R178o193
1658B1476j6595k1070j0267L415J5628K1322J2037k117j4912k0594j3254m37J3734
1671a1634K0895J4508K424j3401k0275j4196m262J0459K0081J6439N751j0151
1683A6638j9132j6403p623Q362J7798J7574R353o534j8044j7960r960N176J5535
1696e220J8667J2233l692j4726j9402j2682K215J3571J8296J4264O65j2376j9547
1709g734j4933j128J0688J8454J5468L474q677j8758j6837n011Q115J8189J6225
$$ plain form
1722 17535 24274 18705 1494 -16068 -24587 -19354 -2891 14268 23598 20862 5555 -12091 -23616
1735 -23616 -21884 -7107 10427 22601 21917 9320 -7827 -21747 -23376 -11350 6140 20500 23057
1748 23057 13157 -3483 -19011 -23642 -15084 1766 18105 23712 16002 362 -16004 -23180 -17826
1761 -17826 -2315 15000 23048 18356 4133 -12685 -22340 -20033 -6774 11201 21895 20873 7739
1774 7739 -9000 -20308 -21328 -10382 7036 20210 22397 11221 -5191 -18545 -22145 -13365 2871
1787 2871 17420 22867 14524 -1257 -16061 -22068 -16221 -1210 14174 22275 17489 2828 -13198
1800 -13198 -21477 -18086 -4962 10932 21206 19715 6873 -9573 -20226 -19730 -8576 7046 19256
1813 19256 20840 10614 -5789 -18663 -20912 -11660 3653 16794 21119 13705 -1755 -16426 -21355
$$ packed form
1722A7535O739n569j7211j7562q519N233J6463J7159R330k736j5307j7646j1525
1735b3616J732J4777J7534J2174o84j2597j7147j3920j629J2026J7490J4360K557
1748B3057r900j6640j5528m631Q558J6850J6339N607p710j5640j6366p176N354
1761a7826J5511J7315Q048m692j4223j6818r655K307J3259J7975J0694j022j3134
1774G739j6739j1308j020J0946J7418J3174K187j1176j6412j3354l600Q780J6236
1787B871J4549N447q343j5781j4804o007N847J5011J5384Q101m786j4661j6026
1800a3198q279L391J3124J5894J0274j491j2842j6446j0653M96J1154J5622J2210
1813A9256J584j0226j6403j2874k249R252J5313J3141M325p414j5460j4671m929
$$ plain form
1826 -21355 -14554 157 14256 20829 16037 2184 -13007 -21012 -16775 -3384 11371 20078 17745
1839 17745 5716 -9411 -20114 -18786 -7002 7973 18852 18877 8948 -5682 -17868 -19605 -10368
1852 -10368 4831 17140 19767 11717 -2435 -15643 -20083 -13284 1188 14562 19936 13939 908
1865 908 -13063 -19734 -15569 -2677 11809 19351 16325 4113 -9868 -18806 -17296 -6133 8525
1878 8525 18578 17787 7503 -6771 -17211 -18550 -9282 5013 16711 19054 10550 -3587 -15195
1891 -15195 -18740 -11929 1610 14449 19185 12938 34 -13339 -18781 -14054 -1703 11581 18756
1904 18756 15191 3369 -10460 -18244 -15698 -4630 8960 17599 16692 6492 -7606 -17274 -17217 -8020
1918 -8020 5575 16181 17628 9368 -4295 -15247 -17940 -10652 2578 14266 18095 12099 -826
$$ packed form
1826b1355O801J4711J4099O573m792j3853j5191q005M237J3391J4755Q707k333
1839A7745j2029j5127j0703J328J1784J4975J0879K5r929j4630j2186j737R237
1852a0368J5199J2309K627q050j4152j3208m440O799J4472J3374N374n997j3031
1865I08j3971o671M165J2892J4486P542l026j2212j3981q938J510J1163J4658
1878H525J0053p91j0284j4274j0440j339R268J4295J1698K343q504j4137j1608
1891a5195l545O811J3539J2839M736o247j2904j3373n442M727J2351J3284P175
1904A8756l565j1822j3829p784K546J1068J3590Q639r07j0200j4098r668N7R197
1918h020J3595J0606J447q260j3663j0952k693P288J3230J1688L829n996j2925
$$ plain form
1931 -826 -13156 -18002 -12841 -603 11863 18109 14091 1870 -10619 -17685 -14796 -3725 9138
1944 9138 17180 15649 5012 -7685 -16926 -16169 -7024 6250 15829 16434 8131 -4626 -14844 -16786
1958 -16786 -9351 2971 14074 17316 10956 -1575 -12985 -17058 -11748 -50 11799 16953 12991
1971 12991 1247 -10939 -16737 -13545 -3003 9066 16394 14424 4383 -8032 -16066 -15062 -5814
1984 -5814 6890 15299 15792 7163 -5407 -14857 -16215 -8449 3758 13707 16212 9210 -2362 -12690
1998 -12690 -16679 -10543 855 11833 16303 11487 896 -10584 -16317 -12395 -2037 9619 15861
2011 15861 13176 3862 -8081 -15526 -14150 -5022 7242 14962 14439 6173 -5573 -14199 -15026 -7490
2025 -7490 4465 13823 15259 8485 -3151 -12673 -15312 -9728 1532 12002 15684 10596 -349 -10474
$$ packed form
1931h26j2330m846N161J2238J2466O246m018j2221j2489p066K889J1071J2863
1944I138Q042j531j0637j2697r241P57R145J3274R579O05q303j2757j0218j942
1958a6786P435J2322J1103L242o360j2531j1410m073N310J1698J1849N154l962
1971A2991j1744j2186n798L192J0542J2069P328j970j0041j2415q034J004R248
1984e814J2704Q409M93q629j2570r450j358P766J2207R949K505p002j1572j0328
1998a2690l989O136J1398J0978M470m816j0591j1480n733L922J0358J1656O242
2011A5861k685r314j1943p445J376R128J2264P720n23q266j1746q626q27P536
2025g490J1955R358J436o774j1636r522k639N584J1260J0470L682n088j0945j0125
$$ plain form
2039 -10474 -15487 -11658 -1236 9562 15454 12281 2326 -8451 -14819 -13157 -4145 7143 14723 13569
2053 13569 4872 -6042 -13942 -13761 -5988 4475 13348 14519 7377 -3515 -12620 -14276 -8096 1745
2067 1745 11748 14832 9734 -831 -11327 -14507 -10194 -512 9709 14285 11409 1812 -9013 -13937
2081 -13937 -11837 -3030 7455 13590 12761 4246 -6542 -13438 -13164 -4896 5203 12396 13624 6828
2095 6828 -4034 -12213 -13951 -7206 2694 11196 14156 8429 -1144 -10630 -14277 -9077 90 9832 13954
2110 13954 10358 1341 -8517 -13967 -10843 -2199 8075 13458 11466 3497 -6357 -13049 -12167 -4876 5460
2125 5460 12815 12201 5669 -4268 -12038 -12907 -7022 3261 11291 12847 7652 -2049 -10240 -13098 -8743
2140 -8743 1109 9980 13289 9406 73 -8540 -12783 -10108 -1327 7835 12889 10719 2268 -6702 -12526
$$ packed form
2039a0474n013L829J0422J0798N892l173r955j0777o368J662R012J1288P580j154
2053A3569q697j0914p900J81P773J0463Q873J171p142j0892r105j656O180R841
2067A745J0003L084n098j0565j0496l180M313R682J0221M576k876r597j0825m924
2081a3937K100Q807J0485O135q29q515j0788o896K74Q268J0099P193J228o796
2095F828j0862q179j738O745R900Q502K960n727r573r486l647N200R167R742M122
2110A3954l596r017r858n450L124Q644J0274N383j992p969r854o692Q82P291J0336
2125E460P355o14o532r937p770q69N885J0283Q030J556n195r701q191k858M355
2140h743R852Q871L309l883r333q613m243K675Q781R162N054k170q451q970n824
$$ plain form
2155 -12526 -11223 -3900 5575 12377 11875 4732 -4347 -11740 -11962 -5697 3518 11420 12411 6773 -2513
2170 -2513 -10543 -12380 -7908 1311 9766 12497 8372 -348 -9000 -12425 -9280 -907 7817 12102 10186
2185 10186 2053 -7285 -11945 -10558 -2695 6080 11339 11288 4136 -5116 -11380 -11409 -4843 3785 10676 11678
2201 11678 6090 -2885 -10115 -11955 -6864 2102 9393 11934 7648 -556 -8939 -12017 -8475 -128 8182
2216 8182 11935 9092 1679 -7119 -11749 -9699 -2429 6364 11081 10213 3464 -5120 -10790 -10597 -4564
2231 -4564 4458 10601 10744 5386 -3516 -9813 -10968 -6478 2422 9411 11376 7178 -1152 -8537 -11473
2246 -11473 -7807 217 8030 11294 8447 465 -6773 -11062 -8846 -1777 6015 10905 9627 2846 -5389
2261 -5389 -10767 -9715 -3656 4413 10261 10118 4430 -3429 -9645 -10264 -5477 2674 9398 10416 6217
$$ packed form
2155a2526J303P323R475O802n02p143r079p393k22O265R215P902R91n638r286
2170b513q030j837M472R219Q455K731m125q720q652l425L145Q373Q724M285j916
2185A0186q133r338m660J387P863Q775N259n1p152r252o264k9O566Q628O891J002
2201A1678n588q975p230j840N091Q966P291K541m286q204q383l078L542Q347Q310
2216H182L753k843p413q798m630K050P270Q793M717q68o749q584n670J93O033
2231d564R022O143J43n358q902o297j155M490Q900O989J965m198q330p385k936
2246a1473L666Q024P813L264k847p982p238m289K216P069P792M890j278o781q235
2261e389n378J052O059Q069N848j43n688p859o216o19M787Q151O724J018m199
$$ plain form
2276 6217 -1471 -8627 -10680 -6961 836 7937 10885 7748 290 -7102 -10372 -8080 -878 6412 10362
2291 10362 8795 2005 -5305 -9940 -9031 -2868 4724 9700 9426 3656 -3996 -9431 -9699 -4644 2895
2306 2895 9191 10075 5219 -2018 -8393 -10293 -5954 1158 8016 10149 6786 -353 -7303 -9940 -7530
2321 -7530 -537 6543 9924 7924 1585 -5842 -9543 -8458 -2506 4687 9535 8808 3160 -4038 -9249
2336 -9249 -9010 -3825 3370 8521 9634 5008 -2422 -8331 -9515 -5413 1697 7863 9724 6228 -692
2351 -692 -7229 -9749 -6759 -178 6328 9268 7249 1015 -5866 -9496 -7581 -1860 5168 9280 8049
2366 8049 2832 -4237 -8822 -8521 -3446 3547 8506 8628 4259 -2604 -8216 -9010 -4899 1949 7478 8848
2382 8848 5410 -1107 -7031 -9123 -6140 318 6368 8923 6581 448 -5778 -8955 -7272 -1356 5176
$$ packed form
2276F217p688p156k053L719P797P101K948l137p458p392l270K292P202P290L950
2291A0362j567o790p310m635R09O163P592M976k74n770p652n435k68N055P539
2306B895O296Q84m856p237o375j900M339P112O858K133l363p139o950k637K410
2321g530O993P080L381k000o339p427l701J085N952P193M848p27n648p198n211
2336i249K39N185P195N151J113m626p430n909j184M102P110O166J861l496o920
2351f92o537k520K990O581O506K940k019o234o881l630J915N721P028M112j231
2366H049n217p069m585L01N075O993M959J22m369o863n612p94M111O848N529J370
2382H848l438o517n924k092K983O458O050K555k342o133o226l177J683N916O532
$$ plain form
2397 5176 8697 7565 1988 -4348 -8529 -7905 -2893 3702 8370 8175 3257 -2950 -7839 -8175 -4241 2165
2413 2165 7720 8757 4825 -1177 -6766 -8564 -5346 537 6509 8735 6018 81 -5859 -8451 -6609
2428 -6609 -1044 5202 8418 6946 1626 -4612 -8077 -7379 -2706 3942 7908 7604 3273 -3262 -7659
2443 -7659 -7780 -3604 2400 7100 8038 4394 -1691 -6985 -8418 -4731 915 6390 8208 5445 -391
2458 -391 -5830 -8178 -5829 -409 5365 8150 6248 1371 -4793 -7985 -6984 -1928 4018 8016 7092
2473 7092 2848 -3366 -7578 -7677 -3211 2672 6909 7517 3993 -1878 -6626 -7903 -4431 1460 6408 7866
2489 7866 4875 -697 -5746 -7651 -5353 74 5457 7335 5971 593 -4468 -7489 -6486 -1372 4056
2504 4056 7361 6270 2013 -3477 -7352 -7102 -2536 2778 6799 7038 3484 -2106 -6379 -7201 -3858 1771
$$ packed form
2397E176L521j132n577o336m181O24N012O595M668j95m918o207m889l36L934O406
2413B165N555J037l932o002n589j798L218N883N972K226k717n937n940k592J842
2428f609N565O246L216j472n320o238l465O98M673O648L966l04m331o535m397
2443g659j21M176O004M700R38l644o085n294j433L687N646N475J818k763n836
2458c91n439k348K349N420N774K785j902m877o164l192J001N056N946L998r24
2473G092m244o214m212r9M466N883M237O08l524n871m748j277L472N891M948J458
2489G866k991n572n049j905K298N427N383J878j364n378n061l021J003N114N428
2504D056L305j091m257n490l875K50M566N314M021K39l554n590m273q22L343N629
$$ plain form
2520 1771 6210 7429 4487 -841 -5741 -7285 -5080 249 5150 7665 5371 536 -4968 -7310 -5843
2535 -5843 -1275 4184 7074 6106 1572 -3481 -6866 -6301 -2320 3120 6514 6827 3015 -2350 -6449 -6785
2551 -6785 -3401 1660 5978 6882 4068 -1248 -5681 -6900 -4555 710 5221 7027 5003 34 -4697
2566 -4697 -7033 -5089 -642 4261 7004 5605 1511 -3917 -6754 -5849 -1893 3214 6524 6202 2365
2581 2365 -2681 -6221 -6382 -3104 2227 6025 6328 3439 -1498 -5687 -6483 -3913 762 5209 6944 4629
2597 4629 -274 -4696 -6633 -4812 -244 4345 6345 5346 992 -3806 -6314 -5535 -1461 3413 6216
2612 6216 5841 2067 -2661 -6085 -5830 -2503 2150 6034 6362 3128 -1562 -5609 -6045 -3331 1019 5230
2628 5230 6364 3748 -297 -5073 -6152 -4244 -291 4361 6202 4739 773 -4000 -6196 -5351 -1201
$$ packed form
2520A771M439J219k942n328m900j544K205N329M901K515k294m835n504k342J467
2535e843M568N459K890r68m534n053l385N65L981N440L394L13l812n365m099l36
2551f785L384N061M318R04k814n316m433j219K345N265M511J806k024m969m731
2566d697k336J944M447M903K743j399m094n428k837R05L956N107L310l22l837
2581B365n046l540j61L278N331L798L03k889m937m189p96K570M675M447J735k315
2597D629m903m422j937J821M568M589K000r99m354m798k508P79M074M874K803
2612F216l75l774m728l424K55L327M653L884L28l234m690m047m36K714M350M211
2628E230J134k616m045m776j079J908L953M652J841j463l966m773k196Q45M150
$$ plain form
2643 -1201 3606 5879 5475 1637 -2819 -5693 -5786 -2300 2480 5491 5785 2870 -1763 -5467 -5907 -3158
2659 -3158 1257 5041 5897 3487 -1066 -4602 -6032 -4147 323 4479 6020 4373 390 -3899 -6036
2674 -6036 -4743 -1055 3470 5829 4990 1395 -2982 -5664 -5197 -1887 2722 5692 5464 2145 -2120 -5245
2690 -5245 -5347 -2849 1522 5178 5392 3263 -1094 -4495 -5467 -3570 577 4364 5853 3917 -153 -3957
2706 -3957 -5601 -4142 -709 3756 5544 4540 991 -3172 -5554 -4699 -1269 2562 5279 5172 2065
2721 2065 -2008 -5250 -5233 -2287 1784 4790 5237 2925 -1069 -4672 -5450 -3333 594 4225 5453 3633
2737 3633 -152 -3899 -5551 -3885 -267 3483 5251 4314 855 -3074 -5179 -4632 -1278 2758 5356
2752 5356 4682 1640 -2212 -4798 -5000 -2234 1724 4869 5082 2433 -1124 -4456 -5052 -2789 1017 4183
$$ packed form
2643a201M807K273m04l838m456k874r3L486M780L011K94k915m633l704m40K749
2659c158M415L784Q56k410m553l536j430J885M470M156J541j647l983m289k137
2674f036J293L688M525K359q39l595m377k682M67L310M609K970k28l319m265l125
2690e245j02K498M371L656K14k129m357l401r72J897M147L787J489j936m070l804
2706c957j644J459L433M465J788j004l549m163k382Q55L430L831K717j07l107
2721B065m073l242J7K946M071L006M47k312l994l603p78K117L927L631J228j820
2737C633l785l747j652J666L618L750J768r37l459l929k105N47L354M036K598
2752E356o74l042l852k586k02K766L958L145K13k649l557l332n96K263L806L166
$$ plain form
2768 4183 5133 3284 -445 -3842 -5165 -3530 -280 3311 5087 3838 516 -3086 -5007 -4205 -1084
2783 -1084 2953 5016 4349 1567 -2352 -4634 -4519 -1803 1785 4538 4716 2370 -1623 -4213 -4735 -2742
2799 -2742 1027 4137 5068 3061 -319 -3723 -4882 -3355 111 3393 4842 3537 256 -3216 -4917
2814 -4917 -3702 -594 2617 4651 3881 1018 -2559 -4547 -4121 -1650 2044 4316 4118 1895 -1749 -4222
2830 -4222 -4534 -2487 1290 4068 4666 2682 -683 -3792 -4687 -3097 115 3563 4587 3317 221 -3180
2846 -3180 -4496 -3578 -450 2711 4317 3801 955 -2534 -4328 -3952 -1217 1990 4090 3970 1858 -1827
2862 -1827 -3905 -4427 -2220 1274 3936 4176 2272 -799 -3718 -4276 -2791 248 3392 4403 2772 130
2878 130 -3013 -4500 -3304 -530 2928 4355 3382 690 -2476 -4469 -3629 -1162 2062 4030 3777 1402
$$ packed form
2768D183R50j849l729l397j323J635L250L591J776j249l322l602j921Q02L121
2783a084M037K063o67k782l919k282J15K716L588K753J78k346l993k590n22J993
2799b742L769L110R31k007l380l404j159J527L466L282J449j305l281l472j701
2814d917J215L108L211K034p70k863l577j988M26K471L694K272j98k223l644k473
2830d222l12K047L777K778N98j984l365l109q95J590L212L448J024j270l096l401
2846c180j316R18L128L161J606n16k846l489j794L76K735L207K100j20k112l685
2862a827k078n22K207L494K662K40j904l071k919n58J485L039L144J011j631k642
2878A30l143j487J196K774L458J427r73k692l166j993Q40K467L224J968k53k375
$$ plain form
2894 1402 -1631 -3889 -4094 -2002 1143 3749 3973 2061 -787 -3551 -4051 -2405 725 3249 4201 2837
2910 2837 -332 -3025 -4272 -3011 -195 2645 4310 3170 381 -2421 -4000 -3514 -843 2065 4288
2925 4288 3538 1446 -1525 -3991 -3688 -1572 1252 3579 3669 1977 -932 -3412 -3998 -2200 665 3091
2941 3091 4018 2263 -549 -2933 -3808 -2697 -83 2619 3913 3010 358 -2495 -3738 -2970 -834 1958
2957 1958 3898 3377 997 -1549 -3694 -3374 -1211 1843 3396 3426 1762 -1288 -3440 -3426 -1959 753
2973 753 3098 3541 2455 -731 -2719 -3836 -2530 98 2677 3472 2551 7 -2438 -3729 -2966 -592
2989 -592 2209 3708 3259 731 -1793 -3379 -3080 -1379 1511 3289 3413 1473 -1170 -3289 -3578 -1702
3005 -1702 1086 3105 3488 1988 -597 -2998 -3808 -2269 321 2869 3494 2446 117 -1995 -3587 -2804
$$ packed form
2894A402l033k258k05K092L145K606K24j912k848k764n00J646L130K524R52j364
2910B837l169k693j247J261K816K840J665j140k789k802j579M86K671K908K223
2925D288p50k092k971k466L03K116K824K327R0j692k909k480n86J798K865K426
2941C091R27j755k812k384q75J111K614K702J294r03k652k853j243P68K136K792
2957A958J940n21k380k546k145L20K163L054J553L0j664l050k152J4J467K712
2973G53K345M43j086l186j988j117J306K628K579P95r21k544k445j291P63K374
2989e92K801J499m49k528k524j586K99J701K890J778J24j940k643k119k89J876
3005a702K788K019L83j500k585k401q10J539K590K548O25j048k329k112j592P83
$$ plain form
3021 -2804 -408 2028 3366 2846 555 -1945 -3569 -2982 -879 1712 3239 3304 1503 -1441 -3320 -3271
3037 -3271 -1607 1091 2937 3394 1798 -990 -2555 -3546 -2088 414 2477 3419 2326 30 -2330 -3389
3053 -3389 -2469 -250 2504 3378 2669 740 -1892 -3369 -2722 -747 1639 3118 2990 1119 -1508 -2887
3069 -2887 -3016 -1475 1288 2840 2974 1743 -771 -2704 -3290 -1874 526 2637 3228 2368 -146 -2480
3085 -2480 -2983 -2271 -255 2191 3198 2526 207 -2089 -3184 -2862 -571 1649 2794 2788 956 -1503 -3000
3102 -3000 -2936 -1055 1240 2731 2970 1468 -1007 -2783 -2971 -1729 579 2224 2800 1903 -199 -2176
3118 -2176 -3259 -2150 65 2125 2984 2434 224 -1891 -3014 -2340 -241 1783 2999 2380 883 -1391
3134 -1391 -2714 -2388 -1089 1123 2754 2892 1351 -726 -2608 -2598 -1492 570 2333 2760 1870 -333
$$ packed form
3021b804K396K436J338n20k291k500j624N87K103K591J527O5j801k944j879M9
3037c271J664K698J846M57j596k788j565r91J458K502K063R42j093k296k360j059
3053c389R20K219K754Q74p09j929k632j477O47J975K386J479j28j871k627j379
3069b887j29J541K763J552J34j231k514j933n86J416K400K111N91q60k514k334
3085b480n03P12K016K446J007o72k319k296j095L22K291K220J145oj832k459j497
3102c000O4J881K295J491K39j502k475j776j88J242K308J645N76q97k102j977
3118b176j083J109K215K060Q59n50k210k115j123O74K099K024J216o19j497k274
3134a391j323L26J299K212J631J38j541k077j882J0J106K062J763M27q90k203
$$ plain form
3150 -333 -2294 -2799 -1765 -22 2203 2843 2145 -96 -1613 -3064 -2270 -215 1741 2838 2538 563
3166 563 -1392 -2641 -2663 -919 1252 2729 2681 1027 -1077 -2496 -2702 -1312 769 2613 2579 1494 -499
3183 -499 -2342 -2805 -1589 148 2347 2595 1752 342 -1912 -2713 -1945 -338 1619 2614 2336 721 -1525
3200 -1525 -2479 -2283 -919 1214 2439 2377 957 -1192 -2598 -2528 -1165 898 2428 2590 1520 -569 -2108
3217 -2108 -2581 -1562 292 1977 2664 1740 -118 -1764 -2672 -1737 -60 1667 2449 2252 476 -1394 -2496
3234 -2496 -2164 -496 1283 2427 2336 1023 -985 -2538 -2085 -897 882 2310 2437 1198 -500 -2117
3250 -2117 -2487 -1435 489 1911 2410 1541 -244 -1828 -2427 -1722 -141 1742 2295 1826 444 -1535 -2481
3267 -2481 -1856 -241 1381 2259 1997 731 -1197 -2060 -2175 -1105 778 2216 2457 1042 -757 -2026
$$ packed form
3150c33j961n05J034J743K225O40o98k241j517j451P94K055J956J097l00j975
3166E63j955j249k2J744K171J477m8j654k104j419k06J390K081J844l4j085j993
3183d99j843m63J216J737K199K48q43j410k254q01P68J607J957R95k78j615k246
3200a525r54J96J364K133J225o2j420k149j406P0J363K063J530J62j070k089j539
3217b108m73J019J854J685O87r24j858j646r08R35J677J727P82j97j776j870j102
3234b496L32J668J779J144r1j313k008j553M53J188J779J428J27j239j698j617
3250b117l70J052J924J422M99q69j785j584n99P05J581J883N53m69j382j979r46
3267b481O25J615J622Q78k62j266j928q63j15J070J883J438K41j415j799j269
$$ plain form
3283 -2026 -2335 -1106 621 2019 2469 1331 -175 -1704 -2261 -1524 67 1627 2282 1854 179 -1567
3299 -1567 -2176 -2210 -185 1138 2377 1983 555 -1036 -2153 -2155 -760 872 2231 2208 968 -709 -1953
3316 -1953 -2294 -991 631 1896 2111 1294 -483 -1843 -2155 -1407 61 1538 2254 1780 200 -1443 -2066
3333 -2066 -1803 -482 1159 2181 1662 682 -981 -2029 -1970 -659 979 1901 1988 711 -879 -2040 -2002
3350 -2002 -1163 672 1753 2173 1268 -350 -1670 -2181 -1212 303 1722 2058 1369 -20 -1446 -1970 -1573
3367 -1573 -251 1267 2113 1629 345 -1233 -1774 -1857 -728 957 1986 1958 725 -763 -1970 -1909 -853
3384 -853 561 1898 1986 1052 -254 -1841 -1844 -1113 163 1464 1718 1315 -38 -1409 -2039 -1647 -98 1260
3402 1260 1953 1526 70 -1029 -1880 -1707 -504 906 1746 1665 861 -800 -1784 -1777 -741 589 1771 2040
$$ packed form
3283b026l09J229J727J398M50j138j506j529n57P37J591J560O55m28j675j746
3299a567o09l4K025J323J239l94j428j591j117kJ395J632J359k3j240j677j244
3316a953l41J303J622J265K15q17j777j360l12P48J468J477P16m74j580j643o23
3333b066K63J321J641J022n19r80j663j048N9J311J638R22Q7j277j590j161L8
3350b002Q39J835J081M20r05j618j320n11R69J515J419L36o89j389j426n24L97
3367a573J322J518Q46m84j284j578n41q3J129J685J029k8j233j488j207O1J056
3384h53J414J337Q8r34j306j587lP31J276J301K54m03j353j371o30L92J549J358
3402A260O93m27j456j099q51J73J203J410Q40q1q04j661r84PJ036J330J182K69
$$ plain form
3420 2040 1077 -517 -1514 -1566 -1260 45 1495 1763 932 -73 -1344 -1767 -1515 -144 1047 2124 1191
3437 1191 428 -1122 -1796 -1612 -394 903 1574 1523 627 -682 -1757 -1505 -931 802 1757 1877 810 -592
3455 -592 -1663 -1587 -847 287 1573 1828 1064 -192 -1419 -1783 -1288 -124 1200 1728 1419 -50 -1188
3472 -1188 -1647 -1389 -440 1128 1632 1791 627 -885 -1560 -1442 -560 682 1602 1649 761 -503 -1802 -1723
3490 -1723 -790 246 1407 1618 1001 -230 -1346 -1706 -1195 -122 1038 1528 1162 85 -1115 -1633 -1310
3507 -1310 -422 1002 1750 1303 253 -731 -1818 -1294 -447 568 1395 1817 507 -441 -1431 -1766 -958 390
3525 390 1490 1758 850 -68 -1236 -1553 -944 60 1456 1540 1116 -133 -982 -1843 -1196 -148 855 1590
3543 1590 1318 209 -956 -1543 -1334 -627 611 1434 1472 485 -483 -1295 -1454 -715 467 1140 1724 806 -242
$$ packed form
3420B040r63j594r97n2L06J305J450K68q31j005j271m23K52J371J191J077r33
3437A191p63j550o74J84J218J297O71n1q96j309j075K52N74J733R55J20j067j402
3455e92j071P6P40J134J286K55p64j256j227l64M95J164J324N28l09j469j138
3472a188m59K58R49J568N04J59j164j512o75J18Q82J242R20M7q88j264j299P9
3490a723R33J036J161K11o17j231j116l60N11J073J160M90l66j077j200n18L23
3507a310Q88J424P48m47j050r84j087N24Q47J015Q27M22j310r48r90l35Q08J348
3525C90J100K68r08r18j168l17O09J004J396Q4m24j249q49q61O47J048J003P35
3543A590k72j109j165n87K09P07J238Q23L8r87r68q12j59P39J182O73N84r18j048
$$ plain form
3562 -242 -1299 -1343 -1039 427 1040 1483 1152 -163 -1109 -1418 -1118 -210 728 1493 1250 198 -761 -1420 -1096
3581 -1096 -442 573 1263 1376 473 -831 -1502 -1111 -749 419 1260 1484 493 -428 -1439 -1352 -1063 332
3599 332 1216 1591 797 -118 -893 -1339 -983 -19 1006 1319 1285 54 -827 -1318 -1213 -297 760 1276 1095
3618 1095 342 -597 -1107 -1298 -581 692 1238 1404 617 -547 -1330 -1225 -871 448 1133 1513 657 -162 -965
3637 -965 -1417 -929 -91 892 1288 976 259 -818 -1370 -1244 -329 513 1380 1135 428 -497 -1292 -1189 -504 341
3657 341 1216 1203 526 -170 -1049 -1232 -662 130 955 1218 605 -122 -866 -1481 -776 32 968 1271 1001 90
3677 90 -1007 -1148 -1110 -229 741 1282 1031 133 -732 -1229 -1111 -505 477 1180 1156 648 -348 -1368 -1255 -654
3697 -654 229 835 1089 612 -352 -966 -1338 -765 -1 921 1172 716 69 -814 -1214 -924 -226 794 1164 968
$$ packed form
3562b42j057m4L04J466O13M43l31j315r46l09L00R08R38P65k43j052r59o59L24
3581a096O54J015O90J13r03j304o71L91L62J168Q41K24r91r21j011Q7K89J395
3599C32Q84L75p94r15p75m46L56R64J025L13l4j231q81m91J05R16J057N16j81
3618A095p53r39n10j91P17J273N46J66p87j164p83J05L54J319O85L80q56q19q03
3637i65m52M88Q38R83L96l12p17j077n52J26R15Q42Q67k45p07r25p95J03O85Q45
3657C41Q75j3o77o96q79j83N70P92Q25K63o13p27p44o15P05Q08R36L03k70r11
3677I0j097j41L8Q81R70N41k51q98q65m97J18O06R82P03k4n08r96j020J13O01
3697f54Q83O06K54m77r64o14l72N73P64R22K51m56o47q83m00K90O98J020L70j96
$$ plain form
3717 968 -35 -500 -1025 -1062 -440 475 982 1070 461 -369 -1006 -1113 -767 224 966 1228 759 -381 -817 -1173
3737 -1173 -744 2 753 1111 661 133 -761 -818 -792 -164 703 1040 1000 91 -478 -1200 -892 -271 506 951 725
3758 725 562 -368 -976 -1212 -611 91 1105 1198 610 -214 -874 -926 -819 73 1009 1308 911 -268 -654 -1068
3778 -1068 -986 -53 354 1168 899 221 -486 -1046 -656 -290 294 1108 909 623 -473 -1014 -902 -383 123 1146
3798 1146 1023 438 -183 -778 -1193 -616 -94 761 1025 900 -102 -733 -895 -822 120 698 980 785 -34 -642
3818 -642 -1080 -1023 -315 573 852 979 443 -197 -814 -878 -349 197 998 892 585 -317 -868 -1060 -685 -4 748
3839 748 881 786 -79 -850 -1027 -732 28 523 999 742 270 -519 -914 -1037 -336 435 1097 870 238 -353
3859 -353 -696 -874 -244 606 714 779 692 -179 -693 -1020 -702 133 739 1017 597 -173 -639 -982 -973 116 881
$$ packed form
3717I68j003m65n25l7O22R15N07Q8o09q30o37j07L46R91P42K62m69j140m36l56
3737a173M29P46P51L58m50n28q94n7K6O28Q67L37m0r09n69p22L08O21P77M45k26
3758G25j63r30o08k36O01P02J014R3n88q24o60n2J07Q92R36K99l97j179l86m14
3778a068Q2R33M07Q14k69o78p07n60L90L66N84Q14j99k86j096n41J12N19N06J023
3798A146j23n85o21n95m15N77N22Q55K64j25j002o31j62P3R42N78K82j95q19o08
3818f42m38N7P08Q88K79J27n36o40o17o4N29N46Q01j06l07r02n51j92L75O81P52
3839G48J33r5q65p71j77K95P60M95M76k57m72p89l95j23P01P71O62k27o32n91
3859c53l43j78O30Q50J08O5q7q71n14l27L18Q35O06K78m20p70m66l43RJ089P65
$$ plain form
3880 881 608 659 265 -459 -790 -683 -450 481 884 842 333 -384 -808 -764 -234 360 880 650 470 -85 -635
3901 -635 -737 -626 176 499 821 469 36 -537 -951 -734 13 441 911 724 185 -678 -752 -745 -196 54 769
3922 769 892 408 -269 -503 -867 -500 -45 855 785 445 -105 -644 -920 -413 76 476 848 643 -114 -489
3942 -489 -827 -447 -14 647 931 756 62 -510 -573 -502 -327 304 636 630 364 -71 -843 -745 -231 561 799 822
3964 822 402 -79 -596 -824 -342 -71 615 1058 576 -149 -556 -804 -577 -97 765 758 465 115 -377 -674 -979
3985 -979 -183 507 707 804 253 -365 -744 -616 -142 150 571 778 231 -1 -487 -744 -126 152 834 524
4005 524 542 -165 -607 -719 -464 -192 479 843 576 203 -305 -725 -376 -202 185 715 750 110 -458 -874 -692
4026 -692 -425 278 581 542 467 -130 -730 -782 -394 -7 509 778 441 -90 -471 -640 -533 -30 355 904 248
$$ packed form
3880H81k73N1l94p24l31J07K33R31M03m2n09p17m24M4N30N94N20k30j80n55n50
3901f35j02J11Q02L23L22l52m33n73m14K17P47M28M70j87n39q63p4PN49K50P15
3922G69J23m84o77k34l64L67M55R00p0l40n50n39k76N07M89M00L72k05p57l75
3942d89l38L80M33O61K84j75o94n72o3P1J75O31L32ok66m35p72R8N14P92K38K3
3964H22m20m81n17k28M82K71O86M43m82p25m07k48K27M80Q62pk93l50m92k97l05
3985i79P96O90K00R7n51o18l79J28M74K92M21K07n47k32m86k57O18K78O82l10
4005E24J8p07m42j12K55K72O71L64k67l73n08m20L49J74L87N30L5o40n68m16J82
4026f92K67P03L03l9p5n97o00n2L88L87N16K69l37n31l81j69J07N03L85N49o56
$$ plain form
4047 248 21 -308 -760 -390 -240 331 610 573 333 -280 -836 -462 -285 401 609 700 133 -218 -555 -704 -389
4068 -389 238 785 459 227 -172 -437 -790 -465 -46 600 853 385 152 -300 -634 -247 -70 164 428 449
4088 449 102 -152 -620 -600 -166 266 681 511 376 -169 -525 -576 -400 202 451 553 291 -35 -428 -649 -576
4109 -576 101 539 548 408 285 -246 -502 -583 -210 432 446 334 181 -413 -815 -469 -280 192 674 694 144 -76
4131 -76 -782 -722 -313 358 476 351 227 -230 -524 -534 -260 179 277 433 542 -48 -785 -517 -484 -226 319 564
4153 564 403 22 -275 -768 -504 -388 249 617 588 183 -317 -550 -660 -151 323 462 620 281 94 -259
4173 -259 -225 -315 -184 431 398 482 -158 -498 -707 -422 -158 305 519 446 280 -156 -476 -600 -187 327 594 559
4195 559 338 15 -364 -643 -293 147 507 544 308 81 -363 -685 -293 77 241 558 453 -107 -377 -651
$$ packed form
4047B48k27l29m52L70J50N71K79l7k40o13n56L74J77O86K08R1n67l51l37j49L15
4068c89O27N47l26k32l99k65l53L25M19O46K53m68k33m52l34L87J77K34K64K1
4088D49l47k54m68K0M34M32M15j70j35n45l56n1J76O02K49J02k62l26l93k21P3
4109e76O77M38Rj40j23n31k56q1L73O42J4j12j53n94m02L46J89M72M82K0n50k20
4131g6p06O0M09O71J18j25j24m57k94j0K74M39R8J56J09n90p37K68L3K58N45K45
4153E64j61l81k97m93K64J16O37L68k9m05n00k33j10N09M74J39J58l39j87l53
4173b59L4r0J31O15l3Q4o40l40k09K85K64M63K14p3j66m36l20j24M13N14K67l5
4195E59k21l23l79k79L50M40L60L7k36k27m44l22L92L70J64L17j05n60k70k74
$$ plain form
4215 -651 -521 99 389 185 243 176 -157 -542 -395 -376 -86 501 387 389 -59 -422 -436 -241 367 409 617 -7
4237 -7 -166 -253 -481 -241 -16 570 600 465 -169 -178 -653 -290 -341 318 564 574 241 -352 -527 -335 -324 176 537
4260 537 462 273 -135 -450 -439 -300 123 443 484 182 -28 -324 -498 -278 -20 294 704 367 105 -343 -537
4281 -537 -336 94 111 584 508 129 -25 -334 -425 -137 241 331 288 236 -228 -241 -137 -209 270 270 383 366 72 -416
4305 -416 -435 -321 95 303 329 114 91 -204 -271 -542 -191 194 266 240 -31 -59 -356 -444 -94 191 397 362 349
4328 349 -4 -444 -383 -222 -27 388 435 294 -44 -308 -455 -406 8 229 383 316 125 -275 -456 -318 -31
4349 -31 330 545 300 -25 -66 -339 -302 -48 425 274 235 232 -55 -355 -234 -426 -2 281 314 129 -41 -407
4371 -407 -333 -347 62 295 301 388 109 -437 -637 -194 55 200 328 426 -126 -252 -310 -314 -81 -6 407 377 147 -261
$$ packed form
4215f51J30O20K90k04N8o7l33l85J47J9K90N87j14Km48l63j4J95O08M2K08o24
4237gj59q7k28K40K25N86L0j35o34rm75L63n1O59K46J0l33n93j75J92J1N00L61
4260E37p5j89m08l15J1J39M23L20M1l02k10k96j74K20K58L14M10l37k62m48j94
4281e37K01M30J7M73p6l79j54l09r1K88L78R0m3n2m64j3J04p2M79%J13j7k94m88
4305d16j9J14M16K08K6k15k3k95o7k71L51L85P2k6k71k8k97q8L50K85K06l5j3
4328C49l53m40O1J61J95M15M7j41l38k64j47M9M14K21J54o7j91m00j81J38K87
4349c1L61K15k45l25m1k73L7K54M73j51l9lk87l00J21j92M24K83L3j85j70l66
4371d07P4j4M09K33OQ7k79n46k00M43K49J45J28R8n52j26n8mK33P5M13l0k30m08
$$ plain form
4395 -261 -282 -369 -117 63 205 299 270 -41 -359 -438 -265 19 326 413 149 -16 -99 -390 -184 84 350 336 263
4418 263 113 -115 -497 -358 -44 135 446 498 249 122 -120 -351 -242 100 238 368 157 -145 -187 -342 -198
4439 -198 77 200 628 216 -79 -469 -408 -253 -24 248 208 215 107 -231 -254 -269 -229 248 202 299 -131 -196 -448
4462 -448 -224 53 1 500 471 281 -28 -547 -227 -50 69 162 667 335 -348 -400 -377 -153 49 195 211 201
4484 201 298 -126 -447 -420 -139 231 384 428 68 -212 -139 -295 -146 115 74 342 134 -171 -118 -416 23 103
4506 103 168 261 337 23 -153 -280 -278 -233 307 366 41 -74 -207 -187 -332 -139 109 227 258 146 -275 -263 -571
4529 -571 -232 131 198 169 10 -122 -212 -160 -140 35 267 257 150 52 -224 -194 -190 -75 352 255 223 -37 -268 -271 5
4554 5 -140 -74 23 169 83 -142 -67 -196 -148 90 180 123 132 -36 -287 -194 -164 85 170 8 122 -92 -182 -204 -420
$$ packed form
4395b61k1q7K52J80J42R4k9l11l18p9J73K84L07Q7k64j65q3k91K06K68K66j4p3
4418B63j50k28l82J39L14J79L11N2k49j27k42k31J09L42J38J30k11l02m2j55J44
4439a98K75J23M28m12k95l90O1J55K29K72m0Pj08l38k3j5M0M77m6R7m30o5k52
4462d48K24K77n2M99k9j90l09n19L20J77J19R3N05l32o83n2K3K24K02J46J6j0
4484B01R7m24l21K7K81L70J53M4l60k80P3j56J49K61m1K68k08l05N3k98M39Q0
4506A03O5R3P6l14j76j27KM5N40N9l25j15j33K0j45J93K48J18L1j12m21J2l08
4529e71L39L63O7k9j59j32r0N2K0J75K32j0j07r8k76L0MJ15M27r7l2k60k31lK76
4554Ej45O6R7J46q6k25P5j29M8K38R0n7Rj68k51R3L0K49Q5j62J14k14r0k2k16
$$ plain form
4579 -420 -49 368 179 388 -31 -298 -371 -280 -103 144 402 -54 58 -221 -211 -236 -2 -117 234 365 201
4600 201 157 -37 -282 -238 15 166 254 166 -208 -210 28 -14 110 194 159 102 12 -189 -566 -160 -254 85 304 218
4624 218 133 -6 -257 -330 -279 -1 446 322 95 2 58 -150 11 179 288 336 349 -17 -232 -151 -161 -8 163
4647 163 34 135 283 -29 -39 23 18 100 278 163 100 -163 -152 -217 -17 42 -23 69 211 -59 -127 -304 -104 113
4671 113 154 197 134 31 -261 -512 -248 -18 217 323 210 -23 -196 -365 -248 -224 40 223 139 205 -187 -222
4693 -222 -222 -26 -14 344 385 57 -16 -171 -307 -55 276 116 181 382 -71 -63 -153 -114 -27 -48 411 96 2 -98
4717 -98 -227 -123 191 205 53 242 -20 -130 -144 -449 -133 -53 79 -86 222 131 -248 -251 -224 -134 227 197 -61
4740 -61 -20 -66 -319 -273 -9 -25 256 18 51 -76 -253 -308 -37 175 144 339 220 88 -379 -53 96 87 343
$$ packed form
4579d20L71M17j89K09m19k67p3R1J77K47K58m56J12k79J0k5K34j15L51J31j64
4600B01m4j94k45M4K53J51Q8q8l74kK38m2J24Q4l5n7r0k01l77M06r4L39K19q6
4624B18q5j39k51p3N1K78M47j24k27r3N6k08J61J68J09M8J3l66k15Q1j0J53J71
4647A63j29J01J48l12j0O2nQ2J78j15o3k63J1o5K00N9o5R2J42k70o8j77K00K17
4671A13M1M3o3j03k92k51K64K30K35J06j13k33j73j69J17K4K64J83q4O6l92l5
4693b22%J96J2L58M1l28p3j55j36K52L31j60O5K01m53Qr0L9Q7k1M59l15r4j00
4717i8j29J04L14J4j52J89k62j10j4l05L16Q0J32j65L08r1l79lK7R0L61l0k58
4740f1M1m6k53M6K64j6K81k38L3j27j77n5K71K12l1J95j19j32m67L26J49rK56
$$ plain form
4763 343 20 -65 -134 -140 -237 -257 254 367 97 173 -27 -40 -246 -184 -13 319 112 249 44 33 -264 -282 -40 -47
4787 -47 121 155 -36 -37 -199 -308 -274 18 65 251 157 -28 121 -321 104 24 173 455 81 -23 -47 -136 -216 123
4811 123 -25 267 167 208 -165 -314 -43 -173 124 155 4 32 -89 -80 -80 -251 152 105 54 118 143 -194 -309 -275
4835 -275 158 185 212 -107 50 117 85 -114 -130 36 3 453 148 12 -70 -66 116 38 24 -35 46 -162 -162 -138 -41 -89
4861 -89 124 172 232 -149 -287 -256 -159 126 301 105 294 -76 -257 -230 9 -41 0 85 69 -138 -39 28 -155 -238
4885 -238 16 228 243 -109 131 -86 66 -127 -163 101 333 45 -157 -127 -348 -300 131 64 246 66 48 -181
4907 -181 -150 -274 -28 198 252 304 228 -184 -103 10 -98 167 -16 248 171 -74 108 -253 -233 -45 176 356
4929 356 123 34 -35 -277 -37 -153 332 -35 161 175 -202 -73 -121 -172 147 215 186 24 -157 -68 -88 -198 119
$$ packed form
4763C43l23q5o9or7k0N11J13k70P6k00j3k06O2J71L32k07J37k05j1k97j8K42p
4787d7J68L4j91jj62j09L4K92M7J86r4j85J49m42M25q0J49K82l74j04k4q9q0L39
4811A23j48K92j00M1l73j49K71j30K97L1j51K8j21R%j71M03m7n1O4K5l37j15L4
4835b75M33K7K7l19J57O7l2j99j6J66l3M50l05j36q2MJ82p8j4n9Q1k08%K4R7m8
4861h9K13M8O0l81j38L1R7K85J75j96J89l70j81K7K39n0M1Q5j6k07R9O7j83q3
4885b38K54K12J5l52K40k17J52j93l6K64K32k88k02L0k21M8M31o7J82j80j8k29
4907a81L1j24K46K26N4N2p6m12Q1J13j08K65j83K64p7k45J82l61K0J88K21J80
4929C56k33q9o9k42K40j16M85l67J96J4l77J29m8n1L19O8k9j62j81Q9k0j10L17
$$ plain form
4952 119 88 230 201 -232 -147 -91 30 -120 -43 228 231 93 -84 -337 -269 63 -2 254 202 -67 -359 -176 -90 -187
4976 -187 43 235 135 -265 -120 -15 -168 -142 41 197 -41 -54 -37 -61 217 161 85 196 272 -61 -6 -310 -118
4999 -118 149 -33 190 233 114 55 -127 23 -327 148 206 75 191 175 -122 -282 -144 -51 293 443 296 -69
5021 -69 -206 44 -191 -129 57 283 114 304 14 -202 -322 -127 204 322 202 139 41 -204 -411 -254 103
5042 103 90 329 274 -29 -164 -233 -204 80 -95 201 145 129 -197 -176 -232 13 -158 204 336 66 107 -294 -21
5065 -21 -74 128 123 219 49 1 26 -223 -147 50 4 46 373 144 67 -200 -230 -80 93 167 340 112 -68 -112 -355
5090 -355 -74 143 60 176 233 -165 -120 -19 -54 8 64 518 105 177 -70 -270 -262 119 237 52 60 145 -245 -237 -255
5115 -255 -130 128 -94 237 44 128 -300 -561 -276 78 63 187 140 -213 -87 -126 -286 121 110 12 128 -53
$$ packed form
4952A19l1J42k9m33Q5N6J21j50P7K71Lj38j77k53O8L32o5K56n2k69k92J83Q6r7
4976a87K30J92j00m00J45J05j53K6J83J56k38j3J7k4K78n6p6J11P6l33N5l04J92
4999a18K67j82K23M3j19n9j82J50l50M75N8j31J16j6k97j60J38R3L44J50j47l65
5021f9j37K50k35O2J86K26j69J90k90k16j20J95L31J18j20o3r8k45k07J57L57
5042A03j3K39n5l03j35o9K9K84j75K96n6j6l26K1n6K45j71L62J32k70M1m01K73
5065b1n3K02nR6j70m8K5k49P6J97m6M2L27k29p7k67l0J50J73P4J73k28j80m4k43
5090c55K81K17q3J16N7l98M5J01l5O2N6M54m13P2k47k00QL81J18j85QQ5l90Qj8
5115b55J25K58k22L31j93Q4m28k61K85L54j5J24m7l53J26l9j60M07j1r8J16j81
$$ plain form
5137 -53 -117 -229 -235 90 85 269 254 79 -101 -96 -124 -9 77 24 63 5 -149 -238 -145 -200 -1 66 339 232 69 -87
5163 -87 -73 -249 6 67 181 84 140 -464 -97 6 -61 263 115 197 30 31 -201 -103 -38 235 102 198 247 3
5187 3 -416 -273 -7 -104 59 22 -77 -27 -143 -96 -362 -47 239 190 201 272 -202 -341 -180 48 -22 250 5 -254
5211 -254 -31 -236 -359 -29 55 326 158 -143 -49 -353 -429 -60 74 63 -108 64 21 -190 -43 58 -45 104
5233 104 215 363 -197 -248 -272 -376 -164 79 126 337 136 -156 -226 -212 -205 -77 463 272 125 -3 112 -222
5255 -222 -178 110 -32 174 160 -77 -119 -171 -25 -309 333 344 38 -11 -113 -159 7 -163 122 157 255 -275 30
5278 30 -317 -129 -123 -6 194 72 207 -98 -35 -179 -263 34 49 69 106 81 -59 -222 25 -10 190 248 72 -63
5302 -63 -7 -89 -131 -4 280 175 299 9 -203 -17 -157 -120 117 255 194 22 69 -332 173 -112 172 250 248
$$ packed form
5137e3o4j12oL25nJ84j5j75j80Nk8J15Q6n3L9n8j54q9R3n5J99O7K73j07j63j56
5163h7J4j76K55O1J14r7N6o04L67J03o7L24j48Q2j67Jk32R8O5K73j33R6M9k44
5187Cm19J43K66r7J63l7r9N0j16M7k66L15K86m9J1P1m74j39J61K28p0K72k45k59
5211b54K23k05j23L30Q4K71j68l01R4l04p6L69J34j1j71J72m3k11J47J01j03J49
5233A04J11J48n60n1k4j04K12K43M7K11k01k92p0J4PJ28N40j91j47j28J15l34
5255b22M4K88j42K06j4k37m2n2J46k84O42J1l06m9j02m6J66j70K85L5R8n30L05
5278C0l47J88OJ17K00j22J35l05O3j44q4K97J5K0L7k5j40j63K47l5K00N8j76j35
5302f3N6q2m2J27K84j05J24k90k12J86j40L7K37J38o1j72M7m01N05k85K84P8k
$$ plain form
5325 248 15 -107 -84 -68 92 -51 306 38 -50 -86 -26 -267 -271 20 98 187 266 -145 -182 -337 -279 80 36 192
5349 192 144 49 -312 12 -42 69 99 9 223 270 44 -211 -143 -132 -46 449 244 100 -25 -265 -55 -207 204
5372 204 211 238 134 152 14 -258 -98 -70 168 175 164 239 -28 -128 -47 73 72 239 223 113 79 -159 -298 -96 203
5397 203 451 643 105 -236 -78 -204 -142 231 256 31 124 49 -134 -209 44 134 349 76 267 56 -300 -158
5419 -158 -65 -45 2 166 136 135 -27 -317 -123 8 152 376 -8 167 -81 -55 -90 -57 -122 108 159 243 148 -25
5443 -25 -185 -133 -55 79 96 452 199 -266 -231 56 29 268 240 191 171 6 -115 -508 -207 141 47 149 124 187
5467 187 -156 -53 -171 -148 205 264 227 -8 -80 -306 -157 -120 158 121 91 241 -274 -408 210 15 117 187 321
5490 321 147 -134 -273 -117 -164 2 259 139 43 31 -401 -280 -155 -70 213 288 21 -258 -245 -205 -319 -39
$$ packed form
5325B48k33j22K3J6J60j43L57k68q8l6O0k41mK91P8Q9P9m11l7j55N8L59m4J56
5349A92m8r5l61L24n4J11L0r0K14M7k26k55O8J1Q6M95k05j44j25k40K10j52M11
5372B04PK7j04J8j38k72J60K8K38Pj1P5k67j00Q1J20jJ67j6j10l4k38j39K02K99
5397B03K48J92n38l41J58j26O2L73K5k25R3p5j83p5K53R0K15k73J91k11l56J42
5419a58R3K0M7J64l0jj62k90J94J31J44K24l84J75k48K6l5L3o5K30N1Q4r5j73
5443b5j60N2P8J34J7L56k53m65L5K87k7K39k8m9k0j65j21l93L01L48r4J02k5O3
5467A87l43J03j18K3L53N9l7k35p2k26J49L7K78l7l0J50n15j34O18j95J02P0J34
5490C21j74k81j39J56m7J66K57j20r6j2m32J21J25Q5K83P5k67k79J3M0j14K80
$$ plain form
5512 -39 219 217 118 80 -229 -326 -176 53 26 184 101 281 -164 -200 -76 -38 176 143 231 160 59 -162 -167 -170 364 82
5538 82 259 74 51 -29 -119 -280 56 261 286 192 -6 -88 -375 -56 -172 -40 160 318 -89 -13 -175 -403 -238
5561 -238 141 314 370 232 29 -240 -214 32 143 271 168 64 -20 -187 -240 51 -130 184 252 21 -89 -61
5583 -61 -340 -428 -76 49 305 362 -49 -39 -184 -47 158 -20 200 210 291 83 -122 -129 163 216 45 278 143
5606 143 60 -200 -22 -358 96 203 157 151 1 -180 -271 -73 -77 79 57 212 40 16 -185 -61 -162 -50 292
5629 292 -7 149 19 -372 -72 -83 -56 434 62 129 0 -88 -210 -138 118 131 386 195 191 -243 -255 -400 -184
5652 -184 94 391 297 46 92 -180 -170 -226 249 115 328 177 58 -134 -318 -113 122 334 75 -62 -197
5673 -197 -161 -172 -203 -14 30 70 235 87 -127 -127 -415 102 31 175 -30 56 -197 -197 -345 -6 -1 100 394 210
$$ packed form
5512c9K58kr9l8l09r7J50K29k7J58q3J80m45l6J24L8K14l3Q8p1j01k21nlN34k82
5538H2J77j85k3q0r0j61L36K05K5r4j98q2k87L19j16J32K00J58m07P6j62k28J65
5561b38L79J73N6j38k03k69K6K46J11J28j03j04q4j67n3K91j81L14O8k31j10K8
5583f1k79q8L52J25K56N7m11J0j45J37K05j78K20J0Q1k08k05pK92N3j71K33j35
5606A43q3k60J78l36M54J07m6oj50j81r1J98mJ56k2J55j72k4k01J24j01J12L42
5629B92k99J56j30l91L00j1K7M90l72O7j29q8j22P2K56J3K55j91mm34j2j45K16
5652a84K78K97r4k51M6k72J0n6M75j34K13j51j19j92j84K05K35K12k59j37j35
5673a97L6j1l1J89M4M0J65j48k14%k88N17p1J44k05Q6k53%j48L39NJ01K94j84
$$ plain form
5697 210 115 -361 -384 -175 115 284 113 -106 -20 -218 -274 -118 -28 138 406 328 79 -340 -237 2 -58 370
5719 370 328 304 141 -348 -134 -191 75 -45 161 267 217 -210 -177 -185 -127 32 175 401 -26 -56 -28 -107 -58 27
5743 27 347 238 71 252 -40 -351 -230 -85 5 174 437 162 -151 -195 -97 61 107 341 1 54 -10 -185
5765 -185 -127 -179 267 228 286 125 3 105 -117 -406 26 18 97 95 97 -134 -35 -165 160 181 157 108 109 -160 -11 -137
5791 -137 -16 50 100 175 31 -113 3 -173 -102 209 4 333 138 -170 -210 -169 -215 -94 219 233 40 -10 -126
5814 -126 -391 -416 -36 226 180 185 150 -185 -371 -292 -185 224 246 475 192 -29 -181 -193 -92 109 179 230 302 -159
5838 -159 -82 -92 -28 -27 146 47 -45 -146 -127 -112 -159 -48 93 177 342 20 0 -191 -207 94 283 86 100 99 -197
5863 -197 -32 -262 -215 3 63 331 302 138 -317 -316 -197 293 260 48 12 -115 -178 -194 -56 27 -26 414 254 137
$$ packed form
5697B10r5m76k3K09K90J69j71k19Q6j98n6J56R0J66K68p8k49m19J03K39o0M28
5719C70m2k4j63m89K14n7K66j20K06J06n0m27L3qN8J59J43K26m27l0K8p9M9Q5
5743B7L20j09j67J81k92l11J21J45R0J69K63k75l13m4R8J58M6K34l40N3o4j75
5765a85N8n2M46l9N8j61j22J02k22k89M32qP9kKk31R9j30L25K1k4m9Jk69J49j26
5791a37J21O6N0P5j44j44J16j76P1L11k05L29j95l08m0M1m6J21L13J4j93n0j16
5814a26k65k5L80K62m6Nl5l35j86P9J07M09K2K29k83k21j52j2J01K01P0N1P2m61
5838a59P7j0O4JJ73r9r2j01J9J5m7J11J41Q4J65l22k0j91j6L01J89j97J4jk96
5863a97J65k30M7K18O0K68k9j64m55JJ19M90l3k12l6j27o3j6J38Q3n3M40j60j17
$$ plain form
5887 137 144 -248 -199 -26 166 264 40 56 -296 -169 -270 -188 18 429 208 -17 -32 -108 -300 -261 23 275 316
5910 316 175 18 -260 -204 -447 161 243 179 95 95 -48 -250 89 64 285 -17 439 234 -180 -239 -28 -197 57
5933 57 265 278 115 -8 -105 -324 -238 162 -30 360 201 3 -90 -226 -73 -111 287 138 263 -60 -131 -224 -218
5956 -218 -63 37 261 314 70 -48 -366 -15 -8 125 246 79 -264 -240 -28 -163 -87 -113 77 309 75 140
5978 140 -112 -126 -136 184 346 379 375 176 -310 -143 -266 43 193 108 64 30 -121 -143 -164 -189 180 17 350 -170
6002 -170 93 -254 -170 -77 72 196 82 -7 -47 -303 -140 41 177 73 151 126 -31 -191 -157 -149 -128 227 478
6025 478 317 126 -154 -156 -231 33 -120 220 381 37 -281 -261 85 -95 -45 378 64 193 38 -391 -83 -165
6047 -165 289 86 388 67 65 -152 -5 -214 -152 61 297 247 -65 23 -158 -87 85 88 249 135 101 -145 -202
$$ packed form
5887A37Pl92M9J73J92R8k24J6l52J27j01Q2K06M11k21k25j5p6j92L9K84K52M1
5910C16j41j57k78N6k43O08Q2o4q4%j43k02L39k5K21l02M56k05m14n9K11j69K54
5933E7K08J3j63j23r7k19Q6M00j92L90j59j98r3j36J53l8L98j49J25l23p1r3O
5956b18J55J00K24N3k44j18l18L51PJ33J21j67l43K4K12j35P6k6J90K32k34O5
5978A40k52j4j0L20J62L3mj99m86J67j23L09J50q5m4l4j51k2k1k5L69j63L33n20
6002a70K63l47Q4R3J49J24j14q9m0k56J63J81J36j04P8k5j57j60L4QK1L55K51
6025D78j61j91k80kp5K64j53L40J61l44l18K0L46j80N0M23l14J29j55m29L08q2
6047a65M54k03L02l21kk17J47k09O2K13K36n0l12Q8j81P1J72LJ61j14l4k46n7
$$ plain form
6070 -202 -322 -130 137 -51 111 92 117 -205 -257 -48 30 215 183 72 -131 -222 -165 -246 114 224 354 97 192
6093 192 -165 -88 -316 -14 121 12 278 93 -131 -261 -329 -109 -129 -10 159 21 -82 -260 -281 -25 -20 121
6115 121 207 59 32 -292 11 87 -67 132 173 50 64 -89 -72 11 -18 84 345 155 10 -132 -101 -21 31 -2
6139 -2 336 88 -7 195 -313 -108 -97 129 147 226 27 -121 -174 -510 -114 211 3 46 197 115 -286 -304 -104
6162 -104 -132 108 359 131 42 -82 -268 -342 -66 235 189 270 147 7 -360 -211 -200 31 144 313 -10 66
6184 66 -240 -123 -32 -62 -38 232 282 -167 -121 -376 -187 -127 135 315 91 -33 -102 -355 -231 -44 212 212 198 -32
6208 -32 6 -154 -176 -132 -152 354 262 -34 -164 -166 -209 -223 75 68 240 385 218 -46 -431 -218 247 139 272 44
6232 44 110 -15 -186 -37 6 83 329 300 187 35 -74 -107 -21 143 313 236 -9 -222 -201 -2 -222 -91 225
$$ packed form
6070b02j20J92K67j88J62j9K5l22n2K09P8J85l2j11k03r1N7q1L60J10J30k57R5
6093A92l57P7k28L02J35j09K66j85k24j30o8K20k0J19J69j38j03j78k1K56NJ41
6115A21Q6j48k7l24L03P6j54J99M1j23J4j53J7Q3k9J02K61j90j45j42L1Q0N2l3
6139bL38k48r5K02n08K05J1K26J8P9j99j48n3l36L96L25k08M3J51q2m01j8K00
6162a04k8K40K51k28q9j24j86p4K76L01m6Q1j23j40l67J49J1K31J13J69l23P6
6184F6l06J17R1l0K4K70N0m49M6k55J89O0K62J80k24j24o9k53J24J87K56%j4k30
6208c2L8j60k2M4k0N06r2k96j30km3j4K98pJ72J45j67k64l85K13M65j08J33k28
6232D4O6j25j71J49M3P7K46k9j13j52j09l3Q6J64J70p7k45k13K1J99k20J31L16
$$ plain form
6255 225 188 213 132 -289 -102 11 -16 154 230 42 168 -155 -286 -109 125 65 295 246 23 9 -188 -22 61
6278 61 186 431 169 -6 -234 -76 -328 -87 163 356 202 123 227 -59 -273 -230 -83 111 193 254 43 -395
6300 -395 -121 -15 -224 64 128 -107 56 181 -176 -10 10 123 249 390 10 65 -190 -113 -327 189 220 199
6322 199 304 -82 -40 -411 -243 -7 22 255 98 39 3 -95 -9 -226 157 187 153 -74 -167 -75 -332 -130 46
6345 46 123 380 105 -238 -4 -394 -261 29 -34 347 -199 179 -15 -291 -8 186 109 263 191 -185 -112 -166
6367 -166 115 -6 67 89 170 -2 -149 -122 -138 68 24 292 193 -83 -292 -205 -291 -43 33 206 338 73 -48
6390 -48 -372 -179 -275 204 69 169 213 200 -167 -157 -48 -92 65 50 99 -225 123 -391 -363 -87 208 96 244
6413 244 -44 43 -244 -223 -210 -59 107 53 60 -76 -95 -176 -96 -112 330 489 21 29 -357 -188 -301 -139 -53 200
$$ packed form
6255B25l7K5q1m21J87J13k7J70P6j88J26l23j31J77K34o0K30m9k23j4j97J66Q3
6278F1J25K45k62j75k28J58k52K41K50J93j54p9J04k86k14M3J47J94Q2O1k11m38
6300c95K74J06k09K88O4k35J63J25l57J66K0J13J26J41l80N5k55P7k14N16L1k1
6322A99J05l86M2l71J68K36K9K33j57n9l6r8Q6k17L83L0l4k27r3R2k57K02J76
6345D6P7K57k75l43K34l90J33K90o3L81n46L78j94k76K83J94p7J54p2l76P3n4
6367a66K81j21P3K2Q1j72j47K7j6K06m4K68r9k76k09Q7q6K48P6J73J32k65j21
6390d8l24J93r6M79j35J00M4j3l67J0J09m4J57j5M9l24L48n14K8K76K95j12J48
6413B44k88Q7k87K1J3J51J66n4Pj36j9q1Q0j6M42J59m68Ql86J69j13J62Q6K53
$$ plain form
6437 200 115 -15 134 -478 -28 -1 257 256 431 39 -74 -25 -102 -121 -244 71 116 101 0 -105 -256 -251 210 339
6461 339 247 64 -19 -235 -173 -123 -103 38 -3 429 79 -121 -305 -141 30 376 211 211 189 275 -18 -388 -92
6484 -92 -132 232 93 2 15 101 -93 -45 -110 330 365 103 -98 223 -163 -197 -120 -27 305 161 52 -124 -182 -119
6508 -119 254 347 -17 222 149 -120 -181 -196 -70 131 104 19 -20 48 -204 -88 -184 200 88 241 192 -197 -308
6531 -308 -252 -111 120 118 25 190 -85 -111 -147 -75 -126 73 190 48 134 -118 -71 -187 -292 344 104 151 -27 -348
6555 -348 -24 -138 -236 -8 232 44 204 -23 -116 -362 -449 86 240 25 175 194 -166 -149 -73 -26 65 247 237
6578 237 261 -264 -222 -170 -28 218 170 176 100 -81 -8 -167 67 -9 128 354 -28 -261 -93 -43 -68 131 45 205
6602 205 54 -46 -244 -212 46 58 86 362 191 36 -250 -311 -171 -73 -28 312 385 130 -39 -183 -230 -202 254
$$ packed form
6437B00q5j30J49o12M50K7K58jJ75l92j13M9p7j9j23L15M5j5j01j05j51NM61J29
6461C39r2j83q3k16O2N0K0J41m1M32l50k00j84J64J71L46j65%k2Q6k93l70K96
6484i2m0L64j39r1J3Q6j94M8o5M40L5k62k01L21l86l4P7R3L32j44j09j76n8O3
6508a19L73R3l64K39p3k69o1j5J26K01k7q5l9O8k52J16r6L84j12J53m9l89j11
6531c08N6J41K31kr3J65k75k6l6P2n1J99J17j42Q6k52M7j16j05O36k40M7j78l21
6555c48L24j14r8K28K40j88J60k27r3k46q7N35J54k15J50J9l60J7P6M7R1J82j0
6578B37K4n25M2N2J42K46m8Op6j81P3j59K34p6J37K26l82k33J68N0k5J99q6J60
6602B05j51j00j98L2K58J2K8K76j71j55k86o1J40R8M5L40P3k55j69j44m7K8M56
$$ plain form
6625 254 216 149 194 59 -119 -146 -87 9 130 281 169 -73 -184 -115 -494 -114 16 252 108 -49 34 -217 -408
6648 -408 -55 362 -79 221 -176 -169 -120 -114 -189 45 272 365 -15 -171 -101 -105 -288 -41 333 213 305 107 -23 -309
6672 -309 -353 -62 202 126 126 123 -88 -311 -103 -83 158 168 390 195 -34 85 -79 -32 85 278 87 261 -319
6695 -319 -41 -131 -71 158 80 90 41 -307 -235 -119 -47 -75 234 219 69 -103 -117 -253 -29 -42 72 257 367 -48
6719 -48 -193 -47 -229 10 -67 353 302 309 -162 -27 -225 -56 209 133 200 43 5 -100 -308 -387 -66 245 358
6742 358 223 -66 -63 -206 -227 -77 43 146 128 81 -358 -277 -220 12 191 223 332 110 77 -237 -187 -44 78
6765 78 285 -1 47 50 -151 -416 -43 39 243 242 128 -65 -115 29 -377 -52 16 102 339 201 -157 -388 -52
6788 -52 -25 134 148 378 91 37 -232 -442 -128 10 159 222 130 -319 -239 -389 -96 13 67 213 107 -109 -258
$$ packed form
6625B54l8o7M5j35j78k7N9R6J21J51j12k42j11O9l79L80J30K36j44j57Q3k51j91
6648d08L53M17m41L00l97PM9Op5K34K27R3l80j56P0mj83K47L74j20R2j98j30k86
6672c09m4K91K64p6%lk11k23K08K0K41J0K22j95k29J19j64M7J17J93j91J74n80
6695c19K78r0O0K29p8J0m9l48P2J16P2k8L09j5j50j72j4j36K24j3J14J85J10m15
6719d8j45J46j82K39p7M20n1Pm71J35j98J69K65p6O7j57l8j05k08p9L21L11J13
6742C58j35k89Lj43k1J50J20J03j8m7m39Q1N7K32J79L2J09k22l3l14N0J43J22
6765G8K07k86M8Lk01k65L73Q2K04jj14j93n0J44m06L25O8Q6K37j38l58k31L36
6788e2K7J59J4K30k87n4k69k10L14J38J49O3r2m49Q0j50K93J09N4J46j06k16j49
$$ plain form
6811 -258 -227 -71 -19 -189 313 232 183 106 -191 -41 -339 125 281 124 143 -176 -667 -218 -154 100 176 107 105 -41
6835 -41 -251 -322 -91 -103 121 286 23 -207 -100 -87 -148 101 32 441 31 131 -215 -99 -182 -250 -39 233 109
6858 109 129 -65 -262 -150 -221 82 115 161 89 -146 -212 -210 -120 166 173 -31 242 -133 -273 -419 -131 -53 -1 353
6882 353 271 -10 -254 -162 -312 -105 83 399 -32 -88 -69 -204 -141 75 142 293 182 59 -112 -130 -228 -110 -13
6905 -13 343 236 145 -118 -147 -295 -140 57 227 75 156 -76 -193 -273 -157 -23 157 321 306 119 -118 -170
6927 -170 12 -95 -2 379 133 86 -151 -15 -264 -97 -41 118 226 -4 -44 -291 -311 -34 -180 342 164 103
6949 103 143 -149 -100 -198 -101 192 97 193 -37 -167 -267 -108 -95 259 323 140 154 -304 -348 -215 -199 37 8 51
6973 51 208 20 -395 -158 122 -21 221 103 34 39 -228 -28 -359 -90 317 545 -81 -15 -28 -308 -27 -62
$$ packed form
6811b58L1J56N2j70N02q1m9p7k97J50k98M64J56j57J9l19m91M49O4K54P6o9kj46
6835d1k10p1K31j2K24J65k63k30J07J3o1K49o9M09m10J00l46J16q3o8K11K72j24
6858A09K0j94j97J12p1L03L3M6p2k35o6KR0K86Pk04K73l75j40j46K88P8N2L54
6882C53q2k81k44R2j50K07J88L16m31n6J9j35O3K16O7J51j11j23j71j8r8J18R7
6905a3L56j07r1k63k9j48J55J97J70j52Q1k32j17q0J16J34J80J64j5j87k37n2
6927a70J82j07R3L81k46m7k37J36k49J67N6J59J08k30m0k47k0K77j46N22j78o1
6949A03M0k92M9r8R7K93r5R6k30j30j00J59J3L54O4j83J4m58m4J33J6K36k9M3
6973E1J57j88m15K37K80j43K42j18o9Nk67K00l31K69M07K28o26O6j3k80K81l5
$$ plain form
6995 -62 64 391 72 81 -21 -139 51 79 -32 376 233 -6 -9 -58 -171 -178 111 450 194 24 17 -124 -157 7
7019 7 -95 29 217 120 -69 -137 -133 -335 4 136 116 99 -39 -299 -5 -61 -224 -23 209 189 176 -201 -81 -124
7043 -124 9 262 157 261 213 -96 -326 -265 47 394 179 159 26 65 -110 1 -213 96 54 231 218 164
7065 164 -43 -516 -102 44 130 8 253 14 -152 -105 -217 -34 11 332 224 139 -16 -229 64 -107 -98 27
7087 27 53 157 47 -70 -191 -178 -49 118 231 319 75 -128 -328 -182 20 75 169 25 168 -161 -312 -112
7109 -112 -140 129 166 351 92 -121 -123 29 60 27 79 141 97 38 -301 -337 -127 28 222 227 110 130 -163 -130 -80
7134 -80 -71 59 -5 247 156 -214 -45 -74 -80 157 166 323 112 -288 -257 -128 -292 86 322 171 311 -101 57 -278
7158 -278 -110 145 63 266 189 21 -110 -361 -197 38 377 121 569 -53 -342 -30 -315 -126 15 138 278
$$ packed form
6995f2J26L27l19Rj02j18J90K8j11M08j43k39lm9j13pK89L39k56j70pj41l3J64
7019Gj02J24J88r7j89o8Mk02L39J32k0j7j38k60K94n6j63K01K32k0j3l77J20m3
7043a24J33K53j05J04m8l09k30O1L12L47k15k0j33L9j75J11k14L09m2J77j3n4
7065A64k07m73M14J46Q6j22K45k39j66M7j12J83M5L21j08q5j55k13K93j71RJ25
7087B7K6J04j10j17j21J3J29J67J13Q8k44k03k00J46K02N5R4j44J43l29j51K00
7109a12k8K69L7J85k59k13kJ52L1l3N2O2m4n9l39l6K10J55J94Nj17K0k93L3N0
7134h0RJ30o4K52r1l70J69k9oK37RJ57k11m00L1J29j64L78K36j51J40m12J58l35
7158b78J68K55q2K03p7j68j31k51J64K35L39k56M48o22k89L12k85J89J41J23J40
$$ plain form
7179 278 169 -37 -78 -88 -159 72 259 305 294 -83 58 45 -46 254 56 178 125 68 -208 32 -42 -235 159
7202 159 333 -69 -27 -152 -280 -83 -166 -2 240 115 48 -147 -136 -294 -243 190 114 77 132 -84 -203 -220 -147
7225 -147 82 4 280 171 -60 -109 -192 -121 -60 -46 18 152 127 -100 -79 -61 -80 166 273 30 146 159 -289 -28
7249 -28 -143 14 144 183 77 -166 -263 -157 33 156 71 -166 288 168 -154 -251 -59 -70 -100 125 244 52
7271 52 -150 -159 -81 -156 79 217 31 -49 34 -140 -235 -214 108 167 257 -16 -10 -187 -149 -74 -61 87 -242 170 66
7296 66 -242 -186 6 213 392 151 257 -34 -205 -272 -148 113 73 116 32 68 -27 23 -124 261 77 -6 149
7319 149 89 -252 -12 -177 235 78 106 217 123 97 -208 -111 -84 112 255 102 52 -184 -3 -159 -41 -63 46
7342 46 126 208 123 -2 -115 -126 -1 294 184 151 -92 -172 -184 -228 -22 129 53 107 72 -132 -264 -90 0 109
$$ packed form
7179B78j09k06m1j0p1K31J87M6j1l77J41j3r1L00j98J22n3n7k76K40p4j93L94
7202A59J74m02M2j25j28J97q3J64K42j25o7j95J1j58N1M33p6l7N5k16j19j7P3
7225a47K29p8K76j09k31m9q3P1O1J4O4J34k5k27K1J8j9K46J07k43J16J3m48K61
7249b8j15J57J30L9j06k43r7J06J90J23q5k37M54j20l22r7J92j1l0K25J19j92
7271E2k02rP8p5K35J38j86q0Q3j74r5K1L22N9R0k73Oj77L8P5J3J48l29M12j04
7296F6l08N6J92K07J79k41J06k91j71o7J24K61m0M3q4L6r5N0j47L85j84q3J55
7319A49o0l41K40j65M12j57K8J11r4k6l05R7K7J96J43j53n0k36J81j56J18k2J09
7342D6Q0Q2q5j25j13j1J25K95j10l3k43q0j2m4K06J51p6N4l5k04j32J74R0J09
$$ plain form
7366 109 213 -39 -9 -14 -183 -160 -6 142 156 228 358 -22 -143 48 -151 -76 33 160 48 184 -93 -245
7388 -245 -8 68 -22 263 284 351 53 -94 -175 59 11 78 12 113 34 -47 -320 23 48 1 135 261 27 -54
7412 -54 -99 -147 92 -1 143 160 215 -81 -173 -197 43 115 67 168 -131 -40 -41 -133 -288 -17 74 261 129 34 -305
7437 -305 49 -151 -140 -15 270 166 -41 -125 -207 -114 -240 -4 226 1 92 -31 -113 -106 -78 5 16 -1 105 -83
7461 -83 -234 96 114 69 -42 90 59 -330 -280 -226 -97 -99 12 148 -27 112 -251 -236 -82 -90 115 202 313 183
7485 183 -86 -284 14 -11 -24 135 94 156 -131 -294 -332 106 69 170 96 -246 -145 -182 -66 180 255 -211 -29
7508 -29 -18 -67 -341 -7 -63 -135 -43 181 111 294 -244 -106 -5 -99 51 114 173 -77 -77 56 -191 -10 146 306
7532 306 -60 49 -116 -12 -252 -158 45 -11 5 103 -62 97 -192 -145 79 -68 125 204 -138 -170 -73 14 -53
$$ packed form
7366A09J04k52L0nj69K3J54J48J4P2J30l80j21J91j99P5J09J27j12J36k77j52
7388b45K37P6r0K85K1O7k98j47q1K34m8O7o6J01p9q1k73L43K5m7J34J26k34q1
7412e4m5m8K39r3J44J7N5k96r2k4K40P2m8J01k99R1jr2j55K71R1J87j32r5l39
7437c05L54k00J1J25K85j04k07q4q2R3j26K36K30k25R1j23q2PK8Q3J1j7J06j88
7461h3j51L30J8m5j11J32l1l89N0N4J29kJ11J36j75J39l63J5J54qK05Q7J11j30
7485A83k69j98K98k5j3J59m1O2k87j63l8M38l7J01p4l42J01l7J16K46P5m66J82
7508b9J1m9k74L34n6p2R2K24p0J83n38J38J01r4J50O3N9k50%J33k47J81J56J60
7532C06l66J09j65J04k40R4K03n6J6R8j65J59k89M7K24j47J93P9l42l2R7Q7o7
$$ plain form
7555 -53 163 169 121 61 -66 -173 -216 -316 162 295 201 189 -41 -239 -106 -39 89 288 193 193 -229 -101 -27 -88 -46
7580 -46 -2 32 205 6 16 -150 -239 8 -57 99 75 89 -333 -158 -164 -162 130 -29 205 137 -167 -108 -199 -6 2 272
7606 272 251 92 163 -19 -190 -75 -47 147 140 32 -53 -118 -63 147 20 112 59 -7 -170 83 -228 -152 54 311
7630 311 199 80 -61 -111 -219 -181 -46 52 -102 -61 109 -197 -32 -363 -47 99 115 154 2 247 -82 -126
7652 -126 -154 -265 104 99 45 121 72 -81 -214 -104 105 -3 292 93 -73 -184 93 44 122 -81 -46 129 -163
7675 -163 -390 -119 -167 31 381 128 222 -69 -186 -41 -172 -124 168 233 367 49 -67 -192 -33 16 124 -41
7697 -41 157 250 -148 -204 18 -89 103 190 207 1 -54 -179 -107 204 211 -57 -147 23 24 -6 12 -87 68 -79 133
7722 133 90 -39 93 -209 146 189 118 188 171 48 29 5 -158 -53 84 180 26 -104 62 -265 -47 -189 224
$$ packed form
7555e3K16Om8o0j27j07m3j00M78J33r4j2k30j98J33O7J28J99r5%m22J28P4o1M2
7580d6M4L4J73j99J0j66q9K47o5J56k4J4m22J75oKK92j59K34o8l04N9r1J93QK70
7606B72k1j59P1j82j71J15K8J94pj08q5o5N5K10j27R2n3o6j63K53l11P6K06K57
7630C11j12j19j41n0j08L8J35R8j54M1J70l06J65l31L16J46J6L9j52K45l29m4
7652a26k8j11L69nn4P6m9j53j33J10K09j08K95j99j66j11K77m9P8k03L5J75k92
7675a63k27K71m8J98L50k53R4k91j17J45j31M8K92O5J34l18j16j25J59M9J08j65
7697d1J98R3l98n6K22j07J92Q7J7k06n5j25P2L11Pk68r0J70Jl0J8r9J55j47K12
7722A33m3j29J32l02L55M3p1P0j7j23j9k4j63J05J37R6j54j30J66l27K18j42M13
$$ plain form
7745 224 22 43 -94 -167 -269 -129 93 -95 252 32 -54 128 -142 -137 -236 86 -130 284 196 -85 -205 -279 -73
7768 -73 -36 299 104 84 16 -251 -253 -90 59 -5 144 244 106 134 14 -84 -227 99 -55 35 171 -140 49
7791 49 -310 -66 -25 95 66 248 53 107 73 -137 -40 166 -31 -117 -278 56 38 -146 -163 150 -181 34 269
7814 269 -7 -174 -25 -147 -99 -19 50 -141 87 61 -256 -48 -61 133 200 99 -177 -368 -194 -158 -80 115 219
7837 219 85 225 -233 -116 -36 -42 -153 -138 20 124 -146 -44 44 -157 2 40 80 150 -66 31 -1 -90 69 205
7861 205 28 7 -77 75 -103 27 218 115 317 42 -221 -179 -375 -96 -56 142 201 233 55 -66 -30 -69 -114
7884 -114 175 -58 213 195 -145 -30 -90 -157 40 215 210 -6 -8 -13 -140 -315 76 -9 -182 67 -110 -144 -299 -53
7908 -53 -186 202 155 171 248 -150 -23 -86 195 -112 214 126 222 87 -26 65 25 -18 137 253 22 -200 52
$$ packed form
7745B24k02K1j37p3j02J40K22j88L47k20q6J82k70Nr9L22k16M14q8k81j20p4K06
7768g3L7L35j95k0o8k67kJ63J49o4J49J00j38K8j20r8j43L26j54R0J36l11J89
7791D9l59K44M1J20k9J82j95N4l4k10R7K06j97q6j61L34j8j84j7L13l31K15K35
7814B69k76j67J49j22M8Q0O9j91K28k6l17K08j3J94O7j01k76j91J74L6P8J95J04
7837B19j34J40m58J17Q0oj11J5J58J04k70J02Q8k01J59L8M0P0k16R7l2q9J59J36
7861B05j77k1q4J52j78J30J91j03K02k75k63M2j96K79M0J98N9L2j78j21L6l9m5
7884a14K89k33K71j8l40J15o0o7J97J75nk16knj27j75L91q5j73K49j77l4j55K46
7908e3j33L88m7J6P7l98J27o3K81l07L26q8R6j35j13R1m0m3J55J16k31k22K52
$$ plain form
7931 52 -54 -24 -101 102 251 17 -70 -34 -87 -91 -159 63 -49 -58 -7 -99 -175 -3 64 115 291 70 60 108 -31 -169
7957 -169 -63 94 229 36 -149 -16 -295 -70 -98 -51 -54 121 162 98 189 -87 97 11 -20 92 114 49 -85 55
7981 55 -51 108 -49 38 20 192 -101 -120 72 39 190 143 -19 209 -27 -29 -178 -292 -22 1 -2 69 255 -79
8005 -79 203 143 -67 -153 -188 152 -179 -89 22 -10 114 57 -14 -95 129 48 -136 -13 -143 -19 77 79 100 111 11
8030 11 117 -206 -118 147 25 99 -155 103 -169 -101 -39 -3 51 290 56 -243 -119 -111 171 -33 72 266 -11
8053 -11 -38 -78 -57 -1 -17 254 -108 106 -82 -223 4 -64 -112 440 -42 75 131 -273 -41 -39 -30 147 -60 110
8077 110 -64 -111 -141 -17 90 -190 204 -279 -108 -245 -171 -129 -93 -29 34 -88 163 -127 16 -254 -121 238
8099 238 134 -99 111 -102 19 -140 34 252 175 211 -4 -183 -56 -229 52 -162 95 33 134 143 120 -134
$$ packed form
7931E2j06L0p7K03J49k34q7L6n3mo8K22j12rN1r2p6J72O7N1J76k21j0M8j39j38
7957a69J06J57J35j93j85J33k79K25k8M7lJ75M1o4R1k76J84q6l1J12K2o5j34J40
7981E5j06J59j57Q7j8J72k93j9J92l3J51m7j62K28k36kj49j14K70K3lP1J86l34
8005g9K82o0k10q6l5L40l31R0J11l2J24n7p1q1K24q1j84J23j30J24R6KK1J1j00
8030A1J06l23Q8K65j22P4k54K58k72O8O2L6N4K39k34k99J24QK82k04J05J94k77
8053a1k7m0K1N6j6K71l62K14j88j41K27o8m8N52m82J17N6m04K32KRJ77k07J70
8077A10j74m7l0J24J07k80L94m83J71j37P4M2L6O4O3j22K51k90J43k70J33L59
8099B38j04k33K10k13J21j59J74K18p7L6k15j79J27j73K81k14K57o2J01Rk3k54
$$ plain form
8121 -134 85 -319 174 -58 145 58 27 168 -242 2 -71 299 5 215 1 -160 -4 -1 76 -39 294 40
8143 40 58 109 -144 -53 19 -151 279 -171 43 -64 -61 -33 44 -47 0 173 -22 2 88 -10 -181 -132 -29 135 -29
8168 -29 -67 -33 -47 -63 -71 -78 70 146 -229 -38 -66 -3 -230 90 -37 70 54 -96 -239 -18 -15 188 -47
$$ packed form
8121a34K19m04M93k32K03q7l1J41m10K44p3L70k94K10k14j61J56LP7j15L33k54
8143D0J8N1k53R1P2j70M30m50K14j07LK8P7r1M7J73j95K4Q6r8j71M9J03J64j64
8168b9l8L4j4j6qpJ48P6l75J91k8O3k27L20j27J07j6j50j43K21LK03k35
8191d7
$$ Imaginary data points
##PAGE= N=2
##DATA TABLE= (X++(I..I)), XYDATA
$$ plain form
0 0 0 0 0 0 0 0 0 0 0 -8 8 -8 16 -16 24 -32 32 -48 54 -64 80 -90 112 -129 153 -181 209 -241 280 -318 367
31 367 -415 473 -537 603 -682 766 -856 960 -1067 1192 -1323 1466 -1627 1797 -1985 2193
47 2193 -2414 2661 -2933 3229 -3561 3923 -4327 4784 -5295 5877 -6546 7321 -8240 9334
61 9334 -10682 12379 -14584 17600 -21981 28959 -41896 74171 -338194 -436691 121111 381750
73 381750 710137 415208 42447 -406758 -671927 -481591 -73405 374637 642570 466317
83 466317 173272 -320558 -606655 -518948 -220279 297001 572170 503009 286181 -248821
93 -248821 -525430 -506018 -351739 176620 529060 515769 337366 -122926 -438674 -529642 -393922
104 -393922 64662 415985 552220 391276 -39925 -328994 -528707 -437343 -24213 296136
$$ packed form
0@%%%%%%%%%qJ6j6K4l2M0n6O4q0J02j18J44j70K02k41K82l34L90m50N21n98O85
31C67p82Q88j010J140j285J448j622J816k027K259k515K789l093L424l782M178
47B193m607N075n594O162o790P484q250R111j0079J1172j2423J3867j5561J7574
61I334k0016K3061k6963L2184l9581N0940p0855J16067m12365r8497N57802K60639
73C81750L28387k94929l72761m49205k65169J90336M08186M48042K67933j76253
83D66317k93045m93830k86097Q7707K98669N17280K75169o9161k16828n35002
93b48821k76609J9412J54279N28359L52440j3291j78403m60292l15748r0968J35720
104c93922M58584L51323J36235j60944m31201k89069j99713R1364M13130L20349
$$ plain form
114 296136 539802 446506 47473 -242993 -501700 -461081 -117698 196133 496771 468846
124 468846 153368 -163216 -471253 -454558 -198860 104269 443911 468047 249532 -80730
134 -80730 -428719 -438648 -268767 19768 384011 450491 313986 5279 -362498 -435798 -324958
145 -324958 -41867 299991 422313 372310 72446 -280151 -407897 -379889 -100665 228670
155 228670 382876 404743 142607 -191342 -374145 -412840 -158661 152771 342919 413928
165 413928 199329 -103319 -334319 -422495 -216209 68391 306994 407803 239821 -15032
175 -15032 -286444 -416569 -258876 -12407 261850 397523 274105 57570 -229165 -392032
185 -392032 -296747 -83896 209045 373038 305413 117723 -172940 -354513 -326133 -149013
$$ packed form
114B96136K43666r3296l99033k90466k58707M0619L43383L13831L00638k7925
124D68846l15478l16584l08037J6695K55698L03129L39642K4136k18515l30262
134h0730l47989r929J69881K88535L64243O6480j36505l08707l67777p3300J10840
145c24958K83091L41858J22322n0003k99864l52597j27746K8008K79224L29335
155B28670J54206K1867k62136l33949j82803l8695K54179L11432J90148P1009
165D13928k14599l02648k31000q8176K06286K84600K38603J00809j67982k54853
175a5032k71412j30125J57693K46469K74257J35673j23418k16535k86735j62867
185c92032R5285K12851K92941J63993o7625j87690k90663j81573K8380J77120
$$ plain form
195 -149013 150260 336042 329023 170830 -115796 -310199 -341564 -201875 87239 291409
205 291409 344699 219788 -55140 -261420 -343453 -243668 21424 242770 345689 256357 8553
216 8553 -212631 -340339 -271352 -41716 184991 335980 283591 66678 -160246 -323418 -293265
227 -293265 -99834 132742 313135 300086 127447 -105044 -298557 -303523 -151215 76260
237 76260 281456 310190 175735 -49874 -259330 -310349 -200727 24371 239171 305191 220399
248 220399 4833 -219226 -302794 -236780 -34126 194578 300612 249054 56165 -164015
258 -164015 -290575 -266182 -80376 143295 280082 275254 106232 -117619 -267089 -278516 -132414
269 -132414 85988 259268 286066 145905 -61331 -238084 -289584 -170385 33699 220620
$$ packed form
195a49013K99273J85782p019j58193k86626j94403l1365J39689K89114K04170
205B91409N3290j24911k74928k06280q2033R9785K65092K21346J02919q9332k47804
216H553k21184j27708O8987K29636K26707J50989n2389k16913k26924j63172L0153
227b93265J93431K32576J80393j3049j72639k32491j93513m966J52308K27475
237G6260K05196K8734j34455k25609k09456n1019J09622K25098K14800O6020q4792
248B20399k15566k24059q3568O6014K02654K28704J06034n1558j92889k20180
258a64015j26560K4393J85806K23671J36787m828j69022k23851j49470j1427J46102
269a32414K18402J73280K6798j40161k07236j76753n1500J19199K04084J86921
$$ plain form
279 220620 290340 190356 -11377 -204109 -281189 -204043 -21442 182341 284311 221440 41919
290 41919 -162278 -273117 -229985 -67476 134598 264811 246813 89389 -118336 -255312
300 -255312 -249672 -109115 88755 237150 260414 135898 -71293 -230135 -257969 -147421 43809
311 43809 209581 261737 170529 -18390 -197496 -264424 -179719 2095 173326 253423 200675
322 200675 29322 -162792 -256252 -206878 -47326 139435 244841 214114 73852 -111875
332 -111875 -243694 -231520 -84975 99141 224342 231163 112825 -69729 -216295 -241401 -129481
343 -129481 55142 205225 236562 140530 -25550 -183268 -246501 -165132 12941 174836 236592
354 236592 171044 12715 -151701 -234242 -190545 -35805 142666 234519 192219 50510 -113941
$$ packed form
279B20620O9720r9984k01733j92732p7080P7146J82601K03783J01970o2871j79521
290D1919k04197j10839M3132J62509K02074J30213j7998j57424k07725j36976
300b55312N640J40557J97870J48395K3264j24516k07191j58842k7834J10548J91230
311D3809J65772N2156r1208j88919j79106o6928Q4705J81814J71231Q0097n2748
322B00675j71353j92114r3460M9374J59552J86761J05406l0727j40262j85727
332a11875j31819J2174J46545J84116J25201O821j18338j82554j46566k5106J11920
343a29481J84623J50083L1337r6032j66080j57718o3233Q1369J78073J61895O1756
354B36592o5548j58329j64416q2541M3697J54740J78471R1853m2300j41709j64451
$$ plain form
365 -113941 -220005 -208009 -77116 100412 220000 212431 86762 -79861 -200856 -216159 -114223
376 -114223 54774 198364 225284 120455 -42034 -177183 -219329 -141901 14112 167482
386 167482 228083 155587 -3021 -154025 -214618 -163158 -26470 134014 220899 179604 38055
397 38055 -124698 -210384 -180716 -59806 97837 203230 197204 78408 -90568 -198968 -194321
408 -194321 -89987 62534 182206 207922 112857 -48983 -177001 -207311 -118909 30588 154440
419 154440 207237 142923 -8587 -150290 -211057 -147236 -5371 127904 201006 162890 31548
430 31548 -116357 -205655 -170391 -42125 102313 191365 173796 69425 -80358 -193317 -183943
441 -183943 -78497 69820 180522 181057 97487 -43900 -171874 -192865 -112426 34705 161932
$$ packed form
365a13941j06064J1996J30893J77528J19588p569j25669j66623j20995j5303J01936
376a14223J68997J43590K6920j04829j62489j35149m2146P7428J56013J53370
386A67482O0601p2496j58608j51004o0593N1460J36688J60484Q6885m1295j41549
397C8055j62753q5686K9668J20910J57643J05393o026j18796j68976j08400M647
408a94321J04334J52521J19672K5716r5065j61840j28018l0310Q8402J49497J23852
419A54440N2797o4314j51510j41703o0767O3821J41865J33275P3102l8116j31342
430C1548j47905q9298L5264J28266J44438Q9052j7569j04371j49783j12959R374
441a83943J05446J48317J10702N35q3570j41387j27974k0991Q0439J47131J27227
$$ plain form
452 161932 186420 121423 -11655 -143199 -192985 -141465 -75 136101 188046 146272 17557
463 17557 -112528 -183420 -163861 -34808 105117 182257 166370 45872 -83914 -170755 -176002
474 -176002 -67780 69649 170959 178889 74400 -52687 -157350 -180793 -94385 32781 154679
485 154679 185501 102494 -20443 -141341 -178872 -115699 -2637 131882 184651 127121 12830
496 12830 -120249 -175036 -136233 -33468 105087 172787 148572 46556 -97335 -165867 -150570
507 -150570 -62143 76725 158721 162819 75699 -66143 -150663 -164047 -85638 48997 138591
518 138591 170547 101215 -33477 -132797 -172208 -105855 16696 116730 173442 117928 -1064
529 -1064 -108161 -175126 -124765 -12042 94824 168852 133149 31487 -83784 -167809 -137835
$$ packed form
452A61932K4488o4997j33078j31544m9786N1520J41390J36176N1945m1774j28715
463A7557j30085p0892J9559J29053J39925P7140j5887j20498j29786q6841n247
474a76002J08222J37429J01310P930j04489j27087j04663k3443Q6408J27166J21898
485A54679L0822q3007j22937j20898l7531O3173J13062J34519N2769n7530j14291
496A2830j33079n4787L8803J02765J38555O7700k4215j02016j43891o8532J5297
507a50570Q8427J38868Q1996M098q7120j41842q4520j3384P8409J34635Q9594
518A38591L1956o9332j34692r9320l9411O6353J22551J00034N6712n5514j18992
529a064j07097o6965N0361J12723J06866P4028l5703j01662j15271q4025K9974
$$ plain form
540 -137835 -44200 72554 160730 142055 62108 -58085 -155355 -147070 -74894 47351 146194
551 146194 147142 88834 -33088 -137674 -151000 -101887 20568 127757 150587 111044 -6350
562 -6350 -114274 -151779 -121503 -4713 102582 151191 130123 17308 -88369 -147763 -138007
573 -138007 -30270 75856 144924 142273 42438 -61337 -141209 -147396 -54689 47109 135685
584 135685 149470 67190 -33016 -130101 -149721 -78240 18820 123648 149447 89607 -3165
595 -3165 -115574 -149087 -98392 -9198 105601 145867 107788 21743 -95088 -143318 -117644 -34019
607 -34019 85215 137766 123163 45225 -71121 -132367 -132163 -54735 61020 125829 136975 65095
619 65095 -47496 -115846 -141660 -77076 36112 110967 141895 83295 -21266 -100837 -144133
$$ packed form
540a37835R3635J16754Q8176j8675p9947j20193r7270Q285P2176J22245R8843
551A46194R48n8308j21922j04586j3326M9113J22455J07189K2830l9543j17394
562f350j07924l7505L0276J16790J07295M8609k1068j12815j05677n9394R756
573a38007J07737J06126O9068k651r9835j03775p9872o187R2707J01798Q8576
584A35685J3785q2280j00206r7085j9620P1481R7060J04828K5799n9840r2772
595c165j12409l3513N0695Q9194J14799M0266l8079q6045j16831m8230K5674Q3625
607c4019J19234N2551j4603p7938j16346o1246K04P7428J15755O4809J1146p1880
619F5095j12591o8350k5814O4584J13188P4855L0928n8600j04561p9571m3296
$$ plain form
630 -144133 -93537 7149 94346 143832 98070 5331 -84429 -139999 -105182 -22070 76663 141607
642 141607 109084 32299 -65541 -134706 -113432 -45752 54115 131554 120109 55603 -47497 -123380
654 -123380 -119248 -68490 32050 117042 126066 76352 -25545 -107868 -125206 -85007 13231 96422
666 96422 127534 97732 -3953 -91213 -124486 -99656 -9137 76999 125200 109079 19471 -68979
678 -68979 -124461 -111644 -28135 54800 117247 117856 42339 -46685 -117792 -118966 -48721 34867 108711
691 108711 120329 62412 -21971 -106220 -123309 -67807 15102 96586 119320 79476 -419 -90403
703 -90403 -122284 -87788 -5600 83308 114259 92426 21329 -73029 -116518 -100328 -28078 66101
715 66101 112024 102015 37992 -50815 -107436 -111092 -46582 46024 103641 110311 53700 -31494
$$ packed form
630a44133N0596J00686Q7197M9486m5762r2739q9760n5570L4817Q3112R8733O4944
642A41607l2523p6785r7840o9165K1274O7680R9867P7439j1445o4506j03100p5883
654a23380M132N0758J00540Q4992R024m9714j01897q2323j7338M0199R8238Q3191
666I6422L1112k9802j01685q7260l3273K4830R0519Q6136M8201j6121q9608q8450
678f8979n5482J2817Q3509Q2935O2447O09p5517q9024p1107j174P0245Q3588P3844
691A08711J1618n7917q4383q4249j7089N5502Q2909Q1484K2734l9844p9895q9984
703i0403l1881L4496Q2188Q8908L0951k1833p1097r4358m3489J6190P2250R4179
715F6101M5923j0009o4023q8807n6621l656O4510R2606N7617O670n6611q5194
$$ plain form
727 -31494 -95865 -115157 -64654 21678 93592 115928 66397 -11333 -81154 -116048 -78949 59
739 59 78305 116722 82174 7733 -67743 -110051 -89617 -22862 62067 112617 93155 28240 -52914
752 -52914 -104688 -96803 -41471 41542 103243 102974 46902 -36817 -95627 -101411 -57455 22762 90662
765 90662 107135 65155 -17340 -85291 -104082 -69407 4789 75065 107506 80015 1954 -71823
777 -71823 -104269 -81392 -12700 59681 102205 89749 23134 -55664 -102548 -89990 -29179 43742
789 43742 96089 95594 40930 -36497 -95151 -97181 -45051 28115 87063 98097 56826 -17013 -84742
802 -84742 -101510 -60864 10715 75997 98718 68402 435 -69729 -101381 -75294 -6000 63779
814 63779 96093 78727 18105 -54371 -96796 -84685 -24076 49381 93297 86097 32205 -37829
$$ packed form
727c1494o4371j9292N0503Q6332P1914K2336m9531p7730o9821l4894L7099P9008
739E9P8246L8417l4548p4441p5476m2308K0434O6755Q4929N0550j9462o4915q1154
752e2914n1774P885N5332Q3013O1701k69n6072q3719n8810n784M3956Q0217O7900
765I0662J6473m1980q2495o7951j8791L4675P4196P0276L2441k7491p8061p3777
777g1823l2446K2877O8692P2381M2524j2456o6615p8798m6884J2558O0811P2921
789D3742N2347m95n4664p7427n8654k030N2130P3166N8948J1034m1271p3839o7729
802h4742j6768M0646P1579O5282K2721l0316o7967p0164l1652K6087O9294O9779
814F3779L2314j7366o0622p2476m2425J2111O0609P3457M3916p200n3892p0034
$$ plain form
826 -37829 -88834 -92118 -41096 33177 85969 90638 47068 -22042 -80033 -94102 -55885 13718
838 13718 76747 94826 59498 -6031 -67308 -93787 -68287 -3463 63973 94306 71551 10784
850 10784 -55599 -90488 -76715 -20974 48177 90589 80743 25972 -41508 -85395 -83485 -35957
862 -35957 32556 83029 86853 41300 -26365 -78154 -86721 -48305 17042 73252 89659 55453
874 55453 -10635 -68566 -88173 -59888 1407 61834 88849 66197 5666 -57063 -87770 -69525
886 -69525 -13605 49031 85584 74719 21719 -43073 -83483 -76650 -28215 35579 79988 79881 36129
899 36129 -27926 -77382 -81598 -41389 20592 72570 83205 47763 -13225 -67910 -84707 -54082
911 -54082 6056 62098 83060 59518 1721 -57353 -82650 -63577 -9247 51255 82021 68200
$$ packed form
826c7829n1005l284N1022P4273N2792M669m3570o9110n7991j4069L8217O9603
838A3718O3029J8079l5328o5529o1277k6479K5500O4824O7436L0333k2755o0767
850A0784o6383l4889J3773N5741O9151M2412r846n4771o7480m3887J910M7528
862c5957O8513N0473L824m5553o7665n1789q567L8416O5347N6210J6407l4206
874E5453o6088n7931j9607K8285O1295O0427K7015k2652o0531o2729l0707J8245
886f9525N5920O2636L6553j0865n3000o4792m0410O833M8435O3794M4409j07m3752
899C6129o4055m9456m216M0209O1981N1978J0635l5442o0988n4685j6797L0625
911e4082O0138N6042K0962k3542n7797n9074k5297J9073N4330O0502L0766j3821
$$ plain form
923 68200 16264 -43980 -79338 -72248 -22817 37879 76174 75031 29761 -32059 -74087 -76521 -36738
936 -36738 23322 70433 78659 41858 -16306 -66227 -80303 -47018 9637 61152 80379 53227
948 53227 -1828 -56886 -80054 -56699 -4967 51383 78743 61017 12645 -45758 -78538 -64894
960 -64894 -18579 39291 74473 67970 26183 -33475 -72904 -70965 -31851 27916 68832 72399 38604
973 38604 -19877 -64913 -74801 -43338 14365 60375 75122 48317 -6905 -54890 -76332 -54422
985 -54422 730 50933 75005 56532 5884 -43979 -74491 -61717 -13009 40023 73858 63391
997 63391 18714 -32407 -70022 -66581 -26696 27764 69537 67296 30961 -20700 -64903 -68750 -38448
1010 -38448 13207 62348 70670 42070 -8979 -57052 -69034 -48600 1247 53273 70966 52848
$$ packed form
923F8200n1936o0244l5358P090M9431O0696L8295j143m5270o1820m2028k434L9783
936c6738O0060M7111Q226l6801n8164m9921j4076L3285N6655N1515J9227k7152
948E3227n5055n5058k3168K3355N1732N6350K7360j7726m8372n8403l2780J3644
960f4894M6315N7870L5182o503m1787n9658l9429J939L9114N9767M0916L567l3795
973C8604n8481m5036r888L1463N7703M6010J4747k6805n5222m7985k1442K1910
985e4422N5152N0203K4072j8473n0648m9863l0512J2774M8708N3032L3835j0467
997F3391m4677n1121l7615L441L9885N4460M1773k241l6335n1661m4203l847L0302
1010c8448N1655M9141Q322k8600n1049m8073j1982K0434M9847N2026J7693j8118
$$ plain form
1022 52848 3162 -47908 -67982 -55866 -10449 41100 68919 61647 14466 -37420 -64886 -62675
1034 -62675 -21397 29643 63109 66864 26813 -25599 -62020 -66941 -30416 16604 57448 69328
1046 69328 37194 -11899 -56093 -68831 -39516 5064 50507 68797 45651 2502 -47961 -69837
1058 -69837 -47978 -6672 41345 66157 52821 14810 -38257 -66739 -55996 -18709 33148 62262
1070 62262 57890 25995 -26198 -60710 -62334 -29566 23733 56124 61615 35851 -15429 -53246
1082 -53246 -65183 -40192 11554 49661 63935 42382 -4047 -43523 -66121 -48675 -477 41285
1094 41285 64643 48986 7628 -34632 -63780 -53251 -13633 31374 64101 54467 17676 -24617
1106 -24617 -59487 -57538 -25617 20795 59434 57641 28441 -15786 -54667 -58423 -35441 9346
$$ packed form
1022E2848m9686n1070k0074J2116M5417N1549K7819p272m7181n1886k7466K211
1034f2675M1278N1040L3466L755m0051n2412l6421m921L6525M7020M0844J1880
1046F9328l2134m9093m4194j2738K9315M4580M5443J8290k3146m3149n0463k1876
1058f9837K1859M1306M8017K4812j3336l8011n3067k8482J0743L7287N1857K9114
1070F2262m372l1895n2193l4512j624L2768N3299L2391N491k5764n1280l7817
1082e3246j1937K4991N1746L8107J4274k1553m6429l9476k2598J7446M8198M1762
1094D1285K3358j5657m1358m2260k9148J0529L9618M5007L2727r634l6791m2293
1106b4617l4870J949L1921M6412L8639j793k9200m4227l8881l756K2982M4787
$$ plain form
1118 9346 52589 60515 38597 -6756 -47736 -57984 -43744 -658 43979 60277 47307 3991
1130 3991 -39763 -57847 -49583 -10035 33145 58102 54290 13630 -30291 -55861 -54531 -19175 22742
1143 22742 54007 58259 24082 -18453 -52683 -57926 -27230 12404 48602 60090 33501 -7381
1155 -7381 -47095 -59186 -35532 2319 42408 58235 40867 4066 -40239 -58466 -43073 -7871
1167 -7871 35115 55779 46569 14611 -31337 -55773 -48989 -17625 27109 52247 51124 23544 -21277
1180 -21277 -50746 -53976 -26546 17404 47156 54077 30947 -11179 -44191 -56247 -34911 7295
1192 7295 41268 55443 37257 -1314 -36709 -56400 -41351 -3230 34083 55462 43083 8582
1204 8582 -28859 -54037 -45943 -13694 25793 53112 47101 17647 -21139 -50401 -49339 -23259 16997
$$ packed form
1118I346M3243P926k1918m5353m0980j0248J4240M3086M4637J6298j2970m3316
1130C991m3754j8084Q264L9548M3180K4957l812m0660m3921k5570J330L5356M1917
1143B2742L1265M252l4177m2535l4230n243L0696L9634L6198J1488k6589m0882
1155g381l9714j2091K3654L7851M0089J5827j7368l6801m4305j8227J5393L5202
1167g871M2986K0664r210l1958m5948k4436O784L1364M4734K5138j123k7580m4821
1180b1277k9469l230K7430M3950K9752O921k3130m2126l3012j2056K1336M2206
1192G295L3973J4175j8186l8571l5395j9691J5049L8121L7313K1379j2379l4501
1204H582l7441k5178Q094L2249L9487K7319o011k9454l8786k9262J062K6080M0256
$$ plain form
1217 16997 48711 50175 26740 -12569 -45262 -50750 -31124 7808 42688 51759 34411 -3733
$$ packed form
1217A6997L1714J464k3435l9309l2693n488J9626L8932L4880R071j7348l8144
$$ [...]
8191B1
##END NTUPLES=NMR FID
##END=
