##TITLE=1H_11P153_k5D2O
 aceton-d6
 8 sc, 
 27.9.2023
##JCAMPDX= 6.0         $$ Bruker NMR JCAMP-DX V2.0
##DATA TYPE= NMR FID
##DATA CLASS= NTUPLES
##ORIGIN= UXNMR, Bruker Analytische Messtechnik GmbH
##OWNER= root
$$ XWIN-NMR		Version 3.5
$$ Wed Sep 27 16:38:53 2023 Russian Standard Time (UT+4h)  she@DPX200
##.OBSERVE FREQUENCY= 200.13135
##.OBSERVE NUCLEUS= ^1H
##.DELAY= (6, 6)
##.ACQUISITION MODE= SIMULTANEOUS
##.ACQUISITION SCHEME= undefined
##.AVERAGES= 8
##.DIGITISER RES= 18
##SPECTROMETER/DATA SYSTEM= spect
##.PULSE SEQUENCE= zg30
##.SOLVENT NAME= CDCl3
##.SHIFT REFERENCE= (INTERNAL, CDCl3, 0, 15.7039)
##AUDIT TRAIL= $$ (NUMBER, WHEN, WHO, WHERE, WHAT)
$$ ##TITLE= Audit trail, XWIN-NMR		Version 3.5
$$ ##JCAMPDX= 5.01
$$ ##ORIGIN= Bruker BioSpin GmbH
$$ ##OWNER= she
$$ F:/spectra/data/she/nmr/H-F/1/audita.txt
$$ ##AUDIT TRAIL=  $$ (NUMBER, WHEN, WHO, WHERE, WHAT)
(   1,<2023-09-27 16:37:51.57 +0400>,<she>,<DPX200>,
      <created by zg, POWCHK disabled, PULCHK disabled
       configuration hash MD5:
       00 E9 B6 7A A2 85 ED C7 34 08 36 98 17 FE 4E 26
       data hash MD5: 16K
       72 25 6C 95 11 46 3B DE E3 77 28 57 3C 11 D5 ED>)
$$ ##END=
$$ 
$$ hash MD5
$$ 00 DF CF 7A 61 8F F8 DD BF E4 24 D7 C9 95 70 F9
##$RELAX= 
##$RELAX= 
##$RELAX= 
##$RELAX= 
##$RELAX= 
##$RELAX= 
$$ Bruker specific parameters
$$ --------------------------
##$DU= <F:/spectra>
##$EXPNO= 1
##$NAME= <H-F>
##$PROCNO= 1
##$TYPE= <nmr>
##$USER= <she>
##$AMP= (0..31)
100 100 100 100 100 100 100 100 100 100 100 100 100 100 100 100 100 100 
100 100 100 100 100 100 100 100 100 100 100 100 100 100 
##$AQSEQ= 0
##$AQ_mod= 1
##$AUNM= <au_zg>
##$AUTOPOS= <>
##$BF1= 200.13
##$BF2= 200.13
##$BF3= 200.13
##$BF4= 200.13
##$BF5= 200.13
##$BF6= 200.13
##$BF7= 200.13
##$BF8= 200.13
##$BYTORDA= 1
##$CFDGTYP= 0
##$CFRGTYP= 5
##$CHEMSTR= <none>
##$CNST= (0..31)
1 1 145 1 1 1 1 1 1 1 1 1 1 1 1 1 1 1 1 1 1 1 1 1 1 1 1 1 1 1 1 1 
##$CPDPRG= <>
##$CPDPRG1= <>
##$CPDPRG2= <>
##$CPDPRG3= <>
##$CPDPRG4= <mlev>
##$CPDPRG5= <mlev>
##$CPDPRG6= <mlev>
##$CPDPRG7= <mlev>
##$CPDPRG8= <mlev>
##$CPDPRGB= <>
##$CPDPRGT= <>
##$D= (0..31)
0 1.2 0 0 0 0 0 0 0 0.06 0 0.03 0 0 0 0 0.0002 0 0 0 0 0 0 0 0 0 0 0 0 
0 0 0 
##$DATE= 1695818271
##$DBL= (0..7)
120 120 120 120 120 120 120 120 
##$DBP= (0..7)
150 150 150 150 150 150 150 150 
##$DBP07= 0
##$DBPNAM0= <>
##$DBPNAM1= <>
##$DBPNAM2= <>
##$DBPNAM3= <>
##$DBPNAM4= <>
##$DBPNAM5= <>
##$DBPNAM6= <>
##$DBPNAM7= <>
##$DBPOAL= (0..7)
0.5 0.5 0.5 0.5 0.5 0.5 0.5 0.5 
##$DBPOFFS= (0..7)
0 0 0 0 0 0 0 0 
##$DE= 6
##$DECBNUC= <off>
##$DECIM= 32
##$DECNUC= <off>
##$DECSTAT= 4
##$DIGMOD= 1
##$DIGTYP= 9
##$DL= (0..7)
0 120 120 120 120 120 120 120 
##$DP= (0..7)
150 150 150 150 150 150 150 150 
##$DP07= 0
##$DPNAME0= <>
##$DPNAME1= <>
##$DPNAME2= <>
##$DPNAME3= <>
##$DPNAME4= <>
##$DPNAME5= <>
##$DPNAME6= <>
##$DPNAME7= <>
##$DPOAL= (0..7)
0.5 0.5 0.5 0.5 0.5 0.5 0.5 0.5 
##$DPOFFS= (0..7)
0 0 0 0 0 0 0 0 
##$DQDMODE= 0
##$DR= 18
##$DS= 0
##$DSLIST= <SSSSSSSSSSSSSSS>
$$ [...]
##$SUBNAM2= <"">
##$SUBNAM3= <"">
##$SUBNAM4= <"">
##$SUBNAM5= <"">
##$SUBNAM6= <"">
##$SUBNAM7= <"">
##$SUBNAM8= <"">
##$SUBNAM9= <"">
##$SW= 18.05172834244
##$SWIBOX= (0..15)
0 0 2 0 0 0 0 0 0 0 0 0 0 0 0 0 
##$SW_h= 3612.71676300578
##$TD= 16384
##$TD0= 1
##$TE= 0
##$TE2= 300
##$TE3= 300
##$TEG= 300
##$TL= (0..7)
0 120 120 120 120 120 120 120 
##$TP= (0..7)
150 150 150 150 150 150 150 150 
##$TP07= 0
##$TPNAME0= <>
##$TPNAME1= <>
##$TPNAME2= <>
##$TPNAME3= <>
##$TPNAME4= <>
##$TPNAME5= <>
##$TPNAME6= <>
##$TPNAME7= <>
##$TPOAL= (0..7)
0.5 0.5 0.5 0.5 0.5 0.5 0.5 0.5 
##$TPOFFS= (0..7)
0 0 0 0 0 0 0 0 
##$TUNHIN= 0
##$TUNHOUT= 0
##$TUNXOUT= 0
##$USERA1= <user>
##$USERA2= <user>
##$USERA3= <user>
##$USERA4= <user>
##$USERA5= <user>
##$V9= 5
##$VALIST= <valist>
##$VCLIST= <CCCCCCCCCCCCCCC>
##$VD= 0
##$VDLIST= <DDDDDDDDDDDDDDD>
##$VPLIST= <PPPPPPPPPPPPPPP>
##$VTLIST= <TTTTTTTTTTTTTTT>
##$WBST= 1024
##$WBSW= 4
##$XGAIN= (0..3)
0 0 0 0 
##$XL= 0
##$YL= 0
##$YMAX_a= 592531
##$YMIN_a= -725585
##$ZGOPTNS= <>
##$ZL1= 120
##$ZL2= 120
##$ZL3= 120
##$ZL4= 120
##$ABSF1= 10
##$ABSF2= 0
##$ABSG= 5
##$ABSL= 3
##$ALPHA= 0
##$AQORDER= 0
##$ASSFAC= 0
##$ASSFACI= 0
##$ASSFACX= 0
##$ASSWID= 0
##$AUNMP= <proc_1d>
##$AZFE= 0.1
##$AZFW= 0.1
##$BCFW= 1
##$BC_mod= 2
##$BYTORDP= 1
##$COROFFS= 0
##$CY= 11.3945322036743
##$DATMOD= 1
##$DC= 2
##$DFILT= <>
##$DTYPP= 0
##$F1P= 15.7292609196834
##$F2P= 12.9074282941183
##$FCOR= 0.5
##$FTSIZE= 0
##$FT_mod= 4
##$GAMMA= 1
##$GB= 0.15
##$INTBC= 1
##$INTSCL= 1
##$ISEN= 128
##$LB= 0.24
##$LEV0= 0
##$LPBIN= 0
##$MAXI= 10000
##$MC2= 0
##$MEAN= 0
##$ME_mod= 0
##$MI= 1.114404
##$NCOEF= 0
##$NC_proc= 0
##$NLEV= 6
##$NOISF1= 3.799351
##$NOISF2= 2.8
##$NSP= 1
##$NTH_PI= 0
##$NZP= 0
##$OFFSET= 15.70392
##$PC= 1
##$PHC0= -21710.8
##$PHC1= 12.25271
##$PH_mod= 1
##$PKNL= yes
##$PPARMOD= 0
##$PSCAL= 0
##$PSIGN= 0
##$REVERSE= no
##$SF= 200.130013532006
##$SI= 16384
##$SIGF1= 3
##$SIGF2= 2
##$SINO= 400
##$SIOLD= 16384
##$SREGLST= <1H.CDCl3>
##$SSB= 0
##$STSI= 0
##$STSR= 0
##$SW_p= 3612.71676300578
##$SYMM= 0
##$S_DEV= 0
##$TDeff= 0
##$TDoff= 0
##$TI= <>
##$TILT= no
##$TM1= 0
##$TM2= 0
##$TOPLEV= 0
##$USERP1= <user>
##$USERP2= <user>
##$USERP3= <user>
##$USERP4= <user>
##$USERP5= <user>
##$WDW= 1
##$XDIM= 8192
##$YMAX_p= 0
##$YMIN_p= 0
$$ End of Bruker specific parameters
$$ ---------------------------------
##NTUPLES= NMR FID
##VAR_NAME=  TIME,          FID/REAL,        FID/IMAG
##SYMBOL=    X,             R,               I
##VAR_TYPE=  INDEPENDENT,   DEPENDENT,       DEPENDENT
##VAR_FORM=  AFFN,          ASDF,            ASDF
##VAR_DIM=   8192,          8192,            8192
##UNITS=     SECONDS,       ARBITRARY UNITS, ARBITRARY UNITS
##FACTOR=    0.0002768,     1,               1
##FIRST=     0,             0,               0
##LAST=      2.2672688,     0,               0
##MIN=       0,             -725585,         0
##MAX=       2.2672688,     592531,          0
$$ Real data points
##PAGE= N=1
##DATA TABLE= (X++(R..R)), XYDATA
$$ [...]
1755D57o39pN17k11m83K51K45k66j24K19N02m75l42L17L13l66J0J39J24j90k40
$$ 457 -182 -189 328 117 -366 -115 130 -136 -260 -41 461 -14 -356 -39 274 -92 -82 57 181 -9 -249
1776b49L04K14l94m5K76J67l49j48M15l5l05J46J75J4o62L51L88l13j14J73M47
$$ -249 55 269 -125 -170 106 273 -76 -224 191 156 -149 -3 172 186 -476 -125 263 -50 -164 9 456
1797D56m34l07J17M88l05l76N57J1k69m06P56Rl79m4J39K29j96k77P42n48l88
$$ 456 22 -285 -168 320 15 -361 196 207 -62 -468 288 297 -82 -126 13 242 46 -231 511 -37 -425
1818d25J80O32m72k97M26L7j47j01L10J57j14k43pJ89j19m52L91L48m31J00j10
$$ -425 -245 387 -85 -382 44 81 -66 -167 143 300 186 -57 -64 125 6 -446 -55 293 -138 -38 -148
1839a48K53l58MN37j59j89n6J63L3j96o7K39O3k07J65pJ54l60K61O1m08j9J75
$$ -148 105 -253 -249 288 129 -60 -116 47 80 -116 -183 56 119 -88 77 70 224 -136 125 186 -222 -241 -66
1862f6K08r4j67J52L18m44J02K30k00k01l4M55l27Q1l10O05j22j56k0K50j40m30
$$ -66 142 48 -119 33 351 -93 9 239 39 -162 -196 259 -68 13 -297 308 186 30 10 260 120 -310
1884c10J86K42m3l25Q0L24J19m98J58O5M0j58J83j7k31Q9N0L14m22l3J6L51l16
$$ -310 -124 118 75 -250 -170 154 273 -225 -67 -2 38 -120 63 46 -185 -96 -46 268 -154 -187 -171 180 -136
1907a36o7L36J04m16k9J54K28j62L7LK31m92J45L93l08o4N6K31j36o5l2r6J20
$$ -136 -203 133 237 -179 -208 -54 174 12 49 52 283 -209 -64 329 21 -43 13 244 108 43 11 -85 35
1930C5k49J44J81M3l11M20k10oj97K06l16J33O6K84k88j26J45L46l38k15J21K30
$$ 35 -214 -70 111 154 -157 263 53 47 -150 56 -260 -127 -61 223 -65 -191 -46 300 -38 -253 -132 98
1952I8Q0k64j36K54J06k38J47J15l06L2K84L6j75RJ38p3k09j38K86K55n19J97
$$ 98 178 -86 -222 32 138 -100 47 162 -144 -112 172 208 33 42 180 107 -102 -240 46 301 -218 -21
1974b1J75j40k50K29J30k19q3L16O4j65j75K24k23J49K7Q7k71m3K78j18J80q4
$$ -21 154 14 -236 -7 123 -96 -179 137 201 36 -139 85 -138 11 38 125 -146 -189 89 -29 151 67
1996F7j13j16K85l29J36K51q6k20Q4P0l6j93J30m7QJJ71J56k89r3L0K54j1L4K3
$$ 67 -46 -162 123 -206 -70 181 95 -125 -41 29 -7 -200 -70 -117 -109 -108 63 219 -70 -163 -133 121 110 144 167
2021A67l0j78K87k17j96K34P6j53oj19K48j54J13l3j72j31M76l13N7LJ44j29K8
$$ 167 137 -41 246 29 -167 67 143 -10 -16 -135 113 -41 72 39 -133 -264 212 -101 -44 -41 103 -26 2
2044BK13k64L9k7j16K72j58J64j84j2K06m34K47Q5l05N64l50j44K66M5m9j95J18
$$ 2 215 -49 -10 -37 -153 119 -39 125 -59 -71 135 -299 -52 33 -272 292 -58 -202 64 109 60 -135 -17
2067a7J55j85q3K29M8l4o7K9J47p3k6j71k56J33j08O28m58O6M3O9O8k28J53J09
$$ -17 138 -47 -130 99 147 113 46 75 222 149 123 -48 -304 -171 -279 349 -109 -43 0 69 137 -91 62 171
2091A71Jr0j45L15p9j01J64m6k47k12M23k51K79j8k36K14k51K26O0J51n50J32
$$ 171 172 82 -63 252 173 72 236 190 -57 -269 154 -97 182 164 -72 142 -109 117 177 328 -222 -90
2113i0M25k88J32k15J88q9j90Q0k82L87k51J59L4N4k02M0K62k33K73k25J06M7
$$ -90 335 47 179 -36 152 63 -127 -47 -329 58 -193 -34 0 54 -148 -108 154 -79 194 -31 75 122
2135A22l41K49N4M7k24J64P3L0l56K54K14l36Qk4k1j32R2K78n25K23j61J68m5
$$ 122 -219 30 84 131 -93 71 144 174 -182 72 286 -50 -42 -66 -87 -219 -127 151 -374 -151 -312 -144 -189
2158a89K40j46j49L33j4n3p8r2K16K9J49n02K97jo4M1j06J13O3j3k41J6k7K55
$$ -189 51 -95 -244 89 75 22 -56 -148 68 97 246 -256 41 40 -24 17 -89 24 87 74 -167 -151 -178 77
2182G7k49J10j22J34lQ4M7q8J2m6J39L0q2K25l90K75j49k9k4K06p7p2N6K75m21
$$ 77 -172 -62 -184 -50 -53 31 78 -10 2 -44 95 125 43 268 -122 153 4 -25 -49 157 80 8 64 339 -82
2207h2J99j24l7L6r4J7L65j82k25J98q1J18k85K42k36J80k34J82L4j6j6Q8LM9
$$ -82 117 -7 -44 -8 -102 -85 280 98 -127 71 -10 108 -177 65 -171 9 -225 -43 -9 -25 -41 47 50 99
2231I9j55L26k63K5k23J67k6j07K57j98J16j95J91K13k93j24M05j88j1o8M1p1
$$ 99 -56 270 7 32 -191 -24 -50 -157 100 -98 18 -177 14 227 -66 -190 215 27 16 -52 -11 -82
2253h2o7J26J71O6j48k60L34j63j44Q1O2o3J07O3j44M2O7K8l15K66m6k71J30J63
$$ -82 -149 -23 148 214 66 -194 140 -23 -167 -86 -24 -87 20 83 -61 -19 48 76 -239 27 -19 -290 -160 3
2277Cn6j34M71m80K36k0nk45K71J12k23K75n9k03j16J27J26j47M6kRK19j67K0
$$ 3 -53 -187 284 -196 40 20 15 -230 41 153 -70 205 146 -57 -173 -46 80 -67 -21 -23 -14 205 38 58
2301E8j08J98k23K31k0j57J56k89K57j04k5m4J03K58l18r3K55q1P1J7k16K7N7
$$ 58 -50 148 -75 156 136 -21 135 -154 103 -1 -26 -70 33 291 -27 -120 135 54 125 142 -74 -47 10
2324A0Q6l2K00k19nK3j96n6j0L0J41R6j13q0K46p5%j64J32O9J85q0r7j2k24J93
$$ 10 96 64 264 45 40 63 -133 -189 -199 -169 -28 68 -45 -125 121 46 46 -118 14 83 268 188 91 79 -145 48
2350D8K3N1K8j74r0l4Q1k41L76k02KK10Nl4j62J58J09j03j29J43j64J72pk03J95
$$ 48 71 122 150 -24 -114 -148 -67 -308 68 -134 -132 78 83 49 -113 45 154 51 -78 65 -99 73 66 -137 58
2375E8n1l8o0N1N8l5j55N1Q2Q4J06j70l0N7J03J19n09K39l25J56J49M01n04K66
$$ 58 7 -31 -91 -40 18 -17 -172 -121 -39 45 151 -19 -49 8 111 230 -279 -40 -365 -209 -60 341 -163 103
2399A03j41n2n4L6J89J01m74K58Q8n7K10j54L5l81L22n0p6j83P6J09K15j25k7
$$ 103 -38 -90 -144 -108 81 182 -292 -34 54 -3 207 53 88 -293 29 -21 -97 -280 -204 -95 120 -5 -32
2422c2L21l26j39L5R9L0q7NJ28j36L02l10J96r5l1J86k57J84k54K28m7M16k08
$$ -32 289 -37 -176 -141 -42 -12 -99 -94 34 -102 200 -110 86 -9 -40 146 -111 73 -181 47 0 416 208
2445B08k76n7K55J15j91k7j81Q7j26L68m60K49k10K90k27L70m51L29M0R9K22m17
$$ 208 -68 -125 130 245 54 27 -154 -67 -193 175 -285 -36 -246 44 -183 187 -264 65 105 204 426 9
2467Ikp1K89N8n01K30R3m7N9j91q0Q4L4M3L2k7j58k18L83mJ68q4j70L18l23p5
$$ 9 7 -64 225 283 -218 12 105 58 117 -74 -154 -70 -36 7 39 12 -146 -364 19 15 183 99 -71 247 -76 -151
2493a51J75j5p1J49p7l22J41J52R9j63L4M00l96N3k8RK0K17l04R7n7m5q0J84o8
$$ -151 24 9 -62 87 10 -312 -171 -19 80 -83 -49 351 -45 8 -20 -11 9 226 -78 19 -38 -83 -163 21 -47
2518d7R6J35l47K35J74k87j00J01J15lq0j64J30j02k22M01N5j57O2j41J41j76
$$ -47 49 184 -163 72 246 -41 -141 -40 75 72 -8 -172 -42 -144 -366 35 90 -67 -5 -146 -5 -181
2540a81M8M7J19m6J11j04J7j85L51l61Q8J59j97M7n3J67O6k98L05j48o9P8pJ63
$$ -181 -133 -86 33 -13 98 -6 11 -174 177 -184 -96 63 -134 -87 -140 27 93 -205 100 -48 -117 -39 -46 117
2564A17j87q8K51j32K23N5j18j74K06j54j5J32j08j21M9j98K59p2L27n5r8j81
$$ 117 -70 -158 93 -39 184 239 121 -53 153 -1 -16 116 8 -113 -64 -262 -3 -75 252 197 99 -82
2586h2J61L26l21j84J42j97R8K7q2J85R5m45M46j96L8L1k55K29q6J85j48K1J8
$$ -82 79 405 84 -100 42 -155 -57 -30 -112 73 168 -277 169 -27 11 42 -213 16 -70 115 -33 -12 6
2609Fk01N2J46J00rk6j29R1j49L71j50n6K5q9R5k8j51J6L8r1J00o3O7P2J73m07
$$ 6 -195 -143 3 103 94 68 -61 30 -119 252 102 46 71 -18 77 49 -102 -86 -48 -139 -39 -102 -35 37 210 -197
2635a97j62L69r3L19k08J20k95J40P5n0N6l7J8J01k69L0k2K4J82K65l68j35J05
$$ -197 -359 10 -83 236 28 148 -147 -7 68 18 74 37 55 156 -113 -83 -105 -81 101 366 -2 -137 -32
2658c2j11j55K09o4j39L66K9l7j81J04k6O6m4MK5R3j31Q5l58K33J09l07L35k97
$$ -32 -143 -298 -89 -153 -292 74 103 66 -115 -11 -37 29 -15 -11 14 107 -24 61 -297 -64 45 -262 73 -224
2682b24K22k00K96o5J14j77j72K66J87k63j00L01l50K59j53M3j5p8K7l9P1Rj26
$$ -224 -2 -202 94 29 143 -34 -206 60 247 -16 -116 185 -165 94 -59 -16 -31 -109 -82 -121 -50 -41 -167
2705a67K03J00k01Q9J21j36j33K15J9r7J18n08M48M4q7J60j91r0K62P6k65K86
$$ -167 36 136 -65 24 145 9 -124 91 110 13 131 -377 71 115 28 188 -3 -93 169 245 -20 266
2727B66k87K29k42L5P7k51o1N4J85j72j07M45l04K00JL1k06J97j17p2J17l2q8
$$ 266 -21 208 -34 1 78 -173 -234 -180 5 -167 -274 171 -133 67 68 99 -107 90 -27 -99 18 -14 -102
2750a02O4q2K10j72l3Q5O3q1N5j07J14K2j53l6J37O9J27O0n39K09M7k11K59Q9
$$ -102 -38 -120 90 -82 -115 -30 33 -48 7 -100 14 36 -117 -153 -16 53 180 240 -299 -90 -43 -254 5 94
2774I4m18N96k79r8J35K04k61k3K50l44J0J77J84j68j21J14l6J03j22J17l18J80
$$ 94 -324 272 -7 -105 30 234 -27 -50 200 -144 -134 43 227 59 -62 52 16 119 -3 114 -204 -24
2796b4r3j11K21j34K83k52K72m87M59j05j19j18J60M2j41J5L9L17m2l16J72j97
$$ -24 -117 -228 -7 -141 142 -110 162 -325 134 29 -90 -208 -48 -6 -147 -132 -93 224 182 -134 38 -159
2818a59J69rr7J21O8n6J36j20K38l26n8JkJ58o7m1p4M11q7j14n1M6k42L25q5l1
$$ -159 10 1 -96 25 93 37 173 53 291 -35 -93 -92 -94 64 -3 -44 -118 293 206 92 41 87 -155 170 85 54
2844E4k02L91n27M07J03k43K44j05k23o3P1J47J7oK1J28k89J55N2n2j00J86m00
$$ 54 -148 243 -284 123 226 -17 227 122 -101 -164 -93 54 71 65 86 214 -75 80 132 80 -20 166 -234
2867b34J09J27K5J19K1k76O3K68j29j90L24p7l72M32k2j76J14l84K41k58K64p3
$$ -234 -125 2 27 146 167 -109 -46 222 93 -97 227 150 -222 210 188 12 126 -258 -17 -275 -11 -84
2889h4N2J08k47K34l26R7L44j32J19j54R9k06J15N7k27L27k53L5J65k87P4MJ9
$$ -84 -32 76 -171 63 -263 -166 178 46 165 11 110 -96 19 76 -151 176 -77 -42 123 -164 -90 -86 -67
2912f7K77j45k8q7N4O7K46k09j44k2l6J56p9n6J87k54k12K79Q2J91k87J41o6J86
$$ -67 210 65 37 -50 4 71 317 108 -36 -58 -94 62 -17 -73 114 -140 -352 -73 9 200 -87 54 -12 174
2936A74j55j16K43j97r6K14l4q5K7q5m2L16q0o7nR7n9k7p9p6J20j44K18m4p8M
$$ 174 19 -97 146 -51 -147 67 33 -52 -25 -110 -152 164 84 17 12 109 50 23 -56 -132 -12 -156 62 18 -60 -56
2962e6R2j58L0rM9O0k45L81j67q0K17J55q5k75j06K46M4r1K07q3N9m97K49K1L5
$$ -56 36 -122 -92 -101 -52 8 -237 144 -23 -103 114 269 184 -91 -197 49 93 2 209 126 185 -312 -63 -42 -7
2987gj56J34k8J61j63Q8J44k78N7J65M6l04Q5L15l40N5r7J63j53K15n0j29r6K05
$$ -7 -163 -29 -57 104 -59 29 173 -105 -48 117 163 -141 -56 259 -81 -26 -123 40 -113 102 52 -77 -173 32
3011C2m5j92J64r4J90l34K80K04k6k34j2K46m43J22J31o1M3P3l11J63R7k17M0
$$ 32 -13 -205 -41 -135 55 -279 1 205 179 -55 -67 179 -264 -142 -11 -72 -29 44 -267 -104 -7 -224 -184
3034a84K9l8J89J8m3L0j10J99R9k52q0L01n6N1l1J9L1l48K27j1n4j69M2K77k28
$$ -184 -155 -193 -4 14 -29 1 -109 90 189 -63 -143 158 102 153 122 141 172 -176 51 40 -14 -183 -141 136 -92
3059i2j20K44Q7n2Q2k77J28j83R4J31Pk2j82K23k80q2K36K33q0j82p0K61j58N8
$$ -92 -212 32 119 67 149 -128 0 -183 -89 42 49 27 -155 68 -212 -294 -58 175 95 -87 -157 104 -54 4
3083Dj8J59j85m0r0J35O2j66L7j07K99J16k66K4K81m47K53J59l26jj22Q5L25j47
$$ 4 -14 145 -40 -80 -170 -35 27 -139 -102 -209 90 206 -60 -36 245 -202 51 210 -116 -117 -239 -154 171 24
3107B4n9l2J29rj76R9nP3r1P2K22o4L0r4p8k1L28l33P8n8rq4J35l0p0J50j71R2
$$ 24 -35 -67 62 53 -123 -24 -29 44 -47 25 247 183 213 119 41 20 348 15 93 35 26 -58 77 47 -23 127 -44 48
3135D8k94K38m8R1J6j18pJ66k02p8O5JR3j02J03L21l94K23M5p0J62l48M3L4OK1
$$ 48 -246 -8 -56 35 51 -67 -74 92 -110 -188 -123 -122 -29 -131 -28 293 -101 122 167 97 259 -89 -46 -12 -6 15
3161A5Q0K7j63j5j36P5k1J49O7jj60K67j70j31K02K28j23l37J4O0K28l82K93k5
$$ 15 95 122 -41 -56 -192 -117 -138 11 78 77 -83 184 14 -117 85 313 190 -147 -133 -73 155 -227 66 41
3185D1l89L18q8J16K64k23N8k41K87k71L71k19j79J04lM6J65l22K87l23J52k82
$$ 41 -348 -30 -118 -2 262 39 97 -144 143 -128 243 24 -155 -51 -54 -8 157 -165 122 -201 -49 -331
3207c31L70M0k14K88k76J44lJ0N5k78j0R5P0K74n03L82j48J24k1M5l3j9j16Q9
$$ -331 39 79 -135 153 -123 21 18 28 83 -195 -205 -110 -40 234 -269 113 -35 89 68 113 80 61 -55 34
3231C4o7J29k23J78r5J22r9m1j07Q4K96k56j8o5K2pL7J15k71N7K01j10R9j42J89
$$ 34 -33 96 -127 51 -44 78 -21 -62 -169 -85 211 -45 -63 -128 -106 -113 -76 39 -232 -175 26 -84 15 -127 62
3256F2k87J37p7M1K26k82L61l05K42N9l17J19J3j08o0O1K05j67o5J6R6L8M5L5
$$ 62 -225 -88 -165 -124 102 -180 181 -124 118 177 -140 -21 -8 -116 -176 -115 90 -77 -142 -126 -30 8 53 88
3280H8k08J25q7K35r4o8l9O3N3J03j33k4J08J58k39m5N7k32K33k70K34MpM4P5
$$ 88 -120 5 -82 153 59 -9 -48 15 68 171 38 14 122 280 41 -4 53 -179 54 -216 18 22 15 59 134
3305A34j27k51J85J25j31P4k05K69j40J23K77k55l5k10J17M3J72Pk64J84q4n3
$$ 134 7 -244 -59 66 -65 9 -196 73 -67 56 333 78 43 -167 -50 -7 165 172 -92 92 8 -45
3327d5q3K96j60O6r3OR0mj03K40m21j07L35l5K88m28j75L04J20L0l18K95j48q
$$ -45 -128 168 8 74 -19 -13 77 73 -30 210 -211 -318 17 -18 270 -158 -333 -29 91 121 -197 98 -50 -58
3351e8J18QO6j56K85l42O7Om21L41K29j17J15l3n5n5L59n65J6M7K45R3k46M1O2
$$ -58 60 68 134 -22 263 -79 -12 -6 -427 -86 143 26 141 108 53 -2 357 -208 -192 -145 100 193 -53 -12 50
3376E0Pj97K55j78k38K62N6M4l1Q3p7j98K38Q9j89j15K03rP2j80L5J38l79K57
$$ 50 57 -140 115 -63 -301 -39 17 61 30 113 36 -162 76 165 -24 -139 64 55 127 -53 -18 120 -259 -2
3400bQ4k0l5r6k11J47K08l3k37L07j14Q9k24K1L8J1L21m0q2k7j73j54J15k5M2
$$ -2 82 62 27 -69 -280 -133 75 42 -195 112 -2 87 -137 -116 -78 -67 254 214 132 105 -68 -222 -107 -132 -90
3425i0L2K43l33J7J28J06k49M76m90J38j8j11O6r7K41j6m5J66j31M5N7K4k37K60
$$ -90 -58 185 -148 -131 -3 103 -146 330 -160 -22 -40 -151 -85 -182 59 43 -2 164 33 78 135 159 -78 182
3449A82l88j1K49J3J92j66J15n1J19m60L61j31J11J67k07k17L43j81j19P8j2k24
$$ 182 -206 -217 32 45 237 71 186 135 254 -206 155 24 135 302 95 -122 221 40 -79 -1 -13 -237
3471b37M19l33Q9o3L79n01N64k77j78J59J72j7q7M1k8j18R3%J55j04j70p2J07
$$ -237 182 -151 -62 -125 254 -247 317 40 -138 21 193 176 89 130 102 -16 77 77 232 128 -42 -114 -7
3494gK9l58L84j20J0K8L34n20K01j8J09j00O6j29R8O6N6k00J48lK5j76m0J01n
$$ -7 22 -336 48 -72 -62 -34 300 -220 -19 -37 72 -28 38 -91 7 73 129 -71 77 74 99 -77 -117 -16 -21
3519b1O7J92l1o6q9Q9p1l4J67q5j01r5J87o2P4k37qj9J84L04l76j62K70k2j2n9
$$ -21 46 238 207 141 52 141 70 36 203 118 17 -78 109 47 121 -116 -124 -143 41 345 -31 -193 77 55 43 -16
3545a6L06m60J52J60k80L56p6q8r4K17j5l3j56OJ22j51j73NJ82k03P4K78j65P3
$$ -16 290 -170 -18 142 -138 218 142 54 -40 177 162 129 -27 -21 101 -50 -223 -218 -36 -239 -165 113 -52 21
3569B1j31N7q8P1L39l04l3j0L1q4n7J95j28K51r3M3j56J63j85j33J51R9j03k03
$$ 21 -110 -53 -141 -70 269 -35 -68 -78 -47 -131 -188 7 -121 130 37 80 -76 87 -98 -231 -80 19 -84 -287
3593b87K96J71j88j08J63nJ77l43R9k9J79l69L40pk65K37m8j02P2j37N1J20K9
$$ -287 9 180 -8 -116 47 42 219 -124 -25 -54 125 -244 96 89 -176 61 13 -89 -17 -154 -103 17 46
3616D6p1k4O9J64l0k65J58k1P2n6j68J38j00J98P1j61%K3l67j7N09j14m1N9N8
$$ 46 -25 -49 20 184 154 -111 47 26 98 42 -126 12 -88 110 181 20 20 43 -324 -341 168 54 13 72 130
3641A30j29J11l94N47j38r6j5K4j24k7j63M34j06L08n47J14J20r6j74L3R1n5N5
$$ 130 1 112 -282 265 127 31 16 40 -84 -111 -274 160 54 362 -185 -71 49 -47 -221 -188 -97 -152 -97
3664i7M5Oq2J03Q1j03j56N6K95k9j20LN4J40m53L8L65p3O2j70K17k09P5k29K47
$$ -97 -52 -46 -128 -25 56 -47 -203 -147 148 119 -1 2 56 196 -257 -219 146 73 135 -35 182 -27 48 -181 66
3689F6m44M80j05J48k62J34P5j81J70k04Q8J91K2j08R0k15K53r2j19j29J35j4
$$ 66 -378 102 -3 145 -117 17 92 -89 81 -123 -35 156 178 70 160 -55 198 106 -13 -142 -7 -21
3711b1J1j00n0L52l59J89k58J58K61k36J00j41J80P7k53J65k1k4k76J13n5K37
$$ -21 -10 -110 -160 192 -167 22 -236 -78 183 -53 47 -94 86 163 -90 75 54 30 -246 -133 -188 49
3733D9P5n9j09J35j19l45J41l4K04K45l31q4M00k56L02l44L65k7J39k40Qk84l5
$$ 49 124 65 -44 91 -28 -373 -232 -266 -62 183 -148 -232 168 -88 214 -130 235 208 347 107 115 -169 -204
3756b04L10j97J46r7Q7r3j00K42j28M9q4J09J93j09j12Q0j04M2q4O0J24q9J55
$$ -204 106 -91 55 -42 45 -48 -148 94 -34 15 -69 40 233 124 12 92 -12 30 -54 6 130 41 196
3779A96j91n5R0Mm6k9R7r8K1K17k15J31k7L3o1l8J07k97N8N4N9n9M0j25P5J27
$$ 196 5 -50 40 44 -2 -31 66 -32 -11 206 -9 122 95 128 67 29 136 -161 -103 -49 10 -49 -9 -134 -59 68
3805F8k00L47j44k22M28m70M1K13Pk54J23q4N1r0J98j99K37j06lm4q4J45m9k17
$$ 68 -132 215 71 -151 277 -193 -152 61 68 -186 -63 -147 -96 -186 12 -187 50 -56 -59 -103 -187 -42 -91 -308
3829c08J01J43n6K40k04J31J14j91j58Q8M0n7J35p2J13j17j62L13j08K3p1J4K43
$$ -308 -207 -64 -120 120 -84 47 161 -30 -188 -100 -60 -117 18 -54 59 -58 -220 93 -15 8 -63 -49 194
3852A94m1j72R6o9m9r8N4p2J19O7p2j9J10l45J14J55M1J77j79j74J79R0k14m6
$$ 194 153 -19 77 8 -41 -139 -85 -157 -38 29 -43 -62 48 -297 -183 -28 13 190 11 -163 16 106 -108 -154
3876a54K7l0P0K0j07L35n31K52K21j07N8J17k74K38l16R5L4p9K42jl5l5J27L4
$$ -154 -127 -157 -87 -67 -174 161 -370 -118 103 -4 54 171 -103 135 -181 -86 -52 -131 111 110 75 40 167 201
3900B01l28J34j1n3q3N5K38k96j18K98j65N8m1p3K35q8ml1L41k11l2K63j87q5
$$ 201 -127 7 -4 -57 -140 -85 153 -143 -261 37 -128 -70 -111 -184 51 -37 -41 -72 269 58 26 289 102 17
3924A7j56J91p1j72o4K26l9J77j55J88r8l8n1m7NL37k82k7J48k24J34q8L41j75
$$ 17 -139 52 -19 -191 -255 -29 -68 109 -46 142 44 6 -45 -92 -87 250 -32 -59 89 -135 -1 -89 252 77
3948G7J11J6K4m87M46j92O0k7n9L3K04k21k2K34j5r0j83J6J90k87L54k15M0%R6
$$ 77 188 204 228 -259 187 -5 55 28 -31 2 206 -15 -37 197 182 92 -91 -75 115 -172 182 -33 7 7 103
3973A03L46n02L35l82m3j27K88j7L1L1Op9J84k39J79l39m4L84l0j55J47j65J65
$$ 103 449 -53 282 -100 -143 -270 18 1 32 63 69 -10 174 -65 114 -225 -269 115 85 -70 77 -88 77
3996G7k99J80J25j1l1j53P9Q5j17lQ4j04R6J00M9k86J23o1K23n1l60J81J21k8
$$ 77 -222 -42 83 72 41 -112 -33 52 -65 -68 16 -88 8 108 157 -129 -6 -67 156 105 -255 -74 47 19
4020A9Jm6o8K8j0j83L10M1j98J22p3j18L72k29j3J55L5n4j0j89N8K07L2k28K8
$$ 19 20 -26 -94 -66 -76 -259 51 92 -106 16 -57 -175 197 -32 -45 110 145 91 81 -108 -50 157 189 -39 -11
4045a1K87m11L38m90M04j76j27J13J27j90J96q5J50J03k51j29K57J30k11j94R2
$$ -11 276 -135 203 -287 117 -59 -186 -73 54 -136 60 -25 125 228 -23 -152 105 235 24 -170 -78
4066g8K85j61J09J22l80p9M29l61J38K3o6j85L21J51l02j83K71k6j0J17k59R8
$$ -78 207 46 155 277 -103 -182 247 -114 24 47 -19 -204 117 268 -34 -217 54 28 18 135 -124 -26
4088b6J2K3o4L08k76o8p5K73k28J59J77k72L41j28j45k8Q6Mj18N7j8K04k97K56
$$ -26 -14 9 -55 253 -23 -91 -166 107 -121 38 215 -57 284 156 11 -17 69 73 -45 12 -6 198 -99 157
4112A57j02J34k44J9p1K48m49M60k09J35q8k06K82q5k9K04j17q6J77j67q0K1L2
$$ 157 55 189 -55 -36 -107 141 -308 152 -57 78 -10 -216 66 -19 -48 156 39 -47 130 -37 -117 -96 -64
4135f4K2L56k23j09j49J27n7r8K53j92O6j0J59k11lJ54r9m7J30n6j19P2j76J99
$$ -64 -42 314 91 -18 -167 -40 -97 -195 58 -134 -68 -78 81 -130 -133 21 -78 -125 5 -51 -170 -98 -274 -75
4159g5O2K5l96M97q2L8l26J37K81j27K16j98J6Pl8l92O04l52J07M8j61J7J38N8
$$ -75 -13 12 -384 113 31 69 -257 -120 161 34 250 52 68 75 37 -355 249 -103 4 52 -109 -92 46 104
4183A04j32K5J08k9pj47J04j88K47L3k01Q1l22L29M6p8J93o0j84J36l72N54k01
$$ 104 -28 -3 105 76 69 -78 26 -162 85 118 -83 -2 -324 5 51 -27 166 106 -78 58 -314 240 39
4206C9j33L70m20J80o9p2J79l8Q8k21j26L37j03k06lJ65kl6M3j43K22q6p3j36
$$ 39 -94 276 -144 36 -33 -105 74 36 124 -97 -223 114 11 -195 -198 -33 -35 -71 -28 -171 51 -35 -108 -244
4230b44L88N5m9k10J31j62J61n7J16p6Q2j40K4j06J58J31j93k35L77jK13m32p3
$$ -244 144 199 150 -60 71 -91 70 13 129 53 135 -5 19 -87 71 202 9 -226 151 150 363 -69 -142
4253a42L0M6k07J83J3mJ94l18R5J25J30j4j58J66Q3j49l65J84J38j04O3l3M4j09
$$ -142 -112 -66 -273 -90 -77 -81 113 -205 -110 15 145 131 -27 139 222 73 -292 -108 30 -74 -11 -44 0 -109
4277a09J60m8j80J59qj14K65P7j73k01n2J48J35m3q7J24j19K07L8k09j4L0Oj50
$$ -109 51 3 -177 -18 -26 -140 125 202 29 -172 -224 -76 59 16 -71 53 -66 141 179 -30 -44 -14 -8 -158
4301a58J11k43K20M18m12K8l5J15j34K19L8l21J04J20j46R1k71J39J63Kj04j3
$$ -158 -47 -290 -70 348 -64 -36 -71 44 -90 129 167 -154 -50 70 -76 15 -256 -117 46 48 -56 -69
4323f9J09j14K25k08J01qR4k42K54k65K04Pj09j70K77K5Qk84M4J73j03R5j49J95
$$ -69 40 -74 151 -57 44 36 130 -112 142 -123 81 88 -21 -191 86 111 119 -165 -121 52 -51 44 -105 90
4347I0r5k17j3K56j83L05l9J53j73m7l99M83j59M7J53L4k72k0L7j69M72l39J09
$$ 90 -5 -222 -235 21 -162 143 104 257 84 37 -362 121 -38 9 162 196 -76 -96 -59 -228 244 -95 14
4370A4j86J72M1k13K10k07J23J40l65L10P7j12P9J55M1j58O2k39O9J35N0k6j68
$$ 14 -172 0 41 -172 38 -169 -46 94 -271 39 116 4 83 238 279 121 183 -56 13 148 198 172 4
4393Dj69K0J84o6K67k57j32K66j86J80N8j68r1m4N2J58r4K06m9l9j62J67k98J91
$$ 4 -165 -145 39 -27 240 -17 -149 117 -69 111 169 1 -90 -134 -82 76 -18 188 139 100 -62 105 -193 -2
4417bJ64j31j0M1J46j46j02l3J34j2N9j6k7n6j4M1l1j17l3N1K47j48J74k38o6
$$ -2 162 31 21 62 208 62 -40 -73 61 49 108 92 65 9 -5 36 5 -112 -145 -94 153 5 179 -59 -125
4442a25J47J65k63p5J07J50j26J01J70m23K3K91k82k3j03L15l2j09QJ47j40J27
$$ -125 22 187 -76 -151 -44 106 -20 81 251 -172 -149 142 -140 -163 -266 49 17 -92 -84 63 -77 50
4464E0Q0j67M45l23j05K75k16Oj70K81l96K03j04L56k81k97K88j66K31L9r3L0
$$ 50 130 -37 408 85 -20 255 39 45 -125 156 -240 -37 -141 215 -66 -363 -75 -241 -10 29 -64 -34
4486c4K55l82J17J69k32O9J78k10O5j76K39K8oj64J65Q5k62Q9M04l85J48o8J78
$$ -34 221 -161 -44 125 -107 -38 140 -70 -5 -181 58 86 80 -84 81 166 -96 -7 397 12 160 92 270
4509B70k32k7J60j35J11Q6k70j27J62RO2q8j96K06pL0l7L4J38k52J67k2j0k7N8
$$ 270 38 11 171 36 147 233 -37 -164 -2 7 69 -19 -215 -9 -16 14 -23 11 149 -103 64 42 32 5 63
4534F3r5j09j5J11nj6K34j65Q4K2j44l1j80J72K63k21R5k0l2J37k32P0J3n8j11
$$ 63 -32 -141 -156 -45 -50 -66 168 3 87 109 -35 -66 -246 -74 189 -32 63 43 11 148 -84 -14 -1 -59 -170
4559a70M58k83j74K39m8Q3j4J9j2p8J08n1j75K19l22L87j60m6j36L62k96J09p5
$$ -170 288 5 -169 70 22 105 91 110 98 20 128 77 -98 121 -201 186 26 -20 -156 206 -90 19 -56
4582e6j82L31j11J28L9J29k75j66K70j27M4K1j11j04K75k3k76K90j81ql0J1J60
$$ -56 -238 93 -18 110 149 278 3 -163 107 -20 24 45 -66 -170 105 82 -194 96 -85 -93 -123 -112 48
4605D8k6j18J94j34J4n5K04j44R1P8k7l59L30l00m7K25j13J13j61K95j54p0j11
$$ 48 22 -96 98 -36 -22 -77 127 -17 74 152 125 -234 96 -204 -251 -26 -139 -26 -187 108 -46 -116 -227
4628b27L94n5qj65M2p8N9m0J05j05jK98k23J46j13J19L4j92J14p1k15M59p8l3
$$ -227 167 112 104 -61 -19 -97 -38 -78 27 -78 -79 219 -4 142 29 148 182 -10 104 33 -182 277 199 166
4652A66j36j50p1M21k58Mk35L13j27M4m6M4R2J6j07K27j85j42J40Q2r6k17L20
$$ 166 30 -120 -191 230 -28 -24 -259 54 -73 -29 -75 -31 61 77 -30 197 12 -130 10 92 -4 -221 99
4675I9k94R0Q5q5K91m05K75p5K3p6J59j99q3K01r3LJ43n8j9J7R6P6k88L66k41
$$ 99 -195 -105 -20 -105 186 -219 56 -19 4 -72 87 -112 -195 6 -87 -84 59 1 -18 -1 95 171 -117 249 8
4700HP9Oj81K14j40N5Q9j78K18j69q9J76n8k28J29J41k08K51k00j92M04Lj17j92
$$ 8 87 93 -88 126 -14 41 130 -48 170 1 -88 88 30 -198 -69 72 -136 115 -85 -277 127 130 13 -179
4724a79J52l1j49M65j41m32K20R8o6l3J08j32J93j30j38L16j4k4o7n2M8o1K71
$$ -179 -27 -58 -207 258 117 -315 -95 3 -63 -96 12 -120 73 -57 -195 121 107 83 16 -36 12 -49 222
4747B22j87j53K61p6J73k65r1K82l24R9K0r4J62j81J27oR3k47J59P9J29j50L2
$$ 222 35 -118 143 67 240 -25 -116 166 -158 -59 -39 -133 29 -152 -25 -31 62 -185 -26 53 182 32 64
4770F4j90k0J68k5j75K22Lj13k3J17p5L87m21O7M1j28J69L1Q7j73j50J24M1p8
$$ 64 -126 -146 22 -3 -178 44 47 -66 -89 28 -47 340 -81 -14 27 -101 68 99 186 13 -137 -13 28 -50
4794e0K19j94j26K54J71k65J27k22J14l32K63R9K9Lk56J56p7P1J10J00j76j23
$$ -50 169 -25 -151 103 274 9 136 -86 28 -304 -41 58 87 90 -166 -10 -87 -16 94 194 18 -105
4816a05J46p9j30K58J61m88J35O6j85M66m18K27j74j4j11J66j8O7j54K31L0j65
$$ -105 41 -38 -168 90 251 -237 -102 -36 -221 245 -173 54 -120 -134 -245 -79 -97 -30 -184 47 77 -88
4838h8K7j53K89j43J8J80n9o4j50J27K18j17q1J97k99L5O8j37J84n8J45O4k48
$$ -88 -61 -214 75 -68 -50 130 71 7 -143 -16 202 85 4 201 -98 -63 5 -132 52 -6 139 203 -45
4861d5J28n8r3Jn5P9JK4l2Q2n9J54rN5k37N2r5J84m70N86j03Oo4J34o9j71J20
$$ -45 83 25 -68 -67 -122 -43 -42 -18 -50 32 -27 127 118 173 -64 -12 -107 77 -393 193 90 96 32 166 97 -74 46
4888D6j92L58J8l4k25L3J73j74n6K6R3k4Mj49P3J11P5j54O5J40k66J52l9j07j12
$$ 46 -146 212 230 196 -29 4 177 3 -53 -27 66 42 46 -103 -30 81 156 2 67 207 -59 93 54 -53 -165
4913a65K58j37k04J99J59k58l7K85J50k81K34r5l38L64j75J08j28j1J9M5K40j28
$$ -165 93 -44 -248 -49 110 -148 -185 100 250 -31 203 108 -230 134 -41 67 -61 -72 -53 -8 232 104
4935A04J77k04j00r5k1M12k50R3q8r2K03m32K03J23k06J62k27J69K50n21M40j6
$$ 104 281 77 -23 -118 -139 273 23 116 28 -64 139 -293 -90 33 -173 -11 -238 -69 181 -340 100 84
4957H4k91M66l50J61m11O12n96L89l73K43L4J67k4M3j30k40N34l06N0k31m1P7
$$ 84 -207 259 -91 70 -341 271 -325 64 -309 -66 -32 135 111 154 24 -216 318 12 62 -169 -210 -133
4979a33L16j75k74P2P0K9J47l82M77l11L8K76P6l07j5r8K18L01m47J50l1R9L4
$$ -133 183 8 -266 -194 -124 -95 52 -330 147 -164 -126 150 226 -81 -96 -194 24 325 -122 28 -3 96 130
5002A30l9j51L2k8N2Q5K9P7k5qj94L36k68k5Q4p1o3K6O4J53m02L4Q3k29K0k2M58
$$ 130 91 -60 -28 -56 -4 81 110 187 162 154 -40 296 28 3 87 16 -47 -21 43 196 -206 -172 -89 -318 -298 -320 138
5029A38k17O5K8J15k84M06j88l06KK70K02k81k30J15k1K25k49J99n0N0K09J36
$$ 138 -79 -14 14 129 -155 251 63 -243 -241 29 231 -50 -280 -165 -186 39 -210 -11 -61 -11 198 334
5051C34m89L59n6j91r4R9om9J01k59J07N6m9P0N4K4MO6j30Q4J61j60J91m39K55
$$ 334 -155 204 148 -43 -137 -38 -44 -93 8 -251 -144 -88 -137 -67 -13 11 15 81 -49 35 196 36 227 -212 43
5076D3k2m8K40m01M85k77L0n3L5J06k94K05j15J49j29J65j28k01K97k94J96L8
$$ 43 21 -27 213 -188 297 20 50 -3 32 138 -156 49 -66 83 -46 119 -9 -210 87 -207 -11 27
5098B7J07j78J20j7j30M8J14M1l66K41k25J07J67p0K6k78P2J75j04n9M55l63R3
$$ 27 134 -44 76 59 -71 -23 91 132 -234 7 -218 -111 56 -14 12 -266 -194 -19 -123 -182 273 -90 3
5121Cp3k27L40K43j95L8J66l0m41J49M6l16K47K26k52P9k5k25L11J22R5j86j44
$$ 3 -70 -297 43 286 91 129 295 265 -176 -27 19 -297 -50 176 -76 3 -22 -247 64 186 281 95 -49
5144d9J10r5J4j62J84N6j91J40J9K77l42K15k53K6J2K32l16K50k75L63k68R1L2
$$ -49 61 -34 -20 -182 2 58 -133 7 26 303 -39 176 -77 -51 -39 193 -123 127 -148 215 -53 38 70
5167G0L6k48R2M2J19p0j80K68p1M0k10J84n24L79J28k8Q9j82q0J35k8k5Q9J77
$$ 70 106 -142 -50 -8 111 41 -139 129 58 98 -112 72 -452 -73 55 27 116 -66 -146 -11 -39 -64 25 202
5191B02k50K7p2J5J53r6j40J95j19J62j13j60O6J52k6j26J87j77r8K33j59p2J7
$$ 202 -48 -21 -93 -78 75 -21 -161 34 -85 77 -36 -196 -130 22 -4 -130 57 -120 -218 15 -144 -216 -199
5214a99J12J24m9l0P1K10k60K01j64q9j07L53k76LL49m57Q4K32n6j13Q6l28K55
$$ -199 -87 37 -12 -42 29 239 -21 180 16 -73 -180 173 -103 -100 249 -208 -124 108 52 -61 25 -303 -48
5237d8P1m8K97k85Q2j03K20k33M3R2l99L6J43K67jj08j19K89k93j92K26j8J49
$$ -48 23 -25 272 -13 69 -34 186 -47 -4 88 -311 -275 -132 135 134 26 -93 196 -97 -289 -63 -81 68
5260F8j37O0%J47k59J25O7j46K92m30L41j33J30j86p5J55j33l8J53m3J27j08O3
$$ 68 -69 -9 -9 138 -121 4 71 -75 217 -213 128 -5 125 -61 -136 19 -114 -152 1 -42 85 -23 40
5283D0J62r9j21p7K9j73K19j42k5J70j2Q2kj84R5P6N6j47k1K5L5K06r3l6O7j99
$$ 40 202 103 -18 -95 -66 -239 -20 -162 -187 -17 -29 53 51 -133 -38 38 94 -53 -74 -49 -14 192 99 63 130 -69
5309f9p2K57k99R6j29M27k09j54N0L7m2l8K17L4k13L09p8k09J41q2J85l65K77
$$ -69 -141 116 -183 -87 -216 211 2 -152 -102 -65 -107 -145 72 106 -107 202 124 -85 56 -26 159 -206 71
5332G1k58J50J3j12OJ90R1l52L01K7l15J96Kj6%J28l17K3K15k25L26l37J87K22
$$ 71 -187 -37 -24 -136 -130 60 151 -201 100 127 -188 8 10 -6 -6 122 -195 -172 43 -182 144 -193 -6 216
5356B16P3n25K02n7L4L05m31P2k18M23p1r8J46j27J21R7j7j88J77j97qm1M95k42
$$ 216 289 -236 -34 -91 -57 248 -183 -111 -329 94 23 -75 71 -56 65 162 145 -43 134 -63 -71 -112 383 141
5380A41k89L32m34K76j28M2J36k05L39Mj2k30k6j9q9L02J05l26P6j1R4m91L59
$$ 141 -148 184 -250 26 -102 -60 76 -129 210 214 202 -28 -54 -73 -162 140 245 -81 -5 -16 78 -413 -54
5403e4n9M1P3O1k83M82m50K78J8j55O6M2j51j78O34l17p5O0J8p5K56k15o4j32
$$ -54 -113 -72 1 62 -221 261 -189 89 107 -48 18 60 -91 -269 365 48 -27 33 51 -24 232 17 -47 -179
5427a79J20j80K39k31Q5J17M35l14K6j10J92k52JK92m58m1K95J07j02m2J69k78
$$ -179 -59 -239 0 -231 -146 -29 406 92 118 8 200 -52 -51 241 -217 -258 37 144 42 0 169 -109
5449a09J37R1K3k37O6Q2L8M7k2K4J08j88j50K37k10j16K83O2l2m14L74P6m01L00
$$ -109 28 119 142 -95 -29 53 91 138 116 140 248 60 -90 147 -63 -179 104 166 134 -280 94 170 -231 69
5473F9j01k95K91K65j08j31o7K69J22j25m9l96K74j29K4r8K3K54j13J25k40M4
$$ 69 -32 -327 -36 229 121 -10 -77 192 314 189 140 -256 18 -111 -87 -185 -162 92 -21 104 -136 -92
5495i2K58l26M7MP4j01Q6M8o0J3L3l6J45O5j61Mj03K17j20j02J58J58k85J61M2
$$ -92 166 -160 -113 -109 -35 -136 -50 -2 -62 -49 -16 -52 93 158 -3 1 -102 115 -5 -107 51 209 -76 85 127
5520A27j14k2J30k08O7Q6j65K23j47l5k8n3O2Oj52K61J34k77L12j44k19M03q4
$$ 127 13 -9 121 -87 -20 66 -99 124 -23 -58 -86 -139 -77 -71 -223 38 172 -105 207 63 -156 247 163
5543A63j42j34J44K06l26k17K73J37q1L9o9N9n1j32p2J91J27MO4k%J86m23R4j34
$$ 163 21 -113 31 237 -89 -306 -33 104 23 62 -7 52 1 -131 -203 -12 115 119 183 181 181 367 -56 38 -96
5568i6M09m26o3p5M06j01Kj49L85j42j43j16J50J7M0j27k2j9l4J48j07J47J3K3
$$ -96 313 -113 -176 -251 155 54 56 -93 292 150 7 -109 41 58 98 -29 -51 -70 -104 44 -63 84 97 120
5592A20j31K50p3K9j08k10J30j66J00O1R8j09l1J70r1Q8k08J0P6n0R5j32j12L7
$$ 120 -11 239 166 195 87 -123 7 -159 -59 2 100 -9 -40 130 39 127 -81 -71 5 -45 50 -82 -194 -157
5616a57K06r9q0R8k4K4l5K09lM3J07k66n1J87r5j84K38l8q6q1J19K7j97K40j17
$$ -157 49 -50 -130 -32 -56 -32 -67 142 139 182 289 23 -28 159 64 -120 118 80 -6 -87 32 59 -138 102 -15
5641a5J81j31j8j31j19M06l3k73r5M71k90J65l33L05r2k8J55j66J68j61P1j61
$$ -15 166 35 17 -114 -233 173 140 -133 -228 243 -47 118 -215 90 -2 -30 125 -41 127 -34 37 -124
5663a24K11j98O5n2R7J60l18J11J76m04J18J05j39J17kj53L18j82L08m35L48m21
$$ -124 87 -111 -46 -98 -1 159 -159 -48 128 -276 -158 -53 -192 -75 -77 -230 88 -94 214 -221 127 -294
5685b94o4M41l6j49J63J31j31m64N22n0j23n9K37j65O4J30o1L1j23K41m56P1o6
$$ -294 -358 83 47 -102 61 192 61 -403 119 69 -54 -113 124 -41 23 153 92 123 0 241 -215 -144 -210
5708b10J29J75n2L23k67p3j36L27j80nN8q9N6j28k0K94k67j42M07k73J63j06j46
$$ -210 -81 94 42 365 98 25 -111 216 36 31 89 0 56 -72 -92 202 -65 -207 200 -73 90 -16 -162
5731a62J83J42No1j63K01j70n5K41k2n9j84J12k43L68k27J76p8M3o1J74j11j34
$$ -162 21 163 168 107 -56 145 -25 -80 161 139 80 -104 8 -235 133 -94 82 4 47 -14 160 49 -85
5754h5K72l07m4J90pj16J28N6j34p5K98q1k3J9J12j27Q7k45j55K92j92J35K37
$$ -85 187 -120 -164 26 19 -97 31 87 -47 -122 176 95 72 91 203 76 163 -82 -237 55 -137 -2 235
5777B35k00J75J88p00K17J36J77l76M28l43K38k80J90r8j31M16k59J70k04K5j80
$$ 235 35 210 398 -302 -85 51 228 -148 280 -63 175 -105 85 -13 -144 272 13 183 -21 4 -176
5798a76J76K0k24J81R7k2j33P8m6j82J52R1J81m58M33k25N3J76r6j72R3l7L2%
$$ -176 0 20 -204 -23 74 52 -81 -3 -49 -231 -79 12 193 -265 168 -57 -4 172 76 -96 -3 -40 -8 -8
5822hL9K29n46J96OL3p1J01l7J76J71l09o6j34k3L67O7k59K65l05J39j03l6K36
$$ -8 31 260 -286 -90 -84 -51 -122 -21 -58 118 289 -20 -86 -220 -243 124 191 -68 197 -108 31 -72 -108 128
5846A28j11K07J5j44kk07N3j70K19J38n3j50M06j68LL8k55M68m74K77k18Q0J34
$$ 128 17 224 239 95 93 -114 -61 -231 -12 126 73 -77 329 161 164 202 -53 415 -59 218 0 80 214
5869B14l76L02Lj83K1p4R3j17J39j20J98k8KJ05j20j24R4q8j66Q6L59k57K24j0
$$ 214 -162 140 143 -40 -19 -93 0 -117 22 -98 100 72 74 179 59 -65 29 -59 -225 -139 220 -37 187 177
5893A77k70K04k22N0L72l08j29k9L89m9n42M20j20J97l69L7K88l1j95M20l42J20
$$ 177 -93 111 -111 -61 311 3 -126 -155 234 185 -357 63 -57 140 -229 -192 96 65 -130 290 -52 68
5915F8N2j33m9n9J88k2K92l40Q5k14K28n8k6Q6N2k75J15K33l15J46k51L78j5%
$$ 68 120 -13 -62 -121 67 45 337 -3 82 -132 96 38 12 98 150 -125 -10 223 -92 54 -197 181 166 166
5939A66l44K00j22J53j20j28J00r3Q9J17m01J06K69R2q1M8m31L57j77L9K22j3
$$ 166 -178 22 -100 53 -67 -195 -95 -188 -99 18 -383 -277 -8 84 3 51 -380 -23 -200 -161 61 48
5961D8R6k03P7K08M7j58k13J88P4k31Q7j51L21J32k58j09J55j9L7j05J7j20J70
$$ 48 144 -59 18 226 273 115 -98 90 164 -67 20 -131 190 322 64 -45 110 91 128 23 40 -80 90
5984I0j83J22R7l21J38L50m19N0R9m8j6K1k58M04j9j05q8M1j13K83j74k3L9J59
$$ 90 -93 29 126 -195 -57 293 -126 -76 23 -25 -41 -20 -278 126 107 2 -86 -45 -158 125 -49 -72 -33 126
6008A26m1l08K80j46K11m25L94j40l8K18j41j97J56J56j85J57J28l59K28J0k28
$$ 126 85 -223 57 -89 122 -303 91 -49 -87 131 -10 -207 -51 105 -80 77 205 -154 74 84 -144
6029a44M31l04K0J49j95j20J38N6N7k58L0%J48j32K87j18j15L15l34M4P0pj01
$$ -144 287 -17 3 152 -43 -163 -25 31 88 -170 -140 -140 8 -124 163 45 -70 245 -89 -45 25 18 -83
6052h3J76J4K2k69M46l14J12k07m1O0J62k24J80j64L62r3j16K6q6K26m49J80K02
$$ -83 93 107 129 -140 306 -8 104 -103 -144 -84 78 -146 34 -130 232 139 23 49 -37 189 -260 -80 122
6075A22J3j90mn9L0q8L36l87K36k76L81j8r4J98k21J59j24j49J59o2J11r8r4J31
$$ 122 135 -55 -59 -118 -88 -176 160 -227 9 -267 114 96 2 200 -21 138 14 -135 24 -38 73 -25 -119 12
6099A2P2j72J48N2j64J6P7rj43K33k25q9K13J33k37J93j87J07n1m2J87Nq1k57
$$ 12 84 -88 60 112 -52 -36 41 32 -111 122 -103 -192 21 154 -83 110 -77 30 -21 -63 124 129 48 -209
6123b09J47j48K93q5n6j59K11O9j82m1l3K66P0k09j59K80J81l54J47N3k49J90
$$ -209 -62 -210 83 -2 -58 -217 -6 63 -119 -160 -193 73 143 -66 -225 55 236 -118 29 82 -167 23
6145B3Q8N4j31K8j01k2p3K50qj84K22k36J76l35J26L40L2l73OK06n0P5l43K43
$$ 23 111 165 34 62 -39 -61 -134 116 108 -76 146 -90 86 -249 -123 217 249 -124 -118 88 38 113 -230 13
6169A3k2J81k17J25k30J37r7N8o5J51J44l0j54l6n6K60j91nQ2j08k58M62r4j61
$$ 13 -9 172 -45 80 -150 -13 -110 -52 -117 34 178 148 -6 -42 -98 162 -29 -34 48 -60 -318 144 50 -111
6193a11J89m00M04j56R9O5N8l0j29op6R6n4K51k10m6J75j07J16j79J27o2PJ0L1
$$ -111 78 -322 82 -74 25 90 148 118 -11 -17 -93 3 -51 200 -10 -56 119 12 128 -51 76 14 21 31 62
6218F2k49L42r0n3q9r6K69o3o2r1K76m13K49n3k55L63j6nJ92l06K7J26L14m62
$$ 62 -187 155 65 12 -77 -173 96 33 -29 -120 156 -257 -8 -61 -316 47 31 26 218 -88 -61 65 379 -83
6242h3N0J7k6m7L20q7l52J23K2L6R6K95k68j30k1J31j68J5J12l5L5j9K6k02J52
$$ -83 -33 -16 -42 -89 231 144 -208 -85 -63 -27 69 364 96 -34 -55 76 -92 -77 35 0 35 16 42 -160 -8
6267hj00J22R4n9K01k10j53J41O0K0J4l97L25j30K43j46k14M3J16J94L0k23m0
$$ -8 -108 14 108 49 250 40 -113 28 88 108 122 -275 50 -80 163 17 -197 -154 -38 156 186 -37 -77
6290g7K05j85m8J21J7n9J05O4k38PK68j51Lj13LK07O3j67K9J27n6j26p8J21n9
$$ -77 128 -57 -105 16 33 -26 79 143 -95 -88 180 29 32 -81 -78 129 192 25 54 181 125 -1 -79 42 -17
6315a7l3K13j88j8NN8N5k39K37Kk18K66k30J75j07K31k87J31k13o8M51j19m1k67
$$ -17 -50 163 -25 -43 -38 20 75 -164 73 75 -143 123 -107 68 -39 192 -95 36 -177 -245 206 87 46 -221
6339b21L21r7J3k4L6k12P8K19j22p2L07k45k17J71K98l85Q1J14j99L8m4M17k12
$$ -221 100 3 16 -8 28 -184 -106 113 -9 -81 226 -19 -236 -65 233 -152 -71 43 -156 -118 -162 255 43
6362D3K7k8j79K86r9K09j60pp1J78k22J02l51K01p4J27j92J01K8J18J40l44K61
$$ 43 70 42 -137 149 50 259 99 92 21 199 -23 79 -272 -71 -145 -18 -210 -109 -81 37 177 -167 94
6385I4N7j51j39R4J9j10K52k61K34k42N8J52j51K45l45L4M75l26J17m7o1J01k19
$$ 94 151 0 -139 -45 -26 -136 116 -145 89 -153 -95 57 -94 151 -194 -160 315 -11 106 59 -2 99 -120
6408a20oK07j86J9O1O8k9o1J7R2j3K02l16J3k01J84R2j16L04k69N5J83l89J8J75
$$ -120 -126 81 -105 -86 -25 43 14 -47 -30 62 49 251 -65 -52 -253 -69 23 -93 211 -58 -3 180 -209 -191 -16
6433a6j4j02J52Q5k34RP0l2J38q5QM12l86J85k19l7K77k34J28J13k95J25p8K49
$$ -16 -30 -132 20 105 -129 -120 -50 -82 56 -29 -21 391 5 190 -29 -66 211 -23 105 218 -77 48 -30 219
6457B19j89j35J25J61j42Q7Lk01l7L06k19J53k30N9j6k0J56k41M31l48J50j26
$$ 219 30 -105 20 181 39 126 129 -72 -109 197 -22 131 -99 -40 -56 -76 80 -161 270 -78 72 -54
6479e4j42J60P9k91L18k39K23o2K3M9Q7j70Q3l5j14P7m0N9k4Q2m5k58J88L7n7
$$ -54 -196 -36 43 -248 70 -169 54 -8 15 64 151 -19 64 29 -85 -8 -48 11 -13 69 24 -234 -46 -9 -66
6504f6j50N1J90k3o9J59Q2n2j23o5j9L58m71J57K0o5K35o7j76M0mn6L02l21R8
$$ -66 -216 -165 25 2 -67 92 174 122 -1 -66 -85 273 -198 -41 -21 -86 149 82 -94 -54 -58 -114 188 -133 -35
6529c5n5J25J12k17m1J91n7j13l9J88j79K15j92J39k19M85k24k10K09p4Q2Q7m36
$$ -35 -90 35 147 -70 -111 80 23 -90 -129 59 -120 95 -97 42 -177 308 84 -126 83 9 91 178 -258
6552b58K97m9j13J96P9J41l88Q1j31M75j72kl12J19K35j42k67K67L1j81K71m1
$$ -258 39 -10 -123 73 152 293 -95 -14 -145 330 158 156 -156 -37 198 56 -211 56 87 -94 177 136
6574A36k21O8m9K1k8J62J12k83RJ23L5q8m0j09L59k44p8j04K7K54n6j31J42j61
$$ 136 -85 -17 -66 -45 -73 89 201 -82 -73 50 85 -3 -43 -152 207 -37 -115 -219 -192 62 6 -125 17 -144
6598a44M5R6P0J9l40K22j00m0K97j71o4j77J18K56M3ok28R0P8k20K49k3K4O2l72
$$ -144 -99 -3 67 86 -254 -32 -132 -172 125 -46 -110 -287 -169 87 130 124 -104 -14 64 -156 93 70 94 156 -216
6623b16mK18j1m7o5J46k09J84j28q6L58j27k4j88L07J4j91N1J90j72K42r5j51
$$ -216 -220 -2 -13 -60 -125 21 -188 -4 -132 -218 140 13 -11 -199 108 122 -69 -18 172 0 242 147 -4
6646dJ49J12k28k02K18k54K92l9j1o2J07j23j42J10k18K51m2j38K18m6j22J03
$$ -4 145 257 29 -173 45 -209 83 44 33 -29 78 -45 -187 -77 -295 -44 -86 -224 -6 -52 -174 -71
6668g1j56J84p6J82Nj69j33K25q7Q0J64k6q1j20R9j43J04k7J24J12l9j24j42r7
$$ -71 -227 -43 -119 63 68 -101 -234 -9 -96 -16 148 122 41 -79 20 -123 -19 -46 78 190 151 27 -115 -212
6692b12J82K6O5K20l07J03k03L61k2l6ml2k10J28m78L09K13k11J30m0P5N9l1k5
$$ -212 -30 -4 61 281 -26 77 -126 235 213 177 173 141 -69 59 -419 -110 103 -108 22 -18 57 116 85 60
6716F0K11r9k8j83K74k66L2M1m3J80k74K34m2k86K16m7j00J44j9j7P1J08j12N
$$ 60 271 172 144 -39 235 -31 1 42 -1 179 -95 139 97 -189 27 -20 -120 24 5 -12 59 167 55 60
6740F0k0R5j40J06J0ROj61Q6P2k11%J11J14r8k44J75j27J18M7K45j87j16J18q4
$$ 60 40 135 -5 101 111 120 126 -35 51 123 -88 -88 23 137 39 -205 -30 -157 -39 8 253 66 -50 68 -16
6765a6j7J5J27j39j97K02J6P6k33J20j22J75J36k26K20j47j13J8K26m8j45J99
$$ -16 -33 -18 109 -30 -227 -25 -9 67 -166 -46 -168 7 143 -83 137 -10 -123 -105 121 73 -72 127
6787A27j61J34k65Q0P4k20K04O3J55j82j79N4L3j00L18L9j02j06m5L79j37l15
$$ 127 -34 100 -165 -85 -11 -231 -27 36 191 9 -170 -116 -83 -183 135 174 72 -34 -79 300 163 -152
6809a52L37O9k99L21k22j19j3Q4l79M14k23J78J2r7L2L57l96J31J22n5k98M42
$$ -152 185 254 -45 276 54 -65 -78 6 -373 41 -182 -4 8 -89 -57 300 -96 35 157 102 -196 246
6831B46l66L11q2m9j89p9J91j04K82l31R3K82j04k81L0J07k7K41j53K32n58K71
$$ 246 -120 191 109 60 -129 -208 -17 -121 161 -170 -77 205 101 -180 -150 -43 -70 171 18 250 -308 -37
6853c7K7J6J09m7qj03J27k99N8J21l9K68j47j63J08Q5M5j21oJ18l9j31J79j21
$$ -37 -10 6 115 68 60 -43 84 -215 -157 -36 -75 193 46 -117 -9 76 121 0 -6 112 73 -58 121 0
6877@K79k88q4Q0o1J47p6p9rk6J91j30R5j32J13K8n8q9K76m30K58J59k9j57j11
$$ 0 279 -9 -93 -13 -74 73 -3 -82 -91 -117 74 -56 39 -93 20 48 -10 -99 177 -253 5 164 135 -22 -133
6902a33K77j48k43K51j90K8O4O9O0P2m9P9j5j00J08o2K3o8N8l00q1K23p0L82j76
$$ -133 144 -4 -247 4 -186 -158 -94 -25 35 107 58 137 122 22 130 68 91 23 81 -219 -300 -77 -147 235 59
6927E9j07k05L37k79J83P9J82l49p1K04O4j25k31k1J79J93j6k10Q5J06m40P34
$$ 59 -48 -253 84 -195 -12 67 249 -100 -171 33 97 -28 -259 -280 -101 92 76 -134 -49 57 -383 351
6949C51j87O3k31j7j58J53P3p0M52n71K05j33M5j15P7O3k26M10j98K2Q3n4j75
$$ 351 164 227 -4 -21 -179 -26 47 -23 429 -142 63 -70 -25 -140 -63 0 -226 184 -14 8 91 37 -138
6972a38J65J49k10j19J28n0J89N6j62L2R7j50p1L09k38k13q1M47k62q2k8M19l17
$$ -138 27 176 -34 -153 -25 -75 114 170 8 40 137 -13 -84 225 -13 -226 -307 140 -122 -204 -232 187 -130
6995a30K01k1J8J88k33m5J33l36L02O3j80q3n4J81k29R0J46O4l2k00J65j21j15
$$ -130 71 50 68 256 23 -22 111 -225 77 140 -40 -123 -177 4 -225 -135 11 75 43 -157 8 -113 -228
7018b28m2J72J78k21m7J75K31j09l5q%q3Q7j94J15jn1o2o8K13L61n05J59q9K24
$$ -228 -270 -98 80 -141 -188 -13 218 109 74 66 66 -17 70 -124 -9 -10 -61 -123 -191 22 383 -122 37 -52 172
7043A72j85j2J92n5k6j45j21J77k48K74j7K53k40o6N0j95K30L8j33J15Q3j39M12
$$ 172 -13 -25 167 112 86 -59 -180 -3 -251 23 6 259 19 -47 3 -192 38 76 -57 58 141 2 414
7066D14l17m5P2k94M07j73k48L37j16j1J2J64k03K8j62L24j49l1K22k83O7J81
$$ 414 97 52 124 -170 237 64 -184 153 37 26 38 202 -1 27 -135 189 40 9 231 -52 15 196
7088A96m12J38k28L37K06l30K17j80M6Q4O2J10k72L10j53k90J58l12K3K80R1r8
$$ 196 -216 -78 -306 31 237 -93 124 -56 -10 74 136 246 -26 284 131 -159 -1 -313 -290 -10 81 -17
7110a7k18L18j65K0m7J3J45j9k1%m1J20j80J28J4j93K85j85L56l74J27J32k70
$$ -17 -235 83 -82 -62 -109 -96 49 30 9 9 -32 88 -92 36 50 -143 142 -43 313 -61 66 198 -72
7133g2N9j6j63P7K81j57k5M4j18Q1j81K40j22q9J2k9J48j09K34m0J08r5q1K29
$$ -72 -13 -29 -192 -115 166 9 -16 28 -90 -9 -190 50 -72 -161 -149 -178 -30 -139 95 55 163 68 -13 216
7157B16k78k1l3J52N1k05j00J19K07q2Lk16K19J02l50K26K0K46k51J81k03j36
$$ 216 -62 -83 -116 36 87 -118 -218 -99 108 26 29 -187 32 134 -216 10 30 276 25 206 3 -133
7179a33J10J5oJ31J88n29K39Q7J08k46n1K5L0p1L6M25n00O2K08R2l38J85n3m2
$$ -133 -23 -8 -14 117 305 -224 15 102 210 -36 -87 -62 -32 -103 -67 358 -142 -80 128 220 -118 67 14 -28
7203b8K1K13l04P3Q7J41k02j10J33P4l48M51j07o5j39J81j93L07o3k59K95l19
$$ -28 -7 206 -98 -25 62 203 1 -109 24 98 -250 201 94 29 -110 71 -122 185 122 -137 158 -161
7225a61J16LR5j83R7O0J33j96k5j9r5P4J48j96O4K88k85q1J65J40l42K01j74O
$$ -161 -45 -42 53 -130 -33 27 160 -36 -61 -80 -175 -101 47 -149 -85 203 -82 -163 2 142 -200 1 -173 -167
7249a67J72o2N8j78M42j24k54Q9L2j08J36JM6J17j08q5l5k50oK80mR9j79J51k4
$$ -167 5 -57 1 -177 265 141 -113 -24 8 -100 36 37 83 200 92 7 -28 -278 -284 -4 -8 91 -88 63 39
7274C9j35j52K00K25k40K37k04J2J21j03K27j94j09J46l67M26R3j6l65K9%J60
$$ 39 -96 -248 -48 177 -63 174 -30 -18 103 0 227 33 -76 70 -297 129 222 206 -159 -130 -130 30
7296C0l8R8o7K3J4mm8J24k7k42M5J13j34P4R2Ol0P6j64J51q9K18Mr4j60rm4J03
$$ 30 -8 90 23 46 60 56 8 132 105 -137 -92 21 -113 -39 53 59 29 105 -59 92 3 221 225 131 -29 -38 -82 21
7324B1j49j0L26j19j09P3M9q5o7N2L67k68K27n65K25o8J63Lj31O6k07L47k67K32
$$ 21 -128 -138 188 69 -40 33 82 -3 -70 -18 349 81 308 -257 -32 -100 63 66 -65 1 -206 141 -126 106
7348A06r3Or8J10J86j32R1o7k20j04J07J29j64R8J33L3Lk47L7j00K07j61J98P2
$$ 106 13 19 -79 31 217 85 176 109 -111 -215 -108 21 -143 -45 88 121 124 -123 -86 -186 21 -140 58 130
7372A30M7k63R9J05q4Q5r2j58R5JJ54l34M9J96n7J24j81J60m4j84j60M11k49K37
$$ 130 177 -86 13 118 34 119 27 -131 -36 -35 119 -215 -166 30 -27 97 -84 76 32 -152 -312 99 -150 87
7396H7r8J89l98L19j89j31K50r8L52l92J20k99K28J61r9m4J33q6P4l43O7J20J65
$$ 87 -11 178 -220 99 -90 -221 29 -69 283 -109 11 -288 -60 101 2 -42 91 5 79 -264 -197 -77 88
7419H8q0j49j33K99O4m72K98m4O6K07O5l73J31J56m9l99L93Kk03L7P3J1K5j5j68
$$ 88 8 -141 -274 25 89 -383 -85 -129 -63 144 209 -164 -33 123 74 -325 68 70 -133 -96 -23 -12 13 -2 -170
7444a70J53J20k40O6k3N9j39K31J60l95J10J48m9k31K62m3P3l19K60J39r4l10
$$ -170 -17 103 -137 -71 -94 -35 -174 57 217 -178 -68 80 31 -200 62 19 92 -227 33 172 78 -232
7466b32K49j13J14p5j57J58J19k30J97J01k33O3J54p2nj04m2J38P1j18RJ03l21
$$ -232 17 -96 18 -57 -214 -56 63 -167 30 131 -102 -39 115 43 38 -66 -108 30 101 -17 -8 95 -226
7489b26K87k9L3q7J39L5k48M1P8Jj29O1RP0j2N7p0R2l41L93k48k0K70jq4j46j64
$$ -226 61 32 65 -22 117 152 -96 -55 23 24 -105 -44 -35 35 23 80 10 102 -239 154 -94 -114 156 155 71 -75 -239
7516b39J89k38L35J52k47N8Q2j34R0n5q5o9J95JJJ18l89Q1L38k28M3o7J28N4j39
$$ -239 -50 -288 47 199 -48 10 92 -42 48 -7 -92 -161 34 35 36 154 -235 -154 184 -44 -1 -68 60 114 -25
7541b5n9qJ54q6J65j63J35k85J95j07N9J44r6k37J99J37q8j42J96j51j37K25m16
$$ -25 -84 -92 62 -24 141 -22 113 -172 23 -84 -25 119 23 -214 -15 122 34 -108 88 -63 -200 25 -391
7564c91L93j97K01j38J19P8m5r7K39j04J50j21j37OK06q8k79J83j16K69k30j3
$$ -391 2 -195 6 -132 -13 65 20 -77 162 58 208 87 -50 -44 162 74 -205 -22 -138 131 -99 -112
7586a12m3R4N2J86k30j78J88N8j36NR0M3j51K18j27J0m4J65J10k34J80k76K73
$$ -112 -155 -61 -9 177 -53 -231 -43 15 -121 -116 -26 17 -134 84 -43 -33 -77 88 198 -36 144 -132 141
7609A41j30r7R2l2N8J30j15N8j40N0r7J95j05m2k12K76j36O2J34l99J60O0k5J97
$$ 141 11 -86 6 -26 32 162 47 105 -35 15 -82 113 8 -34 -246 30 -106 -44 90 -309 -149 -89 -114 83
7633H3k62P8p8MK29J31k59J33n1r4L97l09q0K30O3l56k3J56n8nK64j87J7O4q0
$$ 83 -179 -101 -179 -175 54 185 -74 59 8 -86 311 2 -78 152 215 -141 -164 -8 -66 -71 193 6 23 87 7
7658GL2j24M9K37p5j36J4M4j28j07N5M14l0j55j34N6J61m46L23LJ19k25L7k27
$$ 7 39 -85 -36 201 126 -10 4 48 -80 -187 -132 282 252 97 -37 19 180 -266 57 60 179 -46 -9 -236
7682b36K09J22O0k53m3J08J0k1J8J32l58K40J69o9k10nQ2j5J98m00K61J07j26
$$ -236 -27 95 155 -98 -141 -33 -23 -44 -26 106 -252 -12 157 88 -122 -127 -45 -60 138 -262 -1 106 -20
7705b0L13J5m10J72l8J14k57J66N1JJ14j18l36J51J13O8j18j69O8o2q5M20M8k19
$$ -20 293 308 -102 70 32 146 -111 55 106 107 221 103 -233 -82 31 99 -19 -188 -120 -182 -267 153 201 -18
7729a8l5J01l6j70J8O9J72k0j72Q2J96k76R6M9M7k71L37l93m4J91nR0l9J84Q6
$$ -18 -53 48 12 -158 -140 -71 101 81 -91 -9 187 -89 7 56 103 -168 169 -224 -268 -77 -82 8 -31 153 239
7754B39j10j14k33K76j20N3j51K25K27k06j16J45K9k0m59M68K57k04j22K8j25
$$ 239 129 15 -218 58 -62 -9 -160 65 292 86 -30 115 144 124 -335 133 390 186 64 92 -33
7775c3k26L47o0L4N2L7o5k21k1J44j4m4K4M0K8p2L4J12j3Q8k47J17Oj88J26K6
$$ -33 -259 88 28 62 114 151 86 -135 -156 -12 -26 -70 -46 -6 22 -50 -16 96 83 171 -76 41 47 -141 -15 11
7801A1k70K15n8k30L41m4J79j12K0Q7K61l87J61l65J02O8j59J70jJ99p4K1J03
$$ 11 -259 -44 -102 -332 9 -35 144 32 52 139 400 13 174 -191 -89 -21 -180 -10 -11 188 114 135 238
7824B38j87q3l3L08k22q0K14p6j36K12j47j85m5K87n5M3N7k21P0qJ36k37J60Q7
$$ 238 51 -32 -65 243 21 -59 155 79 -57 155 8 -177 -222 65 10 53 110 -111 -41 -49 87 -150 10 97
7848I7j3n7pk57K15P9k04Q3p6J08j63L39k06Q8J46k11J70N3l06J71Jj93K92k15
$$ 97 84 27 20 -237 -22 57 -147 -64 -140 -32 -195 144 -62 26 172 -39 131 184 -122 49 50 -143 149 -66
7872f6k7P9J87k46K1m9O4L47m79J03l2j0K26m04N55j51k43O7J46l40K36M4j43
$$ -66 -93 -14 173 -73 -52 -101 -37 310 -169 -66 -98 -108 118 -286 269 118 -125 -58 88 -252 -16 28 -115
7895a15J34p9J70j90L90j72k2k28Q2N8J88k38o7J58k06k2L36j71J62j49L6R2k
$$ -115 19 -60 110 -80 310 138 116 -112 -30 28 216 -22 -89 69 -137 -159 177 6 168 19 55 147 145
7918A45k90K09n7k03R0Q8J17k26L82k57n4q3J42l7k8J52r2j01P3P1j52L4r2J55
$$ 145 -145 64 7 -196 -106 -18 99 -127 255 -2 -56 -139 3 -34 -62 90 -2 -103 -30 41 -111 -77 -169 -14
7942a4r6J16j84R5j94M20j31J09j03lml2k3K6r0j12L48l62L57j71j39L80k19j60
$$ -14 -110 6 -178 -83 -277 143 12 121 18 15 11 -21 -44 -18 -108 -220 128 -234 123 -48 -187 193 -26 -186
7966a86L88k17J25j20J5j12k1R6Kj0L52m49J22l0K5K8J69k93K72j73O0K0o7M5
$$ -186 202 -15 110 -10 5 -107 -128 -32 -30 -40 312 -137 -15 -45 -20 8 177 -116 156 -17 43 63 -4 41
7990D1M9j31J38l67K15o7J36l6j76o7M09K9m9N9j54Lk17p4M67ol35K13l37K29
$$ 41 90 -41 97 -270 -55 -122 14 -22 -198 -265 144 173 124 183 29 32 -185 -259 208 202 -133 80 -257 -28
8014b8J90j31L8j13J6J42j05k11K51O2j42P4j92J97j30R6r9k0K78R8j29q2q7l0
$$ -28 162 31 69 -44 -28 114 9 -202 49 111 -31 43 -149 48 -82 14 -85 -105 173 271 142 60 -27 -57
8038e7r4Q9L06k76j8O7nnJ24J8k67L8R1J01k24L5k70L05n5L13l27K03j34J89n9
$$ -57 -151 -62 244 -32 -50 17 12 7 131 149 -118 -80 11 112 -112 -77 -347 -42 -97 216 -111 92 -42 147 88
8063H8o3k4p4N3O5L2j54J10k04Rj87L23j9j26L55l02K55M0k95M1j4MJ52k41J52
$$ 88 25 1 -73 -20 45 77 -77 33 -171 -162 -349 -26 -45 -171 184 -118 137 177 -118 -77 -91 -87 65 -176 -24
8088b4j5K03j55L20l19l8j27K12j28K26rj94K82j66k85k9M52n18L13J67j52j73
$$ -24 -39 164 9 329 10 -28 -155 57 -71 155 146 -48 234 68 -217 -246 206 -312 1 168 16 -157
8110a57K13r1K02o8Q0k97q7Q3J67o8K29k74N0p1k43L49j41J46K75j44o8m0J68
$$ -157 56 -35 167 99 179 -118 -205 -122 45 -23 206 -68 -18 -89 -332 17 -124 22 297 153 85 45 213
8133B13k56Q1Q2p7N0l28K77m0J2j57L97l27L4j98K40k33L47j52J35k11j6M04j80
$$ 213 -43 38 120 43 93 -235 42 2 14 -143 254 -73 -39 -237 3 -230 117 -35 100 -111 -127 277 97
8156I7Jp3J28J32l45k10K18p2j48L00k99KM20j04j01j59J77K32j48j79J91J52
$$ 97 98 25 153 285 -60 -270 -52 -124 -272 28 -271 -269 151 47 -54 -213 -36 196 48 -131 60 212
8178B12l09L52j87m6n2P3n0q9K04j09N0j61J33
$$ 212 -97 255 68 22 -30 43 -7 -96 108 -1 49 -112 21
8191B1
$$ Imaginary data points
##PAGE= N=2
##DATA TABLE= (X++(I..I)), XYDATA
0@%%%%%%QqQj6J6k4M0m8N6p2Q8j12J44j76K08k48K96l52M16m84N64o56P52q64
$$ 0 0 0 0 0 0 0 8 0 8 -8 8 -16 24 -24 32 -40 48 -64 80 -96 112 -136 160 -192 224 -260 304 -352 400 -464
30d64R92j128J285j461J651j860K091k346K626k932L268l634M034m470M947n469
$$ -464 528 -600 685 -776 875 -985 1106 -1240 1386 -1546 1722 -1912 2122 -2348 2599 -2870
46b870O038o661P343q091Q912r818J0821j1935J3179j4579J6164j7976K0072k2528
$$ -2870 3168 -3493 3850 -4241 4671 -5147 5674 -6261 6918 -7661 8503 -9473 10599 -11929
60a1929K5453k9006L3431l9123M6758n7591P4292j03701J70747n98972k31383
$$ -11929 13524 -15482 17949 -21174 25584 -32007 42285 -61416 109331 -489641 -721024
71g21024P10063k17808J23534O9387j47709j17264J12413p4962J51164K68933
$$ -721024 -10961 -228769 -105235 -35848 -183557 -300821 -188408 -263370 -112206 156727
81A56727J17104M5155Q1971j98467j14856J02262o1721j83260J80122K37859k8664
$$ 156727 273831 318986 400957 202490 87634 189896 128175 -55085 125037 362896 334232
92C34232j29870q0254j30537j04984n2234K0687P7978O2474k695N328m4007j33504
$$ 334232 204362 124108 -6429 -111413 -163647 -142960 -64982 -2508 -5203 125 -43882 -177386
104a77386q6614O0246O8267Q757N3800J13179J0034j13545n6786O0320K3797j9894
$$ -177386 -264000 -203754 -135487 -126730 -72930 40249 50283 -63262 -120048 -59728 -35931 -55825
116e5825P8253J15358N191l6115k253k6813n7967k1103M0803N6803k610l7001
$$ -55825 22428 137786 142977 106862 104609 77796 19829 -1274 39529 96332 93722 56721
128E6721J2583J0691p6467q1177Q294L6210n231l117L9209J0563p1134m8170M5979
$$ 56721 69304 79995 3528 -77649 -69355 -33145 -38376 -41493 -2284 8279 -62855 -111025 -65046
141f5046J6896m8906L6945R7404q050m9493J6659J1357j7587l520K948L1304L7963
$$ -65046 -48150 -97056 -60111 37293 29243 -20250 -3591 7766 -9821 -13341 -10393 20911 58874
154E8874k2638n493M5691m0834p7299M6206N2175n2702j2742N3036j3244m9657
$$ 58874 36236 30743 76434 35600 -41699 4507 56682 3980 -8762 44274 31030 -18627
166a8627j1376J855J0805L794j9483K1986L6541l7162k3271M3840j2602n5220
$$ -18627 -30003 -28148 -17343 -13549 -33032 -11046 25495 -11667 -34938 8902 -3700 -58920
178e8920K7405N2742j2889k1407J5933J8478r511k8968K237M1327K107l4398J4221
$$ -58920 -31515 21227 8338 -13069 2864 21342 11831 -17137 -14900 26427 28534 -5864 8357
191H357K4306l4623k0250L0309K046l0126R15K9488J3869k1613k4288J6155J4725
$$ 8357 32663 -1960 -22210 8099 10145 -19981 -19066 10422 24291 2678 -21610 -5455 9270
204I270k8845j0484L6207P120l0864L979K8275r347k2504J3450K4323q953j8924
$$ 9270 -19575 -30059 6148 13268 -17596 -13617 14658 5311 -17193 -3743 20580 11627 -7297
217g297J2015K1640j6380k5861J1839J8216j3717j3172J6465J5391j7754j9015
$$ -7297 4718 26358 9978 -15883 -4044 14172 455 -12717 3748 19139 1385 -17630
229a7630J6408J2764k4967j1306K7827M827k5549K216K3109m502j8860M551J9517
$$ -17630 -1222 11542 -13425 -24731 3096 7923 -17626 -15410 7699 3197 -15663 -11112 8405
242H405K981j6345j997K1147j197k4758P241K3363j3841j5714K1421J3167j8821
$$ 8405 11386 -4959 -6956 14191 12994 -11764 -4523 18840 4999 -10715 10706 23873 5052
255E052j1501J2353Q637j2741j2617R817R732j5995q841J7732K876k1519N13K1253
$$ 5052 -6449 5904 14541 1800 -10817 -1000 8732 -7263 -16104 1628 4504 -17015 -16502 4751
269D751j285j5925K082J4195l92j4680P8J7590r64j5015R277J7754j0357j2386
$$ 4751 3466 -12459 -10377 3818 3426 -11254 -11176 6414 5450 -9565 -288 17466 7109 -5277
283e277J3745R578j4062q819J0912P114j1285r902Q641P723j1888o086J3798L147
$$ -5277 8468 18046 3984 -4835 6077 13191 1906 -7996 645 8368 -3520 -9606 4192 7339
297G339j5940o94J4547k056j4940NJ2538j444j0425M239J3112m651j0201P954
$$ 7339 -8601 -9295 5252 3196 -11744 -11739 799 -645 -11070 -6831 6281 1630 -8571 -617
311f17J2273o955j0687P207R122o965p762O204O972p736n260J0012N580j1271
$$ -617 11656 4701 -5986 1221 10343 3378 -4384 1820 8792 1056 -4204 5808 11388 117
325A17m537J1043Q76j1938k687Q572l18q957M19Q172m91p394K773Q368k737p898
$$ 117 -4420 6623 7499 -4439 -7126 1446 1128 -7829 -7410 762 271 -7123 -4350 4018 1281 -6617
341f617M371Q296n417q083N403P435m839m984O557N714n824l402P741K381r422
$$ -6617 -2246 6050 633 -7450 -2047 5388 549 -4435 2122 7836 2012 -1390 6351 8732 -690
356f90k627P180P73p897j112N917O90n559R15O172j044o598J182O600k374p820
$$ -690 -3317 3863 4636 -3261 -4373 1544 2234 -3325 -2410 3762 2718 -3880 -2698 3902 1528 -6292
372f292K111O250k984m192M230M476l312k591N094K691n365k883M426K188n524
$$ -6292 -4181 2069 -915 -5107 -877 3599 287 -2304 2790 5481 116 -2767 1659 3847 -1677
387a677k478N166J742m428K8M983J03m149L38L548j360m906K43M065p32m263K034
$$ -1677 -4155 1011 2753 -1675 -1647 3336 3439 -710 -372 3176 1816 -3090 -2847 1218 486 -3777 -1743
404a743M758j694k867K934K566l393k505K791Q77l655j823K830K827k207j955
$$ -1743 3015 1321 -1546 1388 3954 561 -1944 847 1724 -1931 -3754 -924 1903 -304 -2259
419b259L579J915l310n2K920j364m310N92L518j491k318J175K520P24j267L03
$$ -2259 1320 3235 -75 -127 2793 1429 -2881 -2289 1229 -262 -2580 -1405 1115 1839 572 875
435H75K189j385l050J628K075l054k958K188K433j792j039K521P55j153K64J004
$$ 875 3064 1679 -1371 257 2332 -722 -3680 -1492 941 -851 -1890 631 1386 233 497 1501
451A501j80j881q87J385K00k108J20K433K79j655J158K452o54j567j50O42j082
$$ 1501 1321 -560 -1447 -62 138 -1970 -1850 583 862 -793 365 2817 2163 596 446 1088 6
468Fj312P28Q06j043j625J887K378j126r58J481m92j927Q43J035j337j216J15
$$ 6 -1306 -578 228 -815 -2440 -553 1825 699 -259 1222 730 -1197 -354 681 -656 -1872 -1757
485a757O69J395L33p72P41J438j475m0J972j731k605K210J087k446l8J451J29
$$ -1757 -1088 307 640 -132 609 2047 572 532 2504 773 -1832 378 1465 -981 -1019 432 561
502E61K23O47j388l29J298j463r25J098r80j651K408J061k463J307K652q79j033
$$ 561 784 1431 43 -286 1012 -451 -1376 -278 -1258 -2909 -501 560 -1903 -596 2056 1177 144
519A44P25o36l32M31n40p72K24M98R1J800r5j540R48J134j084n62L20j299r64
$$ 144 869 233 -99 332 -208 -980 -756 -258 -167 1633 1538 -2 946 2080 996 434 754 -545 -1509
538a509K82N07p2Q2J69K40Q03J56o04l55k53l99K78k61j38l43Q28J282K00l24
$$ -1509 -1227 -720 -792 -710 -541 -301 502 658 54 -301 -554 -953 -675 -936 -1074 -1417 -589 693 893 569
558E69K34Q58m52m02K91p87j109M58O28j117Q2J318k63K59L09q68k41R78n14j542
$$ 569 803 1661 1209 807 1098 311 -798 -340 288 -829 -747 571 308 567 876 8 -233 745 231 -1311
578a311J82K44o66R65N20p34L87R98K27n08N1P0m67J8J42p51k04P93J13J47N06
$$ -1311 -1129 -885 -1551 -586 -66 -800 -413 585 812 304 355 425 -42 -24 118 -633 -837 -44 69 216 722
599G22j0p19Q26J54p12p1Qj258K46J393k85j067P72q8j94J332J62j663L90o5r12
$$ 722 712 -7 819 973 261 190 198 -1060 -814 579 294 -773 -1 -89 -283 1049 1211 -452 -62 -127 -1039
620a039K07O83q87K01J085m27m29J564k70k12O98j138j131J447Qr35N29m46m21
$$ -1039 -832 -149 -1036 -835 250 -177 -606 958 688 476 1174 36 -1095 352 360 -575 -46 -492 -913
639i13J389N64p76K58j44l90M51m13j102L31P07m88J29R44q40N50J023o55m32
$$ -913 476 1040 264 522 378 -12 439 26 -1076 -745 -38 -526 -397 547 -293 257 1280 625 193
658A93M74j115m40R45q68o52J161l09k30J739L7j153R58M87p50J97l5j335K24
$$ 193 667 -448 -888 57 -811 -1463 -302 -611 -841 898 935 -218 740 1227 477 674 639 -696 -472
677d72R71r77M06N98o28N2J240q59q25Q15o07j79j61l77K39O39j73l0R09k50j93
$$ -472 499 -478 -72 526 -102 -50 1190 331 -494 321 -286 -465 -626 -1003 -764 -125 -298 -328 581 331 138
698A38P24l13o27l11N96m12p2L5k00N63L63k91N67L0j032M73K83p34l14j17j74
$$ 138 862 549 -78 -389 207 -205 -277 -242 -442 121 484 193 760 790 -242 231 514 -220 -534 -651 -825
719h25Q02l68rM33j7m04Q89K39q46m81P80j75k16n8k96M10Q25l58K85L83q07o5
$$ -825 -23 -391 -400 33 16 -388 501 740 -106 -587 193 18 -198 -256 -552 -142 683 325 610 993 186 121
741A21Q92n34j250O02nn04M84j50o3P67j61l7K67l9r20M51O04j163n14J011K11
$$ 121 1013 479 -771 -169 -174 -678 -194 -344 -407 360 199 162 429 390 -530 -79 525 -638 -1152 -141 70
762G0k91M87o6L73L80o76M58j12r41m53J035j49q28L75L93k1J51J88j33M1o62
$$ 70 -221 266 200 573 953 277 735 623 -318 -771 264 115 -713 -338 55 34 185 373 240 281 -381
783c81M68K28p10p52P58J01l28M03M69o3L46r7l05K38k92l72L10M74j141L7J217
$$ -381 87 315 -395 -1147 -389 -288 -616 -213 256 193 539 442 137 375 83 -289 21 495 -646 -609 608
804F08m17n23J023j43l84R5o1j05k91n06L08K35n21k06P62L00p9J67L31j91m42
$$ 608 191 -332 691 548 164 259 198 93 -198 -704 -396 -161 -682 -888 -126 174 95 262 593 402 -40
825d0k50J94j02k79k37O06M76n01J84P05k31l4M7m5n11k51j48M82qo93K61P66
$$ -40 -290 -96 -198 -477 -714 -108 368 -133 51 756 525 491 538 493 -18 -269 -417 65 57 -636 -375 391
847C91k10m69R15p0r77J60M6j68l47R9L92K59p2j37M93M63o38J62M06o02m37K97
$$ 391 181 -288 627 557 -420 -260 -214 -382 -729 -630 -238 21 -51 -188 305 768 130 292 698 96 -341 -44
869d4K28l75j76K65O18N4n87L89J19j13n32L66k98o99J97L51R6j11j15L90L86
$$ -44 184 -191 -367 -102 516 570 -17 372 491 378 -154 212 -86 -785 -588 -237 -141 -252 -367 23 409
890D09l69k47M17N7p58K53J81r3o22O04L90q5OJ73J96J23l63k9q9k93l82L82P5
$$ 409 40 -207 210 267 -491 -238 -57 -150 -772 -168 222 137 143 316 512 635 272 243 154 -139 -521 -139 -64
913f4j59qK98K84l95o7K27J28n73l63M95M2p33L07Q36Nl26N65M9k3l25k12M82
$$ -64 -223 -231 67 351 -44 -111 116 244 -329 -692 -197 -155 -888 -581 255 260 -66 499 548 525 200 -12 470
936D70m69l75K47J27j54k53K52M46k30l32O18j37j69l42nK60k82j08O19j46m53
$$ 470 1 -374 -127 0 -154 -407 -155 291 61 -271 347 210 41 -301 -306 -46 -328 -436 183 37 -416
957d16M80M82k52r9k24mL53p24K9L38k48n09N70R22p71K04M49l7o64M70k96j23
$$ -416 64 546 294 195 -29 -33 320 -404 -375 -37 -285 -794 -224 698 -73 131 580 543 -121 349 53 -70
979g0M4k33k1M10n37O3Q27q1p79N04J69m59j22O4J20l39M02M2K52K9J5j76O21
$$ -70 -26 -259 -280 130 -407 -344 483 402 -377 127 296 -163 -285 -221 -101 -440 -38 4 256 285 300 124 745
1002G45l92n34J71L4l20K28j17O4j83M53J52L13n91l29M25l35K54j88l97Q6l6
$$ 745 353 -181 -10 24 -296 -68 -185 -121 -304 149 301 614 23 -306 119 -216 38 -150 -547 -461 -497
1023d97K10L61M1K22k73K52k0l56K33j10l64J44q8k9K3K87J86J78k77J3N2Q5j33
$$ -497 -287 74 115 337 64 316 296 -60 173 63 -301 -157 -245 -274 -251 36 222 400 123 136 188 273 140
1046A40j71m8l89J38Q4J04l8K48Q4J68j52j28j07K76j94l90K22P8J00J99k52j00
$$ 140 -31 -79 -468 -330 -246 -142 -180 68 152 320 168 40 -67 209 15 -375 -153 -75 25 224 -28 -128
1068a28K81k94O59l13r8j82l1j03K17n3k63N9J99L05l37J33K46m32R9K6n29K92
$$ -128 153 -141 518 205 107 -75 -106 -209 8 -45 -308 -249 -50 255 -82 51 297 -135 -36 -10 -539 -247
1090b47N07n78R7L15l10J46L67rk66J24l8k10j85K39O4J60l02J76k00K73NKQ6
$$ -247 260 -318 -221 94 -216 -70 297 288 22 146 108 -102 -287 -48 16 176 -126 50 -150 123 128 130 216
1113B16j86j3k79M4K17l7jl45M4M01P7J2J84l70p7K19k22J05o3q2j51J41J00L2
$$ 216 30 17 -262 -218 -1 -38 -39 -384 -340 61 138 150 334 -36 -113 106 -116 -11 -74 -156 -307 -166 -66 -34
1137c4j46L17J35k62r1P0j1j94L19l07o6K49Q7k07M78j61k51J28K3j5j54k21L4
$$ -34 -180 137 272 10 -81 -11 -22 -216 103 -204 -270 -21 66 -141 337 176 -75 53 76 61 -93 -314 -280
1160b80J15j84K71J51K24j61K41n1k66k15L48l23L0j11J1l5J20J38N2l4K14k42
$$ -280 -165 -349 -78 73 297 136 377 326 60 -155 193 -130 -100 -211 -200 -235 -115 23 75 41 255 13
1182A3J42Kl08K00k16Q0M2q5J54J29kJ0L0j14K24k58j58j5j50N8L98Lk23P2j9
$$ 13 155 157 -151 49 -167 -87 -45 -130 24 153 151 161 191 77 301 43 -115 -130 -280 -222 176 179 -44 28 9
1207IJ8j33M78k88l3j91j22M77o72J34L83RJ62k43L86k74R2j56J74m3l43r2K76
$$ 9 27 -106 372 84 51 -140 -262 215 -457 -323 60 69 231 -12 374 100 192 36 210 167 -176 -268 8
1230HP9l13Q7L71J14m83M83J37l19k71J38o7j68J84k62M41n1l52R6L67j90K1Q
$$ 8 87 -226 -139 232 346 -137 346 483 164 -107 31 -36 -204 -20 -282 159 108 -244 -148 219 29 50 58
1253E8o3q4q6P0O8j62J78j01n9M27j72L4m2Pk14J02J8p0J21k2P9k20K72q3J55
$$ 58 -5 -89 -175 -105 -37 -199 -21 -122 -181 246 74 108 66 73 -141 -39 -21 -91 30 8 87 -133 139 56 211
1278B11j16N5o0k40k42L41l8j04j88P9M33mk58J45J45p0k60K48j00l23J29L67
$$ 211 95 150 90 -150 -392 -51 -89 -193 -381 -302 131 127 -131 14 159 89 -171 77 -23 -346 -217 150
1300A50l08o0M25j16J35M5j95j1l8j97p6L23j85Q3k3L11j23j66KK48k1k81q7K75
$$ 150 -158 -218 207 91 226 271 76 65 27 -170 -246 77 -108 -25 -48 263 140 -26 -24 224 203 -78 -165 110
1324A10k10l0Q7J78l33J91K99j16j08J03J48j87j83q4K65m09P4J7O33l57k50K72
$$ 110 -100 -130 -43 135 -198 -7 292 176 68 171 319 132 -51 -135 130 -279 -205 -188 445 88 -162 110
1346A10L86n27j58Q9K25j68p4j53L4l7j04M48k4k64K43P7J67n14o1K31j75K39
$$ 110 496 -31 -189 -100 125 -43 -117 -270 -236 -273 -377 71 47 -217 26 103 270 -244 -305 -74 -249 -10
1368a0nL23L2l41k04N89j54k42J96J29m16l11M69J95m91J37K84K02m03N8L76j00
$$ -10 -15 308 340 -1 -205 384 230 -12 184 313 -103 -414 55 250 -241 -104 180 382 -21 37 413 313
1390C13n26J82J12K42o46J52J68j59j51K61K55q7n13L02N17k23n98O9L62l70K75
$$ 313 -213 -31 81 323 -323 -171 -3 -162 -313 -52 203 116 -397 -95 422 199 -399 -330 32 -338 -63
1411f3J21J45k27j90K87K40n43k7K08K32l94j48N55l67J07L00K20p5p66L57N30
$$ -63 58 203 -24 -214 73 313 -230 -257 -49 183 -211 -359 196 -171 -64 236 456 381 -385 -28 502
1432E02o06k77L30M37o22k02N26L24o58J20M47R4m90m09Q33k83k40j69M41K25
$$ 502 -104 -381 -51 386 -236 -438 88 412 -246 -126 321 415 -75 -484 349 66 -174 -343 98 323
1452C23q38M47L86k19l11J50K77L6m77J05M99n02k60O58J75o46j24P65K26p74
$$ 323 -515 -68 318 99 -212 -62 215 251 -226 -121 378 -124 -384 274 449 -197 -321 444 670 -104
1472a04k57O82K9o19j74L87Q7k34N8N98l42n13N53L08l78n75K78O68l35n91L42
$$ -104 -361 321 350 -269 -443 -56 31 -203 -145 453 111 -402 151 459 81 -494 -216 452 117 -474 -132
1493a32M00n40m29R57L64p53m5K66O3l86j33L18J44k96j72O83K16j051M67N69
$$ -132 268 -272 -701 256 620 -133 -178 88 151 -235 -368 -50 94 -202 -374 309 525 -526 -59 510
1513E10m44n24K08M36J1q89N36L04j60k45K23N37n08m13K80N25m61k22M07J01
$$ 510 66 -458 -250 186 197 -692 -156 148 -12 -257 -34 503 -5 -418 -138 387 -74 -296 111 212
1533B12n65M7M57N3o69L52N92jo79j28N73q0n54k5O92k4o77J20O72l29k62M39
$$ 212 -353 -306 151 204 -465 -113 479 478 -201 -329 244 164 -390 -415 277 253 -424 -304 368 39 -223 216
1555B16L30p65j16L38M28o25j95O29R1l69k16M76L17p43q6M03K54r17J89N46p4
$$ 216 546 -219 -335 3 431 -194 -389 240 331 -38 -254 222 539 -204 -290 113 367 -550 -361 185 111
1576A11k83N9L92j15l27J34L53M4q16L71N36k69n53K48K87l36l9N71l1m46m06
$$ 111 -172 -113 279 164 -163 -29 324 368 -448 -77 459 190 -363 -115 172 -164 -203 368 337 -109 -515
1597e15Q18P6p86mO56K63q48J92L47M8m80j1O16l43l97K54O74k74r31Q20K04l08
$$ -515 303 379 -407 -411 245 508 -340 -148 199 247 -233 -244 372 29 -368 -114 560 286 -645 175 379 71
1619G1l27K67N50o78m1J95K35l24m50P80p0o08J26N16J08o14J73M71k82j96j73
$$ 71 -256 11 561 -117 -158 37 272 -52 -502 278 208 -400 -274 242 350 -264 -91 380 98 -98 -271
1640b71N82j55n88M59K07j74o17N66P51o68m61M94R7m40m0L49L84n39j91J82M94
$$ -271 311 156 -432 27 234 60 -557 9 760 92 -369 125 222 -218 -258 91 475 -64 -255 -73 421
1661D21o87J40O61k75p33N05K31k41k70L58n5K09n79L64L28j67o14N16L41o30
$$ 421 -266 -126 535 260 -473 32 263 22 -248 110 55 264 -315 49 377 210 -404 112 453 -177
1681a77K7K25K01l76l31M85J94k91k10O74oo82j58P45q4n23L39L11k52l59p1P89
$$ -177 -150 75 276 -100 -431 54 248 -43 -253 421 415 -267 -425 320 236 -287 52 363 111 -248 -319 470
1703D70j26p15M96L63k53o37K41M54n01l68N76K10k70m60Q61lp04J82L75J22p59
$$ 470 344 -371 125 488 235 -402 -161 293 -208 -576 0 210 -60 -520 341 338 -366 -184 191 313 -446
1724d46J65M81n3n44K13O12m66j8N9M83p1q65K97M27m33k02L87L02n26j87L52
$$ -446 -281 200 147 -397 -184 428 -38 -56 3 486 415 -450 -153 274 -159 -361 26 328 -198 -385 -33
1745c3M26l50k04K8M82o21M9K97k4m82J95L12K7k01k08O65k52n64L76N13l54l96
$$ -33 393 43 -161 -133 349 -272 -223 74 50 -432 -237 75 102 -99 -307 358 106 -458 -82 431 77 -319
1767c19J85N51l87n21N47K41j79m08K96L54J5o57M85k8l66l1K75L47o97J71L39
$$ -319 -134 417 30 -491 56 297 118 -290 6 360 375 -282 203 175 -191 -222 53 400 -297 -126 213
1788B13j72m92M52J48P9l74o0L93j46l64M22J66n23n0M14K53n42j86K38K22m02
$$ 213 41 -451 1 149 228 -146 -206 187 41 -323 99 265 -258 -308 106 359 -183 -369 -131 91 -311
1809c11k9N34k41m6j22M26q8l01J56Q8P5l64J58J9J35l32J95K08o5k48R1K98p4
$$ -311 -340 194 -47 -93 -215 211 123 -178 -22 66 141 -223 -65 -46 89 -243 -48 160 95 -153 -62 236 162
1832A62j05j4k4l8k58L02J19o1m40O58N1k77k50J73K63o12K52J79K02m88J89K16
$$ 162 57 43 19 -19 -277 25 144 83 -357 301 352 75 -175 -2 261 -351 -99 80 282 -206 -17 199
1854A99K3p00N85K93l74p4OK26k31K22j83j6j52J01j71K91o3k6J35J08l58Q5K45
$$ 199 222 -478 107 400 26 -48 -42 184 -47 175 -8 -24 -176 -75 -246 45 -18 -44 91 199 -159 -74 171
1877A71o4m30O0L85k04k21K20J20J42l11J56Q5J9m02L24L53l74J63m47M71j45
$$ 171 107 -323 -263 122 -82 -303 -83 37 179 -132 24 109 128 -274 50 403 29 192 -255 216 71
1898G1k75K50K55l57j47K22j6j71N0K69Q5l53K65k2N6k97J81QOk05K64J26l38
$$ 71 -204 46 301 -56 -203 19 3 -168 -118 151 236 -117 148 126 182 -115 66 74 80 -125 139 265 -73
1921g3k05K22K96j29j58K45l7j09j34J66P9l51o0N94j58r5J7o4K26l67J43n4J69
$$ -73 -278 -56 240 111 -47 198 161 52 -82 84 163 -188 -248 346 188 93 110 46 272 -95 48 -6 163
1944A63m68K32N79j71n59Q8J91k06K4J97L7j60k07K28J24p1r3m7L23o1j75Q1K80
$$ 163 -305 -73 506 335 -224 -136 55 -151 -127 70 107 -53 -260 -32 92 21 -72 -119 204 143 -32 49 329
1967C29l53n3Q6R4l97K23l3J31j76K42J79m33K53jL3k04k38J88J94J2N7j04J67
$$ 329 -24 -77 9 103 -294 -71 -104 27 -149 93 272 -161 92 91 124 -80 -318 -130 64 76 133 29 196
1990A96n1m04K38J05N0j42J4J69j74n7M3r0k78L04LJ88j33j71N91k82p0P4j96
$$ 196 145 -259 -21 84 134 -8 6 175 1 -56 -13 -103 -381 -77 -74 114 -19 -190 401 119 49 123 -73
2013g3NO3j55J18j38K3K45P9j55N3L3j00j37K29%p1k62m6M94l84J99M5Q6k38J82
$$ -73 -68 -5 -160 -42 -180 -157 88 167 12 65 98 -2 -139 90 90 19 -243 -289 205 -179 20 65 151 -87 95
2038I5P2k32J43j28n0PK61k97n2K54j93O5m1m0K16P4j03J57k51P4K48j48k56j7
$$ 95 167 -65 78 -50 -100 -93 168 -129 -181 73 -120 -55 -96 -136 80 154 51 208 -43 31 279 131 -125 -142
2062a42K55k08K65l42L98J24n78M18j54J61m08J55K96j00j34L6j40K76l83L07
$$ -142 113 -95 170 -172 226 350 -228 190 36 197 -211 -56 240 140 6 42 -98 178 -205 102
2082A02j49J99k4l46L68j97K03k70J98k74J94J00k12J09J48j10k91K38r2K29M9
$$ 102 -47 152 128 -218 150 -47 156 -114 84 -190 4 104 -108 1 149 39 -252 -14 -106 123 172
2103A72k45p7L69q8l7M2k60L76l9N7l83O7M41l71J0K21K01o50L10j80J5j35L11
$$ 172 -73 -150 219 131 94 136 -124 252 213 270 -113 -46 395 24 34 255 456 -194 116 -64 -49 -184 127
2126A27j80j31j2K30J52k62N9J6J20p6k6k18J68o9Q2Q7j10L06l99K50J60l23J90
$$ 127 -53 -184 -196 34 186 -76 -17 -1 119 43 17 -201 -33 -102 -20 67 -43 263 -136 114 274 -49 141
2149A41j78M3j09P6N0k01J92Qj30k55J00K11J76q2J17k24j91K50P2n1J49k58J38
$$ 141 -37 6 -103 -27 23 -178 14 22 -108 -363 -263 -52 124 42 159 -65 -256 -6 66 15 164 -94 44
2172D4j5j41L31k01k86K74J29J28m11K50l69N01l55p3K15j0o3J30j38O0P6l70
$$ 44 29 -112 219 18 -268 6 135 263 -148 102 -267 234 -121 -194 21 11 -52 78 -60 0 76 -294
2194b94K58J30k75K33N2k44O4J47j76L11k47K33l65J84j08J59k01K27J7l25L93
$$ -294 -36 94 -181 52 104 -140 -76 71 -105 206 -41 192 -173 11 -97 62 -139 88 105 -220 173
2215A73j02j22J00k08N15m15m6J1K13p7K40j41j82O7r7L91m31L28k89P5J11j25
$$ 173 71 -51 49 -159 356 -59 -105 -94 119 42 282 141 -41 26 -71 320 -111 217 -72 3 114 -11
2237a1J61j05q8j03L62k67j60M87p6l81J14J56L3k02n4K61Mk54J20O6r5k2N7O0
$$ -11 150 45 -43 -146 216 -51 -211 276 200 -181 -67 89 122 -80 -134 127 131 -123 -3 63 -32 -54 3 63
2261F3k20J52j36J58l1J43N4j27P4j57Lj25pJ59j34K99J1j82q5j5J84N1k88K40
$$ 63 -157 -5 -141 17 -14 129 183 56 130 -27 -24 -149 -156 3 -131 168 179 -3 -88 -103 81 132 -156 84
2285H4M6j61j79K54p6P2j28O5Q9J7J07k86J13p0K60J13k63j17K31R2p5r2O3l78
$$ 84 130 -31 -210 44 -32 40 -88 -23 66 83 190 -96 17 -53 207 320 57 -60 171 263 188 96 159 -219
2309b19J97j35K47oP6j50J8R2JQ0k31O6K3km4Mj07J76P0J50m70j8L11l8j89p7
$$ -219 -22 -157 90 84 160 10 28 120 121 201 -30 36 59 57 13 17 -90 86 156 306 -164 -182 129 91 -98 -175
2335a75R7K68j59r1K1J20k17J75L4k18K89m8l51K89l4L1l8nq2L30j80k29L57k77
$$ -175 -78 190 31 -60 -39 81 -136 39 73 -145 144 96 -255 34 0 31 -7 -12 -94 236 56 -173 184 -93
2359i3J77J6kj35J08k8J0j18Q0N1k16K92k46J98k87K07j15L0K96j86p3j57L15
$$ -93 84 100 98 -37 71 43 53 -65 15 66 -150 142 -104 94 -193 14 -101 -71 225 39 -34 -191 124
2382A24j29j49Q2J43J37k65K20k62k90N20j27j03R4j12K2P7J48k32J83j08K55
$$ 124 -5 -154 -72 71 208 -57 163 -99 -389 131 4 -99 -5 -117 -95 -18 130 -102 81 -27 228
2403B28j27k38K67k85J67J07k48r2K03m8Rm3J36p7K00j58p9L04k02M4j84J74q3
$$ 228 101 -137 130 -155 12 119 -129 -221 -18 -66 -57 -100 36 -41 159 1 -78 226 24 68 -116 58 -25
2426b5L3M3p5r5L44k93J85p3J62j79k1J81k78M34l68K54j93N7P7l03L13j57J07
$$ -25 8 51 -24 -119 225 -68 117 44 206 27 6 187 -91 343 -25 229 36 93 170 -133 180 23 130
2449A30j29r6K51k2j96J74J01l23n3J64k12j94J59L54q3J7p0K08m5k17K22k88
$$ 130 1 -95 156 134 -62 112 213 -110 -163 1 -211 -405 -246 108 25 42 -28 180 135 -82 140 -148
2471a48J40J08k10K53k31Q8J40l15J75j10L65l19J45k39O3l17L97J93k67J29K3
$$ -148 -8 100 -110 143 -88 0 140 -175 0 -110 255 -64 81 -158 -95 -412 -15 178 -89 40 63
2492F3J56j05Q1k88J12N3j81R2L6J33l47R5m7j01N66l62j67K12M5j29J36m1J04
$$ 63 219 114 195 -93 19 72 -109 -17 19 152 -195 -100 -147 -248 318 -44 -211 1 46 -83 53 12 116
2515A16j88J43P4k15k91L41K0j98L83k72M3L30j33l02K0J44j31J51L3r1L04j17
$$ 116 -72 71 145 -70 -361 -20 0 -198 185 -87 -44 286 153 -149 -129 15 -116 35 68 -23 281 164
2537A64k83J57J03QLk12Kn1J14j28L17k66J41o3k20K87j02K7k5j6J68k30P0j31
$$ 164 -119 38 141 149 152 -60 -58 -109 5 -123 194 -72 69 6 -214 73 -29 -2 -27 -43 125 -105 -35 -166
2561a66J58k7K58k13Jj4k09R1L7r9L29k23J71j30R2q6j00K20p6J8m6j39o4J61
$$ -166 -8 -35 223 10 11 -3 -212 -121 -84 -183 146 -77 94 -36 56 -30 -130 90 14 32 -14 -153 -217 -56
2585e6kM9q3J68j85J03R1o9j50K68j03j83Q7Q5j32K37l01R8M0O8J45j19K61k38
$$ -56 -58 -9 -92 76 -109 -6 85 16 -134 134 31 -152 -65 20 -112 125 -176 -78 -38 30 175 56 317 79
2609G9l72L14PJ39j69J3k33K61m8K8O2p7j99KL26j70J97j88k99L58p8P2N0J98
$$ 79 -293 21 28 167 -2 11 -222 39 -9 19 81 4 -195 -193 133 -37 160 -28 -327 31 -47 25 75 273
2633B73l24R2q1k77M25r8m4K03m9l80L84J07l08O7R2K3n6j78R6j3J94k21J00k60
$$ 273 -51 41 -40 -317 108 10 -34 169 120 -260 124 231 -77 -10 82 105 49 -129 -33 -46 148 -73 27 -233
2657b33K04l1P7RL3r5L34o1k97J89L0J09l74J66p4J98k97J31J3k05K71j19j30
$$ -233 -29 -60 17 26 59 -36 298 237 -60 129 159 268 -106 60 -14 184 -113 18 31 -174 97 -22 -152
2680a52L4R8K84j24l71M8O6J77q8J10J8k6K3p1j67O1j31N32k20r1J42j16l52K12
$$ -152 -118 -20 264 140 -231 -183 -117 60 -28 82 100 74 97 26 -141 -80 -211 321 101 10 152 36 -316 -104
2704a04J87l2L5j80K46l94J47J55N3j65R2j12J68J8m0j30O2j73J39m5Q2Q5j56
$$ -104 83 51 86 -94 152 -242 -95 60 113 -52 40 -72 96 114 74 -56 6 -167 -28 -73 9 94 -62
2727f2P9L0j40r4R1L97k53P2JK25l37M3j7o9J73J2l35j06N63j72l21K28J25l35
$$ -62 17 47 -93 -187 -96 301 48 120 121 346 9 52 35 -34 139 151 -184 -290 273 101 -220 8 133 -202
2751b02J46j80K47j17J23k56K21J69q9K17l89N1Q4j06J4N8M2m7J67R9k66r2K86
$$ -202 -56 -236 11 -106 17 -239 -18 151 62 279 -110 -59 25 -81 -67 -9 33 -14 153 252 -14 -106 180
2774A80l18O7R7L5j20M21l16l08N44k34l09K98J3LK4j6k00K46j24K9K4J0J04j4
$$ 180 -138 -71 26 61 -59 362 46 -262 282 48 -261 37 50 53 77 61 -139 107 -17 12 36 46 150 136
2798A36k98Q5J50K5j9K1q4j60K05M1j91L00j58l00L68k25k6J47M8j83P6R0k78
$$ 136 -162 -77 73 98 79 100 16 -144 61 102 -89 211 53 -247 121 -104 -130 17 65 -118 -42 48 -230
2821b30K39l6n5J30j98n2L04j55K21L5l97L77m24L20q9J74j5J33l51q5K93Mq6
$$ -230 9 -27 -82 48 -150 -202 102 -53 168 203 -194 183 -241 79 -10 164 149 282 -69 -154 139 143 57
2844E7j2J47m6M5P4k35J08q7k76L59j31J11l13J93j87K10j28R1R9j05J25l70K75
$$ 57 45 192 146 191 265 30 138 51 -225 134 3 114 -199 -6 -193 17 -111 -20 79 -26 99 -271 4
2867Do3o4K61J2Q0l56J18N5k4k3K00m86K48J11j67p8K17L34n03L45j05k25K00
$$ 4 -59 -123 138 150 230 -126 -8 47 23 0 200 -286 -38 73 -94 -172 45 379 -124 221 116 -109 91
2890I1j37j9J39l99L05R3R0J2l10O0J52O8k35L05k84J39m3l7N2L1j39J90R5k47
$$ 91 -46 -65 74 -325 -20 73 163 175 -135 -75 77 145 -90 215 -69 70 27 -10 42 73 -66 124 219 -28
2914b8L59j47o3q4M1l29L62m51K41L08j47O5l3k47K07p1J66j81J9j8k27K85l01
$$ -28 331 184 121 37 78 -251 111 -340 -99 209 62 127 94 -153 54 -17 149 -32 -13 -31 -258 27 -274
2937b74J53J69k3j92J74j9kJ50j14k07K57n3kj86J17KJ12j70K23k67L39j62J41
$$ -274 -121 48 25 -167 7 -12 -14 136 22 -185 72 19 17 -169 -52 -50 62 -108 115 -152 187 25 166
2960A66j24J37r3j8k9j24J44j2j51k2L49k45K44m25M50j03k55J45N2k43M29j71
$$ 166 42 179 86 68 39 -85 59 47 -104 -126 223 -22 222 -203 247 144 -111 34 86 -157 272 101
2982A01J47j61O5L8j52j22N0R3Q2k41J34J20k47k80J57L06J7M3j25Q3o5l8O2m4
$$ 101 248 87 152 190 38 -84 -34 59 141 -100 34 154 -93 -373 -216 90 107 150 25 108 43 5 67 23
3006B3l1j6J85l20Q2J33l26M70k52Q3l2n5r3L96k55o9J68m44J42J94J11l2m9j23
$$ 23 -8 -24 161 -159 -77 56 -270 200 -52 31 -1 -56 -149 247 -8 -77 91 -353 -211 -17 94 62 13 -110
3030a10k1L97j5l20k7R7J27L1k24R9k74J6L64r8J05j04J7K1k2k05J51j67K53k18
$$ -110 -131 266 251 -69 -96 1 128 159 -65 34 -240 -224 140 42 147 43 60 81 59 -146 5 -162 91 -127
3054a27R9KM4J04l28K11k94J34J56j69J15p9n6LK68q8j96J69j53J97oj7J60k06
$$ -127 -28 -26 18 122 -206 5 -289 -155 1 -168 -53 -132 -188 -185 83 -5 -201 -32 -185 12 6 -11 149 -57
3078e7on9J89k78J91P9m01N44j31l3Q3j75N4O1r0q2l9L50j17p0K16k1k01p7j0
$$ -57 -63 -122 67 -211 -20 59 -342 202 71 38 121 -54 0 61 -29 -111 -150 200 83 13 229 208 7 -70 -80
3103h0O8l4J57q2J13k17L35l73P8N7j61L7q5M20j38M3j28j07J08p9N3K18k42o1
$$ -80 -12 -46 111 29 142 -75 260 -113 -35 22 -139 -102 -187 233 95 138 10 -97 11 -68 -15 203 -39 -100
3127a00l5K28j45J32J28l56K43j06rJ06j84q7J12J58j53J47J79M9l89m0jj2K86
$$ -100 -135 93 -52 80 208 -148 95 -11 -20 86 -98 -185 -73 85 -68 79 258 307 -82 -122 -123 -135 151
3150A51l06M30m77L2J05R5j66K34m2j1J73l87K87o3M8k95J59j95O4L28k06n4L19
$$ 151 -155 275 -202 -170 -65 30 -136 98 56 45 218 -169 118 55 103 -192 -33 -228 -164 164 -42 -96 223
3173B23j56q0o8J18Q8L59m45L7K27j90j15j11L8r2K84k29lK12k60J68o7M9nj21
$$ 223 67 -13 -81 37 125 484 39 76 303 113 -2 -113 -75 -167 117 -112 -115 97 -163 5 -62 -13 -18 -139
3197a39J21Ok0L4l04M62j44k9J33j07p6PK92j74k27L05o9k01K57k89L42j10k40
$$ -139 -18 -12 -32 2 -302 160 16 -13 120 13 -63 -56 236 62 -165 140 71 -130 127 -162 180 70 -170
3220a70L82j42k76J95K85k01J24k55l27M14J10k39J87j31P5J0o5O5J05j96K74
$$ -170 212 70 -206 -11 274 73 197 -58 -385 29 139 -100 87 -44 31 41 -24 41 146 -50 224
3241B24j35k00kR2L6M7j50M3J23j76J78J0K09l65J26J31n5%ok76J13J78k80J72
$$ 224 89 -111 -113 -21 15 62 -88 -45 78 -98 80 90 299 -66 60 191 136 136 130 -146 -33 145 -135 37
3265C7N9j87Lo9L7mm0J55mJ28lj1q1j21L0l9J72j38k41L85j58J95R2q0j77O3j40
$$ 37 96 -91 -88 -157 -120 -124 -164 -9 -13 115 112 101 20 -101 -71 -110 62 -76 -317 68 -90 105 197 117 -60 3 -137
3292a37L47m3M3k69R2P1j80J97p4Kr4L65j91o9q5jK11l24J88K5q8K6j24J07k05
$$ -137 210 167 210 -59 33 104 -76 121 47 49 -45 320 129 60 -25 -26 185 -139 49 74 -14 12 -112 -5 -210
3317b10J50K04l88K44K03p7J34j33j43L2l69K53j9L06l81J13J85j68K29k22j17
$$ -210 -60 144 -244 0 203 126 260 127 -16 16 -353 -100 -119 187 -194 -81 104 -64 165 -57 -174
3338a74J17m6K44q9Jr4K77l82K35n8o9J52k94J55K1O7l13J45POk9J30l10K26O4
$$ -174 -57 -103 141 52 53 -41 236 -146 89 31 -38 114 -180 -25 -4 63 -250 -105 -98 -92 -121 9 -301 -75 -11
3363a1n6J76j9O9j22k3J13j13j24j50J2M23k35J64k17J04J94j11j9k86L25N3k52
$$ -11 -67 109 90 159 37 14 127 14 -110 -260 -248 175 -60 104 -113 -9 185 74 55 -231 94 147 -105
3386a05J16L66j05l79K86l84K34jJ26j5J8l09J02J38j76P1L2O3l83K26M55k33
$$ -105 11 377 272 -107 179 -205 29 28 154 139 157 -152 -50 88 -88 -17 15 78 -305 -79 376 143
3408A43k32Q8J8P5j39J3J19J41m08K33j44k13J03K60ok02L17j80k30L90r8J66
$$ 143 -89 -1 17 92 -47 -34 85 226 -182 51 -93 -306 -203 57 51 -151 166 -14 -244 146 48 214
3430B14n28K97Q8j10NL8j99r5M06k51K36M3j88j22O4J21l49l8N19n4Ro2J39k23
$$ 214 -314 -17 71 -39 -34 4 -195 -290 116 -135 101 144 -44 -166 -102 19 -330 -368 151 97 106 44 183 -40
3454d0L38k36k24r1J77k25K79j58L16k06Q4O1j3k1J60j01p5j82R7J63r0J81l01
$$ -40 298 62 -162 -253 -76 -301 -22 -180 136 -70 14 75 62 41 201 100 25 -157 -60 103 13 194 -107
3477a07R1j40K98l33K13j02j9O7j60J96j2Q6j1o2m4rR0k9k91K01L20k46o8J83
$$ -107 -16 -156 142 -191 22 -80 -99 -32 -192 4 -8 78 67 5 -39 -48 42 13 -278 -77 243 -3 -71 112
3501A12j59J31K5k18J54K6j38r4L19r9kq4No1K10J08k98m8j56J55o9K57J00j60
$$ 112 -47 84 109 -109 45 71 -67 -161 158 59 57 -27 -22 -83 127 235 -63 -111 -267 -112 -181 76 176 16
3525A6n3k53N23k39p7K0K47NM8l30K43j72q7J34J03j00r7K8J46j5L7M9j11O6L0
$$ 16 -37 -290 233 -6 -83 -63 184 189 237 -93 150 -22 -109 25 128 28 -69 -41 105 90 127 176 65 131 161
3550A61j34L7l82M54k80K10k3l6K77l84P7l0J20R9R0j97j74J23j2R5j6jq9j46
$$ 161 27 64 -318 136 -144 66 43 7 284 -100 -23 -53 67 166 256 59 -115 8 -4 91 75 74 -15 -161
3574a61J83q0J34p5n3J28K2k58K86k64K45o4k53J99j2L24k64j52n5N14k02O1j77
$$ -161 22 -58 76 1 -52 76 98 -160 126 -138 107 43 -210 -11 -23 301 37 -115 -170 344 142 203 26
3597B6o2L8RK57l01L45l25J99k29K60k12N4N4j76m1K02m7k83K45M3j92J52K19
$$ 26 -36 2 11 268 -33 312 -13 186 -43 217 5 59 113 -63 -104 98 51 -232 13 56 -136 16 235
3620B35j96J07k63P9K06N8j78k15J29Q2q7J5J47k57J04K49p3K7o51N37P0j65K30
$$ 235 39 146 -117 -38 168 226 48 -167 -38 44 -43 -28 119 -138 -34 215 142 169 -482 55 125 -40 190
3643A90k79K3P2j1P1j86J39N0R8l1l9o5k59J47j15J99j23L8K32j34J3q9o9K33
$$ 190 -89 -66 6 -5 66 -120 19 69 167 136 97 32 -227 -80 -195 4 -119 -81 151 17 30 -59 -128 105
3667A05M41o52K08J08k11l9J81j76J18r2M6J87j14J20n8L2l94K50k86L66nn3N8
$$ 105 546 -106 102 210 -1 -40 141 -35 83 -9 37 224 110 230 172 204 -190 60 -226 140 135 82 140
3690A40j19R8j84J06m7k0J80J26q3l11Q2j78J92Q2j18n5K17j59J85j99N3O2K42
$$ 140 21 119 -65 41 -6 -26 154 280 197 -114 -32 -210 -18 64 -54 -109 108 -51 134 -65 -12 50 292
3713B92N9k91J06j22l16K06r3K47M8k96K10R5j57L4O0j44j3K4l9l68N78o0q8j00
$$ 292 351 60 166 44 -272 -66 -159 88 136 -160 50 145 -12 22 82 -62 -75 -51 -90 -458 120 60 -28 -128
3737a28O7n2j56L58k16N7kO9K40k72L2L0k27L62q2r6K39k84r0N6J95J22l42J04
$$ -128 -61 -113 -269 89 -127 -70 -72 -3 237 -35 -3 27 -200 162 80 -16 223 -61 -151 -95 100 222 -120 -16
3761a6J09p5R0Ql11K96k4kr3J99l39ON1J56k30J99L29m02q5K35J81j55m4j64K1
$$ -16 93 18 108 116 -195 101 77 75 -18 181 -158 -152 -101 55 -175 24 353 -49 -134 101 282 127 83 -81 -60
3786f0J49l0l35O5L42k21K89j50n5j09K04l41K28J75j77m8J09l16J65P6J05r1
$$ -60 89 59 -276 -211 131 -90 199 49 -6 -115 89 -252 -24 151 -26 -74 35 -281 -116 -40 65 -26
3808b6Lj48m0K09O8j99l2K05K9j03K28k90L26r7Q3k16M7L0j25K1k6L83n64J89
$$ -26 -23 -171 -211 -2 66 -133 -165 40 69 -34 194 -96 230 133 216 0 47 77 -48 -27 -53 330 -234 -45
3832d5J2k0Q6p6LK55k44j94K39K5K8r6o8lJ88R5p2k5J98k02r9Q5j47q6M32j32
$$ -45 -33 -53 33 -43 -40 215 -29 -223 16 41 69 -27 -95 -98 90 185 113 88 286 84 -15 70 -77 -163 269 137
3858A37k30L9k17L72j54O0l9m6J86k15Q8P6Nr0K92k31J99m64L61j71R1K8kj23
$$ 137 -93 -54 -271 101 -53 7 -32 -78 108 -107 -19 57 62 -28 264 33 232 -232 129 -42 49 77 75 -48
3882d8J5n3P8M05l00O3k65J30r9j60K94p4j39J4K19K28m30j32K95j73N1K8J52
$$ -48 -33 -86 -8 397 97 160 -105 25 -74 -234 60 -14 -153 -139 80 308 -122 -254 41 -132 -81 -53 99
3905I9k82J98J48j17L58m99K39k88O8l2K48J63k12m0K1j35J24j46Q0L09m40R5
$$ 99 -183 15 163 46 404 -95 144 -144 -76 -108 140 303 91 51 72 -63 61 -85 -5 304 -136 -41
3927d1K18l74K54k93K97l97L15L5j3M3P8k55J21J00j78j36m8L34l20M20J82k17
$$ -41 177 -197 57 -236 61 -336 -21 14 1 44 122 -133 -12 88 -90 -226 -274 60 -260 160 342 125
3949A25j85K72k60Oj22O5J95k17O4K29j64j00O4J6Q7p2J37j94P2N1N2l13J76l9
$$ 125 -60 212 -48 -42 -164 -99 96 -121 -57 172 8 -92 -28 -12 75 3 140 -54 18 69 121 -192 -16 -55
3973e5k2N5N3p8J91P6j62l41L19j06P4M9k07J59k8p8j28P6L91k96m7K84k57R3
$$ -55 -77 -22 31 -47 144 220 58 -283 36 -70 4 53 -154 5 -23 -101 -229 -153 238 -58 -105 179 -78 15
3997A5k14K81j96J37j00J8O0j20M2K55j65Q8j35M5P6o6P8k54L53l87K15m4J48
$$ 15 -199 82 -114 23 -77 -59 1 -119 -77 178 13 101 -34 11 87 21 99 -155 198 -189 26 -18 130
4020A30j39k19N34l94O7k06K1K88k08n7J75n3J60j77J19rj63L83m07J65o6J78
$$ 130 -9 -228 306 -88 -21 -227 -206 82 -126 -183 -8 -61 99 -78 41 32 -131 252 -155 10 -56 122
4042A22p6K43l40J13p4r2J85p8J42l40o2K30j82K84k2o9J2pJ92j29N2k07m3J53
$$ 122 46 289 -51 62 -12 -104 81 3 145 -195 -257 -27 -209 75 53 -16 -4 -11 181 52 104 -103 -146 7
4066GJ30j14K33m9l38OJ6J78r4j2m7j08K85l27K36J89j76n4J4M11l43R8O1j30
$$ 7 137 23 256 207 -131 -125 -109 69 -25 -37 -84 -192 93 -234 2 191 15 -39 -25 386 43 141 202 72
4090G2J00k11J58k78M12o9o0j85J70n7j25O3p7L29k96jJ22o8N2r3n7k0N2K8J62
$$ 72 172 -39 119 -159 253 184 124 -61 109 52 -73 -10 -87 242 -54 -55 67 -1 51 -42 -99 -119 -67 -39 123
4115A23l21J77J88j71j11J77k46L54k84J14Q4k39J11j71J5L62j06k60L19j57O
$$ 123 -198 -21 167 -4 -115 62 -184 170 -114 0 84 -155 -44 -215 -200 162 56 -204 115 -42 -36
4136c6n3L20m30L31j33J3j16L14j60j78K08q2M3N1k44J23P2j97J76r6L72k90j86
$$ -36 -89 231 -199 132 -1 12 -104 210 50 -128 80 -2 41 92 -152 -29 43 -154 22 -74 298 8 -178
4159a78J14O2k3K53j76n6j88M32k23J55j48k9o4j39L10j02q7p5L67k23p6R7q8
$$ -178 -64 -2 -25 228 52 -4 -192 240 17 172 24 -5 -69 -208 102 0 -87 -162 205 -18 -94 3 -85
4182h5J33J39m66rJ57R2J73j93MJ69k79J35k03oJ68Q8l2L2j8O3k60J17K78k1q
$$ -85 48 187 -279 -288 -131 -39 134 -59 -55 114 -165 -30 -233 -239 -71 17 -15 17 -1 62 -198 -81 197 176 168
4207A68r6k44L73k36p1L96m82L27l2Lj78j94K82J37l93L70m98K68J03k72M96l89
$$ 168 72 -172 201 -35 -106 290 -192 135 103 106 -72 -266 16 153 -240 130 -368 -100 3 -269 227 -162
4229a62j28K32k19K51j15J82k2M9k37J83j89M30m95K45L33k64R2m07K59l4R7p6
$$ -162 -290 -58 -277 -26 -141 41 19 68 -169 14 -175 255 -240 5 338 74 166 -241 18 -16 81 5
4251Ej19O3K20L2j96L2j38L31%k79J33j0j8j95J36J53j92o6K13j93P8J99K8j67
$$ 5 -114 -51 169 201 5 37 -101 230 230 -49 84 74 56 -139 -3 150 -42 -108 105 -88 -10 189 217 50
4275E0K6p1K14l03R9L1o4J8L03l38k63L14j66Q1J02K8K0j9p0%k0j19K94j25P1
$$ 50 76 5 219 -84 15 46 -18 0 303 -35 -298 16 -150 -69 33 61 81 62 -8 -8 -28 -147 147 22 93
4300I3k52p9J05j81L95K5qJ15k42J79r8q6K98k91j47J25JR3o7N0M2k32m3L7K84
$$ 93 -159 -238 -133 -314 81 106 98 213 -29 150 52 -34 264 -27 -174 -49 -48 45 -22 28 70 -162 -205 -168 116
4325A16O0k93J11R9m30N26n5k21L79j35l08Lq6N8K94l23L42n5l06J73R7k0l12
$$ 116 176 -117 -6 93 -337 189 134 -87 292 157 -151 -148 -234 -176 118 -205 137 82 -224 -51 46 26 -286
4348b86K53R2k87L41j77j67K39L87m40J67j21q3K49j49J9K24l46P1J37j14o6K21
$$ -286 -33 59 -228 113 -64 -231 8 395 -45 122 1 -82 167 18 37 261 -85 -14 123 9 -57 164
4370A64m4J20k58M6P1q3j84J09j34M51j85l88N88l92R8o8R6q9p5K87j42j74L3
$$ 164 120 240 -18 28 99 16 -168 -59 -193 258 73 -315 273 -119 -21 -89 7 -82 -157 130 -12 -186 -153
4393a53J77j26K74k50J67M7l23J56J17J0k59J21K59j72J30j84M02k14k33MJ25
$$ -153 24 -102 172 -78 89 136 -187 -31 86 96 -163 -42 217 45 175 -9 393 179 -54 -50 75
4414G5j87L13k18J44K0m6K2J5J52r9o0Ml99K36l3J23q3K0J37j07J9j48O9m0K04
$$ 75 -112 201 -17 127 147 101 123 138 290 191 131 135 -264 -28 -61 62 -21 -1 136 29 48 -100 -31 -71 133
4439A33l14J55j01J11J3j76J39q1K46k07N6q9J68J29k39J30j32K35j69j8m4N4
$$ 133 -181 -26 -127 -16 -3 -179 -40 -121 125 -82 -26 -115 53 182 -57 73 -59 176 7 -11 -55 -1
4461al8L49j94l8j51J50N7P8n4m84J77qJ26K04l90L3L08%l26m9L23k05Q2P8Lj30
$$ -1 -39 310 116 78 -73 77 134 212 158 -326 -149 -157 -31 173 -217 -184 124 124 -202 -251 72 -133 -51 27 30 -100
4487a00J22J18kk0j87m3k85L39JO0k0Q7l10M14r1N9J97l29Q4j47J08K70k37k21
$$ -100 22 140 138 118 -69 -112 -397 -58 -57 3 -17 70 -240 174 83 142 339 10 94 -53 55 325 88 -133
4511a33L7J35r1J24J06k02O1l2l6J69k22j28J62j43J34p2J71k54L45j63Oj0n3
$$ -133 -96 39 -52 72 178 -24 37 5 -31 138 -84 -212 -50 -193 -59 -131 40 -214 131 -32 -26 -36 -89
4534h9K44k69j04M08k28R6m9j48J52o2K36k00j62L78j02j5j47j08R7O3Q4q7j34
$$ -89 155 -114 -218 190 -38 58 9 -139 13 -49 187 -13 -175 203 101 86 -61 -169 -72 -9 75 -12 -146
4557a46J31j00j7K53o5j08K72j30r8R8l09J01%PN6k17K06J34K6n7L40m74J22k19
$$ -146 -15 -115 -132 121 56 -52 220 90 -8 90 -219 -118 -118 -111 -55 -272 -66 68 94 37 377 -97 25 -194
4581a94L86k11j32P5j00K57O8l57J79p3K59j08J31l21M46m22J07k29J73r0mK02
$$ -194 192 -19 -151 -76 -176 81 149 -208 -29 -102 157 49 180 -141 305 -117 -10 -239 -66 -156 -160 42
4603D2j13qn0J11k5p1K53K9j24l3J23j11l85M51n4j96J27qK8j6J23j69j58J77
$$ 42 -71 -79 -129 -18 -43 -114 139 168 44 11 134 23 -362 89 35 -161 -34 -42 -14 -30 93 -76 -234 -57
4627e7J85nJ6K6j49l6J68o1p0Q1j88N8K31l50K97j06l34J15K98j16j74N8R5j82
$$ -57 128 123 139 165 16 -20 148 87 17 98 -90 -32 199 -151 146 40 -294 -179 119 3 -171 -113 -18 -200
4651b00L10j31L8m8R7n4J49k08K31q6J05n21L67O4o3j86K03N7k6O3j4j72j11O8
$$ -200 110 -21 17 -31 66 12 161 -47 184 98 203 -318 49 113 50 -136 67 124 98 161 147 -25 -136 -68
4675f8J37j30l54L75J53qj86K19k02O9J46l63K09j6j51K76k23K97j79J43j63j02
$$ -68 69 -61 -415 -40 113 105 -81 138 -64 5 151 -212 -3 -19 -170 106 -117 180 1 144 -19 -121
4697a21J98Q6l27J01PJ26j25J23O7m14M54k78Q6J19J41k09j47J06j31m2K59r6
$$ -121 77 163 -164 -63 -56 70 -55 68 135 -279 175 -103 -17 102 243 34 -113 -7 -138 -180 79 -17
4719a7k5J78k5j11R5o6j19J20q4r7O0K56l99L29j26O4K2k31J47R3O0qj27QJ07
$$ -17 -42 136 111 0 95 29 -90 30 -54 -151 -91 165 -234 95 -31 33 55 -176 -29 64 124 116 -11 -3 104
4744A04M9j23N5n2j72K59l01L22o3j00J30k58N9O4rj0j40K48R8k03L4J4j47M43
$$ 104 153 30 85 33 -139 120 -181 141 78 -22 108 -150 -91 -27 -36 -46 -186 62 160 -43 -9 5 -142 301
4768C01l96J0J81J95j37j12lo7J64k29K80j91j2K40m11L08k25j98L04j70J74J50
$$ 301 -95 -85 96 291 154 42 39 -28 136 -93 187 -4 -16 224 -187 121 -104 -302 2 -168 6 156
4790A56k67j13J25K32K4l62J81P0p4J58j12k29R3R9P2L9j76K35r9r6k7L67l30
$$ 156 -111 -224 -99 133 157 -205 -24 46 -28 130 18 -211 -118 -19 53 92 -84 151 52 -44 -71 296 -34
4813c4Q3J4q0J22j64J44j11L23j68k26J49o7K21j7k84J79k39O1O0J74l62K04P6
$$ -34 49 63 -17 105 -59 85 -26 297 129 -97 52 -15 206 189 -95 84 -155 -94 -34 140 -222 -18 58
4836E8j83q6P7J19P4k44J73q3P4q8j18K54R4j27k7M2K51k45K64k21J24o2k70K05
$$ 58 -125 -211 -134 -15 59 -185 -12 -95 -21 -109 -227 27 121 -6 -33 9 260 15 279 58 182 120 -150 55
4860E5o9l6M2R4j08k29R7j00J02K04Mj84r9K52j9Q6k41J89j57o9K17qJ12j01o1
$$ 55 -14 -50 -8 86 -22 -251 -154 -254 -152 52 56 -128 -227 25 6 92 -149 40 -117 -186 31 23 135 34 -27
4885b7j8J30m6O8k56l0J17J44J19p4n0J67n2k66K30N7l37J20N1j50L13l44J06
$$ -27 -45 85 39 107 -149 -179 -62 82 201 127 77 244 192 -74 156 213 -124 -4 47 -103 210 -134 -28
4908b8j59J94K27k08j59K76j28P3Q3l11q4J15j13L06k92K18j31J22J22j08J49
$$ -28 -187 7 234 26 -133 143 15 88 171 -140 -224 -109 -222 84 -208 10 -121 1 123 15 164
4929A64k28J46k33K4J24jj29N3n9K10J0o9l2R0J41k09MK56p0l43K55j71J07Q1
$$ 164 -64 82 -151 -127 -3 -4 -133 -80 -139 71 81 12 -20 70 211 2 6 262 192 -151 104 -67 40 121
4953A21J21k78K2R1l7K11O5j15k36j32K89j57q2K76j98%J57k74J77k49K04Q5q3
$$ 121 242 -36 -14 77 40 251 316 201 -35 -167 122 -35 -117 159 -39 -39 118 -156 21 -228 -24 61 -22
4976b2P0j25Q6N2J18J1k75J18q3K88j72j6j3j91j9L48j38j72J02k81M27m4J01
$$ -22 48 -77 9 61 179 190 -85 33 -50 238 66 50 37 -154 -173 175 37 -135 -33 -314 113 69 170
4999A70j93J15rJ9j27j58J29p4L64l14MK60k26l4K77k51J62n4J28k79J11j18J45
$$ 170 -23 92 83 102 -25 -183 -54 -128 236 -78 -74 186 -40 -74 203 -48 114 60 188 -91 20 -98 47
5022D7K12k41jr4J49j29K16j66j64J74J68k90K06J27Mk36j69J35J04J07pN0l55
$$ 47 259 18 17 -77 72 -57 159 -7 -171 3 171 -119 87 214 218 -18 -187 -52 52 159 152 202 -153
5045a53q8L76m53P7K87kj75J40q4J24o8O2j08J87k8J97j44p5K1j59J77r3J26l87
$$ -153 -241 135 -318 -241 46 44 -131 9 -75 49 -19 43 -65 122 94 291 147 72 93 -66 111 18 144 -243
5069b43L94j0J1k96J40Q0o0j26M4J36j52K12l97L89K9l19K85J42k44n3j1J34l23
$$ -243 151 141 152 -144 -4 76 16 -110 -66 70 -82 130 -267 122 151 -168 117 259 15 -38 -49 85 -238
5092b38K22K51n1j11p4oj4M3o1M7p8K55k63K74j24k48j46L26j0n1Q8K0L8j64k29
$$ -238 -16 235 184 73 -1 -7 -21 22 -39 8 -70 185 -78 196 72 -176 -322 4 -6 -57 31 51 89 -75 -304
5117c04K41J74k30R5k79M88k60J16Pk49L33k17J5M51l65j24nOj60K77j38K90k48
$$ -304 -63 111 -119 -24 -303 185 -75 41 48 -201 132 -85 -70 381 16 -108 -113 -107 -267 10 -128 162 -86
5140h6j15J44K38k14l5J07n0JP7j1j72l7J02K32l03J03j02J64j3J48k3m29K57
$$ -86 -201 -57 181 -33 -68 39 -11 -10 67 56 -116 -153 -51 181 -122 -19 -121 43 30 178 155 -274 -17
5163a7J26k31K99k70j37K16J36j36j53K32l39K92Rk41J37q3j6K68l22K33J98l69
$$ -17 109 -122 177 -93 -230 -14 122 -14 -167 65 -274 18 27 -214 -77 -160 -176 92 -230 3 201 -168
5185a68J54J41J3j08n0j69J69k00J8J17M7k3l46O15k71j13M8K77k79M4M44l72
$$ -168 -14 127 140 32 -18 -187 -18 -218 -200 -83 -36 -59 -405 210 -61 -174 -126 151 -128 -84 360 -12
5207a2K91l92N1L09n22J04K77l36M16j86J36j72M08m55R6N7k3K8j34J14j23K30
$$ -12 279 -113 -62 247 -275 -171 106 -230 186 0 136 -36 372 -83 13 70 47 75 -59 55 -68 162
5229A62k27r7J26k1J93n0r5K47k99LJ12N6m47J84K98k95J84o0j49J74M4l23M21
$$ 162 -65 -162 -36 -57 136 86 -9 238 -61 -58 54 110 -337 -153 145 -150 34 -26 -175 -1 43 -280 141
5252A41j51j12J71M7J56M2k49q8n0N7QM5n5O8k5j2o8p9J43j4n7K09j63r2J26l
$$ 141 -10 -122 49 96 252 294 45 -43 -93 -36 -28 17 -38 30 5 -7 -75 -154 -11 -25 -82 127 -36 -128 -2 -5
5278ej22P3Q7k03J33M2j34o0K69j86K05m1M9J6k85J62r8K48k37k6K66j31J2k3
$$ -5 -127 -54 33 -170 -37 5 -129 -189 80 -106 99 58 107 123 -162 0 -98 150 -87 -113 153 22 34 11
5302A1J27k46L52j17k56J28J14j31m1J79j87j38K38l7j6l3R9j15J56J38j38k9
$$ 11 138 -108 244 127 -129 -1 113 -18 -59 120 -67 -205 33 -4 -20 -53 46 -69 87 225 87 58
5324E8o4k47K52J35l82L48l05L81L0j33o7M5p0J56p5J01k33J88m4K03l20j2J17
$$ 58 -6 -253 -1 134 -248 100 -205 176 206 73 6 51 -19 137 62 163 -70 118 74 277 -43 -55 62
5347F2j31K4K66L3n13L47k07O6K09j92J18j4j62L14j58j49J78j17k27J74K7P7
$$ 62 -69 -45 221 254 -259 88 -119 -53 156 -36 82 68 -94 220 62 -87 91 -26 -253 -79 -52 25
5369B5Q5J29l48Q7j54n7M51k69q6L01j20j8j31K03j40jp7R2K98l72K2L0J57o5
$$ 25 110 239 -109 -22 -176 -233 218 -51 -137 164 44 26 -105 98 -42 -43 -120 -28 270 -102 -80 -50 107 42
5393D2j68j11K50l09K79j8J14r1j08L27j71K50k04k05J00L51k83j91N5K55jN2
$$ 42 -126 -237 13 -296 -17 -35 79 -12 -120 207 36 286 82 -123 -23 328 45 -146 -91 164 163 215
5415B15j26l49L4qL98j65O3r6m5q0J19l3k03J69r2K81J39r9m8j1o3j79K84n2P7
$$ 215 89 -260 -226 -234 164 -1 62 -34 -79 -159 -40 -73 -276 -107 -199 82 221 122 74 63 0 -179 105 53 130
5440A30k43m0J28k4N6M9M1n7M3k59J08J01m8j0j5O5M3k0R7q3k0r5O4N0l02R8J04
$$ 130 -113 -153 -25 -49 7 56 97 40 83 -176 -68 33 -15 -25 -40 25 68 48 145 62 42 -53 11 61 -241 -143 -39
5467c9j00K29r0%j15L3J48j77K53k1r2l2j58L00j44L40m14Q3KK2k08J07O0J00
$$ -39 -139 90 0 0 -115 -82 66 -111 142 121 29 -3 -161 139 -5 335 -79 4 6 28 -180 -73 -13 87
5491H7o2k69J70J70O2L9j38J2m6J4l7j91K23K19k50r8L35k97J34m0K53m30k99
$$ 87 25 -244 -74 96 158 197 59 71 25 39 2 -189 34 253 3 -95 240 -57 77 37 290 -140 -439
5514d39L46K07j11L3k32J48K50k08M0o3K24j01M6N4k82R5K44j84K4o9O9j20r5
$$ -439 -93 114 3 36 -196 -48 202 -6 34 -29 195 94 140 194 -88 7 251 67 91 22 91 -29 -124
5537a24j11K75P6j86J11j76j51K93k46K28j05K9L3j4K93k51J22N1O3k78jL3j89
$$ -124 -235 40 116 -70 41 -135 -286 7 -239 -11 -116 -87 -54 -68 225 -26 96 147 210 -68 -69 -36 -225
5560b25M17j53k04K68j63K09j72j99K81n8K5m8p3J20K92l66N4p7J27m3Oj46J61
$$ -225 192 39 -165 103 -60 149 -23 -222 59 1 26 -22 -95 25 317 -49 5 -72 55 12 18 -128 33
5583C3N1j18m1j7J89l32O6L62j54j55j47K11%J47j01O5r2j14p4Q4qJ78O6j45N
$$ 33 84 -34 -75 -92 97 -235 -169 193 39 -116 -263 -52 -52 95 -6 59 -33 -147 -221 -137 -145 33 99 -46 -41
5608d1Q6J63m85L10J65k17r6n5M76l33j73K52j8J3J8J1j11J3m4K82j87k8j71L09
$$ -41 45 208 -277 33 198 -19 -115 -170 306 -27 -200 52 34 47 65 76 -35 -22 -66 216 29 1 -170 139
5632A39k85K18J0j97N7J12L7L8k21K66j61K2k15J81Q8j24L4j40P7j98J10p5J65
$$ 139 -146 72 82 -115 -58 54 91 129 -92 174 13 35 -180 1 89 -35 -1 -141 -64 -262 -152 -227 -62
5655f2m0Jm3K36O7j25k71K64p0J01nJ19k79L78k43j8n5J30j44M24l48N4j52Q1
$$ -62 -102 -101 -144 92 159 34 -237 27 -43 58 53 172 -107 271 28 10 -45 85 -59 365 17 71 -81 0
5679@j21P9L9K41j03k01L16o7l23K12o5j46J16NJ12L8l7j79j8K2r8J38p3J73k36
$$ 0 -121 -42 -3 238 135 -66 250 183 -140 72 7 -139 -23 -18 94 132 95 -84 -102 -80 -178 -40 -113 60 -176
5704a76J43J55R2j02l2J71P2l91M1j14K94L1l28K14k29O1L6J99j34J82p0l54J40
$$ -176 -33 122 214 112 80 251 323 -68 -27 -141 153 184 -144 70 -159 -98 -62 137 3 185 115 -239 -99
5727i9l3K6J54OJ99n5J26m55N1K01l27J38N2k5l7K35P3m47Q3Q4J79o5K47l45K10
$$ -99 -132 -106 48 54 253 198 324 -131 -80 121 -206 -68 -16 -41 -78 157 230 -217 -134 -50 129 64 311 -34 176
5752A76k73k5N9J27j36l5K07j43j4n0J32k65K05L1p2n4R0P1L8l91M56k23k8n6
$$ 176 -97 -122 -63 64 -72 -107 100 -43 -57 -107 25 -240 -35 -4 -76 -130 -40 31 69 -322 134 -89 -117 -173
5776a73J13j8J69j50J37k57J38p4J87J26j15j36L3L64m18L25p6k93K29j18M4L2
$$ -173 -60 -78 91 -59 78 -179 -41 -115 72 198 83 -53 -20 344 -74 251 175 -118 111 -7 37 69
5798F9k99J65K16q3K73m39J63k06J97m8J79k2j63J82j26J6R0l6j40j3j33J13K8
$$ 69 -230 -65 151 68 341 -98 65 -141 56 8 187 165 2 184 58 74 164 128 -12 -25 -158 -45 -17
5821a7o4J55k50L00PL5l40J47p9J15J5j9N3L8j67n2O4Q5mk09J19Q1r8q5K0Q8J15
$$ -17 -81 74 -176 124 131 166 -174 -27 -106 9 24 5 58 96 -71 -123 -59 26 22 -187 -68 13 -85 -170 -150 -62 53
5848E3j19j14L8J31J2J11j5l65K77JL4rJ01j31J17j32J03j98o7M7J90q9r6j37
$$ 53 -66 -180 -142 -11 1 112 97 -268 9 10 44 35 136 5 122 -10 93 -105 -172 -125 65 -24 -120 -257
5872b57J31L84j46N1j57j78J24M2k03K86j37p3J49Pq1M9j22j6J99n0J28j24N4
$$ -257 -126 258 112 163 6 -172 -48 -6 -209 77 -60 -133 16 23 -58 -9 -131 -147 52 2 130 6 60
5895F0k4j41J10j9l05N25m63K95N4r3l24K56J31j3k24L2n6K56k78L84k41k8L06
$$ 60 36 -105 5 -14 -319 206 -257 38 92 -1 -325 -69 62 49 -175 -143 -199 57 -221 163 -78 -106 200
5918B00k88K56j56N1j55N6oN0R2n1O6k33J73N9l72K64j63K10R9j84J15j54M22
$$ 200 -88 168 12 63 -92 -36 -42 8 100 49 115 -118 55 114 -258 6 -157 53 152 -32 83 -71 351
5941C51m71L03k32K18k15r5O6Q9q5M3J35k49M01j61J20j99o2K3k45J80J68J05
$$ 351 -120 183 -49 169 -46 -141 -75 14 -71 -28 107 -142 259 98 218 19 -43 -20 -265 -85 83 188
5963A88k52J33k28O6L3n9Q2P8M4J24k06M5n0j5J0j29J9J69k7j02J3J89j60J63
$$ 188 -64 69 -159 -93 -60 -119 -37 41 85 209 3 48 -2 -17 -7 -136 -117 52 25 -77 -64 125 -35 128
5987A28j81K62k04k3k3j27J56j8J13j14j58J33N9q7j95L90j16k27J91J3J52p1
$$ 128 -53 209 5 -18 -41 -168 -12 -30 83 -31 -189 -56 3 -84 -279 111 -5 -232 -41 -28 124 53
6009E3lk08n2K17j47J98J78m00L08L7k12r8M45j77l90K67R8J7j61J02j65k12K22
$$ 53 50 -158 -210 7 -140 58 236 -164 144 181 -31 -129 316 139 -251 16 114 131 -30 72 -93 -305 -83
6032h3K69j91J93o11L32O5k00J99K21j68j56J96j28K21k10nj70K96P7M2j8l10
$$ -83 186 -5 188 -423 -91 -26 -226 -27 194 26 -130 66 -62 159 -51 -56 -226 70 147 189 171 -139
6054a39K62L8k93J97l40L24j68J50m9k8O9n6J35j3l0j95J94L9O5k83P7P8q4j6
$$ -139 123 161 -132 65 -275 49 -119 31 -18 -46 23 -33 102 89 59 -136 58 97 162 -121 -44 34 -50 -66
6078f6J21j64K53k09m9K56jr1j0k18L39j82J7K3k63K07J14K43m13L0J95L0l26
$$ -66 55 -109 144 -65 -114 142 141 50 40 -178 161 -21 -4 19 -244 -37 77 320 -93 -63 132 162 -164
6101a64O5KJ37j84J44Nk30K98J82k2l47J53KJ57j40l7k1q4n9R9Q5k57J68J00l25
$$ -164 -99 -97 40 -144 0 5 -225 73 255 233 -114 39 41 198 58 21 0 -84 -143 -44 41 -216 -48 52 -273
6126b73lJ41N0k1l46L10R7J81j51k36M60j18L6k37Q3J61j9P2K5j51m4J92l09O8
$$ -273 -276 -135 -85 -106 -452 -142 -45 136 -15 -251 209 91 127 -110 -27 134 115 187 212 61 17 209 -100 -32
6150c2O3j83k31M00l15M91p0j81m2Q7l0k0K19j8k53J02k06L44J9rl96L67k17N3
$$ -32 31 -152 -383 17 -298 193 123 -58 -100 -13 -43 -63 156 138 -115 -13 -219 125 144 135 -261 106 -111 -58
6174e8j29J37J6l34K66J48J3k05J3K20k09%O4L02k6l43K11K6K18k94Q2N5N3j88
$$ -58 -187 -50 -34 -368 -102 46 59 -146 -133 87 -122 -122 -58 244 218 -125 86 112 330 36 118 173 226 38
6198C8l69K95k23J37J45P6j91L74k43p5J31k62J05J22o4p3j23J42QM4J04j70K77
$$ 38 -331 -36 -259 -122 23 99 -92 282 39 -36 95 -167 -62 60 -4 -77 -200 -58 -50 -6 98 -72 205
6221B05k75K88n20M80j00j88p9L53n3j61J02l0j60L1M9J7n2K14k23K40q0O4P2
$$ 205 -70 218 -302 178 78 -110 -189 164 111 -50 52 22 -138 -107 -58 -41 -93 121 -102 138 58 122 194
6244A94l15K21L5Q1k60J24J15O9q0k89J16r2K07k38p8K96j62J4M5j60K43l68K22
$$ 194 -121 100 135 216 -44 80 195 264 184 -105 11 -81 126 -112 -190 106 -56 -42 3 -157 86 -282 -60
$$ [...]
8191A37
##END NTUPLES=NMR FID
##END=
